<?xml version="1.0" encoding="UTF-8"?>
<glyph name="glyph97" format="1">
  <advance width="202"/>
  <unicode hex="2018"/>
  <outline>
    <contour>
      <point x="145" y="666" type="curve" smooth="yes"/>
      <point x="161" y="666"/>
      <point x="174" y="653"/>
      <point x="174" y="637" type="curve" smooth="yes"/>
      <point x="174" y="627"/>
      <point x="166" y="614"/>
      <point x="157" y="610" type="curve" smooth="yes"/>
      <point x="112" y="587" type="line"/>
      <point x="102" y="550" type="line"/>
      <point x="116" y="550" type="line" smooth="yes"/>
      <point x="123" y="550"/>
      <point x="132" y="545"/>
      <point x="136" y="541" type="curve" smooth="yes"/>
      <point x="165" y="513" type="line" smooth="yes"/>
      <point x="169" y="509"/>
      <point x="174" y="499"/>
      <point x="174" y="492" type="curve" smooth="yes"/>
      <point x="174" y="463" type="line" smooth="yes"/>
      <point x="174" y="456"/>
      <point x="169" y="446"/>
      <point x="165" y="442" type="curve" smooth="yes"/>
      <point x="136" y="414" type="line" smooth="yes"/>
      <point x="132" y="410"/>
      <point x="123" y="405"/>
      <point x="116" y="405" type="curve" smooth="yes"/>
      <point x="87" y="405" type="line" smooth="yes"/>
      <point x="80" y="405"/>
      <point x="70" y="410"/>
      <point x="66" y="414" type="curve" smooth="yes"/>
      <point x="37" y="442" type="line" smooth="yes"/>
      <point x="33" y="446"/>
      <point x="29" y="456"/>
      <point x="29" y="463" type="curve" smooth="yes"/>
      <point x="29" y="487" type="line"/>
      <point x="29" y="492" type="line"/>
      <point x="29" y="495" type="line"/>
      <point x="29" y="546" type="line"/>
      <point x="29" y="550" type="line" smooth="yes"/>
      <point x="29" y="556"/>
      <point x="31" y="562"/>
      <point x="34" y="566" type="curve" smooth="yes"/>
      <point x="60" y="618" type="line" smooth="yes"/>
      <point x="63" y="625"/>
      <point x="71" y="633"/>
      <point x="78" y="635" type="curve" smooth="yes"/>
      <point x="132" y="662" type="line" smooth="yes"/>
      <point x="135" y="664"/>
      <point x="142" y="666"/>
    </contour>
  </outline>
  <lib>
    <dict>
      <key>com.fontlab.hintData</key>
      <dict>
        <key>hhints</key>
        <array>
          <dict>
            <key>position</key>
            <integer>610</integer>
            <key>width</key>
            <integer>55</integer>
          </dict>
        </array>
        <key>vhints</key>
        <array>
          <dict>
            <key>position</key>
            <integer>29</integer>
            <key>width</key>
            <integer>145</integer>
          </dict>
        </array>
      </dict>
    </dict>
  </lib>
</glyph>
