<?xml version="1.0" encoding="UTF-8" standalone="no"?>
<svg
   xmlns:dc="http://purl.org/dc/elements/1.1/"
   xmlns:cc="http://creativecommons.org/ns#"
   xmlns:rdf="http://www.w3.org/1999/02/22-rdf-syntax-ns#"
   xmlns:svg="http://www.w3.org/2000/svg"
   xmlns="http://www.w3.org/2000/svg"
   xmlns:sodipodi="http://sodipodi.sourceforge.net/DTD/sodipodi-0.dtd"
   xmlns:inkscape="http://www.inkscape.org/namespaces/inkscape"
   data-dec="55"
   width="18"
   height="40"
   version="1.1"
   id="svg4"
   sodipodi:docname="55.svg"
   inkscape:version="0.92.4 (unknown)">
  <metadata
     id="metadata10">
    <rdf:RDF>
      <cc:Work
         rdf:about="">
        <dc:format>image/svg+xml</dc:format>
        <dc:type
           rdf:resource="http://purl.org/dc/dcmitype/StillImage" />
      </cc:Work>
    </rdf:RDF>
  </metadata>
  <defs
     id="defs8" />
  <sodipodi:namedview
     pagecolor="#ffffff"
     bordercolor="#666666"
     borderopacity="1"
     objecttolerance="10"
     gridtolerance="10"
     guidetolerance="10"
     inkscape:pageopacity="0"
     inkscape:pageshadow="2"
     inkscape:window-width="640"
     inkscape:window-height="480"
     id="namedview6"
     showgrid="false"
     inkscape:zoom="5.9"
     inkscape:cx="9"
     inkscape:cy="20"
     inkscape:window-x="0"
     inkscape:window-y="27"
     inkscape:window-maximized="0"
     inkscape:current-layer="svg4" />
  <path
     style="color:#000000;font-style:normal;font-variant:normal;font-weight:normal;font-stretch:normal;font-size:medium;line-height:normal;font-family:sans-serif;font-variant-ligatures:normal;font-variant-position:normal;font-variant-caps:normal;font-variant-numeric:normal;font-variant-alternates:normal;font-feature-settings:normal;text-indent:0;text-align:start;text-decoration:none;text-decoration-line:none;text-decoration-style:solid;text-decoration-color:#000000;letter-spacing:normal;word-spacing:normal;text-transform:none;writing-mode:lr-tb;direction:ltr;text-orientation:mixed;dominant-baseline:auto;baseline-shift:baseline;text-anchor:start;white-space:normal;shape-padding:0;clip-rule:nonzero;display:inline;overflow:visible;visibility:visible;opacity:1;isolation:auto;mix-blend-mode:normal;color-interpolation:sRGB;color-interpolation-filters:linearRGB;solid-color:#000000;solid-opacity:1;vector-effect:none;fill:#013272;fill-opacity:1;fill-rule:nonzero;stroke:none;stroke-width:3;stroke-linecap:round;stroke-linejoin:round;stroke-miterlimit:4;stroke-dasharray:none;stroke-dashoffset:0;stroke-opacity:1;color-rendering:auto;image-rendering:auto;shape-rendering:auto;text-rendering:auto;enable-background:accumulate"
     d="M 1.9765625,-0.52148438 A 1.50015,1.50015 0 0 1 3.4101562,0.46875 L 3.9394531,-0.06054687 A 1.50015,1.50015 0 0 1 5,-0.5 h 2 a 1.50015,1.50015 0 0 1 0.7714844,0.21289062 L 12.416016,2.5 h 0.96289 l 0.388672,-0.3886719 0.824219,-1.64843748 a 1.50015,1.50015 0 0 1 0.002,-0.005859 1.50015,1.50015 0 0 1 1.337891,-0.97460937 1.50015,1.50015 0 0 1 0.144531,0 1.50015,1.50015 0 0 1 0.0098,0 1.50015,1.50015 0 0 1 0.138671,0.015625 1.50015,1.50015 0 0 1 0.0078,0 1.50015,1.50015 0 0 1 0.0039,0 1.50015,1.50015 0 0 1 0.107422,0.0214844 1.50015,1.50015 0 0 1 0.05859,0.015625 1.50015,1.50015 0 0 1 0.01953,0.003906 1.50015,1.50015 0 0 1 0.02734,0.009766 1.50015,1.50015 0 0 1 0.113281,0.0390625 A 1.50015,1.50015 0 0 1 17.5,1.1425781 V 4 a 1.50015,1.50015 0 0 1 -0.07617,0.4746094 l -1,3 A 1.50015,1.50015 0 0 1 16.171875,7.9375 l -3.900391,4.875 -0.882812,1.763672 L 10.5,17.244141 V 22 a 1.50015,1.50015 0 1 1 -3,0 v -5 a 1.50015,1.50015 0 0 1 0.076172,-0.474609 l 1,-3 a 1.50015,1.50015 0 0 1 0.082031,-0.195313 l 1,-2 A 1.50015,1.50015 0 0 1 9.828125,11.0625 L 13.662109,6.2714844 13.919922,5.5 H 12 A 1.50015,1.50015 0 0 1 11.228516,5.2871094 L 6.5839844,2.5 H 5.6210938 L 4.2324219,3.8886719 3.5,5.3535156 V 7 a 1.50015,1.50015 0 1 1 -3,0 V 5.1757812 a 1.50015,1.50015 0 0 1 0,-0.3183593 V 1 a 1.50015,1.50015 0 0 1 1.4765625,-1.52148438 z"
     id="path2" />
</svg>
