<?xml version="1.0" encoding="UTF-8" standalone="no"?>
<svg
   xmlns:dc="http://purl.org/dc/elements/1.1/"
   xmlns:cc="http://creativecommons.org/ns#"
   xmlns:rdf="http://www.w3.org/1999/02/22-rdf-syntax-ns#"
   xmlns:svg="http://www.w3.org/2000/svg"
   xmlns="http://www.w3.org/2000/svg"
   xmlns:sodipodi="http://sodipodi.sourceforge.net/DTD/sodipodi-0.dtd"
   xmlns:inkscape="http://www.inkscape.org/namespaces/inkscape"
   data-dec="79"
   width="22"
   height="40"
   version="1.1"
   id="svg4"
   sodipodi:docname="79.svg"
   inkscape:version="0.92.4 (unknown)">
  <metadata
     id="metadata10">
    <rdf:RDF>
      <cc:Work
         rdf:about="">
        <dc:format>image/svg+xml</dc:format>
        <dc:type
           rdf:resource="http://purl.org/dc/dcmitype/StillImage" />
      </cc:Work>
    </rdf:RDF>
  </metadata>
  <defs
     id="defs8" />
  <sodipodi:namedview
     pagecolor="#ffffff"
     bordercolor="#666666"
     borderopacity="1"
     objecttolerance="10"
     gridtolerance="10"
     guidetolerance="10"
     inkscape:pageopacity="0"
     inkscape:pageshadow="2"
     inkscape:window-width="640"
     inkscape:window-height="480"
     id="namedview6"
     showgrid="false"
     inkscape:zoom="5.9"
     inkscape:cx="11"
     inkscape:cy="20"
     inkscape:window-x="0"
     inkscape:window-y="27"
     inkscape:window-maximized="0"
     inkscape:current-layer="svg4" />
  <path
     style="color:#000000;font-style:normal;font-variant:normal;font-weight:normal;font-stretch:normal;font-size:medium;line-height:normal;font-family:sans-serif;font-variant-ligatures:normal;font-variant-position:normal;font-variant-caps:normal;font-variant-numeric:normal;font-variant-alternates:normal;font-feature-settings:normal;text-indent:0;text-align:start;text-decoration:none;text-decoration-line:none;text-decoration-style:solid;text-decoration-color:#000000;letter-spacing:normal;word-spacing:normal;text-transform:none;writing-mode:lr-tb;direction:ltr;text-orientation:mixed;dominant-baseline:auto;baseline-shift:baseline;text-anchor:start;white-space:normal;shape-padding:0;clip-rule:nonzero;display:inline;overflow:visible;visibility:visible;opacity:1;isolation:auto;mix-blend-mode:normal;color-interpolation:sRGB;color-interpolation-filters:linearRGB;solid-color:#000000;solid-opacity:1;vector-effect:none;fill:#013272;fill-opacity:1;fill-rule:nonzero;stroke:none;stroke-width:2.5;stroke-linecap:round;stroke-linejoin:round;stroke-miterlimit:4;stroke-dasharray:none;stroke-dashoffset:0;stroke-opacity:1;color-rendering:auto;image-rendering:auto;shape-rendering:auto;text-rendering:auto;enable-background:accumulate"
     d="M 10.292969,2.25 8.7402344,3.0273438 7.0273438,4.7402344 6.1796875,6.4355469 5.25,10.154297 v 2.691406 l 0.9296875,3.71875 0.8476563,1.695313 1.7128906,1.71289 L 10.292969,20.75 h 1.414062 l 1.552735,-0.777344 1.71289,-1.71289 0.847656,-1.695313 L 16.75,12.845703 V 10.154297 L 15.820312,6.4355469 14.972656,4.7402344 13.259766,3.0273438 11.707031,2.25 Z m -0.28711,-2.5078125 a 1.250125,1.250125 0 0 1 0.04492,0.001953 1.250125,1.250125 0 0 1 0.0078,0 1.250125,1.250125 0 0 1 0.01172,0.001953 1.250125,1.250125 0 0 1 0.07422,0.003906 h 1.712891 a 1.250125,1.250125 0 0 1 0.58789,0.0800781 l 0.0098,0.003906 2.939453,0.98046874 a 1.250125,1.250125 0 0 1 0.490235,0.30078128 l 2,2 a 1.250125,1.250125 0 0 1 0.232422,0.3261718 l 1,2 a 1.250125,1.250125 0 0 1 0.0957,0.2558594 l 1,4 A 1.250125,1.250125 0 0 1 20.25,10 v 3 a 1.250125,1.250125 0 0 1 -0.03711,0.302734 l -1,4 a 1.250125,1.250125 0 0 1 -0.0957,0.25586 l -1,2 a 1.250125,1.250125 0 0 1 -0.232422,0.326172 l -2,2 a 1.250125,1.250125 0 0 1 -0.490235,0.300781 l -2.914062,0.970703 a 1.250125,1.250125 0 0 1 -0.01953,0.0078 1.250125,1.250125 0 0 1 -0.605469,0.08594 h -1.712891 a 1.250125,1.250125 0 0 1 -0.5878905,-0.08008 1.250125,1.250125 0 0 1 -0.00977,-0.0039 L 6.6054688,22.185547 A 1.250125,1.250125 0 0 1 6.1152344,21.884766 l -2,-2 A 1.250125,1.250125 0 0 1 3.8828125,19.558594 l -1,-2 a 1.250125,1.250125 0 0 1 -0.095703,-0.25586 l -1,-4 A 1.250125,1.250125 0 0 1 1.75,13 v -3 a 1.250125,1.250125 0 0 1 0.037109,-0.3027344 l 1,-4 a 1.250125,1.250125 0 0 1 0.095703,-0.2558594 l 1,-2 A 1.250125,1.250125 0 0 1 4.1152344,3.1152344 l 2,-2 A 1.250125,1.250125 0 0 1 6.6054688,0.81445312 l 2.8769531,-0.95898437 a 1.250125,1.250125 0 0 1 0.2480469,-0.078125 1.250125,1.250125 0 0 1 0.021484,-0.005859 1.250125,1.250125 0 0 1 0.00586,-0.001953 1.250125,1.250125 0 0 1 0.052734,-0.007813 1.250125,1.250125 0 0 1 0.1132812,-0.0136719 1.250125,1.250125 0 0 1 0.023437,-0.001953 1.250125,1.250125 0 0 1 0.058593,-0.003906 z"
     id="path2" />
</svg>
