<?xml version="1.0" encoding="UTF-8" standalone="no"?>
<svg
   xmlns:dc="http://purl.org/dc/elements/1.1/"
   xmlns:cc="http://creativecommons.org/ns#"
   xmlns:rdf="http://www.w3.org/1999/02/22-rdf-syntax-ns#"
   xmlns:svg="http://www.w3.org/2000/svg"
   xmlns="http://www.w3.org/2000/svg"
   xmlns:sodipodi="http://sodipodi.sourceforge.net/DTD/sodipodi-0.dtd"
   xmlns:inkscape="http://www.inkscape.org/namespaces/inkscape"
   data-dec="36"
   width="20"
   height="40"
   version="1.1"
   id="svg4"
   sodipodi:docname="36.svg"
   inkscape:version="0.92.4 (unknown)">
  <metadata
     id="metadata10">
    <rdf:RDF>
      <cc:Work
         rdf:about="">
        <dc:format>image/svg+xml</dc:format>
        <dc:type
           rdf:resource="http://purl.org/dc/dcmitype/StillImage" />
      </cc:Work>
    </rdf:RDF>
  </metadata>
  <defs
     id="defs8" />
  <sodipodi:namedview
     pagecolor="#ffffff"
     bordercolor="#666666"
     borderopacity="1"
     objecttolerance="10"
     gridtolerance="10"
     guidetolerance="10"
     inkscape:pageopacity="0"
     inkscape:pageshadow="2"
     inkscape:window-width="640"
     inkscape:window-height="480"
     id="namedview6"
     showgrid="false"
     inkscape:zoom="5.9"
     inkscape:cx="10"
     inkscape:cy="20"
     inkscape:window-x="0"
     inkscape:window-y="27"
     inkscape:window-maximized="0"
     inkscape:current-layer="svg4" />
  <path
     style="color:#000000;font-style:normal;font-variant:normal;font-weight:normal;font-stretch:normal;font-size:medium;line-height:normal;font-family:sans-serif;font-variant-ligatures:normal;font-variant-position:normal;font-variant-caps:normal;font-variant-numeric:normal;font-variant-alternates:normal;font-feature-settings:normal;text-indent:0;text-align:start;text-decoration:none;text-decoration-line:none;text-decoration-style:solid;text-decoration-color:#000000;letter-spacing:normal;word-spacing:normal;text-transform:none;writing-mode:lr-tb;direction:ltr;text-orientation:mixed;dominant-baseline:auto;baseline-shift:baseline;text-anchor:start;white-space:normal;shape-padding:0;clip-rule:nonzero;display:inline;overflow:visible;visibility:visible;opacity:1;isolation:auto;mix-blend-mode:normal;color-interpolation:sRGB;color-interpolation-filters:linearRGB;solid-color:#000000;solid-opacity:1;vector-effect:none;fill:#013272;fill-opacity:1;fill-rule:nonzero;stroke:none;stroke-width:3;stroke-linecap:round;stroke-linejoin:round;stroke-miterlimit:4;stroke-dasharray:none;stroke-dashoffset:0;stroke-opacity:1;color-rendering:auto;image-rendering:auto;shape-rendering:auto;text-rendering:auto;enable-background:accumulate"
     d="m 13.5,12.925781 v 6.994141 L 14.037109,19.740234 15.5,17.544922 v -2.191406 l -0.732422,-1.464844 -0.65625,-0.65625 z m -4,-1.511719 V 20.5 h 1 V 11.748047 Z M 6.5,3.0800781 5.8105469,3.3105469 4.5,4.6210938 V 5.3789062 L 5.8886719,6.7675781 6.5,7.0742188 Z M 9.5,2.5 v 5.7519531 l 1,0.3339844 V 2.5 Z M 7.9765625,-4.5214844 A 1.50015,1.50015 0 0 1 9.5,-3 v 2.5 h 1 V -3 a 1.50015,1.50015 0 1 1 3,0 v 2.91796875 l 1.974609,0.65820313 a 1.50015,1.50015 0 0 1 0.585938,0.36328124 l 2,1.99999998 A 1.50015,1.50015 0 0 1 18.5,4 V 4.7597656 A 1.50015,1.50015 0 0 1 17.931641,6.1894531 L 17.060547,7.0605469 A 1.50015,1.50015 0 0 1 14.5,6 V 5 A 1.50015,1.50015 0 0 1 14.880859,4.0019531 L 14.189453,3.3105469 13.5,3.0800781 v 6.5058594 a 1.50015,1.50015 0 0 1 0.169922,0.072266 l 2,0.9999999 a 1.50015,1.50015 0 0 1 0.390625,0.28125 l 1,1 a 1.50015,1.50015 0 0 1 0.28125,0.390625 l 1,2 A 1.50015,1.50015 0 0 1 18.5,15 v 3 a 1.50015,1.50015 0 0 1 -0.251953,0.832031 l -2,3 a 1.50015,1.50015 0 0 1 -0.773438,0.591797 L 13.5,23.082031 V 26 a 1.50015,1.50015 0 1 1 -3,0 v -2.5 h -1 V 26 a 1.50015,1.50015 0 1 1 -3,0 V 23.082031 L 4.5253906,22.423828 A 1.50015,1.50015 0 0 1 3.9394531,22.060547 l -2,-2 A 1.50015,1.50015 0 0 1 1.5,19 V 18.240234 A 1.50015,1.50015 0 0 1 2.0683594,16.810547 L 2.9394531,15.939453 A 1.50015,1.50015 0 0 1 5.5,17 v 1 A 1.50015,1.50015 0 0 1 5.1191406,18.998047 L 5.8105469,19.689453 6.5,19.919922 v -9.50586 a 1.50015,1.50015 0 0 1 -0.1699219,-0.07226 l -2,-1.0000001 a 1.50015,1.50015 0 0 1 -0.390625,-0.28125 L 2.09375,7.2148438 A 1.50015,1.50015 0 0 1 1.6210938,6.609375 1.50015,1.50015 0 0 1 1.59375,6.5390625 1.50015,1.50015 0 0 1 1.5,5.7792969 V 4 A 1.50015,1.50015 0 0 1 1.9394531,2.9394531 l 2,-1.99999998 A 1.50015,1.50015 0 0 1 4.5253906,0.57617188 L 6.5,-0.08203125 V -3 a 1.50015,1.50015 0 0 1 1.4765625,-1.5214844 z"
     id="path2" />
</svg>
