<?xml version="1.0" encoding="UTF-8"?>
<glyph name="idieresis" format="1">
  <advance width="404"/>
  <unicode hex="00EF"/>
  <outline>
    <contour>
      <point x="191" y="406" type="line"/>
      <point x="208" y="389" type="line" smooth="yes"/>
      <point x="209" y="388"/>
      <point x="210" y="385"/>
      <point x="210" y="384" type="curve" smooth="yes"/>
      <point x="210" y="297" type="line" smooth="yes"/>
      <point x="210" y="296"/>
      <point x="209" y="296"/>
      <point x="209" y="295" type="curve" smooth="yes"/>
      <point x="152" y="122" type="line"/>
      <point x="152" y="40" type="line"/>
      <point x="177" y="14" type="line"/>
      <point x="185" y="14" type="line"/>
      <point x="168" y="32" type="line" smooth="yes"/>
      <point x="167" y="33"/>
      <point x="166" y="35"/>
      <point x="166" y="36" type="curve" smooth="yes"/>
      <point x="166" y="123" type="line" smooth="yes"/>
      <point x="166" y="124"/>
      <point x="167" y="124"/>
      <point x="167" y="125" type="curve" smooth="yes"/>
      <point x="224" y="298" type="line"/>
      <point x="224" y="381" type="line"/>
      <point x="199" y="406" type="line"/>
    </contour>
    <contour>
      <point x="173" y="420" type="line"/>
      <point x="174" y="420" type="line"/>
      <point x="175" y="420" type="line"/>
      <point x="202" y="420" type="line" smooth="yes"/>
      <point x="203" y="420"/>
      <point x="207" y="419"/>
      <point x="208" y="418" type="curve" smooth="yes"/>
      <point x="236" y="389" type="line" smooth="yes"/>
      <point x="237" y="388"/>
      <point x="239" y="385"/>
      <point x="239" y="384" type="curve" smooth="yes"/>
      <point x="239" y="297" type="line"/>
      <point x="239" y="295" type="line"/>
      <point x="180" y="122" type="line"/>
      <point x="180" y="40" type="line"/>
      <point x="206" y="14" type="line"/>
      <point x="257" y="14" type="line"/>
      <point x="312" y="69" type="line"/>
      <point x="341" y="126" type="line" smooth="yes"/>
      <point x="342" y="128"/>
      <point x="346" y="131"/>
      <point x="348" y="131" type="curve" smooth="yes"/>
      <point x="352" y="131"/>
      <point x="355" y="128"/>
      <point x="355" y="124" type="curve" smooth="yes"/>
      <point x="355" y="123"/>
      <point x="355" y="121"/>
      <point x="354" y="120" type="curve" smooth="yes"/>
      <point x="324" y="63" type="line" smooth="yes"/>
      <point x="324" y="62"/>
      <point x="323" y="60" type="line"/>
      <point x="266" y="2" type="line" smooth="yes"/>
      <point x="265" y="1"/>
      <point x="262" y="0"/>
      <point x="261" y="0" type="curve" smooth="yes"/>
      <point x="204" y="0" type="line"/>
      <point x="202" y="0" type="line"/>
      <point x="201" y="0" type="line"/>
      <point x="174" y="0" type="line" smooth="yes"/>
      <point x="173" y="0"/>
      <point x="169" y="1"/>
      <point x="168" y="2" type="curve" smooth="yes"/>
      <point x="140" y="32" type="line" smooth="yes"/>
      <point x="139" y="33"/>
      <point x="138" y="35"/>
      <point x="138" y="36" type="curve" smooth="yes"/>
      <point x="138" y="123" type="line"/>
      <point x="138" y="125" type="line"/>
      <point x="196" y="298" type="line"/>
      <point x="196" y="381" type="line"/>
      <point x="170" y="406" type="line"/>
      <point x="119" y="406" type="line"/>
      <point x="64" y="351" type="line"/>
      <point x="35" y="294" type="line" smooth="yes"/>
      <point x="34" y="292"/>
      <point x="31" y="289"/>
      <point x="29" y="289" type="curve" smooth="yes"/>
      <point x="25" y="289"/>
      <point x="21" y="293"/>
      <point x="21" y="297" type="curve" smooth="yes"/>
      <point x="21" y="298"/>
      <point x="21" y="299"/>
      <point x="22" y="300" type="curve" smooth="yes"/>
      <point x="52" y="359" type="line" smooth="yes"/>
      <point x="52" y="360"/>
      <point x="53" y="360" type="line"/>
      <point x="111" y="418" type="line" smooth="yes"/>
      <point x="112" y="419"/>
      <point x="115" y="420"/>
      <point x="116" y="420" type="curve" smooth="yes"/>
    </contour>
    <component base="dieresis" xOffset="17" yOffset="57"/>
  </outline>
  <lib>
    <dict>
      <key>com.fontlab.hintData</key>
      <dict>
        <key>hhints</key>
        <array>
          <dict>
            <key>position</key>
            <integer>0</integer>
            <key>width</key>
            <integer>14</integer>
          </dict>
          <dict>
            <key>position</key>
            <integer>406</integer>
            <key>width</key>
            <integer>14</integer>
          </dict>
          <dict>
            <key>position</key>
            <integer>601</integer>
            <key>width</key>
            <integer>22</integer>
          </dict>
          <dict>
            <key>position</key>
            <integer>681</integer>
            <key>width</key>
            <integer>72</integer>
          </dict>
        </array>
        <key>vhints</key>
        <array>
          <dict>
            <key>position</key>
            <integer>21</integer>
            <key>width</key>
            <integer>14</integer>
          </dict>
          <dict>
            <key>position</key>
            <integer>138</integer>
            <key>width</key>
            <integer>14</integer>
          </dict>
          <dict>
            <key>position</key>
            <integer>165</integer>
            <key>width</key>
            <integer>271</integer>
          </dict>
          <dict>
            <key>position</key>
            <integer>166</integer>
            <key>width</key>
            <integer>14</integer>
          </dict>
          <dict>
            <key>position</key>
            <integer>196</integer>
            <key>width</key>
            <integer>14</integer>
          </dict>
          <dict>
            <key>position</key>
            <integer>224</integer>
            <key>width</key>
            <integer>14</integer>
          </dict>
          <dict>
            <key>position</key>
            <integer>341</integer>
            <key>width</key>
            <integer>14</integer>
          </dict>
        </array>
      </dict>
    </dict>
  </lib>
</glyph>
