<?xml version="1.0" encoding="UTF-8" standalone="no"?>
<svg
   xmlns:dc="http://purl.org/dc/elements/1.1/"
   xmlns:cc="http://creativecommons.org/ns#"
   xmlns:rdf="http://www.w3.org/1999/02/22-rdf-syntax-ns#"
   xmlns:svg="http://www.w3.org/2000/svg"
   xmlns="http://www.w3.org/2000/svg"
   xmlns:sodipodi="http://sodipodi.sourceforge.net/DTD/sodipodi-0.dtd"
   xmlns:inkscape="http://www.inkscape.org/namespaces/inkscape"
   data-dec="77"
   id="dec_77"
   width="24"
   height="40"
   version="1.1"
   sodipodi:docname="77.svg"
   inkscape:version="0.91 r13725">
  <metadata
     id="metadata9">
    <rdf:RDF>
      <cc:Work
         rdf:about="">
        <dc:format>image/svg+xml</dc:format>
        <dc:type
           rdf:resource="http://purl.org/dc/dcmitype/StillImage" />
      </cc:Work>
    </rdf:RDF>
  </metadata>
  <defs
     id="defs7" />
  <sodipodi:namedview
     pagecolor="#ffffff"
     bordercolor="#666666"
     borderopacity="1"
     objecttolerance="10"
     gridtolerance="10"
     guidetolerance="10"
     inkscape:pageopacity="0"
     inkscape:pageshadow="2"
     inkscape:window-width="1333"
     inkscape:window-height="744"
     id="namedview5"
     showgrid="true"
     inkscape:zoom="23.6"
     inkscape:cx="7.7856681"
     inkscape:cy="27.726652"
     inkscape:window-x="33"
     inkscape:window-y="924"
     inkscape:window-maximized="1"
     inkscape:current-layer="dec_77">
    <inkscape:grid
       type="xygrid"
       id="grid821" />
  </sodipodi:namedview>
  <path
     style="color:#000000;font-style:normal;font-variant:normal;font-weight:normal;font-stretch:normal;font-size:medium;line-height:normal;font-family:sans-serif;text-indent:0;text-align:start;text-decoration:none;text-decoration-line:none;text-decoration-style:solid;text-decoration-color:#000000;letter-spacing:normal;word-spacing:normal;text-transform:none;direction:ltr;block-progression:tb;writing-mode:lr-tb;baseline-shift:baseline;text-anchor:start;white-space:normal;clip-rule:nonzero;display:inline;overflow:visible;visibility:visible;opacity:1;isolation:auto;mix-blend-mode:normal;color-interpolation:sRGB;color-interpolation-filters:linearRGB;solid-color:#000000;solid-opacity:1;fill:#000000;fill-opacity:1;fill-rule:nonzero;stroke:none;stroke-width:1px;stroke-linecap:round;stroke-linejoin:round;stroke-miterlimit:4;stroke-dasharray:none;stroke-dashoffset:0;stroke-opacity:1;color-rendering:auto;image-rendering:auto;shape-rendering:auto;text-rendering:auto;enable-background:accumulate"
     d="M 20.992188 0.4921875 A 0.50005 0.50005 0 0 0 20.947266 0.49609375 A 0.50005 0.50005 0 0 0 20.943359 0.49609375 A 0.50005 0.50005 0 0 0 20.921875 0.5 A 0.50005 0.50005 0 0 0 20.917969 0.5 L 20 0.5 A 0.50005 0.50005 0 0 0 19.542969 0.796875 L 12.517578 16.595703 L 5.4882812 0.86914062 A 0.50005 0.50005 0 0 0 5.34375 0.6328125 A 0.50005 0.50005 0 0 0 5.3046875 0.59960938 A 0.50005 0.50005 0 0 0 5.2890625 0.58789062 A 0.50005 0.50005 0 0 0 5.2714844 0.57617188 A 0.50005 0.50005 0 0 0 5.2265625 0.55078125 A 0.50005 0.50005 0 0 0 5.2207031 0.546875 A 0.50005 0.50005 0 0 0 5.1816406 0.53125 A 0.50005 0.50005 0 0 0 4.9199219 0.5 L 4 0.5 A 0.50005 0.50005 0 0 0 3.9335938 0.50390625 A 0.50005 0.50005 0 0 0 3.5 1.0820312 L 3.5 22 A 0.50005 0.50005 0 0 0 4 22.5 L 6 22.5 A 0.50005 0.50005 0 0 0 6.5 22 L 6.5 9.9550781 L 11.515625 22.138672 A 0.50005 0.50005 0 0 0 11.517578 22.144531 A 0.50005 0.50005 0 0 0 12.078125 22.5 L 12.925781 22.5 A 0.50005 0.50005 0 0 0 13.361328 22.353516 A 0.50005 0.50005 0 0 0 13.365234 22.349609 A 0.50005 0.50005 0 0 0 13.394531 22.316406 A 0.50005 0.50005 0 0 0 13.398438 22.3125 A 0.50005 0.50005 0 0 0 13.423828 22.275391 A 0.50005 0.50005 0 0 0 13.439453 22.248047 A 0.50005 0.50005 0 0 0 13.449219 22.232422 A 0.50005 0.50005 0 0 0 13.451172 22.226562 A 0.50005 0.50005 0 0 0 13.490234 22.121094 L 18.5 9.9570312 L 18.5 22 A 0.50005 0.50005 0 0 0 19 22.5 L 21 22.5 A 0.50005 0.50005 0 0 0 21.5 22 L 21.5 1.0800781 A 0.50005 0.50005 0 0 0 21.466797 0.80664062 A 0.50005 0.50005 0 0 0 21.445312 0.76171875 A 0.50005 0.50005 0 0 0 21.441406 0.75390625 A 0.50005 0.50005 0 0 0 21.419922 0.71875 A 0.50005 0.50005 0 0 0 21.416016 0.7109375 A 0.50005 0.50005 0 0 0 21.390625 0.67773438 A 0.50005 0.50005 0 0 0 21.384766 0.671875 A 0.50005 0.50005 0 0 0 21.371094 0.65625 A 0.50005 0.50005 0 0 0 21.353516 0.63867188 A 0.50005 0.50005 0 0 0 21.320312 0.60742188 A 0.50005 0.50005 0 0 0 21.316406 0.60546875 A 0.50005 0.50005 0 0 0 21.275391 0.57617188 A 0.50005 0.50005 0 0 0 21.238281 0.55273438 A 0.50005 0.50005 0 0 0 21.232422 0.55078125 A 0.50005 0.50005 0 0 0 21.1875 0.52929688 A 0.50005 0.50005 0 0 0 21.091797 0.50195312 A 0.50005 0.50005 0 0 0 21.076172 0.5 A 0.50005 0.50005 0 0 0 20.992188 0.4921875 z M 18.056641 6.6015625 L 13.158203 18.029297 L 13.066406 17.824219 L 18.056641 6.6015625 z M 8.7324219 10.576172 L 11.970703 17.822266 L 11.875 18.041016 L 8.7324219 10.576172 z M 12.519531 19.050781 L 12.623047 19.279297 L 12.507812 19.544922 L 12.408203 19.304688 L 12.519531 19.050781 z M 4.5 21 A 0.50005 0.50005 0 0 0 4.9199219 21.5 L 4.5 21.5 L 4.5 21 z M 19.5 21 A 0.50005 0.50005 0 0 0 19.919922 21.5 L 19.5 21.5 L 19.5 21 z M 5.5 21.035156 L 5.5 21.5 L 5.0820312 21.5 A 0.50005 0.50005 0 0 0 5.5 21.035156 z M 20.5 21.035156 L 20.5 21.5 L 20.082031 21.5 A 0.50005 0.50005 0 0 0 20.5 21.035156 z "
     id="path823" />
</svg>
