<?xml version="1.0" encoding="UTF-8"?>
<glyph name="udieresis" format="1">
  <advance width="635"/>
  <unicode hex="00FC"/>
  <outline>
    <component base="dieresis" xOffset="58" yOffset="-7"/>
    <component base="u"/>
  </outline>
  <lib>
    <dict>
      <key>com.fontlab.hintData</key>
      <dict>
        <key>hhints</key>
        <array>
          <dict>
            <key>position</key>
            <integer>0</integer>
            <key>width</key>
            <integer>14</integer>
          </dict>
          <dict>
            <key>position</key>
            <integer>406</integer>
            <key>width</key>
            <integer>14</integer>
          </dict>
          <dict>
            <key>position</key>
            <integer>479</integer>
            <key>width</key>
            <integer>72</integer>
          </dict>
        </array>
        <key>vhints</key>
        <array>
          <dict>
            <key>position</key>
            <integer>138</integer>
            <key>width</key>
            <integer>14</integer>
          </dict>
          <dict>
            <key>position</key>
            <integer>166</integer>
            <key>width</key>
            <integer>14</integer>
          </dict>
          <dict>
            <key>position</key>
            <integer>168</integer>
            <key>width</key>
            <integer>271</integer>
          </dict>
          <dict>
            <key>position</key>
            <integer>455</integer>
            <key>width</key>
            <integer>15</integer>
          </dict>
          <dict>
            <key>position</key>
            <integer>485</integer>
            <key>width</key>
            <integer>14</integer>
          </dict>
        </array>
      </dict>
    </dict>
  </lib>
</glyph>
