<?xml version="1.0" encoding="UTF-8" standalone="no"?>
<svg
   xmlns:dc="http://purl.org/dc/elements/1.1/"
   xmlns:cc="http://creativecommons.org/ns#"
   xmlns:rdf="http://www.w3.org/1999/02/22-rdf-syntax-ns#"
   xmlns:svg="http://www.w3.org/2000/svg"
   xmlns="http://www.w3.org/2000/svg"
   xmlns:sodipodi="http://sodipodi.sourceforge.net/DTD/sodipodi-0.dtd"
   xmlns:inkscape="http://www.inkscape.org/namespaces/inkscape"
   data-dec="113"
   width="18"
   height="40"
   version="1.1"
   id="svg4"
   sodipodi:docname="113.svg"
   inkscape:version="0.92.4 5da689c313, 2019-01-14">
  <metadata
     id="metadata10">
    <rdf:RDF>
      <cc:Work
         rdf:about="">
        <dc:format>image/svg+xml</dc:format>
        <dc:type
           rdf:resource="http://purl.org/dc/dcmitype/StillImage" />
        <dc:title></dc:title>
      </cc:Work>
    </rdf:RDF>
  </metadata>
  <defs
     id="defs8" />
  <sodipodi:namedview
     pagecolor="#ffffff"
     bordercolor="#666666"
     borderopacity="1"
     objecttolerance="10"
     gridtolerance="10"
     guidetolerance="10"
     inkscape:pageopacity="0"
     inkscape:pageshadow="2"
     inkscape:window-width="1920"
     inkscape:window-height="1043"
     id="namedview6"
     showgrid="false"
     inkscape:zoom="5.9"
     inkscape:cx="9"
     inkscape:cy="20"
     inkscape:window-x="0"
     inkscape:window-y="37"
     inkscape:window-maximized="0"
     inkscape:current-layer="svg4" />
  <path
     style="color:#000000;font-style:normal;font-variant:normal;font-weight:normal;font-stretch:normal;font-size:medium;line-height:normal;font-family:sans-serif;font-variant-ligatures:normal;font-variant-position:normal;font-variant-caps:normal;font-variant-numeric:normal;font-variant-alternates:normal;font-feature-settings:normal;text-indent:0;text-align:start;text-decoration:none;text-decoration-line:none;text-decoration-style:solid;text-decoration-color:#000000;letter-spacing:normal;word-spacing:normal;text-transform:none;writing-mode:lr-tb;direction:ltr;text-orientation:mixed;dominant-baseline:auto;baseline-shift:baseline;text-anchor:start;white-space:normal;shape-padding:0;clip-rule:nonzero;display:inline;overflow:visible;visibility:visible;opacity:1;isolation:auto;mix-blend-mode:normal;color-interpolation:sRGB;color-interpolation-filters:linearRGB;solid-color:#000000;solid-opacity:1;vector-effect:none;fill:#000000;fill-opacity:1;fill-rule:nonzero;stroke:none;stroke-width:0.5;stroke-linecap:round;stroke-linejoin:round;stroke-miterlimit:4;stroke-dasharray:none;stroke-dashoffset:0;stroke-opacity:1;color-rendering:auto;image-rendering:auto;shape-rendering:auto;text-rendering:auto;enable-background:accumulate"
     d="M 14.25,30.605469 V 30.75 h 0.144531 z m -1.5,0 L 12.605469,30.75 H 12.75 Z M 3.4296875,10.923828 3.2050781,11.148438 2.25,13.058594 v 3.882812 l 0.9550781,1.910156 1.9433594,1.94336 0.5820313,0.291016 -1.9082032,-1.908204 a 0.250025,0.250025 0 0 1 -0.044922,-0.06641 l -1,-2 A 0.250025,0.250025 0 0 1 2.75,17 v -4 a 0.250025,0.250025 0 0 1 0.013672,-0.07813 z M 13.25,8.3457031 v 2.6308589 a 0.250025,0.250025 0 0 1 0,0.04883 v 7.935547 a 0.250025,0.250025 0 0 1 0,0.07422 v 10.925782 a 0.250025,0.250025 0 0 1 0,0.07422 V 30.75 h 0.5 v -0.720703 a 0.250025,0.250025 0 0 1 0,-0.06055 V 10.039062 a 0.250025,0.250025 0 0 1 0,-0.074218 V 9 a 0.250025,0.250025 0 1 1 0.5,0 V 9.3945312 L 14.787109,8.8574219 Z M 7.0585938,8.25 5.1484375,9.2050781 4.2167969,10.136719 3.25,13.041016 v 3.90039 l 0.9550781,1.910156 1.9433594,1.94336 L 8.0566406,21.75 H 8.9414062 L 10.851562,20.794922 12.75,18.894531 v -7.83789 L 11.814453,9.1855469 9.9414062,8.25 Z M 12.996094,7.7460938 a 0.250025,0.250025 0 0 1 0.121094,0.029297 l 0.0059,0.00391 2.955078,0.984375 A 0.250025,0.250025 0 0 1 16,9.25 H 15.103516 L 14.25,10.105469 V 29.894531 L 15.103516,30.75 H 16 a 0.250025,0.250025 0 0 1 0,0.5 h -1.021484 -0.9375 a 0.250025,0.250025 0 0 1 -0.08789,0 h -0.912109 a 0.250025,0.250025 0 0 1 -0.08789,0 H 12 11 a 0.250025,0.250025 0 0 1 0,-0.5 h 0.896484 L 12.75,29.894531 V 19.605469 l -1.572266,1.572265 a 0.250025,0.250025 0 0 1 -0.06641,0.04492 l -1.9999999,1 A 0.250025,0.250025 0 0 1 9,22.25 H 8 7 a 0.250025,0.250025 0 0 1 -0.015625,0 0.250025,0.250025 0 0 1 -0.00195,0 0.250025,0.250025 0 0 1 -0.023437,-0.0039 0.250025,0.250025 0 0 1 -0.00195,0 0.250025,0.250025 0 0 1 -0.021484,-0.0039 0.250025,0.250025 0 0 1 -0.00195,0 0.250025,0.250025 0 0 1 -0.023438,-0.0078 0.250025,0.250025 0 0 1 -0.052734,-0.02734 l -1.96875,-0.984375 a 0.250025,0.250025 0 0 1 -0.066406,-0.04492 l -2,-2 a 0.250025,0.250025 0 0 1 -0.044922,-0.06641 l -1,-2 A 0.250025,0.250025 0 0 1 1.75,17 v -4 a 0.250025,0.250025 0 0 1 0.027344,-0.111328 l 1,-2 a 0.250025,0.250025 0 0 1 0.044922,-0.06641 L 3.8066406,9.8398438 A 0.250025,0.250025 0 0 1 3.8320312,9.8125 l 0.00977,-0.00781 0.9804687,-0.9824219 a 0.250025,0.250025 0 0 1 0.066406,-0.044922 l 2,-1 A 0.250025,0.250025 0 0 1 7,7.75 h 3 a 0.250025,0.250025 0 0 1 0.111328,0.027344 l 2,1 a 0.250025,0.250025 0 0 1 0.111328,0.1113281 L 12.75,9.9433594 V 8.0351562 a 0.250025,0.250025 0 0 1 0.06836,-0.2109374 0.250025,0.250025 0 0 1 0.0059,-0.00586 0.250025,0.250025 0 0 1 0.01172,-0.00977 0.250025,0.250025 0 0 1 0.0059,-0.00586 0.250025,0.250025 0 0 1 0.01367,-0.00977 0.250025,0.250025 0 0 1 0.0078,-0.00586 0.250025,0.250025 0 0 1 0.0098,-0.00586 0.250025,0.250025 0 0 1 0.0039,-0.00195 0.250025,0.250025 0 0 1 0.0078,-0.00391 0.250025,0.250025 0 0 1 0.111328,-0.029297 z"
     id="path2" />
</svg>
