<?xml version="1.0" encoding="UTF-8" standalone="no"?>
<svg
   xmlns:dc="http://purl.org/dc/elements/1.1/"
   xmlns:cc="http://creativecommons.org/ns#"
   xmlns:rdf="http://www.w3.org/1999/02/22-rdf-syntax-ns#"
   xmlns:svg="http://www.w3.org/2000/svg"
   xmlns="http://www.w3.org/2000/svg"
   xmlns:sodipodi="http://sodipodi.sourceforge.net/DTD/sodipodi-0.dtd"
   xmlns:inkscape="http://www.inkscape.org/namespaces/inkscape"
   data-dec="115"
   width="18"
   height="40"
   version="1.1"
   id="svg4"
   sodipodi:docname="115.svg"
   inkscape:version="0.92.4 (unknown)">
  <metadata
     id="metadata10">
    <rdf:RDF>
      <cc:Work
         rdf:about="">
        <dc:format>image/svg+xml</dc:format>
        <dc:type
           rdf:resource="http://purl.org/dc/dcmitype/StillImage" />
      </cc:Work>
    </rdf:RDF>
  </metadata>
  <defs
     id="defs8" />
  <sodipodi:namedview
     pagecolor="#ffffff"
     bordercolor="#666666"
     borderopacity="1"
     objecttolerance="10"
     gridtolerance="10"
     guidetolerance="10"
     inkscape:pageopacity="0"
     inkscape:pageshadow="2"
     inkscape:window-width="640"
     inkscape:window-height="480"
     id="namedview6"
     showgrid="false"
     inkscape:zoom="5.9"
     inkscape:cx="9"
     inkscape:cy="20"
     inkscape:window-x="0"
     inkscape:window-y="27"
     inkscape:window-maximized="0"
     inkscape:current-layer="svg4" />
  <path
     style="color:#000000;font-style:normal;font-variant:normal;font-weight:normal;font-stretch:normal;font-size:medium;line-height:normal;font-family:sans-serif;font-variant-ligatures:normal;font-variant-position:normal;font-variant-caps:normal;font-variant-numeric:normal;font-variant-alternates:normal;font-feature-settings:normal;text-indent:0;text-align:start;text-decoration:none;text-decoration-line:none;text-decoration-style:solid;text-decoration-color:#000000;letter-spacing:normal;word-spacing:normal;text-transform:none;writing-mode:lr-tb;direction:ltr;text-orientation:mixed;dominant-baseline:auto;baseline-shift:baseline;text-anchor:start;white-space:normal;shape-padding:0;clip-rule:nonzero;display:inline;overflow:visible;visibility:visible;opacity:1;isolation:auto;mix-blend-mode:normal;color-interpolation:sRGB;color-interpolation-filters:linearRGB;solid-color:#000000;solid-opacity:1;vector-effect:none;fill:#000000;fill-opacity:1;fill-rule:nonzero;stroke:none;stroke-width:2;stroke-linecap:round;stroke-linejoin:round;stroke-miterlimit:4;stroke-dasharray:none;stroke-dashoffset:0;stroke-opacity:1;color-rendering:auto;image-rendering:auto;shape-rendering:auto;text-rendering:auto;enable-background:accumulate"
     d="M 10.025391,6.9960938 A 1.0001,1.0001 0 0 1 10.091797,7 H 11 a 1.0001,1.0001 0 0 1 0.316406,0.050781 l 3,1 a 1.0001,1.0001 0 0 1 0.578125,0.5019532 l 1,1.9999996 A 1.0001,1.0001 0 0 1 16,11 v 1 a 1.0001,1.0001 0 0 1 -1,1 h -0.853516 a 1.0001,1.0001 0 0 1 -0.273437,0 H 13 a 1.0001,1.0001 0 0 1 -1,-1 v -0.763672 l -0.123047,-0.24414 a 1.0001,1.0001 0 0 1 -0.119141,-0.02149 L 9,10.28125 6.3496094,10.943359 6.140625,11.046875 l 0.2714844,0.541016 0.9980468,0.5 4.9609378,1.984375 a 1.0001,1.0001 0 0 1 0.07617,0.0332 l 2,1 a 1.0001,1.0001 0 0 1 0.447265,0.447265 l 1,2 A 1.0001,1.0001 0 0 1 16,18 v 1 a 1.0001,1.0001 0 0 1 -0.105469,0.447266 l -1,2 a 1.0001,1.0001 0 0 1 -0.578125,0.501953 l -3,1 A 1.0001,1.0001 0 0 1 11,23 H 10.09375 A 1.0001,1.0001 0 0 1 9.9257812,23 H 7.9785156 7 a 1.0001,1.0001 0 0 1 -0.3164062,-0.05078 l -3,-1 a 1.0001,1.0001 0 0 1 -0.578125,-0.501953 l -1,-2 A 1.0001,1.0001 0 0 1 2,19 V 18.158203 A 1.0001,1.0001 0 0 1 2.8808594,17.005859 1.0001,1.0001 0 0 1 2.953125,17.001953 1.0001,1.0001 0 0 1 3,17 h 0.8378906 a 1.0001,1.0001 0 0 1 0.3203125,0 H 5 a 1.0001,1.0001 0 0 1 0.9492188,0.683594 L 6.375,18.960938 6.5117188,19.097656 8.6894531,19.642578 11.507812,19.078125 12,18.585938 v -0.34961 l -0.412109,-0.824219 -0.998047,-0.5 -4.9609378,-1.984375 a 1.0001,1.0001 0 0 1 -0.076172,-0.0332 l -2,-1 A 1.0001,1.0001 0 0 1 3.1054688,13.447266 l -1,-2 a 1.0001,1.0001 0 0 1 0,-0.894532 l 1,-1.9999996 a 1.0001,1.0001 0 0 1 0.578125,-0.5019532 l 3,-1 A 1.0001,1.0001 0 0 1 7,7 h 1 1.9238281 a 1.0001,1.0001 0 0 1 0.1015629,-0.00391 z"
     id="path2" />
</svg>
