<?xml version="1.0" encoding="UTF-8"?>
<glyph name="less" format="1">
  <advance width="694"/>
  <unicode hex="003C"/>
  <outline>
    <contour>
      <point x="580" y="550" type="line"/>
      <point x="581" y="550" type="line"/>
      <point x="606" y="550" type="line"/>
      <point x="608" y="550" type="line" smooth="yes"/>
      <point x="611" y="550"/>
      <point x="616" y="548"/>
      <point x="618" y="546" type="curve" smooth="yes"/>
      <point x="619" y="544" type="line"/>
      <point x="619" y="543" type="line"/>
      <point x="620" y="543" type="line"/>
      <point x="620" y="542" type="line"/>
      <point x="622" y="541" type="line"/>
      <point x="622" y="540" type="line"/>
      <point x="623" y="538" type="line"/>
      <point x="623" y="537" type="line"/>
      <point x="623" y="536" type="line"/>
      <point x="623" y="535" type="line" smooth="yes"/>
      <point x="623" y="534"/>
      <point x="622" y="532"/>
      <point x="622" y="531" type="curve" smooth="yes"/>
      <point x="622" y="530" type="line" smooth="yes"/>
      <point x="621" y="527"/>
      <point x="617" y="523"/>
      <point x="614" y="522" type="curve" smooth="yes"/>
      <point x="614" y="521" type="line"/>
      <point x="174" y="275" type="line"/>
      <point x="614" y="28" type="line" smooth="yes"/>
      <point x="616" y="27"/>
      <point x="619" y="23"/>
      <point x="620" y="21" type="curve" smooth="yes"/>
      <point x="622" y="20" type="line"/>
      <point x="622" y="19" type="line" smooth="yes"/>
      <point x="622" y="18"/>
      <point x="623" y="16"/>
      <point x="623" y="15" type="curve" smooth="yes"/>
      <point x="623" y="14" type="line"/>
      <point x="623" y="13" type="line"/>
      <point x="623" y="11" type="line" smooth="yes"/>
      <point x="623" y="10"/>
      <point x="622" y="10"/>
      <point x="622" y="9" type="curve" smooth="yes"/>
      <point x="620" y="8" type="line" smooth="yes"/>
      <point x="620" y="7"/>
      <point x="619" y="7"/>
      <point x="619" y="6" type="curve" smooth="yes"/>
      <point x="619" y="4" type="line"/>
      <point x="618" y="4" type="line" smooth="yes"/>
      <point x="616" y="2"/>
      <point x="611" y="0"/>
      <point x="608" y="0" type="curve" smooth="yes"/>
      <point x="606" y="0" type="line"/>
      <point x="581" y="0" type="line"/>
      <point x="580" y="0" type="line"/>
      <point x="576" y="0" type="line"/>
      <point x="575" y="0" type="line"/>
      <point x="574" y="0" type="line"/>
      <point x="573" y="1" type="line" smooth="yes"/>
      <point x="572" y="1"/>
      <point x="572" y="2"/>
      <point x="571" y="2" type="curve" smooth="yes"/>
      <point x="109" y="262" type="line" smooth="yes"/>
      <point x="105" y="264"/>
      <point x="101" y="271"/>
      <point x="101" y="275" type="curve" smooth="yes"/>
      <point x="101" y="279"/>
      <point x="105" y="285"/>
      <point x="109" y="287" type="curve" smooth="yes"/>
      <point x="571" y="547" type="line"/>
      <point x="571" y="548" type="line"/>
      <point x="572" y="549"/>
      <point x="573" y="549" type="curve" smooth="yes"/>
      <point x="574" y="549" type="line"/>
      <point x="575" y="549" type="line"/>
      <point x="576" y="550" type="line"/>
    </contour>
  </outline>
  <lib>
    <dict>
      <key>com.fontlab.hintData</key>
      <dict>
        <key>hhints</key>
        <array>
          <dict>
            <key>position</key>
            <integer>0</integer>
            <key>width</key>
            <integer>23</integer>
          </dict>
        </array>
      </dict>
    </dict>
  </lib>
</glyph>
