<?xml version="1.0" encoding="UTF-8" standalone="no"?>
<svg
   xmlns:dc="http://purl.org/dc/elements/1.1/"
   xmlns:cc="http://creativecommons.org/ns#"
   xmlns:rdf="http://www.w3.org/1999/02/22-rdf-syntax-ns#"
   xmlns:svg="http://www.w3.org/2000/svg"
   xmlns="http://www.w3.org/2000/svg"
   xmlns:sodipodi="http://sodipodi.sourceforge.net/DTD/sodipodi-0.dtd"
   xmlns:inkscape="http://www.inkscape.org/namespaces/inkscape"
   data-dec="97"
   width="17"
   height="40"
   version="1.1"
   id="svg4"
   sodipodi:docname="97.svg"
   inkscape:version="0.92.4 (unknown)">
  <metadata
     id="metadata10">
    <rdf:RDF>
      <cc:Work
         rdf:about="">
        <dc:format>image/svg+xml</dc:format>
        <dc:type
           rdf:resource="http://purl.org/dc/dcmitype/StillImage" />
      </cc:Work>
    </rdf:RDF>
  </metadata>
  <defs
     id="defs8" />
  <sodipodi:namedview
     pagecolor="#ffffff"
     bordercolor="#666666"
     borderopacity="1"
     objecttolerance="10"
     gridtolerance="10"
     guidetolerance="10"
     inkscape:pageopacity="0"
     inkscape:pageshadow="2"
     inkscape:window-width="640"
     inkscape:window-height="480"
     id="namedview6"
     showgrid="false"
     inkscape:zoom="5.9"
     inkscape:cx="8.5"
     inkscape:cy="20"
     inkscape:window-x="0"
     inkscape:window-y="27"
     inkscape:window-maximized="0"
     inkscape:current-layer="svg4" />
  <path
     style="color:#000000;font-style:normal;font-variant:normal;font-weight:normal;font-stretch:normal;font-size:medium;line-height:normal;font-family:sans-serif;font-variant-ligatures:normal;font-variant-position:normal;font-variant-caps:normal;font-variant-numeric:normal;font-variant-alternates:normal;font-feature-settings:normal;text-indent:0;text-align:start;text-decoration:none;text-decoration-line:none;text-decoration-style:solid;text-decoration-color:#000000;letter-spacing:normal;word-spacing:normal;text-transform:none;writing-mode:lr-tb;direction:ltr;text-orientation:mixed;dominant-baseline:auto;baseline-shift:baseline;text-anchor:start;white-space:normal;shape-padding:0;clip-rule:nonzero;display:inline;overflow:visible;visibility:visible;opacity:1;isolation:auto;mix-blend-mode:normal;color-interpolation:sRGB;color-interpolation-filters:linearRGB;solid-color:#000000;solid-opacity:1;vector-effect:none;fill:#000000;fill-opacity:1;fill-rule:nonzero;stroke:none;stroke-width:1;stroke-linecap:round;stroke-linejoin:round;stroke-miterlimit:4;stroke-dasharray:none;stroke-dashoffset:0;stroke-opacity:1;color-rendering:auto;image-rendering:auto;shape-rendering:auto;text-rendering:auto;enable-background:accumulate"
     d="M 6.1171875,14.5 4.3730469,15.373047 3.5,17.117188 v 0.765624 L 4.4101562,19.703125 5.296875,20.589844 7.1171875,21.5 H 8.9179688 L 11.730469,20.5625 13.5,18.792969 V 16.308594 L 11.808594,15.462891 8.9179688,14.5 Z M 7,7.5 h 3 a 0.50005,0.50005 0 0 1 0.222656,0.052734 l 2,1 a 0.50005,0.50005 0 0 1 0.13086,0.09375 l 1,1 a 0.50005,0.50005 0 0 1 0.09375,0.1308594 l 0.96875,1.9394532 a 0.50005,0.50005 0 0 1 0.0059,0.0098 0.50005,0.50005 0 0 1 0.05859,0.128907 0.50005,0.50005 0 0 1 0.01172,0.04492 0.50005,0.50005 0 0 1 0.002,0.0098 0.50005,0.50005 0 0 1 0.0059,0.154297 v 3.863281 a 0.50005,0.50005 0 0 1 0,0.150391 v 2.855469 a 0.50005,0.50005 0 0 1 0,0.126953 V 22 a 0.50005,0.50005 0 1 1 -1,0 v -1.792969 l -1.146484,1.146485 a 0.50005,0.50005 0 0 1 -0.195313,0.121093 l -2.9999999,1 A 0.50005,0.50005 0 0 1 9,22.5 H 7 a 0.50005,0.50005 0 0 1 -0.2226562,-0.05273 l -2,-1 a 0.50005,0.50005 0 0 1 -0.1308594,-0.09375 l -1,-1 a 0.50005,0.50005 0 0 1 -0.09375,-0.13086 l -1,-2 A 0.50005,0.50005 0 0 1 2.5,18 v -1 a 0.50005,0.50005 0 0 1 0.052734,-0.222656 l 1,-2 a 0.50005,0.50005 0 0 1 0.2246094,-0.22461 l 2,-1 A 0.50005,0.50005 0 0 1 6,13.5 h 3 a 0.50005,0.50005 0 0 1 0.1582031,0.02539 l 2.9999999,1 a 0.50005,0.50005 0 0 1 0.06445,0.02734 L 13.5,15.191406 V 12.117188 L 12.589844,10.296875 11.703125,9.4101562 9.8828125,8.5 H 7.1171875 L 5.296875,9.4101562 4.3535156,10.353516 A 0.50005,0.50005 0 1 1 3.6464844,9.6464844 l 1,-1 a 0.50005,0.50005 0 0 1 0.1308594,-0.09375 l 2,-1 A 0.50005,0.50005 0 0 1 7,7.5 Z"
     id="path2" />
</svg>
