<?xml version="1.0" encoding="UTF-8"?>
<glyph name="udieresis" format="1">
  <advance width="578"/>
  <unicode hex="00FC"/>
  <outline>
    <contour>
      <point x="354" y="536" type="line"/>
      <point x="354" y="521" type="line"/>
      <point x="368" y="521" type="line"/>
      <point x="368" y="536" type="line"/>
    </contour>
    <contour>
      <point x="180" y="536" type="line"/>
      <point x="180" y="521" type="line"/>
      <point x="195" y="521" type="line"/>
      <point x="195" y="536" type="line"/>
    </contour>
    <contour>
      <point x="346" y="551" type="curve" smooth="yes"/>
      <point x="348" y="550" type="line"/>
      <point x="375" y="550" type="line" smooth="yes"/>
      <point x="379" y="550"/>
      <point x="383" y="547"/>
      <point x="383" y="543" type="curve" smooth="yes"/>
      <point x="383" y="515" type="line" smooth="yes"/>
      <point x="383" y="511"/>
      <point x="379" y="507"/>
      <point x="375" y="507" type="curve" smooth="yes"/>
      <point x="346" y="507" type="line" smooth="yes"/>
      <point x="342" y="507"/>
      <point x="340" y="511"/>
      <point x="340" y="515" type="curve" smooth="yes"/>
      <point x="340" y="542" type="line"/>
      <point x="340" y="543" type="line" smooth="yes"/>
      <point x="340" y="544"/>
      <point x="340" y="547"/>
      <point x="341" y="548" type="curve" smooth="yes"/>
      <point x="342" y="549" type="line"/>
      <point x="343" y="549" type="line"/>
      <point x="343" y="550" type="line" smooth="yes"/>
      <point x="344" y="550"/>
      <point x="345" y="551"/>
    </contour>
    <contour>
      <point x="173" y="551" type="curve" smooth="yes"/>
      <point x="174" y="550" type="line"/>
      <point x="202" y="550" type="line" smooth="yes"/>
      <point x="206" y="550"/>
      <point x="209" y="547"/>
      <point x="209" y="543" type="curve" smooth="yes"/>
      <point x="209" y="515" type="line" smooth="yes"/>
      <point x="209" y="511"/>
      <point x="206" y="507"/>
      <point x="202" y="507" type="curve" smooth="yes"/>
      <point x="173" y="507" type="line" smooth="yes"/>
      <point x="169" y="507"/>
      <point x="166" y="511"/>
      <point x="166" y="515" type="curve" smooth="yes"/>
      <point x="166" y="542" type="line"/>
      <point x="166" y="543" type="line" smooth="yes"/>
      <point x="166" y="544"/>
      <point x="166" y="547"/>
      <point x="167" y="548" type="curve" smooth="yes"/>
      <point x="168" y="549" type="line"/>
      <point x="169" y="549" type="line"/>
      <point x="169" y="550" type="line" smooth="yes"/>
      <point x="170" y="550"/>
      <point x="172" y="551"/>
    </contour>
    <contour>
      <point x="350" y="565" type="line"/>
      <point x="324" y="540" type="line"/>
      <point x="324" y="517" type="line"/>
      <point x="350" y="493" type="line"/>
      <point x="373" y="493" type="line"/>
      <point x="397" y="517" type="line"/>
      <point x="397" y="540" type="line"/>
      <point x="373" y="565" type="line"/>
    </contour>
    <contour>
      <point x="176" y="565" type="line"/>
      <point x="152" y="540" type="line"/>
      <point x="152" y="517" type="line"/>
      <point x="176" y="493" type="line"/>
      <point x="199" y="493" type="line"/>
      <point x="223" y="517" type="line"/>
      <point x="223" y="540" type="line"/>
      <point x="199" y="565" type="line"/>
    </contour>
    <contour>
      <point x="346" y="580" type="line"/>
      <point x="348" y="580" type="line"/>
      <point x="375" y="580" type="line"/>
      <point x="376" y="580" type="line" smooth="yes"/>
      <point x="377" y="580"/>
      <point x="380" y="579"/>
      <point x="381" y="578" type="curve" smooth="yes"/>
      <point x="409" y="549" type="line" smooth="yes"/>
      <point x="410" y="548"/>
      <point x="411" y="544"/>
      <point x="411" y="543" type="curve" smooth="yes"/>
      <point x="411" y="515" type="line" smooth="yes"/>
      <point x="411" y="514"/>
      <point x="410" y="510"/>
      <point x="409" y="509" type="curve" smooth="yes"/>
      <point x="381" y="481" type="line" smooth="yes"/>
      <point x="380" y="480"/>
      <point x="377" y="478"/>
      <point x="376" y="478" type="curve" smooth="yes"/>
      <point x="375" y="478" type="line"/>
      <point x="346" y="478" type="line" smooth="yes"/>
      <point x="345" y="478"/>
      <point x="342" y="480"/>
      <point x="341" y="481" type="curve" smooth="yes"/>
      <point x="312" y="509" type="line" smooth="yes"/>
      <point x="311" y="510"/>
      <point x="310" y="514"/>
      <point x="310" y="515" type="curve" smooth="yes"/>
      <point x="310" y="543" type="line" smooth="yes"/>
      <point x="310" y="544"/>
      <point x="311" y="548"/>
      <point x="312" y="549" type="curve" smooth="yes"/>
      <point x="341" y="576" type="line"/>
      <point x="342" y="578" type="line"/>
      <point x="343" y="579" type="line"/>
      <point x="344" y="579" type="line"/>
      <point x="344" y="580" type="line"/>
      <point x="345" y="580" type="line"/>
    </contour>
    <contour>
      <point x="173" y="580" type="line"/>
      <point x="174" y="580" type="line"/>
      <point x="202" y="580" type="line" smooth="yes"/>
      <point x="203" y="580"/>
      <point x="206" y="579"/>
      <point x="207" y="578" type="curve" smooth="yes"/>
      <point x="236" y="549" type="line" smooth="yes"/>
      <point x="237" y="548"/>
      <point x="238" y="544"/>
      <point x="238" y="543" type="curve" smooth="yes"/>
      <point x="238" y="515" type="line" smooth="yes"/>
      <point x="238" y="514"/>
      <point x="237" y="510"/>
      <point x="236" y="509" type="curve" smooth="yes"/>
      <point x="207" y="481" type="line" smooth="yes"/>
      <point x="206" y="480"/>
      <point x="203" y="478"/>
      <point x="202" y="478" type="curve" smooth="yes"/>
      <point x="173" y="478" type="line" smooth="yes"/>
      <point x="172" y="478"/>
      <point x="169" y="480"/>
      <point x="168" y="481" type="curve" smooth="yes"/>
      <point x="139" y="509" type="line" smooth="yes"/>
      <point x="138" y="510"/>
      <point x="136" y="514"/>
      <point x="136" y="515" type="curve" smooth="yes"/>
      <point x="136" y="543" type="line" smooth="yes"/>
      <point x="136" y="544"/>
      <point x="138" y="548"/>
      <point x="139" y="549" type="curve" smooth="yes"/>
      <point x="167" y="576" type="line"/>
      <point x="168" y="578" type="line"/>
      <point x="169" y="579" type="line"/>
      <point x="170" y="579" type="line"/>
      <point x="170" y="580" type="line"/>
      <point x="172" y="580" type="line"/>
    </contour>
    <contour>
      <point x="441" y="406" type="line"/>
      <point x="441" y="124" type="line"/>
      <point x="441" y="123" type="line"/>
      <point x="441" y="122" type="line"/>
      <point x="441" y="14" type="line"/>
      <point x="455" y="14" type="line"/>
      <point x="455" y="406" type="line"/>
    </contour>
    <contour>
      <point x="123" y="406" type="line"/>
      <point x="123" y="124" type="line"/>
      <point x="151" y="42" type="line"/>
      <point x="205" y="14" type="line"/>
      <point x="288" y="14" type="line"/>
      <point x="343" y="43" type="line"/>
      <point x="377" y="77" type="line"/>
      <point x="351" y="59" type="line"/>
      <point x="293" y="30" type="line"/>
      <point x="289" y="30" type="line"/>
      <point x="232" y="30" type="line"/>
      <point x="229" y="30" type="line"/>
      <point x="170" y="59" type="line"/>
      <point x="167" y="63" type="line"/>
      <point x="139" y="120" type="line" smooth="yes"/>
      <point x="139" y="121"/>
      <point x="138" y="122"/>
      <point x="138" y="123" type="curve" smooth="yes"/>
      <point x="138" y="406" type="line"/>
    </contour>
    <contour>
      <point x="116" y="420" type="curve" smooth="yes"/>
      <point x="117" y="420" type="line"/>
      <point x="145" y="420" type="line" smooth="yes"/>
      <point x="149" y="420"/>
      <point x="152" y="416"/>
      <point x="152" y="412" type="curve" smooth="yes"/>
      <point x="152" y="125" type="line"/>
      <point x="179" y="70" type="line"/>
      <point x="233" y="44" type="line"/>
      <point x="288" y="44" type="line"/>
      <point x="343" y="72" type="line"/>
      <point x="427" y="128" type="line"/>
      <point x="427" y="411" type="line"/>
      <point x="427" y="412" type="line" smooth="yes"/>
      <point x="427" y="413"/>
      <point x="428" y="416"/>
      <point x="429" y="417" type="curve" smooth="yes"/>
      <point x="429" y="418" type="line"/>
      <point x="430" y="419" type="line"/>
      <point x="431" y="419" type="line" smooth="yes"/>
      <point x="432" y="419"/>
      <point x="433" y="420"/>
      <point x="434" y="420" type="curve" smooth="yes"/>
      <point x="436" y="420" type="line"/>
      <point x="463" y="420" type="line" smooth="yes"/>
      <point x="467" y="420"/>
      <point x="471" y="416"/>
      <point x="471" y="412" type="curve" smooth="yes"/>
      <point x="471" y="9" type="line"/>
      <point x="471" y="8" type="line" smooth="yes"/>
      <point x="471" y="7"/>
      <point x="470" y="4"/>
      <point x="469" y="3" type="curve" smooth="yes"/>
      <point x="469" y="2" type="line"/>
      <point x="468" y="2" type="line"/>
      <point x="468" y="1" type="line"/>
      <point x="466" y="1" type="line" smooth="yes"/>
      <point x="465" y="1"/>
      <point x="464" y="0"/>
      <point x="463" y="0" type="curve" smooth="yes"/>
      <point x="462" y="0" type="line"/>
      <point x="434" y="0" type="line" smooth="yes"/>
      <point x="430" y="0"/>
      <point x="427" y="4"/>
      <point x="427" y="8" type="curve" smooth="yes"/>
      <point x="427" y="106" type="line"/>
      <point x="352" y="32" type="line"/>
      <point x="352" y="30"/>
      <point x="351" y="30" type="curve" smooth="yes"/>
      <point x="293" y="1" type="line" smooth="yes"/>
      <point x="292" y="1"/>
      <point x="290" y="0"/>
      <point x="289" y="0" type="curve" smooth="yes"/>
      <point x="202" y="0" type="line" smooth="yes"/>
      <point x="201" y="0"/>
      <point x="200" y="1"/>
      <point x="199" y="1" type="curve" smooth="yes"/>
      <point x="142" y="30" type="line" smooth="yes"/>
      <point x="141" y="31"/>
      <point x="138" y="33"/>
      <point x="138" y="34" type="curve" smooth="yes"/>
      <point x="109" y="121" type="line"/>
      <point x="109" y="123" type="line"/>
      <point x="109" y="411" type="line"/>
      <point x="109" y="412" type="line" smooth="yes"/>
      <point x="109" y="413"/>
      <point x="109" y="416"/>
      <point x="110" y="417" type="curve" smooth="yes"/>
      <point x="110" y="418" type="line"/>
      <point x="111" y="418" type="line"/>
      <point x="111" y="419" type="line"/>
      <point x="112" y="419" type="line" smooth="yes"/>
      <point x="113" y="419"/>
      <point x="115" y="420"/>
    </contour>
  </outline>
  <lib>
    <dict>
      <key>com.fontlab.hintData</key>
      <dict>
        <key>hhints</key>
        <array>
          <dict>
            <key>position</key>
            <integer>0</integer>
            <key>width</key>
            <integer>14</integer>
          </dict>
          <dict>
            <key>position</key>
            <integer>30</integer>
            <key>width</key>
            <integer>14</integer>
          </dict>
          <dict>
            <key>position</key>
            <integer>406</integer>
            <key>width</key>
            <integer>14</integer>
          </dict>
          <dict>
            <key>position</key>
            <integer>479</integer>
            <key>width</key>
            <integer>14</integer>
          </dict>
          <dict>
            <key>position</key>
            <integer>507</integer>
            <key>width</key>
            <integer>14</integer>
          </dict>
          <dict>
            <key>position</key>
            <integer>536</integer>
            <key>width</key>
            <integer>14</integer>
          </dict>
          <dict>
            <key>position</key>
            <integer>565</integer>
            <key>width</key>
            <integer>14</integer>
          </dict>
        </array>
        <key>vhints</key>
        <array>
          <dict>
            <key>position</key>
            <integer>109</integer>
            <key>width</key>
            <integer>14</integer>
          </dict>
          <dict>
            <key>position</key>
            <integer>136</integer>
            <key>width</key>
            <integer>15</integer>
          </dict>
          <dict>
            <key>position</key>
            <integer>138</integer>
            <key>width</key>
            <integer>14</integer>
          </dict>
          <dict>
            <key>position</key>
            <integer>166</integer>
            <key>width</key>
            <integer>14</integer>
          </dict>
          <dict>
            <key>position</key>
            <integer>195</integer>
            <key>width</key>
            <integer>14</integer>
          </dict>
          <dict>
            <key>position</key>
            <integer>223</integer>
            <key>width</key>
            <integer>14</integer>
          </dict>
          <dict>
            <key>position</key>
            <integer>310</integer>
            <key>width</key>
            <integer>14</integer>
          </dict>
          <dict>
            <key>position</key>
            <integer>340</integer>
            <key>width</key>
            <integer>14</integer>
          </dict>
          <dict>
            <key>position</key>
            <integer>369</integer>
            <key>width</key>
            <integer>14</integer>
          </dict>
          <dict>
            <key>position</key>
            <integer>397</integer>
            <key>width</key>
            <integer>14</integer>
          </dict>
          <dict>
            <key>position</key>
            <integer>427</integer>
            <key>width</key>
            <integer>14</integer>
          </dict>
          <dict>
            <key>position</key>
            <integer>455</integer>
            <key>width</key>
            <integer>15</integer>
          </dict>
        </array>
      </dict>
    </dict>
  </lib>
</glyph>
