<?xml version="1.0" encoding="UTF-8" standalone="no"?>
<svg
   xmlns:dc="http://purl.org/dc/elements/1.1/"
   xmlns:cc="http://creativecommons.org/ns#"
   xmlns:rdf="http://www.w3.org/1999/02/22-rdf-syntax-ns#"
   xmlns:svg="http://www.w3.org/2000/svg"
   xmlns="http://www.w3.org/2000/svg"
   xmlns:sodipodi="http://sodipodi.sourceforge.net/DTD/sodipodi-0.dtd"
   xmlns:inkscape="http://www.inkscape.org/namespaces/inkscape"
   data-dec="51"
   width="20"
   height="40"
   version="1.1"
   id="svg4"
   sodipodi:docname="51.svg"
   inkscape:version="0.92.4 5da689c313, 2019-01-14">
  <metadata
     id="metadata10">
    <rdf:RDF>
      <cc:Work
         rdf:about="">
        <dc:format>image/svg+xml</dc:format>
        <dc:type
           rdf:resource="http://purl.org/dc/dcmitype/StillImage" />
        <dc:title></dc:title>
      </cc:Work>
    </rdf:RDF>
  </metadata>
  <defs
     id="defs8" />
  <sodipodi:namedview
     pagecolor="#ffffff"
     bordercolor="#666666"
     borderopacity="1"
     objecttolerance="10"
     gridtolerance="10"
     guidetolerance="10"
     inkscape:pageopacity="0"
     inkscape:pageshadow="2"
     inkscape:window-width="1920"
     inkscape:window-height="1043"
     id="namedview6"
     showgrid="false"
     inkscape:zoom="5.9"
     inkscape:cx="10"
     inkscape:cy="20"
     inkscape:window-x="0"
     inkscape:window-y="37"
     inkscape:window-maximized="0"
     inkscape:current-layer="svg4" />
  <path
     style="color:#000000;font-style:normal;font-variant:normal;font-weight:normal;font-stretch:normal;font-size:medium;line-height:normal;font-family:sans-serif;font-variant-ligatures:normal;font-variant-position:normal;font-variant-caps:normal;font-variant-numeric:normal;font-variant-alternates:normal;font-feature-settings:normal;text-indent:0;text-align:start;text-decoration:none;text-decoration-line:none;text-decoration-style:solid;text-decoration-color:#000000;letter-spacing:normal;word-spacing:normal;text-transform:none;writing-mode:lr-tb;direction:ltr;text-orientation:mixed;dominant-baseline:auto;baseline-shift:baseline;text-anchor:start;white-space:normal;shape-padding:0;clip-rule:nonzero;display:inline;overflow:visible;visibility:visible;opacity:1;isolation:auto;mix-blend-mode:normal;color-interpolation:sRGB;color-interpolation-filters:linearRGB;solid-color:#000000;solid-opacity:1;vector-effect:none;fill:#000000;fill-opacity:1;fill-rule:nonzero;stroke:none;stroke-width:3;stroke-linecap:round;stroke-linejoin:round;stroke-miterlimit:4;stroke-dasharray:none;stroke-dashoffset:0;stroke-opacity:1;color-rendering:auto;image-rendering:auto;shape-rendering:auto;text-rendering:auto;enable-background:accumulate"
     d="m 5,-0.5 h 11 a 1.50015,1.50015 0 0 1 1.199219,2.4003906 L 13,7.5 a 1.50015,1.50015 0 0 1 0.669922,0.1582031 l 2,1 a 1.50015,1.50015 0 0 1 0.390625,0.28125 l 1,1 a 1.50015,1.50015 0 0 1 0.363281,0.5859379 l 1,3 A 1.50015,1.50015 0 0 1 18.5,14 v 2 a 1.50015,1.50015 0 0 1 -0.07617,0.474609 l -1,3 a 1.50015,1.50015 0 0 1 -0.363281,0.585938 l -2,2 a 1.50015,1.50015 0 0 1 -0.585938,0.363281 l -3,1 A 1.50015,1.50015 0 0 1 11,23.5 H 8 a 1.50015,1.50015 0 0 1 -0.4746094,-0.07617 l -3,-1 A 1.50015,1.50015 0 0 1 3.9394531,22.060547 l -1,-1 a 1.50015,1.50015 0 0 1 -0.28125,-0.390625 l -1,-2 a 1.50015,1.50015 0 1 1 2.6835938,-1.339844 l 0.890625,1.78125 0.578125,0.578125 L 8.2441406,20.5 h 2.5117184 l 2.433594,-0.810547 1.5,-1.5 L 15.5,15.755859 V 14.244141 L 14.689453,11.810547 14.111328,11.232422 12.646484,10.5 H 10 A 1.50015,1.50015 0 0 1 8.8007812,8.0996094 L 13,2.5 H 5 a 1.50015,1.50015 0 1 1 0,-3 z"
     id="path2" />
</svg>
