<?xml version="1.0" encoding="UTF-8" standalone="no"?>
<svg
   xmlns:dc="http://purl.org/dc/elements/1.1/"
   xmlns:cc="http://creativecommons.org/ns#"
   xmlns:rdf="http://www.w3.org/1999/02/22-rdf-syntax-ns#"
   xmlns:svg="http://www.w3.org/2000/svg"
   xmlns="http://www.w3.org/2000/svg"
   xmlns:sodipodi="http://sodipodi.sourceforge.net/DTD/sodipodi-0.dtd"
   xmlns:inkscape="http://www.inkscape.org/namespaces/inkscape"
   data-dec="89"
   width="20"
   height="40"
   version="1.1"
   id="svg4"
   sodipodi:docname="89.svg"
   inkscape:version="0.92.4 5da689c313, 2019-01-14">
  <metadata
     id="metadata10">
    <rdf:RDF>
      <cc:Work
         rdf:about="">
        <dc:format>image/svg+xml</dc:format>
        <dc:type
           rdf:resource="http://purl.org/dc/dcmitype/StillImage" />
        <dc:title></dc:title>
      </cc:Work>
    </rdf:RDF>
  </metadata>
  <defs
     id="defs8" />
  <sodipodi:namedview
     pagecolor="#ffffff"
     bordercolor="#666666"
     borderopacity="1"
     objecttolerance="10"
     gridtolerance="10"
     guidetolerance="10"
     inkscape:pageopacity="0"
     inkscape:pageshadow="2"
     inkscape:window-width="1920"
     inkscape:window-height="1043"
     id="namedview6"
     showgrid="false"
     inkscape:zoom="5.9"
     inkscape:cx="10"
     inkscape:cy="20"
     inkscape:window-x="0"
     inkscape:window-y="37"
     inkscape:window-maximized="0"
     inkscape:current-layer="svg4" />
  <path
     style="color:#000000;font-style:normal;font-variant:normal;font-weight:normal;font-stretch:normal;font-size:medium;line-height:normal;font-family:sans-serif;font-variant-ligatures:normal;font-variant-position:normal;font-variant-caps:normal;font-variant-numeric:normal;font-variant-alternates:normal;font-feature-settings:normal;text-indent:0;text-align:start;text-decoration:none;text-decoration-line:none;text-decoration-style:solid;text-decoration-color:#000000;letter-spacing:normal;word-spacing:normal;text-transform:none;writing-mode:lr-tb;direction:ltr;text-orientation:mixed;dominant-baseline:auto;baseline-shift:baseline;text-anchor:start;white-space:normal;shape-padding:0;clip-rule:nonzero;display:inline;overflow:visible;visibility:visible;opacity:1;isolation:auto;mix-blend-mode:normal;color-interpolation:sRGB;color-interpolation-filters:linearRGB;solid-color:#000000;solid-opacity:1;vector-effect:none;fill:#000000;fill-opacity:1;fill-rule:nonzero;stroke:none;stroke-width:2.5;stroke-linecap:round;stroke-linejoin:round;stroke-miterlimit:4;stroke-dasharray:none;stroke-dashoffset:0;stroke-opacity:1;color-rendering:auto;image-rendering:auto;shape-rendering:auto;text-rendering:auto;enable-background:accumulate"
     d="M 1.9570312,-0.26367188 A 1.250125,1.250125 0 0 1 2.1757812,-0.25 H 3 A 1.250125,1.250125 0 0 1 4.0234375,0.28320312 L 9.5,8.1074219 14.976562,0.28320312 A 1.250125,1.250125 0 0 1 16,-0.25 h 0.830078 a 1.250125,1.250125 0 0 1 1.208984,0.52929688 1.250125,1.250125 0 0 1 0.05469,0.0859375 1.250125,1.250125 0 0 1 0.01172,0.0195312 1.250125,1.250125 0 0 1 0.01563,0.0292969 1.250125,1.250125 0 0 1 0.0078,0.0175781 1.250125,1.250125 0 0 1 0.04492,0.0957031 1.250125,1.250125 0 0 1 -0.25,1.33203125 L 11.25,11.394531 v 10.40625 a 1.250125,1.250125 0 0 1 -0.332031,1.066407 1.250125,1.250125 0 0 1 -0.0078,0.0078 1.250125,1.250125 0 0 1 -0.0078,0.0078 1.250125,1.250125 0 0 1 -0.0059,0.0059 A 1.250125,1.250125 0 0 1 9.796875,23.25 H 9 A 1.250125,1.250125 0 0 1 7.75,22 V 11.394531 L 1.0761719,1.859375 a 1.250125,1.250125 0 0 1 -0.26757815,-1.28320312 1.250125,1.250125 0 0 1 0.007813,-0.0234375 1.250125,1.250125 0 0 1 0.0253906,-0.0585938 1.250125,1.250125 0 0 1 0.0351562,-0.0742187 1.250125,1.250125 0 0 1 0,-0.003906 1.250125,1.250125 0 0 1 0.0625,-0.10546874 1.250125,1.250125 0 0 1 1.01757808,-0.57421876 z"
     id="path2" />
</svg>
