<?xml version="1.0" encoding="UTF-8" standalone="no"?>
<svg
   xmlns:dc="http://purl.org/dc/elements/1.1/"
   xmlns:cc="http://creativecommons.org/ns#"
   xmlns:rdf="http://www.w3.org/1999/02/22-rdf-syntax-ns#"
   xmlns:svg="http://www.w3.org/2000/svg"
   xmlns="http://www.w3.org/2000/svg"
   xmlns:sodipodi="http://sodipodi.sourceforge.net/DTD/sodipodi-0.dtd"
   xmlns:inkscape="http://www.inkscape.org/namespaces/inkscape"
   data-dec="40"
   width="14"
   height="40"
   version="1.1"
   id="svg4"
   sodipodi:docname="40.svg"
   inkscape:version="0.92.4 5da689c313, 2019-01-14">
  <metadata
     id="metadata10">
    <rdf:RDF>
      <cc:Work
         rdf:about="">
        <dc:format>image/svg+xml</dc:format>
        <dc:type
           rdf:resource="http://purl.org/dc/dcmitype/StillImage" />
        <dc:title></dc:title>
      </cc:Work>
    </rdf:RDF>
  </metadata>
  <defs
     id="defs8" />
  <sodipodi:namedview
     pagecolor="#ffffff"
     bordercolor="#666666"
     borderopacity="1"
     objecttolerance="10"
     gridtolerance="10"
     guidetolerance="10"
     inkscape:pageopacity="0"
     inkscape:pageshadow="2"
     inkscape:window-width="1920"
     inkscape:window-height="1043"
     id="namedview6"
     showgrid="false"
     inkscape:zoom="5.9"
     inkscape:cx="7"
     inkscape:cy="20"
     inkscape:window-x="0"
     inkscape:window-y="37"
     inkscape:window-maximized="0"
     inkscape:current-layer="svg4" />
  <path
     style="color:#000000;font-style:normal;font-variant:normal;font-weight:normal;font-stretch:normal;font-size:medium;line-height:normal;font-family:sans-serif;font-variant-ligatures:normal;font-variant-position:normal;font-variant-caps:normal;font-variant-numeric:normal;font-variant-alternates:normal;font-feature-settings:normal;text-indent:0;text-align:start;text-decoration:none;text-decoration-line:none;text-decoration-style:solid;text-decoration-color:#000000;letter-spacing:normal;word-spacing:normal;text-transform:none;writing-mode:lr-tb;direction:ltr;text-orientation:mixed;dominant-baseline:auto;baseline-shift:baseline;text-anchor:start;white-space:normal;shape-padding:0;clip-rule:nonzero;display:inline;overflow:visible;visibility:visible;opacity:1;isolation:auto;mix-blend-mode:normal;color-interpolation:sRGB;color-interpolation-filters:linearRGB;solid-color:#000000;solid-opacity:1;vector-effect:none;fill:#000000;fill-opacity:1;fill-rule:nonzero;stroke:none;stroke-width:0.5;stroke-linecap:round;stroke-linejoin:round;stroke-miterlimit:4;stroke-dasharray:none;stroke-dashoffset:0;stroke-opacity:1;color-rendering:auto;image-rendering:auto;shape-rendering:auto;text-rendering:auto;enable-background:accumulate"
     d="M 6.6542969,3.25 5.2382812,6.0820312 4.25,11.025391 v 3.949218 L 5.2382812,19.917969 6.6542969,22.75 5.7636719,20.078125 a 0.250025,0.250025 0 0 1 -0.00977,-0.0293 l -1,-5 A 0.250025,0.250025 0 0 1 4.75,15 v -4 a 0.250025,0.250025 0 0 1 0.00391,-0.04883 l 1,-5.0000001 a 0.250025,0.250025 0 0 1 0.00977,-0.029297 z m 4.3398441,-6.5019531 a 0.250025,0.250025 0 0 1 0.183593,0.4296875 L 9.203125,-0.84960938 7.2324219,3.0957031 6.2421875,6.0644531 5.25,11.025391 v 3.949218 l 0.9921875,4.960938 0.9902344,2.96875 1.9707031,3.945312 1.974609,1.972657 a 0.25135383,0.25135383 0 0 1 -0.355468,0.355468 L 8.8359375,27.191406 a 0.250025,0.250025 0 0 1 -0.013672,-0.01367 0.250025,0.250025 0 0 1 -0.00391,-0.0039 0.250025,0.250025 0 0 1 -0.011719,-0.01563 0.250025,0.250025 0 0 1 -0.00391,-0.0039 0.250025,0.250025 0 0 1 -0.00391,-0.0039 0.250025,0.250025 0 0 1 -0.00781,-0.01172 l -2,-3 a 0.250025,0.250025 0 0 1 -0.013672,-0.02734 l -2,-4 a 0.250025,0.250025 0 0 1 -0.023438,-0.0625 l -1,-5 A 0.250025,0.250025 0 0 1 3.75,15 v -4 a 0.250025,0.250025 0 0 1 0.00391,-0.04883 l 1,-5.0000001 a 0.250025,0.250025 0 0 1 0.023438,-0.0625 l 2,-4 a 0.250025,0.250025 0 0 1 0.013672,-0.027344 l 2,-3 a 0.250025,0.250025 0 0 1 0.00781,-0.00977 0.250025,0.250025 0 0 1 0.00781,-0.00977 0.250025,0.250025 0 0 1 0.00781,-0.00977 0.250025,0.250025 0 0 1 0.00781,-0.00977 l 0.00781,-0.00781 1.9921879,-1.9921875 a 0.250025,0.250025 0 0 1 0.171875,-0.074219 z"
     id="path2" />
</svg>
