<?xml version="1.0" encoding="UTF-8" standalone="no"?>
<svg
   xmlns:dc="http://purl.org/dc/elements/1.1/"
   xmlns:cc="http://creativecommons.org/ns#"
   xmlns:rdf="http://www.w3.org/1999/02/22-rdf-syntax-ns#"
   xmlns:svg="http://www.w3.org/2000/svg"
   xmlns="http://www.w3.org/2000/svg"
   xmlns:sodipodi="http://sodipodi.sourceforge.net/DTD/sodipodi-0.dtd"
   xmlns:inkscape="http://www.inkscape.org/namespaces/inkscape"
   data-dec="169"
   width="24"
   height="40"
   version="1.1"
   id="svg4"
   sodipodi:docname="169.svg"
   inkscape:version="0.92.4 (unknown)">
  <metadata
     id="metadata10">
    <rdf:RDF>
      <cc:Work
         rdf:about="">
        <dc:format>image/svg+xml</dc:format>
        <dc:type
           rdf:resource="http://purl.org/dc/dcmitype/StillImage" />
      </cc:Work>
    </rdf:RDF>
  </metadata>
  <defs
     id="defs8" />
  <sodipodi:namedview
     pagecolor="#ffffff"
     bordercolor="#666666"
     borderopacity="1"
     objecttolerance="10"
     gridtolerance="10"
     guidetolerance="10"
     inkscape:pageopacity="0"
     inkscape:pageshadow="2"
     inkscape:window-width="640"
     inkscape:window-height="480"
     id="namedview6"
     showgrid="false"
     inkscape:zoom="5.9"
     inkscape:cx="12"
     inkscape:cy="20"
     inkscape:window-x="0"
     inkscape:window-y="27"
     inkscape:window-maximized="0"
     inkscape:current-layer="svg4" />
  <path
     style="color:#000000;font-style:normal;font-variant:normal;font-weight:normal;font-stretch:normal;font-size:medium;line-height:normal;font-family:sans-serif;font-variant-ligatures:normal;font-variant-position:normal;font-variant-caps:normal;font-variant-numeric:normal;font-variant-alternates:normal;font-feature-settings:normal;text-indent:0;text-align:start;text-decoration:none;text-decoration-line:none;text-decoration-style:solid;text-decoration-color:#000000;letter-spacing:normal;word-spacing:normal;text-transform:none;writing-mode:lr-tb;direction:ltr;text-orientation:mixed;dominant-baseline:auto;baseline-shift:baseline;text-anchor:start;white-space:normal;shape-padding:0;clip-rule:nonzero;display:inline;overflow:visible;visibility:visible;opacity:1;isolation:auto;mix-blend-mode:normal;color-interpolation:sRGB;color-interpolation-filters:linearRGB;solid-color:#000000;solid-opacity:1;vector-effect:none;fill:#013272;fill-opacity:1;fill-rule:nonzero;stroke:none;stroke-width:3;stroke-linecap:round;stroke-linejoin:round;stroke-miterlimit:4;stroke-dasharray:none;stroke-dashoffset:0;stroke-opacity:1;color-rendering:auto;image-rendering:auto;shape-rendering:auto;text-rendering:auto;enable-background:accumulate"
     d="m 11,5.5 h 2 a 1.50015,1.50015 0 0 1 0.669922,0.1582031 l 2,1 a 1.50015,1.50015 0 0 1 0.578125,0.5097657 l 2,3.0000002 A 1.50015,1.50015 0 0 1 18.5,11 v 5 a 1.50015,1.50015 0 0 1 -0.251953,0.832031 l -2,3 a 1.50015,1.50015 0 0 1 -0.578125,0.509766 l -2,1 A 1.50015,1.50015 0 0 1 13,21.5 h -2 a 1.50015,1.50015 0 0 1 -0.669922,-0.158203 l -1.9999999,-1 a 1.50015,1.50015 0 0 1 -0.390625,-0.28125 l -1,-1 A 1.50015,1.50015 0 1 1 9.0605469,16.939453 L 9.8886719,17.767578 11.353516,18.5 h 1.292968 L 13.972656,17.835938 15.5,15.544922 V 11.455078 L 13.972656,9.1640625 12.646484,8.5 H 11.353516 L 10.117188,9.1171875 9.3417969,10.669922 A 1.50015,1.50015 0 1 1 6.6582031,9.3300781 l 1,-2 a 1.50015,1.50015 0 0 1 0.671875,-0.671875 l 1.9999999,-1 A 1.50015,1.50015 0 0 1 11,5.5 Z M 10.244141,4.5 7.8105469,5.3105469 6.2324219,6.8886719 5.4160156,8.5234375 4.5,12.185547 v 2.628906 l 0.9160156,3.662109 0.8164063,1.634766 1.578125,1.578125 L 10.244141,22.5 h 3.511718 l 2.433594,-0.810547 1.578125,-1.578125 0.816406,-1.634766 L 19.5,14.814453 V 12.185547 L 18.583984,8.5234375 17.767578,6.8886719 16.189453,5.3105469 13.753906,4.5 Z m 3.789062,-3.0058594 a 1.50015,1.50015 0 0 1 0.179688,0.019531 1.50015,1.50015 0 0 1 0.388671,0.1054687 l 2.873047,0.9570313 a 1.50015,1.50015 0 0 1 0.585938,0.3632812 l 2,2 a 1.50015,1.50015 0 0 1 0.28125,0.390625 l 1,2 a 1.50015,1.50015 0 0 1 0.113281,0.3066407 l 1,4.0000002 A 1.50015,1.50015 0 0 1 22.5,12 v 3 a 1.50015,1.50015 0 0 1 -0.04492,0.363281 l -1,4 a 1.50015,1.50015 0 0 1 -0.113281,0.306641 l -1,2 a 1.50015,1.50015 0 0 1 -0.28125,0.390625 l -2,2 a 1.50015,1.50015 0 0 1 -0.585938,0.363281 l -3,1 A 1.50015,1.50015 0 0 1 14,25.5 h -4 a 1.50015,1.50015 0 0 1 -0.4746094,-0.07617 l -3,-1 A 1.50015,1.50015 0 0 1 5.9394531,24.060547 l -2,-2 a 1.50015,1.50015 0 0 1 -0.28125,-0.390625 l -1,-2 A 1.50015,1.50015 0 0 1 2.5449219,19.363281 l -1,-4 A 1.50015,1.50015 0 0 1 1.5,15 v -3 a 1.50015,1.50015 0 0 1 0.044922,-0.363281 l 1,-4.0000002 A 1.50015,1.50015 0 0 1 2.6582031,7.3300781 l 1,-2 a 1.50015,1.50015 0 0 1 0.28125,-0.390625 l 2,-2 A 1.50015,1.50015 0 0 1 6.5253906,2.5761719 l 3,-1 A 1.50015,1.50015 0 0 1 10,1.5 h 3.849609 a 1.50015,1.50015 0 0 1 0.183594,-0.00586 z"
     id="path2" />
</svg>
