<?xml version="1.0" encoding="UTF-8" standalone="no"?>
<svg
   xmlns:dc="http://purl.org/dc/elements/1.1/"
   xmlns:cc="http://creativecommons.org/ns#"
   xmlns:rdf="http://www.w3.org/1999/02/22-rdf-syntax-ns#"
   xmlns:svg="http://www.w3.org/2000/svg"
   xmlns="http://www.w3.org/2000/svg"
   xmlns:sodipodi="http://sodipodi.sourceforge.net/DTD/sodipodi-0.dtd"
   xmlns:inkscape="http://www.inkscape.org/namespaces/inkscape"
   data-dec="338"
   width="31"
   height="40"
   version="1.1"
   id="svg4"
   sodipodi:docname="338.svg"
   inkscape:version="0.92.4 5da689c313, 2019-01-14">
  <metadata
     id="metadata10">
    <rdf:RDF>
      <cc:Work
         rdf:about="">
        <dc:format>image/svg+xml</dc:format>
        <dc:type
           rdf:resource="http://purl.org/dc/dcmitype/StillImage" />
        <dc:title></dc:title>
      </cc:Work>
    </rdf:RDF>
  </metadata>
  <defs
     id="defs8" />
  <sodipodi:namedview
     pagecolor="#ffffff"
     bordercolor="#666666"
     borderopacity="1"
     objecttolerance="10"
     gridtolerance="10"
     guidetolerance="10"
     inkscape:pageopacity="0"
     inkscape:pageshadow="2"
     inkscape:window-width="1920"
     inkscape:window-height="1043"
     id="namedview6"
     showgrid="false"
     inkscape:zoom="5.9"
     inkscape:cx="15.5"
     inkscape:cy="20"
     inkscape:window-x="0"
     inkscape:window-y="37"
     inkscape:window-maximized="0"
     inkscape:current-layer="svg4" />
  <path
     style="color:#000000;font-style:normal;font-variant:normal;font-weight:normal;font-stretch:normal;font-size:medium;line-height:normal;font-family:sans-serif;font-variant-ligatures:normal;font-variant-position:normal;font-variant-caps:normal;font-variant-numeric:normal;font-variant-alternates:normal;font-feature-settings:normal;text-indent:0;text-align:start;text-decoration:none;text-decoration-line:none;text-decoration-style:solid;text-decoration-color:#000000;letter-spacing:normal;word-spacing:normal;text-transform:none;writing-mode:lr-tb;direction:ltr;text-orientation:mixed;dominant-baseline:auto;baseline-shift:baseline;text-anchor:start;white-space:normal;shape-padding:0;clip-rule:nonzero;display:inline;overflow:visible;visibility:visible;opacity:1;isolation:auto;mix-blend-mode:normal;color-interpolation:sRGB;color-interpolation-filters:linearRGB;solid-color:#000000;solid-opacity:1;vector-effect:none;fill:#000000;fill-opacity:1;fill-rule:nonzero;stroke:none;stroke-width:1.5;stroke-linecap:round;stroke-linejoin:round;stroke-miterlimit:4;stroke-dasharray:none;stroke-dashoffset:0;stroke-opacity:1;color-rendering:auto;image-rendering:auto;shape-rendering:auto;text-rendering:auto;enable-background:accumulate"
     d="M 10.119141,1.75 7.4042969,2.65625 5.6171875,4.4433594 4.6953125,6.2871094 3.75,9.1210938 v 4.7578122 l 0.9453125,2.833985 0.921875,1.84375 1.7871094,1.787109 2.7148441,0.90625 h 3.761718 L 15.09375,20.845703 15.25,20.6875 V 2.3125 L 15.09375,2.1542969 13.878906,1.75 Z m 5.86914,-1.50976562 A 0.750075,0.750075 0 0 1 16.123047,0.25 h 0.753906 a 0.750075,0.750075 0 0 1 0.246094,0 h 6.810547 a 0.750075,0.750075 0 0 1 0.11914,0 H 29 A 0.750075,0.750075 0 0 1 29.75,1 V 4 A 0.750075,0.750075 0 0 1 28.330078,4.3359375 L 27.484375,2.6445312 23.904297,1.75 H 17.75 V 2 9 10.25 h 6.074219 L 25.556641,9.3828125 26.46875,8.46875 A 0.750075,0.750075 0 0 1 27.75,9 v 1.876953 a 0.750075,0.750075 0 0 1 0,0.246094 V 13 a 0.750075,0.750075 0 0 1 -1.28125,0.53125 L 25.556641,12.617188 23.824219,11.75 H 17.75 V 16 20.6875 l 0.5625,0.5625 h 6.568359 l 2.832032,-0.945312 1.951171,-0.97461 a 0.750075,0.750075 0 0 1 1.00586,1.00586 l -1,2 A 0.750075,0.750075 0 0 1 29,22.75 h -3.945312 a 0.750075,0.750075 0 0 1 -0.126954,0 h -6.820312 a 0.750075,0.750075 0 0 1 -0.199219,0 h -0.785156 a 0.750075,0.750075 0 0 1 -0.246094,0 h -0.753906 a 0.750075,0.750075 0 0 1 -0.246094,0 H 15 14.054688 a 0.750075,0.750075 0 0 1 -0.126954,0 h -3.849609 a 0.750075,0.750075 0 0 1 -0.1855469,-0.0078 0.750075,0.750075 0 0 1 -0.058594,-0.0098 0.750075,0.750075 0 0 1 -0.00781,-0.002 0.750075,0.750075 0 0 1 -0.00781,-0.002 l -4,-1 A 0.750075,0.750075 0 0 1 5.46875,21.53125 l -2,-2 A 0.750075,0.750075 0 0 1 3.3300781,19.335938 l -1,-2 a 0.750075,0.750075 0 0 1 -0.041016,-0.09961 l -1,-3 A 0.750075,0.750075 0 0 1 1.25,14 V 9 a 0.750075,0.750075 0 0 1 0.039063,-0.2363281 l 1,-3 a 0.750075,0.750075 0 0 1 0.041016,-0.099609 l 1,-2 A 0.750075,0.750075 0 0 1 3.46875,3.46875 l 2,-2 A 0.750075,0.750075 0 0 1 5.8183594,1.2714844 L 9.8125,0.2734375 a 0.750075,0.750075 0 0 1 0.00586,-0.001953 A 0.750075,0.750075 0 0 1 9.8515625,0.265625 0.750075,0.750075 0 0 1 10.072266,0.25 h 3.849609 a 0.750075,0.750075 0 0 1 0.132813,0 H 15 15.876953 a 0.750075,0.750075 0 0 1 0.111328,-0.009766 z"
     id="path2" />
</svg>
