<?xml version="1.0" encoding="UTF-8" standalone="no"?>
<svg
   xmlns:dc="http://purl.org/dc/elements/1.1/"
   xmlns:cc="http://creativecommons.org/ns#"
   xmlns:rdf="http://www.w3.org/1999/02/22-rdf-syntax-ns#"
   xmlns:svg="http://www.w3.org/2000/svg"
   xmlns="http://www.w3.org/2000/svg"
   xmlns:sodipodi="http://sodipodi.sourceforge.net/DTD/sodipodi-0.dtd"
   xmlns:inkscape="http://www.inkscape.org/namespaces/inkscape"
   data-dec="77"
   width="12"
   height="40"
   version="1.1"
   id="svg4"
   sodipodi:docname="77.svg"
   inkscape:version="0.92.4 5da689c313, 2019-01-14">
  <metadata
     id="metadata10">
    <rdf:RDF>
      <cc:Work
         rdf:about="">
        <dc:format>image/svg+xml</dc:format>
        <dc:type
           rdf:resource="http://purl.org/dc/dcmitype/StillImage" />
        <dc:title></dc:title>
      </cc:Work>
    </rdf:RDF>
  </metadata>
  <defs
     id="defs8" />
  <sodipodi:namedview
     pagecolor="#ffffff"
     bordercolor="#666666"
     borderopacity="1"
     objecttolerance="10"
     gridtolerance="10"
     guidetolerance="10"
     inkscape:pageopacity="0"
     inkscape:pageshadow="2"
     inkscape:window-width="1920"
     inkscape:window-height="1043"
     id="namedview6"
     showgrid="false"
     inkscape:zoom="5.9"
     inkscape:cx="6"
     inkscape:cy="20"
     inkscape:window-x="0"
     inkscape:window-y="37"
     inkscape:window-maximized="0"
     inkscape:current-layer="svg4" />
  <path
     style="color:#000000;font-style:normal;font-variant:normal;font-weight:normal;font-stretch:normal;font-size:medium;line-height:normal;font-family:sans-serif;font-variant-ligatures:normal;font-variant-position:normal;font-variant-caps:normal;font-variant-numeric:normal;font-variant-alternates:normal;font-feature-settings:normal;text-indent:0;text-align:start;text-decoration:none;text-decoration-line:none;text-decoration-style:solid;text-decoration-color:#000000;letter-spacing:normal;word-spacing:normal;text-transform:none;writing-mode:lr-tb;direction:ltr;text-orientation:mixed;dominant-baseline:auto;baseline-shift:baseline;text-anchor:start;white-space:normal;shape-padding:0;clip-rule:nonzero;display:inline;overflow:visible;visibility:visible;opacity:1;isolation:auto;mix-blend-mode:normal;color-interpolation:sRGB;color-interpolation-filters:linearRGB;solid-color:#000000;solid-opacity:1;vector-effect:none;fill:#000000;fill-opacity:1;fill-rule:nonzero;stroke:none;stroke-width:1.5;stroke-linecap:round;stroke-linejoin:round;stroke-miterlimit:4;stroke-dasharray:none;stroke-dashoffset:0;stroke-opacity:1;color-rendering:auto;image-rendering:auto;shape-rendering:auto;text-rendering:auto;enable-background:accumulate"
     d="m 2.4882812,0.24023438 a 0.750075,0.750075 0 0 1 0.076172,0.001953 0.750075,0.750075 0 0 1 0.00977,0.001953 0.750075,0.750075 0 0 1 0.035156,0.003906 0.750075,0.750075 0 0 1 0.052734,0.009766 0.750075,0.750075 0 0 1 0.064453,0.0175781 0.750075,0.750075 0 0 1 0.00781,0.001953 0.750075,0.750075 0 0 1 0.046875,0.0175781 0.750075,0.750075 0 0 1 0.023437,0.009766 0.750075,0.750075 0 0 1 0.021484,0.0117188 0.750075,0.750075 0 0 1 0.044922,0.0214844 0.750075,0.750075 0 0 1 0.00781,0.005859 0.750075,0.750075 0 0 1 0.054688,0.0351563 0.750075,0.750075 0 0 1 0.058594,0.046875 0.750075,0.750075 0 0 1 0.00586,0.005859 0.750075,0.750075 0 0 1 0.027344,0.0234375 0.750075,0.750075 0 0 1 0.00391,0.003906 0.750075,0.750075 0 0 1 0.00391,0.003906 0.750075,0.750075 0 0 1 0.013672,0.015625 0.750075,0.750075 0 0 1 0.029297,0.0292969 0.750075,0.750075 0 0 1 0.00391,0.005859 0.750075,0.750075 0 0 1 0.1796875,0.47460937 v 0.005859 L 6,17.435547 8.7402344,0.99023438 a 0.750075,0.750075 0 0 1 0.1914062,-0.48828126 0.750075,0.750075 0 0 1 0.011719,-0.0136719 0.750075,0.750075 0 0 1 0.00781,-0.009766 0.750075,0.750075 0 0 1 0.00391,-0.003906 0.750075,0.750075 0 0 1 0.00195,-0.001953 0.750075,0.750075 0 0 1 0.00586,-0.005859 0.750075,0.750075 0 0 1 0.023437,-0.0214844 0.750075,0.750075 0 0 1 0.00586,-0.005859 0.750075,0.750075 0 0 1 0.015625,-0.015625 0.750075,0.750075 0 0 1 0.00586,-0.003906 0.750075,0.750075 0 0 1 0.035156,-0.0273438 0.750075,0.750075 0 0 1 0.060547,-0.0429687 0.750075,0.750075 0 0 1 0.066406,-0.0351563 0.750075,0.750075 0 0 1 0.068359,-0.0292969 0.750075,0.750075 0 0 1 0.1464844,-0.0371094 0.750075,0.750075 0 0 1 0.050781,-0.005859 0.750075,0.750075 0 0 1 0.046875,-0.001953 0.750075,0.750075 0 0 1 0.066406,0.001953 0.750075,0.750075 0 0 1 0.037109,0.003906 0.750075,0.750075 0 0 1 0.029297,0.003906 0.750075,0.750075 0 0 1 0.00195,0 H 11 a 0.750075,0.750075 0 1 1 0,1.5 h -0.75 v 19.5 H 11 a 0.750075,0.750075 0 1 1 0,1.5 H 9.6230469 a 0.750075,0.750075 0 0 1 -0.2460938,0 H 8 a 0.750075,0.750075 0 1 1 0,-1.5 H 8.75 V 10.064453 L 6.7480469,22.076172 a 0.750075,0.750075 0 0 1 0,0.002 0.750075,0.750075 0 0 1 -0.1855469,0.427734 0.750075,0.750075 0 0 1 -0.171875,0.144532 0.750075,0.750075 0 0 1 -0.066406,0.03516 0.750075,0.750075 0 0 1 -0.068359,0.0293 0.750075,0.750075 0 0 1 -0.072266,0.02148 0.750075,0.750075 0 0 1 -0.070313,0.01563 0.750075,0.750075 0 0 1 -0.00391,0 0.750075,0.750075 0 0 1 -0.011719,0.002 0.750075,0.750075 0 0 1 -0.046875,0.0039 0.750075,0.750075 0 0 1 -0.064453,0.002 0.750075,0.750075 0 0 1 -0.050781,-0.002 0.750075,0.750075 0 0 1 -0.039063,-0.0039 0.750075,0.750075 0 0 1 -0.00977,-0.002 0.750075,0.750075 0 0 1 -0.056641,-0.01172 0.750075,0.750075 0 0 1 -0.054687,-0.01563 0.750075,0.750075 0 0 1 -0.011719,-0.0039 0.750075,0.750075 0 0 1 -0.068359,-0.02539 0.750075,0.750075 0 0 1 -0.066406,-0.0332 0.750075,0.750075 0 0 1 -0.0625,-0.04102 0.750075,0.750075 0 0 1 -0.1621093,-0.15625 0.750075,0.750075 0 0 1 -0.078125,-0.126953 0.750075,0.750075 0 0 1 -0.074219,-0.261719 L 3.25,10.064453 V 21.25 H 4 a 0.750075,0.750075 0 1 1 0,1.5 H 2.6230469 a 0.750075,0.750075 0 0 1 -0.2460938,0 H 1 a 0.750075,0.750075 0 1 1 0,-1.5 H 1.75 V 1.75 H 1 a 0.750075,0.750075 0 1 1 0,-1.5 h 1.3710938 a 0.750075,0.750075 0 0 1 0.00781,0 0.750075,0.750075 0 0 1 0.048828,-0.005859 0.750075,0.750075 0 0 1 0.00977,-0.001953 0.750075,0.750075 0 0 1 0.050781,-0.001953 z"
     id="path2" />
</svg>
