<?xml version="1.0" encoding="UTF-8" standalone="no"?>
<svg
   xmlns:dc="http://purl.org/dc/elements/1.1/"
   xmlns:cc="http://creativecommons.org/ns#"
   xmlns:rdf="http://www.w3.org/1999/02/22-rdf-syntax-ns#"
   xmlns:svg="http://www.w3.org/2000/svg"
   xmlns="http://www.w3.org/2000/svg"
   xmlns:sodipodi="http://sodipodi.sourceforge.net/DTD/sodipodi-0.dtd"
   xmlns:inkscape="http://www.inkscape.org/namespaces/inkscape"
   data-dec="67"
   width="20"
   height="40"
   version="1.1"
   id="svg4"
   sodipodi:docname="67.svg"
   inkscape:version="0.92.4 (unknown)">
  <metadata
     id="metadata10">
    <rdf:RDF>
      <cc:Work
         rdf:about="">
        <dc:format>image/svg+xml</dc:format>
        <dc:type
           rdf:resource="http://purl.org/dc/dcmitype/StillImage" />
      </cc:Work>
    </rdf:RDF>
  </metadata>
  <defs
     id="defs8" />
  <sodipodi:namedview
     pagecolor="#ffffff"
     bordercolor="#666666"
     borderopacity="1"
     objecttolerance="10"
     gridtolerance="10"
     guidetolerance="10"
     inkscape:pageopacity="0"
     inkscape:pageshadow="2"
     inkscape:window-width="615"
     inkscape:window-height="417"
     id="namedview6"
     showgrid="false"
     inkscape:zoom="5.9"
     inkscape:cx="10"
     inkscape:cy="20"
     inkscape:window-x="0"
     inkscape:window-y="27"
     inkscape:window-maximized="0"
     inkscape:current-layer="svg4" />
  <path
     style="color:#000000;font-style:normal;font-variant:normal;font-weight:normal;font-stretch:normal;font-size:medium;line-height:normal;font-family:sans-serif;font-variant-ligatures:normal;font-variant-position:normal;font-variant-caps:normal;font-variant-numeric:normal;font-variant-alternates:normal;font-feature-settings:normal;text-indent:0;text-align:start;text-decoration:none;text-decoration-line:none;text-decoration-style:solid;text-decoration-color:#000000;letter-spacing:normal;word-spacing:normal;text-transform:none;writing-mode:lr-tb;direction:ltr;text-orientation:mixed;dominant-baseline:auto;baseline-shift:baseline;text-anchor:start;white-space:normal;shape-padding:0;clip-rule:nonzero;display:inline;overflow:visible;visibility:visible;opacity:1;isolation:auto;mix-blend-mode:normal;color-interpolation:sRGB;color-interpolation-filters:linearRGB;solid-color:#000000;solid-opacity:1;vector-effect:none;fill:#013272;fill-opacity:1;fill-rule:nonzero;stroke:none;stroke-width:2;stroke-linecap:round;stroke-linejoin:round;stroke-miterlimit:4;stroke-dasharray:none;stroke-dashoffset:0;stroke-opacity:1;color-rendering:auto;image-rendering:auto;shape-rendering:auto;text-rendering:auto;enable-background:accumulate"
     d="M 10.003906,-0.00585938 A 1.0001,1.0001 0 0 1 10.119141,0 H 13 a 1.0001,1.0001 0 0 1 0.447266,0.10546875 l 2,1.00000005 a 1.0001,1.0001 0 0 1 0.259765,0.1875 L 16.5625,2.1484375 17.050781,0.68359375 A 1.0001,1.0001 0 0 1 19,1 V 7 A 1.0001,1.0001 0 0 1 17.050781,7.3164062 L 16.125,4.5410156 14.408203,2.8222656 12.763672,2 H 10.236328 L 8.6855469,2.7753906 6.9277344,5.4101562 6,9.1230469 V 13.876953 L 6.9277344,17.589844 8.6855469,20.224609 10.236328,21 h 2.527344 l 1.644531,-0.822266 1.769531,-1.769531 0.927735,-1.855469 a 1.0001163,1.0001163 0 1 1 1.789062,0.894532 l -1,2 a 1.0001,1.0001 0 0 1 -0.1875,0.259765 l -2,2 a 1.0001,1.0001 0 0 1 -0.259765,0.1875 l -2,1 A 1.0001,1.0001 0 0 1 13,23 h -2.890625 a 1.0001,1.0001 0 0 1 -0.4257812,-0.05078 l -0.039063,-0.01367 -2.9609374,-0.986328 a 1.0001,1.0001 0 0 1 -0.390625,-0.242188 l -2,-2 a 1.0001,1.0001 0 0 1 -0.1875,-0.259765 l -1,-2 a 1.0001,1.0001 0 0 1 -0.054688,-0.13086 l -1,-3 A 1.0001,1.0001 0 0 1 2,14 V 9 a 1.0001,1.0001 0 0 1 0.050781,-0.3164062 l 1,-3 a 1.0001,1.0001 0 0 1 0.054688,-0.1308594 l 1,-2 a 1.0001,1.0001 0 0 1 0.1875,-0.2597656 l 2,-2 A 1.0001,1.0001 0 0 1 6.6835938,1.0507812 L 9.6777344,0.05273437 a 1.0001,1.0001 0 0 1 0.00586,-0.0019531 1.0001,1.0001 0 0 1 0.3203122,-0.05664063 z"
     id="path2" />
</svg>
