<?xml version="1.0" encoding="UTF-8" standalone="no"?>
<svg
   xmlns:dc="http://purl.org/dc/elements/1.1/"
   xmlns:cc="http://creativecommons.org/ns#"
   xmlns:rdf="http://www.w3.org/1999/02/22-rdf-syntax-ns#"
   xmlns:svg="http://www.w3.org/2000/svg"
   xmlns="http://www.w3.org/2000/svg"
   xmlns:sodipodi="http://sodipodi.sourceforge.net/DTD/sodipodi-0.dtd"
   xmlns:inkscape="http://www.inkscape.org/namespaces/inkscape"
   data-dec="87"
   width="26"
   height="40"
   version="1.1"
   id="svg4"
   sodipodi:docname="87.svg"
   inkscape:version="0.92.4 5da689c313, 2019-01-14">
  <metadata
     id="metadata10">
    <rdf:RDF>
      <cc:Work
         rdf:about="">
        <dc:format>image/svg+xml</dc:format>
        <dc:type
           rdf:resource="http://purl.org/dc/dcmitype/StillImage" />
        <dc:title></dc:title>
      </cc:Work>
    </rdf:RDF>
  </metadata>
  <defs
     id="defs8" />
  <sodipodi:namedview
     pagecolor="#ffffff"
     bordercolor="#666666"
     borderopacity="1"
     objecttolerance="10"
     gridtolerance="10"
     guidetolerance="10"
     inkscape:pageopacity="0"
     inkscape:pageshadow="2"
     inkscape:window-width="1920"
     inkscape:window-height="1043"
     id="namedview6"
     showgrid="false"
     inkscape:zoom="5.9"
     inkscape:cx="13"
     inkscape:cy="20"
     inkscape:window-x="0"
     inkscape:window-y="37"
     inkscape:window-maximized="0"
     inkscape:current-layer="svg4" />
  <path
     style="color:#000000;font-style:normal;font-variant:normal;font-weight:normal;font-stretch:normal;font-size:medium;line-height:normal;font-family:sans-serif;font-variant-ligatures:normal;font-variant-position:normal;font-variant-caps:normal;font-variant-numeric:normal;font-variant-alternates:normal;font-feature-settings:normal;text-indent:0;text-align:start;text-decoration:none;text-decoration-line:none;text-decoration-style:solid;text-decoration-color:#000000;letter-spacing:normal;word-spacing:normal;text-transform:none;writing-mode:lr-tb;direction:ltr;text-orientation:mixed;dominant-baseline:auto;baseline-shift:baseline;text-anchor:start;white-space:normal;shape-padding:0;clip-rule:nonzero;display:inline;overflow:visible;visibility:visible;opacity:1;isolation:auto;mix-blend-mode:normal;color-interpolation:sRGB;color-interpolation-filters:linearRGB;solid-color:#000000;solid-opacity:1;vector-effect:none;fill:#000000;fill-opacity:1;fill-rule:nonzero;stroke:none;stroke-width:0.5;stroke-linecap:round;stroke-linejoin:round;stroke-miterlimit:4;stroke-dasharray:none;stroke-dashoffset:0;stroke-opacity:1;color-rendering:auto;image-rendering:auto;shape-rendering:auto;text-rendering:auto;enable-background:accumulate"
     d="M 2.3320312,1.25 7.9960938,21.080078 12.751953,3.9609375 a 0.250025,0.250025 0 0 1 0.002,-0.00977 0.250025,0.250025 0 0 1 0.0098,-0.035156 0.250025,0.250025 0 0 1 0.0098,-0.023437 0.250025,0.250025 0 0 1 0.01172,-0.021484 0.250025,0.250025 0 0 1 0.0059,-0.011719 0.250025,0.250025 0 0 1 0.0078,-0.00977 0.250025,0.250025 0 0 1 0.01563,-0.019531 0.250025,0.250025 0 0 1 0.0078,-0.00977 0.250025,0.250025 0 0 1 0.0098,-0.00781 0.250025,0.250025 0 0 1 0.01953,-0.015625 0.250025,0.250025 0 0 1 0.0098,-0.00781 0.250025,0.250025 0 0 1 0.0098,-0.00586 0.250025,0.250025 0 0 1 0.01172,-0.00781 0.250025,0.250025 0 0 1 0.0098,-0.00391 0.250025,0.250025 0 0 1 0.01172,-0.00586 0.250025,0.250025 0 0 1 0.01172,-0.00391 0.250025,0.250025 0 0 1 0.02539,-0.00781 0.250025,0.250025 0 0 1 0.02344,-0.00391 0.250025,0.250025 0 0 1 0.01172,-0.00195 0.250025,0.250025 0 0 1 0.002,0 0.250025,0.250025 0 0 1 0.01172,-0.00195 0.250025,0.250025 0 0 1 0.02539,0 0.250025,0.250025 0 0 1 0.01172,0.00195 0.250025,0.250025 0 0 1 0.01172,0.00195 0.250025,0.250025 0 0 1 0.01367,0.00195 0.250025,0.250025 0 0 1 0.04687,0.015625 0.250025,0.250025 0 0 1 0.02149,0.011719 0.250025,0.250025 0 0 1 0.01172,0.00586 0.250025,0.250025 0 0 1 0.0098,0.00781 0.250025,0.250025 0 0 1 0.03906,0.03125 0.250025,0.250025 0 0 1 0.0078,0.00781 0.250025,0.250025 0 0 1 0.0078,0.011719 0.250025,0.250025 0 0 1 0.05273,0.125 L 18.003906,21.080078 23.667969,1.25 h -0.478516 l -4.941406,17.791016 a 0.250025,0.250025 0 0 1 -0.002,0.0078 0.250025,0.250025 0 0 1 -0.0098,0.03516 0.250025,0.250025 0 0 1 -0.0098,0.02344 0.250025,0.250025 0 0 1 -0.01172,0.02148 0.250025,0.250025 0 0 1 -0.0059,0.01172 0.250025,0.250025 0 0 1 -0.0078,0.0098 0.250025,0.250025 0 0 1 -0.01563,0.01953 0.250025,0.250025 0 0 1 -0.0078,0.0098 0.250025,0.250025 0 0 1 -0.0098,0.0078 0.250025,0.250025 0 0 1 -0.01953,0.01563 0.250025,0.250025 0 0 1 -0.0098,0.0078 0.250025,0.250025 0 0 1 -0.0098,0.0059 0.250025,0.250025 0 0 1 -0.01172,0.0078 0.250025,0.250025 0 0 1 -0.0098,0.0039 0.250025,0.250025 0 0 1 -0.01172,0.0059 0.250025,0.250025 0 0 1 -0.01172,0.0039 0.250025,0.250025 0 0 1 -0.02539,0.0078 0.250025,0.250025 0 0 1 -0.02344,0.0039 0.250025,0.250025 0 0 1 -0.01367,0.002 0.250025,0.250025 0 0 1 -0.01172,0.002 0.250025,0.250025 0 0 1 -0.01172,0 0.250025,0.250025 0 0 1 -0.01367,0 0.250025,0.250025 0 0 1 -0.03711,-0.0059 0.250025,0.250025 0 0 1 -0.04687,-0.01563 0.250025,0.250025 0 0 1 -0.02148,-0.01172 0.250025,0.250025 0 0 1 -0.01172,-0.0059 0.250025,0.250025 0 0 1 -0.0098,-0.0078 0.250025,0.250025 0 0 1 -0.03906,-0.03125 0.250025,0.250025 0 0 1 -0.0078,-0.0078 0.250025,0.250025 0 0 1 -0.0078,-0.01172 0.250025,0.250025 0 0 1 -0.05273,-0.125 L 13,1.9316406 8.2480469,19.039062 a 0.250025,0.250025 0 0 1 -0.00195,0.0098 0.250025,0.250025 0 0 1 -0.00977,0.03516 0.250025,0.250025 0 0 1 -0.00977,0.02344 0.250025,0.250025 0 0 1 -0.011719,0.02148 0.250025,0.250025 0 0 1 -0.00586,0.01172 0.250025,0.250025 0 0 1 -0.00781,0.0098 0.250025,0.250025 0 0 1 -0.015625,0.01953 0.250025,0.250025 0 0 1 -0.00781,0.0098 0.250025,0.250025 0 0 1 -0.00977,0.0078 0.250025,0.250025 0 0 1 -0.019531,0.01563 0.250025,0.250025 0 0 1 -0.00977,0.0078 0.250025,0.250025 0 0 1 -0.00977,0.0059 0.250025,0.250025 0 0 1 -0.011719,0.0078 0.250025,0.250025 0 0 1 -0.00977,0.0039 0.250025,0.250025 0 0 1 -0.011719,0.0059 0.250025,0.250025 0 0 1 -0.011719,0.0039 0.250025,0.250025 0 0 1 -0.025391,0.0078 0.250025,0.250025 0 0 1 -0.023438,0.0039 0.250025,0.250025 0 0 1 -0.013672,0.002 0.250025,0.250025 0 0 1 -0.011719,0.002 0.250025,0.250025 0 0 1 -0.011719,0 0.250025,0.250025 0 0 1 -0.013672,0 0.250025,0.250025 0 0 1 -0.037109,-0.0059 0.250025,0.250025 0 0 1 -0.046875,-0.01563 0.250025,0.250025 0 0 1 -0.021484,-0.01172 0.250025,0.250025 0 0 1 -0.011719,-0.0059 0.250025,0.250025 0 0 1 -0.00977,-0.0078 0.250025,0.250025 0 0 1 -0.039063,-0.03125 0.250025,0.250025 0 0 1 -0.00781,-0.0078 0.250025,0.250025 0 0 1 -0.00781,-0.01172 A 0.250025,0.250025 0 0 1 7.75,19.03125 L 2.8105469,1.25 Z M 2,0.74609375 A 0.250025,0.250025 0 0 1 2.0390625,0.75 H 3 A 0.250025,0.250025 0 0 1 3.2402344,0.93359375 L 8,18.068359 12.751953,0.9609375 a 0.250025,0.250025 0 0 1 0.002,-0.009766 0.250025,0.250025 0 0 1 0.0098,-0.0351563 0.250025,0.250025 0 0 1 0.0098,-0.0234375 0.250025,0.250025 0 0 1 0.01172,-0.0214844 0.250025,0.250025 0 0 1 0.0059,-0.0117188 0.250025,0.250025 0 0 1 0.0078,-0.009766 0.250025,0.250025 0 0 1 0.01563,-0.0195313 0.250025,0.250025 0 0 1 0.0078,-0.009766 0.250025,0.250025 0 0 1 0.0098,-0.007813 0.250025,0.250025 0 0 1 0.01953,-0.015625 0.250025,0.250025 0 0 1 0.0098,-0.007813 0.250025,0.250025 0 0 1 0.0098,-0.005859 0.250025,0.250025 0 0 1 0.01172,-0.007813 0.250025,0.250025 0 0 1 0.0098,-0.003906 0.250025,0.250025 0 0 1 0.01172,-0.005859 0.250025,0.250025 0 0 1 0.01172,-0.003906 0.250025,0.250025 0 0 1 0.02539,-0.007813 0.250025,0.250025 0 0 1 0.02344,-0.003906 0.250025,0.250025 0 0 1 0.01172,-0.001953 0.250025,0.250025 0 0 1 0.05078,0 0.250025,0.250025 0 0 1 0.02539,0.003906 0.250025,0.250025 0 0 1 0.04687,0.015625 0.250025,0.250025 0 0 1 0.02149,0.0117188 0.250025,0.250025 0 0 1 0.01172,0.005859 0.250025,0.250025 0 0 1 0.0098,0.007813 0.250025,0.250025 0 0 1 0.03906,0.03125 0.250025,0.250025 0 0 1 0.0078,0.007813 0.250025,0.250025 0 0 1 0.0078,0.0117188 0.250025,0.250025 0 0 1 0.05273,0.125 L 18,18.068359 22.759766,0.93359375 A 0.250025,0.250025 0 0 1 23,0.75 h 0.958984 a 0.250025,0.250025 0 0 1 0.214844,0.0664063 0.250025,0.250025 0 0 1 0.002,0.001953 0.250025,0.250025 0 0 1 0.01563,0.015625 0.250025,0.250025 0 0 1 0,0.001953 0.250025,0.250025 0 0 1 0.01563,0.0175781 0.250025,0.250025 0 0 1 0.0078,0.0136719 0.250025,0.250025 0 0 1 0.0039,0.007813 0.250025,0.250025 0 0 1 0.002,0.001953 0.250025,0.250025 0 0 1 0.0098,0.22656248 L 18.246094,22.046875 a 0.250025,0.250025 0 0 1 0,0.002 0.250025,0.250025 0 0 1 -0.01953,0.06055 0.250025,0.250025 0 0 1 -0.0039,0.0098 0.250025,0.250025 0 0 1 -0.0078,0.01172 0.250025,0.250025 0 0 1 -0.0059,0.0098 0.250025,0.250025 0 0 1 -0.0078,0.01172 0.250025,0.250025 0 0 1 -0.01563,0.01758 0.250025,0.250025 0 0 1 -0.0078,0.0098 0.250025,0.250025 0 0 1 -0.0098,0.0098 0.250025,0.250025 0 0 1 -0.0078,0.0078 0.250025,0.250025 0 0 1 -0.01172,0.0078 0.250025,0.250025 0 0 1 -0.0098,0.0059 0.250025,0.250025 0 0 1 -0.01172,0.0078 0.250025,0.250025 0 0 1 -0.0098,0.0059 0.250025,0.250025 0 0 1 -0.01172,0.0059 0.250025,0.250025 0 0 1 -0.02344,0.0098 0.250025,0.250025 0 0 1 -0.02344,0.0059 0.250025,0.250025 0 0 1 -0.01953,0.0039 0.250025,0.250025 0 0 1 -0.0059,0.002 0.250025,0.250025 0 0 1 -0.01172,0 0.250025,0.250025 0 0 1 -0.01367,0.002 0.250025,0.250025 0 0 1 -0.02539,-0.002 0.250025,0.250025 0 0 1 -0.03516,-0.0039 0.250025,0.250025 0 0 1 -0.02344,-0.0078 0.250025,0.250025 0 0 1 -0.01367,-0.0039 0.250025,0.250025 0 0 1 -0.01172,-0.0039 0.250025,0.250025 0 0 1 -0.07227,-0.04883 0.250025,0.250025 0 0 1 -0.0078,-0.0078 A 0.250025,0.250025 0 0 1 17.75,22.033203 v -0.0039 L 13,4.9316406 8.25,22.035156 a 0.250025,0.250025 0 0 1 -0.013672,0.04883 0.250025,0.250025 0 0 1 -0.00391,0.01172 0.250025,0.250025 0 0 1 -0.00586,0.01172 0.250025,0.250025 0 0 1 -0.058594,0.08008 0.250025,0.250025 0 0 1 -0.00781,0.0078 0.250025,0.250025 0 0 1 -0.011719,0.0078 0.250025,0.250025 0 0 1 -0.019531,0.01367 0.250025,0.250025 0 0 1 -0.021484,0.01172 0.250025,0.250025 0 0 1 -0.023437,0.0098 0.250025,0.250025 0 0 1 -0.00977,0.0039 0.250025,0.250025 0 0 1 -0.011719,0.002 0.250025,0.250025 0 0 1 -0.00391,0.002 0.250025,0.250025 0 0 1 -0.00391,0 0.250025,0.250025 0 0 1 -0.00586,0.002 0.250025,0.250025 0 0 1 -0.013672,0.002 0.250025,0.250025 0 0 1 -0.013672,0.002 0.250025,0.250025 0 0 1 -0.011719,0.002 0.250025,0.250025 0 0 1 -0.00977,0 0.250025,0.250025 0 0 1 -0.025391,-0.002 0.250025,0.250025 0 0 1 -0.025391,-0.0039 0.250025,0.250025 0 0 1 -0.023438,-0.0059 0.250025,0.250025 0 0 1 -0.044922,-0.01953 0.250025,0.250025 0 0 1 -0.00195,0 0.250025,0.250025 0 0 1 -0.00586,-0.0039 0.250025,0.250025 0 0 1 -0.013672,-0.0098 0.250025,0.250025 0 0 1 -0.021484,-0.01563 0.250025,0.250025 0 0 1 -0.00977,-0.0078 0.250025,0.250025 0 0 1 -0.00781,-0.0098 0.250025,0.250025 0 0 1 -0.03125,-0.03906 A 0.250025,0.250025 0 0 1 7.75,22.037109 v -0.0059 L 1.7714844,1.1074219 A 0.250025,0.250025 0 0 1 1.7578125,0.92773438 0.250025,0.250025 0 0 1 1.765625,0.90625 a 0.250025,0.250025 0 0 1 0.00195,-0.001953 0.250025,0.250025 0 0 1 0.00781,-0.0214844 0.250025,0.250025 0 0 1 0.00195,-0.001953 0.250025,0.250025 0 0 1 0.00977,-0.0195313 0.250025,0.250025 0 0 1 0.00195,-0.001953 0.250025,0.250025 0 0 1 0.013672,-0.0175781 0.250025,0.250025 0 0 1 0.00195,-0.001953 0.250025,0.250025 0 0 1 0.033203,-0.0332031 0.250025,0.250025 0 0 1 0.00195,-0.001953 0.250025,0.250025 0 0 1 0.017578,-0.0136719 0.250025,0.250025 0 0 1 0.00195,-0.001953 0.250025,0.250025 0 0 1 0.019531,-0.009766 0.250025,0.250025 0 0 1 0.00195,-0.001953 A 0.250025,0.250025 0 0 1 2,0.74609375 Z"
     id="path2" />
</svg>
