<?xml version="1.0" encoding="UTF-8" standalone="no"?>
<svg
   xmlns:dc="http://purl.org/dc/elements/1.1/"
   xmlns:cc="http://creativecommons.org/ns#"
   xmlns:rdf="http://www.w3.org/1999/02/22-rdf-syntax-ns#"
   xmlns:svg="http://www.w3.org/2000/svg"
   xmlns="http://www.w3.org/2000/svg"
   xmlns:sodipodi="http://sodipodi.sourceforge.net/DTD/sodipodi-0.dtd"
   xmlns:inkscape="http://www.inkscape.org/namespaces/inkscape"
   data-dec="40"
   width="16"
   height="40"
   version="1.1"
   id="svg4"
   sodipodi:docname="40.svg"
   inkscape:version="0.92.4 (unknown)">
  <metadata
     id="metadata10">
    <rdf:RDF>
      <cc:Work
         rdf:about="">
        <dc:format>image/svg+xml</dc:format>
        <dc:type
           rdf:resource="http://purl.org/dc/dcmitype/StillImage" />
      </cc:Work>
    </rdf:RDF>
  </metadata>
  <defs
     id="defs8" />
  <sodipodi:namedview
     pagecolor="#ffffff"
     bordercolor="#666666"
     borderopacity="1"
     objecttolerance="10"
     gridtolerance="10"
     guidetolerance="10"
     inkscape:pageopacity="0"
     inkscape:pageshadow="2"
     inkscape:window-width="615"
     inkscape:window-height="417"
     id="namedview6"
     showgrid="false"
     inkscape:zoom="5.9"
     inkscape:cx="8"
     inkscape:cy="20"
     inkscape:window-x="0"
     inkscape:window-y="27"
     inkscape:window-maximized="0"
     inkscape:current-layer="svg4" />
  <path
     style="color:#000000;font-style:normal;font-variant:normal;font-weight:normal;font-stretch:normal;font-size:medium;line-height:normal;font-family:sans-serif;font-variant-ligatures:normal;font-variant-position:normal;font-variant-caps:normal;font-variant-numeric:normal;font-variant-alternates:normal;font-feature-settings:normal;text-indent:0;text-align:start;text-decoration:none;text-decoration-line:none;text-decoration-style:solid;text-decoration-color:#000000;letter-spacing:normal;word-spacing:normal;text-transform:none;writing-mode:lr-tb;direction:ltr;text-orientation:mixed;dominant-baseline:auto;baseline-shift:baseline;text-anchor:start;white-space:normal;shape-padding:0;clip-rule:nonzero;display:inline;overflow:visible;visibility:visible;opacity:1;isolation:auto;mix-blend-mode:normal;color-interpolation:sRGB;color-interpolation-filters:linearRGB;solid-color:#000000;solid-opacity:1;vector-effect:none;fill:#013272;fill-opacity:1;fill-rule:nonzero;stroke:none;stroke-width:1;stroke-linecap:round;stroke-linejoin:round;stroke-miterlimit:4;stroke-dasharray:none;stroke-dashoffset:0;stroke-opacity:1;color-rendering:auto;image-rendering:auto;shape-rendering:auto;text-rendering:auto;enable-background:accumulate"
     d="M 4.3867188,10.517578 3.5,14.0625 v 0.908203 a 0.50005,0.50005 0 0 1 0.00195,-0.01953 0.50005,0.50005 0 0 1 0.017578,-0.09766 z M 15.990234,-3.5039062 a 0.50005,0.50005 0 0 1 0.04883,0.00195 0.50005,0.50005 0 0 1 0.04883,0.00586 0.50005,0.50005 0 0 1 0.002,0 0.50005,0.50005 0 0 1 0.01172,0.00195 0.50005,0.50005 0 0 1 0.03711,0.00781 0.50005,0.50005 0 0 1 0.01172,0.00391 0.50005,0.50005 0 0 1 0.04687,0.017578 0.50005,0.50005 0 0 1 0.04492,0.021484 0.50005,0.50005 0 0 1 0.04297,0.025391 0.50005,0.50005 0 0 1 0.03125,0.021484 0.50005,0.50005 0 0 1 0.0098,0.00781 0.50005,0.50005 0 0 1 0.02734,0.025391 0.50005,0.50005 0 0 1 0.0078,0.00977 0.50005,0.50005 0 0 1 0.02539,0.025391 0.50005,0.50005 0 0 1 0.0098,0.011719 0.50005,0.50005 0 0 1 0.02148,0.029297 0.50005,0.50005 0 0 1 0.02539,0.042969 0.50005,0.50005 0 0 1 0.0059,0.00977 0.50005,0.50005 0 0 1 0.0059,0.011719 0.50005,0.50005 0 0 1 0.01563,0.035156 0.50005,0.50005 0 0 1 0.01172,0.035156 0.50005,0.50005 0 0 1 0.0039,0.011719 0.50005,0.50005 0 0 1 0.002,0.00977 0.50005,0.50005 0 0 1 0.0098,0.039063 0.50005,0.50005 0 0 1 0.0059,0.048828 0.50005,0.50005 0 0 1 0.002,0.037109 0.50005,0.50005 0 0 1 0,0.013672 0.50005,0.50005 0 0 1 -0.002,0.037109 0.50005,0.50005 0 0 1 -0.0039,0.025391 0.50005,0.50005 0 0 1 -0.0039,0.023437 0.50005,0.50005 0 0 1 -0.0098,0.039063 0.50005,0.50005 0 0 1 -0.002,0.00977 0.50005,0.50005 0 0 1 -0.0039,0.011719 0.50005,0.50005 0 0 1 -0.01367,0.035156 0.50005,0.50005 0 0 1 -0.02148,0.044922 0.50005,0.50005 0 0 1 -0.0059,0.011719 0.50005,0.50005 0 0 1 -0.01953,0.03125 0.50005,0.50005 0 0 1 -0.0078,0.00977 0.50005,0.50005 0 0 1 -0.02344,0.029297 0.50005,0.50005 0 0 1 -0.0332,0.037109 0.50005,0.50005 0 0 1 -0.03711,0.033203 0.50005,0.50005 0 0 1 -0.0098,0.00781 0.50005,0.50005 0 0 1 -0.03125,0.021484 0.50005,0.50005 0 0 1 -0.0098,0.00781 l -0.0098,0.00391 -2.939453,1.96093748 -2.929687,2.92968752 -1.9550782,2.9335937 -0.9707032,1.9394531 -0.9824218,2.9492188 -0.9863282,3.947266 -0.546875,4.916015 0.5429688,4.888672 0.9726562,2.916016 0.96875,1.9375 a 0.50005,0.50005 0 0 1 0.00391,0.0059 l 0.011719,0.02539 a 0.50005,0.50005 0 0 1 0.00977,0.01953 0.50005,0.50005 0 0 1 0.00586,0.01172 0.50005,0.50005 0 0 1 0.013672,0.0332 0.50005,0.50005 0 0 1 0.00391,0.01367 0.50005,0.50005 0 0 1 0.00977,0.03516 0.50005,0.50005 0 0 1 0.00195,0.01172 0.50005,0.50005 0 0 1 0.00781,0.05078 0.50005,0.50005 0 0 1 0.00391,0.03711 0.50005,0.50005 0 0 1 0,0.01172 0.50005,0.50005 0 0 1 -0.00195,0.03711 0.50005,0.50005 0 0 1 -0.00586,0.04883 0.50005,0.50005 0 0 1 0,0.002 0.50005,0.50005 0 0 1 -0.00195,0.01172 0.50005,0.50005 0 0 1 -0.00781,0.03711 0.50005,0.50005 0 0 1 -0.00391,0.01172 0.50005,0.50005 0 0 1 -0.017578,0.04687 0.50005,0.50005 0 0 1 -0.021484,0.04492 0.50005,0.50005 0 0 1 -0.025391,0.04297 0.50005,0.50005 0 0 1 -0.021484,0.03125 0.50005,0.50005 0 0 1 -0.00781,0.0098 0.50005,0.50005 0 0 1 -0.025391,0.02734 0.50005,0.50005 0 0 1 -0.00977,0.0078 0.50005,0.50005 0 0 1 -0.025391,0.02539 0.50005,0.50005 0 0 1 -0.011719,0.0098 0.50005,0.50005 0 0 1 -0.029297,0.02148 0.50005,0.50005 0 0 1 -0.042969,0.02539 0.50005,0.50005 0 0 1 -0.00977,0.0059 0.50005,0.50005 0 0 1 -0.011719,0.0059 0.50005,0.50005 0 0 1 -0.035156,0.01563 0.50005,0.50005 0 0 1 -0.046875,0.01563 0.50005,0.50005 0 0 1 -0.00977,0.002 0.50005,0.50005 0 0 1 -0.039063,0.0098 0.50005,0.50005 0 0 1 -0.048828,0.0059 0.50005,0.50005 0 0 1 -0.037109,0.002 0.50005,0.50005 0 0 1 -0.025391,-0.002 0.50005,0.50005 0 0 1 -0.025391,0 0.50005,0.50005 0 0 1 -0.011719,-0.002 0.50005,0.50005 0 0 1 -0.037109,-0.0059 0.50005,0.50005 0 0 1 -0.039063,-0.0098 0.50005,0.50005 0 0 1 -0.015625,-0.0039 0.50005,0.50005 0 0 1 -0.041016,-0.01563 0.50005,0.50005 0 0 1 -0.044922,-0.02148 0.50005,0.50005 0 0 1 -0.011719,-0.0059 0.50005,0.50005 0 0 1 -0.013672,-0.0098 0.50005,0.50005 0 0 1 -0.027344,-0.01758 0.50005,0.50005 0 0 1 -0.029297,-0.02344 0.50005,0.50005 0 0 1 -0.037109,-0.0332 0.50005,0.50005 0 0 1 -0.033203,-0.03711 0.50005,0.50005 0 0 1 -0.00781,-0.0098 0.50005,0.50005 0 0 1 -0.021484,-0.03125 l -0.00781,-0.0098 a 0.50005,0.50005 0 0 1 -0.00391,-0.0098 L 4.5839844,26.277344 A 0.50005,0.50005 0 0 1 4.5253906,26.158203 L 3.5429688,23.210938 a 0.50005,0.50005 0 0 1 -0.00391,-0.01172 0.50005,0.50005 0 0 1 -0.00195,-0.0039 0.50005,0.50005 0 0 1 -0.017578,-0.04687 0.50005,0.50005 0 0 1 -0.00195,-0.0059 0.50005,0.50005 0 0 1 -0.00977,-0.04297 0.50005,0.50005 0 0 1 -0.00391,-0.0293 L 2.515625,19.121094 A 0.50005,0.50005 0 0 1 2.5,19 v -5 a 0.50005,0.50005 0 0 1 0.015625,-0.121094 l 1,-3.9999998 a 0.50005,0.50005 0 0 1 0.037109,-0.1015624 l 2,-4 a 0.50005,0.50005 0 0 1 0.03125,-0.054688 l 2,-3 a 0.50005,0.50005 0 0 1 0.0625,-0.076172 l 2.9999996,-3.00000002 a 0.50005,0.50005 0 0 1 0.07617,-0.0625 l 3,-1.99999998 a 0.50005,0.50005 0 0 1 0.05469,-0.03125 l 1.96875,-0.984375 a 0.50005,0.50005 0 0 1 0.03125,-0.015625 0.50005,0.50005 0 0 1 0.01953,-0.00977 0.50005,0.50005 0 0 1 0.01172,-0.00586 0.50005,0.50005 0 0 1 0.01367,-0.00391 0.50005,0.50005 0 0 1 0.08008,-0.025391 0.50005,0.50005 0 0 1 0.05078,-0.00781 0.50005,0.50005 0 0 1 0.03711,-0.00391 z"
     id="path2" />
</svg>
