<?xml version="1.0" encoding="UTF-8"?>
<glyph name="bracketleft" format="1">
  <advance width="404"/>
  <unicode hex="005B"/>
  <outline>
    <contour>
      <point x="123" y="724" type="line"/>
      <point x="123" y="-188" type="line"/>
      <point x="138" y="-188" type="line"/>
      <point x="138" y="724" type="line"/>
    </contour>
    <contour>
      <point x="116" y="738" type="line"/>
      <point x="117" y="738" type="line"/>
      <point x="143" y="738" type="line"/>
      <point x="145" y="738" type="line"/>
      <point x="146" y="738" type="line"/>
      <point x="318" y="738" type="line"/>
      <point x="319" y="738" type="line" smooth="yes"/>
      <point x="323" y="738"/>
      <point x="326" y="736"/>
      <point x="326" y="732" type="curve" smooth="yes"/>
      <point x="326" y="728"/>
      <point x="323" y="724"/>
      <point x="319" y="724" type="curve" smooth="yes"/>
      <point x="318" y="724" type="line"/>
      <point x="152" y="724" type="line"/>
      <point x="152" y="-188" type="line"/>
      <point x="318" y="-188" type="line"/>
      <point x="319" y="-188" type="line" smooth="yes"/>
      <point x="323" y="-188"/>
      <point x="326" y="-191"/>
      <point x="326" y="-195" type="curve" smooth="yes"/>
      <point x="326" y="-199"/>
      <point x="323" y="-202"/>
      <point x="319" y="-202" type="curve" smooth="yes"/>
      <point x="318" y="-202" type="line"/>
      <point x="146" y="-202" type="line"/>
      <point x="145" y="-202" type="line"/>
      <point x="143" y="-202" type="line"/>
      <point x="117" y="-202" type="line"/>
      <point x="116" y="-202" type="line" smooth="yes"/>
      <point x="115" y="-202"/>
      <point x="112" y="-202"/>
      <point x="111" y="-201" type="curve" smooth="yes"/>
      <point x="111" y="-200" type="line"/>
      <point x="110" y="-200" type="line"/>
      <point x="110" y="-199" type="line"/>
      <point x="109" y="-199" type="line"/>
      <point x="109" y="-195" type="line"/>
      <point x="109" y="-194" type="line"/>
      <point x="109" y="730" type="line"/>
      <point x="109" y="732" type="line" smooth="yes"/>
      <point x="109" y="733"/>
      <point x="109" y="735"/>
      <point x="110" y="736" type="curve" smooth="yes"/>
      <point x="111" y="737" type="line"/>
      <point x="112" y="737" type="line"/>
      <point x="112" y="738" type="line"/>
    </contour>
  </outline>
  <lib>
    <dict>
      <key>com.fontlab.hintData</key>
      <dict>
        <key>hhints</key>
        <array>
          <dict>
            <key>position</key>
            <integer>-202</integer>
            <key>width</key>
            <integer>14</integer>
          </dict>
          <dict>
            <key>position</key>
            <integer>724</integer>
            <key>width</key>
            <integer>14</integer>
          </dict>
        </array>
        <key>vhints</key>
        <array>
          <dict>
            <key>position</key>
            <integer>109</integer>
            <key>width</key>
            <integer>14</integer>
          </dict>
          <dict>
            <key>position</key>
            <integer>138</integer>
            <key>width</key>
            <integer>14</integer>
          </dict>
        </array>
      </dict>
    </dict>
  </lib>
</glyph>
