<?xml version="1.0" encoding="UTF-8" standalone="no"?>
<svg
   xmlns:dc="http://purl.org/dc/elements/1.1/"
   xmlns:cc="http://creativecommons.org/ns#"
   xmlns:rdf="http://www.w3.org/1999/02/22-rdf-syntax-ns#"
   xmlns:svg="http://www.w3.org/2000/svg"
   xmlns="http://www.w3.org/2000/svg"
   xmlns:sodipodi="http://sodipodi.sourceforge.net/DTD/sodipodi-0.dtd"
   xmlns:inkscape="http://www.inkscape.org/namespaces/inkscape"
   data-dec="83"
   width="12"
   height="40"
   version="1.1"
   id="svg4"
   sodipodi:docname="83.svg"
   inkscape:version="0.92.4 5da689c313, 2019-01-14">
  <metadata
     id="metadata10">
    <rdf:RDF>
      <cc:Work
         rdf:about="">
        <dc:format>image/svg+xml</dc:format>
        <dc:type
           rdf:resource="http://purl.org/dc/dcmitype/StillImage" />
        <dc:title></dc:title>
      </cc:Work>
    </rdf:RDF>
  </metadata>
  <defs
     id="defs8" />
  <sodipodi:namedview
     pagecolor="#ffffff"
     bordercolor="#666666"
     borderopacity="1"
     objecttolerance="10"
     gridtolerance="10"
     guidetolerance="10"
     inkscape:pageopacity="0"
     inkscape:pageshadow="2"
     inkscape:window-width="1920"
     inkscape:window-height="1043"
     id="namedview6"
     showgrid="false"
     inkscape:zoom="5.9"
     inkscape:cx="6"
     inkscape:cy="20"
     inkscape:window-x="0"
     inkscape:window-y="37"
     inkscape:window-maximized="0"
     inkscape:current-layer="svg4" />
  <path
     style="color:#000000;font-style:normal;font-variant:normal;font-weight:normal;font-stretch:normal;font-size:medium;line-height:normal;font-family:sans-serif;font-variant-ligatures:normal;font-variant-position:normal;font-variant-caps:normal;font-variant-numeric:normal;font-variant-alternates:normal;font-feature-settings:normal;text-indent:0;text-align:start;text-decoration:none;text-decoration-line:none;text-decoration-style:solid;text-decoration-color:#000000;letter-spacing:normal;word-spacing:normal;text-transform:none;writing-mode:lr-tb;direction:ltr;text-orientation:mixed;dominant-baseline:auto;baseline-shift:baseline;text-anchor:start;white-space:normal;shape-padding:0;clip-rule:nonzero;display:inline;overflow:visible;visibility:visible;opacity:1;isolation:auto;mix-blend-mode:normal;color-interpolation:sRGB;color-interpolation-filters:linearRGB;solid-color:#000000;solid-opacity:1;vector-effect:none;fill:#000000;fill-opacity:1;fill-rule:nonzero;stroke:none;stroke-width:1.5;stroke-linecap:round;stroke-linejoin:round;stroke-miterlimit:4;stroke-dasharray:none;stroke-dashoffset:0;stroke-opacity:1;color-rendering:auto;image-rendering:auto;shape-rendering:auto;text-rendering:auto;enable-background:accumulate"
     d="M 10.189453,0.24023438 A 0.750075,0.750075 0 0 1 10.949219,1 V 7 A 0.750075,0.750075 0 0 1 9.4648438,7.1464844 L 8.890625,4.2753906 7.859375,2.5585938 6.40625,1.75 H 4.9941406 L 3.5390625,2.5585938 2.5507812,4.2070312 V 6.7929688 L 3.578125,8.5058594 4.5566406,9.3203125 8,10.277344 a 0.750075,0.750075 0 0 1 0.2792969,0.146484 l 1.2011719,1 a 0.750075,0.750075 0 0 1 0.1621093,0.189453 l 0.5996099,1 a 0.750075,0.750075 0 0 1 0.07617,0.171875 l 0.59961,2 A 0.750075,0.750075 0 0 1 10.949219,15 v 3 a 0.750075,0.750075 0 0 1 -0.05274,0.279297 l -1.1992184,3 A 0.750075,0.750075 0 0 1 9.3632812,21.65625 l -1.7988281,1 A 0.750075,0.750075 0 0 1 7.1992188,22.75 H 5.4003906 A 0.750075,0.750075 0 0 1 5.0351562,22.65625 l -1.7988281,-1 A 0.750075,0.750075 0 0 1 2.9570312,21.386719 l -0.40625,-0.677735 V 22 a 0.750075,0.750075 0 1 1 -1.5,0 v -6 a 0.750075,0.750075 0 0 1 1.484375,-0.146484 L 3.109375,18.724609 4.140625,20.441406 5.59375,21.25 h 1.4121094 l 1.3964844,-0.775391 1.046875,-2.61914 V 15.109375 L 8.9082031,13.304688 8.421875,12.494141 7.4433594,11.679688 4,10.722656 A 0.750075,0.750075 0 0 1 3.7207031,10.576172 L 2.5195312,9.5761719 A 0.750075,0.750075 0 0 1 2.3574219,9.3867188 l -1.2011719,-2 A 0.750075,0.750075 0 0 1 1.0507812,7 V 4 A 0.750075,0.750075 0 0 1 1.15625,3.6132812 l 1.2011719,-2 A 0.750075,0.750075 0 0 1 2.6367188,1.34375 l 1.7988281,-1 A 0.750075,0.750075 0 0 1 4.8007812,0.25 h 1.7988282 a 0.750075,0.750075 0 0 1 0.3652344,0.09375 l 1.7988281,1 a 0.750075,0.750075 0 0 1 0.2792969,0.2695312 l 0.40625,0.6777344 V 1 A 0.750075,0.750075 0 0 1 10.189453,0.24023438 Z"
     id="path2" />
</svg>
