<?xml version="1.0" encoding="UTF-8" standalone="no"?>
<svg
   xmlns:dc="http://purl.org/dc/elements/1.1/"
   xmlns:cc="http://creativecommons.org/ns#"
   xmlns:rdf="http://www.w3.org/1999/02/22-rdf-syntax-ns#"
   xmlns:svg="http://www.w3.org/2000/svg"
   xmlns="http://www.w3.org/2000/svg"
   xmlns:sodipodi="http://sodipodi.sourceforge.net/DTD/sodipodi-0.dtd"
   xmlns:inkscape="http://www.inkscape.org/namespaces/inkscape"
   data-dec="89"
   id="dec_89"
   width="20"
   height="40"
   version="1.1"
   sodipodi:docname="89.svg"
   inkscape:version="0.91 r13725">
  <metadata
     id="metadata9">
    <rdf:RDF>
      <cc:Work
         rdf:about="">
        <dc:format>image/svg+xml</dc:format>
        <dc:type
           rdf:resource="http://purl.org/dc/dcmitype/StillImage" />
      </cc:Work>
    </rdf:RDF>
  </metadata>
  <defs
     id="defs7" />
  <sodipodi:namedview
     pagecolor="#ffffff"
     bordercolor="#666666"
     borderopacity="1"
     objecttolerance="10"
     gridtolerance="10"
     guidetolerance="10"
     inkscape:pageopacity="0"
     inkscape:pageshadow="2"
     inkscape:window-width="1333"
     inkscape:window-height="744"
     id="namedview5"
     showgrid="true"
     inkscape:zoom="23.6"
     inkscape:cx="6.2923729"
     inkscape:cy="28.15678"
     inkscape:window-x="33"
     inkscape:window-y="924"
     inkscape:window-maximized="1"
     inkscape:current-layer="dec_89">
    <inkscape:grid
       type="xygrid"
       id="grid11" />
  </sodipodi:namedview>
  <path
     style="color:#000000;font-style:normal;font-variant:normal;font-weight:normal;font-stretch:normal;font-size:medium;line-height:normal;font-family:sans-serif;text-indent:0;text-align:start;text-decoration:none;text-decoration-line:none;text-decoration-style:solid;text-decoration-color:#000000;letter-spacing:normal;word-spacing:normal;text-transform:none;direction:ltr;block-progression:tb;writing-mode:lr-tb;baseline-shift:baseline;text-anchor:start;white-space:normal;clip-rule:nonzero;display:inline;overflow:visible;visibility:visible;opacity:1;isolation:auto;mix-blend-mode:normal;color-interpolation:sRGB;color-interpolation-filters:linearRGB;solid-color:#000000;solid-opacity:1;fill:#000000;fill-opacity:1;fill-rule:nonzero;stroke:none;stroke-width:1;stroke-linecap:round;stroke-linejoin:round;stroke-miterlimit:4;stroke-dasharray:none;stroke-dashoffset:0;stroke-opacity:1;color-rendering:auto;image-rendering:auto;shape-rendering:auto;text-rendering:auto;enable-background:accumulate"
     d="M 1.9824219 0.49414062 A 0.50005 0.50005 0 0 0 1.6757812 0.61328125 A 0.50005 0.50005 0 0 0 1.6386719 0.64648438 A 0.50005 0.50005 0 0 0 1.6054688 0.68359375 A 0.50005 0.50005 0 0 0 1.5761719 0.72460938 A 0.50005 0.50005 0 0 0 1.5527344 0.76367188 A 0.50005 0.50005 0 0 0 1.5488281 0.7734375 A 0.50005 0.50005 0 0 0 1.5429688 0.78515625 A 0.50005 0.50005 0 0 0 1.5292969 0.8125 A 0.50005 0.50005 0 0 0 1.5253906 0.82421875 A 0.50005 0.50005 0 0 0 1.6269531 1.3398438 L 8.5 11.158203 L 8.5 22 A 0.50005 0.50005 0 0 0 9 22.5 L 9.9199219 22.5 A 0.50005 0.50005 0 0 0 10.082031 22.5 L 10.919922 22.5 A 0.50005 0.50005 0 0 0 11.324219 22.386719 A 0.50005 0.50005 0 0 0 11.328125 22.384766 A 0.50005 0.50005 0 0 0 11.361328 22.353516 A 0.50005 0.50005 0 0 0 11.363281 22.349609 A 0.50005 0.50005 0 0 0 11.394531 22.316406 A 0.50005 0.50005 0 0 0 11.396484 22.3125 A 0.50005 0.50005 0 0 0 11.5 21.917969 L 11.5 11.158203 L 18.373047 1.3417969 A 0.50005 0.50005 0 0 0 18.46875 0.81054688 A 0.50005 0.50005 0 0 0 18.464844 0.79882812 A 0.50005 0.50005 0 0 0 18.457031 0.78515625 A 0.50005 0.50005 0 0 0 18.441406 0.75390625 A 0.50005 0.50005 0 0 0 18.423828 0.72265625 A 0.50005 0.50005 0 0 0 18.416016 0.7109375 A 0.50005 0.50005 0 0 0 18.410156 0.70507812 A 0.50005 0.50005 0 0 0 18.384766 0.671875 A 0.50005 0.50005 0 0 0 18.3125 0.60351562 A 0.50005 0.50005 0 0 0 17.925781 0.5 L 17.078125 0.5 A 0.50005 0.50005 0 0 0 16.925781 0.5 L 16 0.5 A 0.50005 0.50005 0 0 0 15.589844 0.71289062 L 10 8.6992188 L 4.4101562 0.71289062 A 0.50005 0.50005 0 0 0 4 0.5 L 3.0664062 0.5 A 0.50005 0.50005 0 0 0 2.9238281 0.5 L 2.0664062 0.5 A 0.50005 0.50005 0 0 0 1.9824219 0.49414062 z "
     id="path13" />
</svg>
