<svg xmlns:dc="http://purl.org/dc/elements/1.1/" xmlns:cc="http://creativecommons.org/ns#" xmlns:rdf="http://www.w3.org/1999/02/22-rdf-syntax-ns#" xmlns:svg="http://www.w3.org/2000/svg" xmlns="http://www.w3.org/2000/svg" xmlns:sodipodi="http://sodipodi.sourceforge.net/DTD/sodipodi-0.dtd" xmlns:inkscape="http://www.inkscape.org/namespaces/inkscape" data-dec="8216" id="dec_39" width="7" height="40" version="1.1" sodipodi:docname="8216.svg" inkscape:version="0.92.2 2405546, 2018-03-11">
  <metadata id="metadata9">
    <rdf:RDF>
      <cc:Work rdf:about="">
        <dc:format>image/svg+xml</dc:format>
        <dc:type rdf:resource="http://purl.org/dc/dcmitype/StillImage"/>
        <dc:title/>
      </cc:Work>
    </rdf:RDF>
  </metadata>
  <defs id="defs7"/>
  <sodipodi:namedview pagecolor="#ffffff" bordercolor="#666666" borderopacity="1" objecttolerance="10" gridtolerance="10" guidetolerance="10" inkscape:pageopacity="0" inkscape:pageshadow="2" inkscape:window-width="1918" inkscape:window-height="1042" id="namedview5" showgrid="true" showguides="true" inkscape:zoom="15.847142" inkscape:cx="-25.650617" inkscape:cy="20.692114" inkscape:window-x="0" inkscape:window-y="18" inkscape:window-maximized="0" inkscape:current-layer="dec_39">
    <inkscape:grid type="xygrid" id="grid836"/>
  </sodipodi:namedview>
  <path inkscape:connector-curvature="0" d="m 2,6 1,-1 h 1 l 1,1 v 1 l -1,1 H 3 l -1,-1 v -3 l 1,-2 2,-1 m -1,6 v -1 H 3 v 1 h 1 m -1,-2 -1,-1 m 0,2 1,-4 " style="fill:none;stroke:#000000;stroke-width:1;stroke-linecap:round;stroke-linejoin:round;stroke-miterlimit:4;stroke-dasharray:none" id="path2-7" sodipodi:nodetypes="cccccccccccccccccccc"/>
</svg>