<?xml version="1.0" encoding="UTF-8" standalone="no"?>
<svg
   xmlns:dc="http://purl.org/dc/elements/1.1/"
   xmlns:cc="http://creativecommons.org/ns#"
   xmlns:rdf="http://www.w3.org/1999/02/22-rdf-syntax-ns#"
   xmlns:svg="http://www.w3.org/2000/svg"
   xmlns="http://www.w3.org/2000/svg"
   xmlns:sodipodi="http://sodipodi.sourceforge.net/DTD/sodipodi-0.dtd"
   xmlns:inkscape="http://www.inkscape.org/namespaces/inkscape"
   data-dec="57"
   width="20"
   height="40"
   version="1.1"
   id="svg4"
   sodipodi:docname="57.svg"
   inkscape:version="0.92.4 (unknown)">
  <metadata
     id="metadata10">
    <rdf:RDF>
      <cc:Work
         rdf:about="">
        <dc:format>image/svg+xml</dc:format>
        <dc:type
           rdf:resource="http://purl.org/dc/dcmitype/StillImage" />
      </cc:Work>
    </rdf:RDF>
  </metadata>
  <defs
     id="defs8" />
  <sodipodi:namedview
     pagecolor="#ffffff"
     bordercolor="#666666"
     borderopacity="1"
     objecttolerance="10"
     gridtolerance="10"
     guidetolerance="10"
     inkscape:pageopacity="0"
     inkscape:pageshadow="2"
     inkscape:window-width="640"
     inkscape:window-height="480"
     id="namedview6"
     showgrid="false"
     inkscape:zoom="5.9"
     inkscape:cx="10"
     inkscape:cy="20"
     inkscape:window-x="0"
     inkscape:window-y="27"
     inkscape:window-maximized="0"
     inkscape:current-layer="svg4" />
  <path
     style="color:#000000;font-style:normal;font-variant:normal;font-weight:normal;font-stretch:normal;font-size:medium;line-height:normal;font-family:sans-serif;font-variant-ligatures:normal;font-variant-position:normal;font-variant-caps:normal;font-variant-numeric:normal;font-variant-alternates:normal;font-feature-settings:normal;text-indent:0;text-align:start;text-decoration:none;text-decoration-line:none;text-decoration-style:solid;text-decoration-color:#000000;letter-spacing:normal;word-spacing:normal;text-transform:none;writing-mode:lr-tb;direction:ltr;text-orientation:mixed;dominant-baseline:auto;baseline-shift:baseline;text-anchor:start;white-space:normal;shape-padding:0;clip-rule:nonzero;display:inline;overflow:visible;visibility:visible;opacity:1;isolation:auto;mix-blend-mode:normal;color-interpolation:sRGB;color-interpolation-filters:linearRGB;solid-color:#000000;solid-opacity:1;vector-effect:none;fill:#000000;fill-opacity:1;fill-rule:nonzero;stroke:none;stroke-width:0.30000001;stroke-linecap:round;stroke-linejoin:round;stroke-miterlimit:4;stroke-dasharray:none;stroke-dashoffset:0;stroke-opacity:1;color-rendering:auto;image-rendering:auto;shape-rendering:auto;text-rendering:auto;enable-background:accumulate"
     d="m 7.8359375,20.625 0.2246094,0.224609 h 0.9160156 l 0.068359,-0.02344 z M 6.6386719,20.425781 7.0625,20.849609 H 7.3222656 L 6.8320312,20.458984 Z m 4.8066401,-0.08203 -0.128906,0.04297 -0.669922,0.402343 0.302735,0.05078 z m -5.4257808,-0.535156 0.2519532,0.25 0.078125,0.01367 z m -0.4726562,-0.05078 0.097656,0.197266 0.1191407,0.01953 z m 8.228516,-0.191406 -1.697266,0.566406 -0.960937,0.960938 a 0.15001501,0.15001501 0 0 1 -0.0098,0.0098 l -0.002,0.002 a 0.15001501,0.15001501 0 0 1 -0.0078,0.0078 0.15001501,0.15001501 0 0 1 -0.002,0.002 0.15001501,0.15001501 0 0 1 -0.002,0.002 0.15001501,0.15001501 0 0 1 -0.04883,0.02539 0.15001501,0.15001501 0 0 1 -0.05664,0.0078 H 10 8.9980469 8.1777344 l 0.875,0.699218 h 0.9238281 l 2.9277345,-0.976562 z m 1.285156,-0.429687 a 0.15001501,0.15001501 0 0 1 -0.01367,0.0059 L 14.240234,19.412109 13.125,21.083984 a 0.15001501,0.15001501 0 0 1 -0.0059,0.0059 0.15001501,0.15001501 0 0 1 0,0.002 0.15001501,0.15001501 0 0 1 -0.0098,0.0098 0.15001501,0.15001501 0 0 1 0,0.002 0.15001501,0.15001501 0 0 1 -0.0059,0.0039 0.15001501,0.15001501 0 0 1 -0.01367,0.01172 0.15001501,0.15001501 0 0 1 -0.002,0.002 0.15001501,0.15001501 0 0 1 -0.01367,0.0098 0.15001501,0.15001501 0 0 1 -0.04102,0.01758 h -0.0059 l -2.101563,0.701171 h 0.05078 l 2.927735,-0.976562 z m -0.556641,-0.664063 -1.916015,1.150391 -0.0332,0.0332 1.492187,-0.496094 z M 4.1503906,18.361328 v 0.603516 l 0.9550782,1.912109 2.9179687,0.972656 h 0.5488281 l -0.875,-0.699218 H 7 A 0.15001501,0.15001501 0 0 1 6.8945312,21.105469 L 6.1308594,20.341797 5.8125,20.287109 6.1347656,20.933594 A 0.15024742,0.15024742 0 1 1 5.8652344,21.066406 L 5.4453125,20.226562 4.9746094,20.148438 a 0.1505939,0.1505939 0 1 1 0.050781,-0.296876 l 0.2539063,0.04297 -0.4023438,-0.80664 v -0.002 z m 0.2773438,-0.210937 2.5292968,2.023437 h 0.00586 L 5.8945312,19.105469 4.9375,18.150391 Z M 10,12.761719 9.890625,12.804688 10,12.841797 10.109375,12.804688 Z M 6.5546875,12.34375 7.0800781,12.869141 10,13.841797 l 2.919922,-0.972656 0.52539,-0.525391 -0.376953,0.125 -0.984375,0.65625 a 0.1505932,0.1505932 0 1 1 -0.167968,-0.25 l 0.06641,-0.04492 -0.908203,0.302734 a 0.15001501,0.15001501 0 0 1 -0.0078,0.0039 l -0.0059,0.002 a 0.15001501,0.15001501 0 0 1 -0.05859,0.01172 0.15001501,0.15001501 0 0 1 -0.002,0 H 10.988281 10 9.9960938 9.0175781 9.0019531 a 0.15001501,0.15001501 0 0 1 -0.00586,0 0.15001501,0.15001501 0 0 1 -0.029297,-0.0039 0.15001501,0.15001501 0 0 1 -0.00977,-0.002 0.15001501,0.15001501 0 0 1 -0.00391,-0.002 l -0.00977,-0.002 a 0.15001501,0.15001501 0 0 1 -0.013672,-0.0059 L 8.0175781,12.830078 8.0839844,12.875 a 0.15059342,0.15059342 0 0 1 -0.1679688,0.25 l -0.984375,-0.65625 z m 6.4277345,-0.179688 -2.001953,0.667969 0.02344,0.0078 1.929688,-0.642578 z m -5.9648439,0 0.048828,0.0332 1.9296876,0.642578 0.023437,-0.0078 z M 13.152344,11.5 l -2.748047,1.099609 0.144531,0.05859 2.355469,-0.785156 z m -6.3046878,0 0.2480469,0.373047 2.3554688,0.785156 0.1445312,-0.05859 z m 9.0019528,-0.138672 -0.699218,0.699219 V 13 a 0.15001501,0.15001501 0 0 1 -0.0039,0.0293 l -1,5 a 0.15001501,0.15001501 0 0 1 -0.04101,0.07617 l -0.638672,0.638672 1.400391,-0.839844 0.982421,-4.919922 z m -1,0 -0.724609,0.722656 a 0.15001501,0.15001501 0 0 1 -0.02539,0.0293 l -0.0059,0.0039 a 0.15001501,0.15001501 0 0 1 -0.0059,0.0039 l -0.982422,0.984375 a 0.15001501,0.15001501 0 0 1 -0.05859,0.03711 l -2.121094,0.707031 h 0.05078 l 2.94336,-0.980468 0.929687,-0.929688 z m 1,-1.8652342 -0.380859,0.5722652 -0.318359,0.955079 v 0.615234 l 0.699218,-0.699219 z m -1,0 -0.380859,0.5722652 -0.326172,0.978516 a 0.15001501,0.15001501 0 0 1 -0.08594,0.0918 l -0.410157,0.164062 -0.503906,0.753907 1.148438,-0.765625 0.558593,-0.835938 z m 1,-0.5703126 -0.01953,0.056641 0.01953,-0.027344 z m -1,0 -0.01953,0.056641 0.01953,-0.027344 z M 14.113281,3.9042969 a 0.15001501,0.15001501 0 0 1 0.0332,0.058594 l 0.19336,0.7773438 0.785156,1.1757812 a 0.15059342,0.15059342 0 1 1 -0.25,0.1679688 l -0.316406,-0.4765625 0.585937,2.3515625 0.002,0.00391 a 0.15001501,0.15001501 0 0 1 0,0.00195 0.15001501,0.15001501 0 0 1 0.0039,0.035156 0.15001501,0.15001501 0 0 1 0,0.00391 V 8.984375 a 0.15001501,0.15001501 0 0 1 0,0.029297 V 10.003906 L 15.197266,9.9335938 15.84375,7.9941406 15.060547,4.8613281 14.494141,4.0117188 Z M 6.8574219,2.9433594 5.7089844,3.7089844 4.8027344,5.0664062 4.1503906,7.0234375 v 0.953125 l 0.6523438,1.9570313 0.90625,1.3574222 1.1484375,0.765625 -0.5039063,-0.753907 -0.4101562,-0.164062 a 0.15001501,0.15001501 0 0 1 -0.085937,-0.0918 L 5.53125,10.068359 4.875,9.0839844 a 0.15059342,0.15059342 0 1 1 0.25,-0.1679688 l 0.044922,0.066406 -0.3125,-0.9355469 A 0.15001501,0.15001501 0 0 1 4.8496094,8 V 7 a 0.15001501,0.15001501 0 0 1 0.00781,-0.046875 L 5.1699219,6.0175781 5.125,6.0839844 A 0.15059342,0.15059342 0 1 1 4.875,5.9160156 L 5.53125,4.9316406 5.8574219,3.953125 a 0.15001501,0.15001501 0 0 1 0.085937,-0.091797 L 6.3535156,3.6972656 Z M 9.7578125,2.6582031 6.5546875,3.9394531 5.8027344,5.0664062 5.1503906,7.0234375 v 0.953125 L 5.8027344,9.9335938 6.5546875,11.060547 10,12.439453 13.445312,11.060547 14.197266,9.9335938 14.84375,7.9941406 14.0625,4.8632812 13.291016,3.7070312 13.189453,3.6386719 Z m 2.2597655,-0.1601562 0.05078,0.033203 0.978516,0.3261719 A 0.15001501,0.15001501 0 0 1 13.125,2.9160156 L 13.447266,3.4003906 14.236328,3.625 13.904297,3.1269531 Z M 9.0800781,2.4648438 7.0957031,3.1269531 6.8476562,3.5 9.2871094,2.5234375 Z M 10.548828,2.3417969 10.212891,2.4765625 12.367188,3.0917969 11.935547,2.8027344 Z M 8.5410156,2.3105469 7.0664062,2.8027344 7.0175781,2.8359375 8.5683594,2.3183594 Z m -0.515625,-0.1464844 -0.00781,0.00586 0.013672,-0.00586 z M 10,2.1582031 9.5859375,2.296875 l 0.15625,0.044922 0.3671875,-0.1464844 z m 0,-1 L 7.0800781,2.1308594 6.5546875,2.65625 6.9316406,2.53125 7.8984375,1.8867188 A 0.15001501,0.15001501 0 0 1 7.9160156,1.875 a 0.15001501,0.15001501 0 0 1 0.00977,-0.00586 0.15001501,0.15001501 0 0 1 0.041016,-0.015625 0.15001501,0.15001501 0 0 1 0.029297,-0.00391 0.15001501,0.15001501 0 0 1 0.015625,0 0.15001501,0.15001501 0 0 1 0.015625,0.00195 0.15001501,0.15001501 0 0 1 0.029297,0.00781 l 0.00391,0.00195 L 8.5351562,1.9960938 8.953125,1.8574219 A 0.15001501,0.15001501 0 0 1 9,1.8496094 h 1 0.0039 0.976563 a 0.15001501,0.15001501 0 0 1 0.0039,0 H 11 a 0.15001501,0.15001501 0 0 1 0.0039,0 0.15001501,0.15001501 0 0 1 0.02344,0.00195 0.15001501,0.15001501 0 0 1 0.002,0 0.15001501,0.15001501 0 0 1 0.0039,0.00195 0.15001501,0.15001501 0 0 1 0.01367,0.00391 0.15001501,0.15001501 0 0 1 0.0098,0.00195 0.15001501,0.15001501 0 0 1 0.01367,0.00586 l 2.375,0.7910156 -0.52539,-0.5253906 z m 0.925781,-0.00781 2.121094,0.7070313 a 0.15001501,0.15001501 0 0 1 0.05859,0.037109 l 0.988281,0.9882813 a 0.15001501,0.15001501 0 0 1 0.03125,0.033203 l 0.962891,0.9628906 a 0.15001501,0.15001501 0 0 1 0.01172,0.00977 l 0.0059,0.00586 a 0.15001501,0.15001501 0 0 1 0.0039,0.00391 0.15001501,0.15001501 0 0 1 0.0098,0.011719 0.15001501,0.15001501 0 0 1 0.02734,0.052734 l 0.19336,0.7773438 0.785156,1.1757812 a 0.15059342,0.15059342 0 1 1 -0.25,0.1679688 l -0.316406,-0.4765625 0.585937,2.3515625 0.002,0.00391 a 0.15001501,0.15001501 0 0 1 0,0.00195 0.15001501,0.15001501 0 0 1 0.0039,0.035156 0.15001501,0.15001501 0 0 1 0,0.00391 V 8.984375 a 0.15001501,0.15001501 0 0 1 0,0.029297 v 1.9707031 a 0.15001501,0.15001501 0 0 1 0,0.0293 V 13 a 0.15001501,0.15001501 0 0 1 -0.002,0.01367 0.15001501,0.15001501 0 0 1 -0.002,0.01563 L 15.152344,18 a 0.15001501,0.15001501 0 0 1 0,0.0059 0.15001501,0.15001501 0 0 1 -0.0059,0.0293 0.15001501,0.15001501 0 0 1 -0.002,0.0078 0.15001501,0.15001501 0 0 1 -0.002,0.0059 0.15001501,0.15001501 0 0 1 -0.0039,0.0078 0.15001501,0.15001501 0 0 1 -0.002,0.0059 0.15001501,0.15001501 0 0 1 -0.0039,0.0078 0.15001501,0.15001501 0 0 1 -0.002,0.0059 0.15001501,0.15001501 0 0 1 -0.0059,0.0078 0.15001501,0.15001501 0 0 1 -0.0039,0.0059 l -0.609375,0.914062 0.441406,-0.146484 a 0.15001501,0.15001501 0 0 1 0.199219,0.144531 l 0.707031,-1.060547 0.990234,-4.957031 V 8.0175781 L 15.865234,4.0761719 13.919922,2.1308594 10.976562,1.1503906 Z m -1.9023435,0 L 6.0800781,2.1308594 4.1308594,4.0800781 3.1503906,7.0234375 v 0.953125 l 0.9804688,2.9433595 1.9492187,1.949219 2.9433594,0.980468 h 0.050781 L 6.953125,13.142578 a 0.15001501,0.15001501 0 0 1 -0.058594,-0.03711 L 5.90625,12.117188 A 0.15001501,0.15001501 0 0 1 5.875,12.083984 L 4.9160156,11.125 a 0.15001501,0.15001501 0 0 1 -0.021484,-0.01953 0.15001501,0.15001501 0 0 1 -0.037109,-0.05859 L 4.53125,10.068359 3.875,9.0839844 a 0.15059342,0.15059342 0 1 1 0.25,-0.1679688 l 0.044922,0.066406 -0.3125,-0.9355469 A 0.15001501,0.15001501 0 0 1 3.8535156,8.0292969 0.15001501,0.15001501 0 0 1 3.8496094,8 V 7 a 0.15001501,0.15001501 0 0 1 0,-0.00391 0.15001501,0.15001501 0 0 1 0.00195,-0.013672 0.15001501,0.15001501 0 0 1 0.00195,-0.015625 0.15001501,0.15001501 0 0 1 0.00391,-0.013672 L 4.1699219,6.0175781 4.125,6.0839844 A 0.15059342,0.15059342 0 1 1 3.875,5.9160156 L 4.53125,4.9316406 4.8574219,3.953125 a 0.15001501,0.15001501 0 0 1 0.00391,-0.00977 0.15001501,0.15001501 0 0 1 0.013672,-0.025391 0.15001501,0.15001501 0 0 1 0.00977,-0.013672 0.15001501,0.15001501 0 0 1 0.00977,-0.00977 l 0.00977,-0.00977 A 0.15001501,0.15001501 0 0 1 4.9160156,3.875 L 5.875,2.9160156 a 0.15001501,0.15001501 0 0 1 0.03125,-0.033203 l 0.00586,-0.00391 0.9824218,-0.984375 A 0.15001501,0.15001501 0 0 1 6.953125,1.8574219 L 9.0742188,1.1503906 Z M 8.984375,0.84960938 a 0.15001501,0.15001501 0 0 1 0.015625,0 h 1 0.0039 H 11 a 0.15001501,0.15001501 0 0 1 0.04687,0.007813 l 3,1.00000002 a 0.15001501,0.15001501 0 0 1 0.05859,0.037109 l 2,2 a 0.15001501,0.15001501 0 0 1 0.04102,0.068359 l 1,4 A 0.15001501,0.15001501 0 0 1 17.150391,8 v 5 a 0.15001501,0.15001501 0 0 1 -0.0039,0.0293 l -1,5 a 0.15001501,0.15001501 0 0 1 -0.02148,0.05469 l -2,3 a 0.15001501,0.15001501 0 0 1 -0.07813,0.05859 l -3,1 A 0.15001501,0.15001501 0 0 1 11,22.150391 H 10 8.9882812 8 a 0.15001501,0.15001501 0 0 1 -0.046875,-0.0078 l -3,-1 a 0.15001501,0.15001501 0 0 1 -0.087891,-0.07617 l -1,-2 A 0.15001501,0.15001501 0 0 1 3.8496094,19 v -0.996094 a 0.15001501,0.15001501 0 0 1 0,-0.0039 0.15001501,0.15001501 0 0 1 0,-0.0098 0.15001501,0.15001501 0 0 1 0.00195,-0.01367 0.15001501,0.15001501 0 0 1 0,-0.002 0.15001501,0.15001501 0 0 1 0.00391,-0.01172 0.15001501,0.15001501 0 0 1 0,-0.0039 0.15001501,0.15001501 0 0 1 0.00391,-0.01172 0.15001501,0.15001501 0 0 1 0,-0.002 0.15001501,0.15001501 0 0 1 0.00391,-0.0059 0.15001501,0.15001501 0 0 1 0.00391,-0.0078 0.15001501,0.15001501 0 0 1 0.013672,-0.02344 0.15001501,0.15001501 0 0 1 0.00195,-0.002 0.15001501,0.15001501 0 0 1 0.00781,-0.0098 0.15001501,0.15001501 0 0 1 0.013672,-0.01172 0.15001501,0.15001501 0 0 1 0.00195,-0.002 0.15001501,0.15001501 0 0 1 0.027344,-0.01758 0.15001501,0.15001501 0 0 1 0.00586,-0.002 0.15001501,0.15001501 0 0 1 0.00195,-0.002 0.15001501,0.15001501 0 0 1 0.00781,-0.002 0.15001501,0.15001501 0 0 1 0.064453,-0.0098 H 5 a 0.15001501,0.15001501 0 0 1 0.1054688,0.04492 l 1,1 1.3652343,1.365235 2.1855469,0.363281 1.529297,-0.509766 1.222656,-0.734375 1.453125,-1.453125 0.988281,-4.941406 v -0.623047 l -0.74414,0.744141 a 0.15001501,0.15001501 0 0 1 -0.05859,0.03711 l -3,1 A 0.15001501,0.15001501 0 0 1 11,14.150391 H 10 9.9960938 9 a 0.15001501,0.15001501 0 0 1 -0.046875,-0.0078 l -3,-1 a 0.15001501,0.15001501 0 0 1 -0.058594,-0.03711 l -2,-2 a 0.15001501,0.15001501 0 0 1 -0.037109,-0.05859 l -1,-3 A 0.15001501,0.15001501 0 0 1 2.8496094,8 V 7 a 0.15001501,0.15001501 0 0 1 0.00781,-0.046875 l 1,-3 a 0.15001501,0.15001501 0 0 1 0.037109,-0.058594 l 2,-2 a 0.15001501,0.15001501 0 0 1 0.058594,-0.037109 l 3,-1.00000002 a 0.15001501,0.15001501 0 0 1 0.03125,-0.007813 z"
     id="path2" />
</svg>
