<?xml version="1.0" encoding="UTF-8" standalone="no"?>
<svg
   xmlns:dc="http://purl.org/dc/elements/1.1/"
   xmlns:cc="http://creativecommons.org/ns#"
   xmlns:rdf="http://www.w3.org/1999/02/22-rdf-syntax-ns#"
   xmlns:svg="http://www.w3.org/2000/svg"
   xmlns="http://www.w3.org/2000/svg"
   xmlns:sodipodi="http://sodipodi.sourceforge.net/DTD/sodipodi-0.dtd"
   xmlns:inkscape="http://www.inkscape.org/namespaces/inkscape"
   data-dec="48"
   width="22"
   height="40"
   version="1.1"
   id="svg4"
   sodipodi:docname="48.svg"
   inkscape:version="0.92.4 (unknown)">
  <metadata
     id="metadata10">
    <rdf:RDF>
      <cc:Work
         rdf:about="">
        <dc:format>image/svg+xml</dc:format>
        <dc:type
           rdf:resource="http://purl.org/dc/dcmitype/StillImage" />
      </cc:Work>
    </rdf:RDF>
  </metadata>
  <defs
     id="defs8" />
  <sodipodi:namedview
     pagecolor="#ffffff"
     bordercolor="#666666"
     borderopacity="1"
     objecttolerance="10"
     gridtolerance="10"
     guidetolerance="10"
     inkscape:pageopacity="0"
     inkscape:pageshadow="2"
     inkscape:window-width="615"
     inkscape:window-height="417"
     id="namedview6"
     showgrid="false"
     inkscape:zoom="5.9"
     inkscape:cx="11"
     inkscape:cy="20"
     inkscape:window-x="0"
     inkscape:window-y="27"
     inkscape:window-maximized="0"
     inkscape:current-layer="svg4" />
  <path
     style="color:#000000;font-style:normal;font-variant:normal;font-weight:normal;font-stretch:normal;font-size:medium;line-height:normal;font-family:sans-serif;font-variant-ligatures:normal;font-variant-position:normal;font-variant-caps:normal;font-variant-numeric:normal;font-variant-alternates:normal;font-feature-settings:normal;text-indent:0;text-align:start;text-decoration:none;text-decoration-line:none;text-decoration-style:solid;text-decoration-color:#000000;letter-spacing:normal;word-spacing:normal;text-transform:none;writing-mode:lr-tb;direction:ltr;text-orientation:mixed;dominant-baseline:auto;baseline-shift:baseline;text-anchor:start;white-space:normal;shape-padding:0;clip-rule:nonzero;display:inline;overflow:visible;visibility:visible;opacity:1;isolation:auto;mix-blend-mode:normal;color-interpolation:sRGB;color-interpolation-filters:linearRGB;solid-color:#000000;solid-opacity:1;vector-effect:none;fill:#013272;fill-opacity:1;fill-rule:nonzero;stroke:none;stroke-width:1;stroke-linecap:round;stroke-linejoin:round;stroke-miterlimit:4;stroke-dasharray:none;stroke-dashoffset:0;stroke-opacity:1;color-rendering:auto;image-rendering:auto;shape-rendering:auto;text-rendering:auto;enable-background:accumulate"
     d="M 12.117188,1.5 10.341797,2.3886719 8.4335938,5.2519531 7.4628906,7.1914062 6.4804688,10.140625 5.5,14.0625 v 4.820312 L 6.4101562,20.703125 7.2070312,21.5 h 1.6757813 l 1.7753905,-0.888672 1.908203,-2.863281 0.970703,-1.939453 0.982422,-2.949219 L 15.5,8.9375 V 4.1171875 L 14.589844,2.296875 13.792969,1.5 Z m 1.876953,-1.00585938 a 0.50005,0.50005 0 0 1 0.261718,0.0761719 l 1.966797,0.9824219 a 0.50005,0.50005 0 0 1 0.13086,0.09375 l 1,1 a 0.50005,0.50005 0 0 1 0.121093,0.1953125 l 1,3 A 0.50005,0.50005 0 0 1 18.5,6 v 3 a 0.50005,0.50005 0 0 1 -0.01563,0.1210938 l -1,4.0000002 a 0.50005,0.50005 0 0 1 -0.0098,0.03711 l -1,3 a 0.50005,0.50005 0 0 1 -0.05859,0.119141 l -2,3 a 0.50005,0.50005 0 0 1 -0.0625,0.07617 l -2,2 a 0.50005,0.50005 0 0 1 -0.195313,0.121093 l -2.9667968,0.988282 a 0.50005,0.50005 0 0 1 -0.015625,0.0059 l -0.017578,0.0059 a 0.50005,0.50005 0 0 1 -0.00977,0.0039 0.50005,0.50005 0 0 1 -0.00391,0.002 A 0.50005,0.50005 0 0 1 8.9355469,22.5 H 7.0664062 A 0.50005,0.50005 0 0 1 6.7441406,22.429688 L 4.7773438,21.447266 a 0.50005,0.50005 0 0 1 -0.1308594,-0.09375 l -1,-1 A 0.50005,0.50005 0 0 1 3.5253906,20.158203 l -1,-3 A 0.50005,0.50005 0 0 1 2.5,17 v -3 a 0.50005,0.50005 0 0 1 0.015625,-0.121094 l 1,-3.9999998 a 0.50005,0.50005 0 0 1 0.00977,-0.037109 l 1,-3 a 0.50005,0.50005 0 0 1 0.058594,-0.1191407 l 2,-3 a 0.50005,0.50005 0 0 1 0.0625,-0.076172 l 2,-2 A 0.50005,0.50005 0 0 1 8.8417969,1.5253906 L 11.800781,0.5390625 a 0.50005,0.50005 0 0 1 0.0039,-0.001953 0.50005,0.50005 0 0 1 0.05078,-0.0175781 0.50005,0.50005 0 0 1 0.04492,-0.0117188 0.50005,0.50005 0 0 1 0.0098,-0.001953 0.50005,0.50005 0 0 1 0.0039,0 0.50005,0.50005 0 0 1 0.0098,-0.001953 0.50005,0.50005 0 0 1 0.01563,-0.001953 0.50005,0.50005 0 0 1 0.01367,-0.001953 0.50005,0.50005 0 0 1 0.01563,-0.001953 0.50005,0.50005 0 0 1 0.0059,0 0.50005,0.50005 0 0 1 0.002,0 A 0.50005,0.50005 0 0 1 12.064453,0.5 h 1.869141 a 0.50005,0.50005 0 0 1 0.06055,-0.005859 z"
     id="path2" />
</svg>
