<?xml version="1.0" encoding="UTF-8" standalone="no"?>
<svg
   xmlns:dc="http://purl.org/dc/elements/1.1/"
   xmlns:cc="http://creativecommons.org/ns#"
   xmlns:rdf="http://www.w3.org/1999/02/22-rdf-syntax-ns#"
   xmlns:svg="http://www.w3.org/2000/svg"
   xmlns="http://www.w3.org/2000/svg"
   xmlns:sodipodi="http://sodipodi.sourceforge.net/DTD/sodipodi-0.dtd"
   xmlns:inkscape="http://www.inkscape.org/namespaces/inkscape"
   data-dec="99"
   width="18"
   height="40"
   version="1.1"
   id="svg4"
   sodipodi:docname="99.svg"
   inkscape:version="0.92.4 (unknown)">
  <metadata
     id="metadata10">
    <rdf:RDF>
      <cc:Work
         rdf:about="">
        <dc:format>image/svg+xml</dc:format>
        <dc:type
           rdf:resource="http://purl.org/dc/dcmitype/StillImage" />
      </cc:Work>
    </rdf:RDF>
  </metadata>
  <defs
     id="defs8" />
  <sodipodi:namedview
     pagecolor="#ffffff"
     bordercolor="#666666"
     borderopacity="1"
     objecttolerance="10"
     gridtolerance="10"
     guidetolerance="10"
     inkscape:pageopacity="0"
     inkscape:pageshadow="2"
     inkscape:window-width="640"
     inkscape:window-height="480"
     id="namedview6"
     showgrid="false"
     inkscape:zoom="5.9"
     inkscape:cx="9"
     inkscape:cy="20"
     inkscape:window-x="0"
     inkscape:window-y="27"
     inkscape:window-maximized="0"
     inkscape:current-layer="svg4" />
  <path
     style="color:#000000;font-style:normal;font-variant:normal;font-weight:normal;font-stretch:normal;font-size:medium;line-height:normal;font-family:sans-serif;font-variant-ligatures:normal;font-variant-position:normal;font-variant-caps:normal;font-variant-numeric:normal;font-variant-alternates:normal;font-feature-settings:normal;text-indent:0;text-align:start;text-decoration:none;text-decoration-line:none;text-decoration-style:solid;text-decoration-color:#000000;letter-spacing:normal;word-spacing:normal;text-transform:none;writing-mode:lr-tb;direction:ltr;text-orientation:mixed;dominant-baseline:auto;baseline-shift:baseline;text-anchor:start;white-space:normal;shape-padding:0;clip-rule:nonzero;display:inline;overflow:visible;visibility:visible;opacity:1;isolation:auto;mix-blend-mode:normal;color-interpolation:sRGB;color-interpolation-filters:linearRGB;solid-color:#000000;solid-opacity:1;vector-effect:none;fill:#013272;fill-opacity:1;fill-rule:nonzero;stroke:none;stroke-width:1;stroke-linecap:round;stroke-linejoin:round;stroke-miterlimit:4;stroke-dasharray:none;stroke-dashoffset:0;stroke-opacity:1;color-rendering:auto;image-rendering:auto;shape-rendering:auto;text-rendering:auto;enable-background:accumulate"
     d="m 5.28125,19.423828 a 0.50005,0.50005 0 0 1 -0.1015625,0.04883 l 0.1757813,0.175782 z M 15.5,12.035156 A 0.50005,0.50005 0 0 1 15.082031,12.5 H 15.5 Z M 14.5,12 v 0.5 h 0.419922 A 0.50005,0.50005 0 0 1 14.5,12 Z M 5.3554688,10.351562 5.1816406,10.525391 a 0.50005,0.50005 0 0 1 0.097656,0.05273 z M 9.0019531,7.4960938 A 0.50005,0.50005 0 0 1 9.0644531,7.5 H 12 a 0.50005,0.50005 0 0 1 0.222656,0.052734 l 2,1 a 0.50005,0.50005 0 0 1 0.13086,0.09375 l 2,1.9999996 A 0.50005,0.50005 0 0 1 16.5,11 v 2 A 0.50005,0.50005 0 0 1 16,13.5 H 14 A 0.50005,0.50005 0 0 1 13.5,13 V 11 A 0.50005,0.50005 0 0 1 14,10.5 h 0.792969 L 13.703125,9.4101562 11.882812,8.5 H 9.1171875 L 7.296875,9.4101562 6.4375,10.269531 5.5,13.082031 v 3.835938 l 0.9375,2.8125 0.859375,0.859375 L 9.1171875,21.5 h 1.8007815 l 2.8125,-0.9375 1.916015,-1.916016 a 0.50005,0.50005 0 1 1 0.707032,0.707032 l -2,2 a 0.50005,0.50005 0 0 1 -0.195313,0.121093 l -3,1 A 0.50005,0.50005 0 0 1 11,22.5 H 9.0664062 a 0.50005,0.50005 0 0 1 -0.2246093,-0.02539 l -0.019531,-0.0059 a 0.50005,0.50005 0 0 1 -0.00391,-0.002 L 5.8417969,21.474609 A 0.50005,0.50005 0 0 1 5.6464844,21.353516 l -2,-2 A 0.50005,0.50005 0 0 1 3.5253906,19.158203 l -1,-3 A 0.50005,0.50005 0 0 1 2.5,16 v -2 a 0.50005,0.50005 0 0 1 0.025391,-0.158203 l 1,-3 a 0.50005,0.50005 0 0 1 0.1210938,-0.195313 l 2,-1.9999996 A 0.50005,0.50005 0 0 1 5.8417969,8.5253906 L 8.8085938,7.5371094 a 0.50005,0.50005 0 0 1 0.033203,-0.011719 0.50005,0.50005 0 0 1 0.013672,-0.00586 0.50005,0.50005 0 0 1 0.1464843,-0.023437 z"
     id="path2" />
</svg>
