<?xml version="1.0" encoding="UTF-8" standalone="no"?>
<svg
   xmlns:dc="http://purl.org/dc/elements/1.1/"
   xmlns:cc="http://creativecommons.org/ns#"
   xmlns:rdf="http://www.w3.org/1999/02/22-rdf-syntax-ns#"
   xmlns:svg="http://www.w3.org/2000/svg"
   xmlns="http://www.w3.org/2000/svg"
   xmlns:sodipodi="http://sodipodi.sourceforge.net/DTD/sodipodi-0.dtd"
   xmlns:inkscape="http://www.inkscape.org/namespaces/inkscape"
   data-dec="56"
   width="12"
   height="40"
   version="1.1"
   id="svg4"
   sodipodi:docname="56.svg"
   inkscape:version="0.92.4 5da689c313, 2019-01-14">
  <metadata
     id="metadata10">
    <rdf:RDF>
      <cc:Work
         rdf:about="">
        <dc:format>image/svg+xml</dc:format>
        <dc:type
           rdf:resource="http://purl.org/dc/dcmitype/StillImage" />
        <dc:title></dc:title>
      </cc:Work>
    </rdf:RDF>
  </metadata>
  <defs
     id="defs8" />
  <sodipodi:namedview
     pagecolor="#ffffff"
     bordercolor="#666666"
     borderopacity="1"
     objecttolerance="10"
     gridtolerance="10"
     guidetolerance="10"
     inkscape:pageopacity="0"
     inkscape:pageshadow="2"
     inkscape:window-width="1920"
     inkscape:window-height="1043"
     id="namedview6"
     showgrid="false"
     inkscape:zoom="5.9"
     inkscape:cx="6"
     inkscape:cy="20"
     inkscape:window-x="0"
     inkscape:window-y="37"
     inkscape:window-maximized="0"
     inkscape:current-layer="svg4" />
  <path
     style="color:#000000;font-style:normal;font-variant:normal;font-weight:normal;font-stretch:normal;font-size:medium;line-height:normal;font-family:sans-serif;font-variant-ligatures:normal;font-variant-position:normal;font-variant-caps:normal;font-variant-numeric:normal;font-variant-alternates:normal;font-feature-settings:normal;text-indent:0;text-align:start;text-decoration:none;text-decoration-line:none;text-decoration-style:solid;text-decoration-color:#000000;letter-spacing:normal;word-spacing:normal;text-transform:none;writing-mode:lr-tb;direction:ltr;text-orientation:mixed;dominant-baseline:auto;baseline-shift:baseline;text-anchor:start;white-space:normal;shape-padding:0;clip-rule:nonzero;display:inline;overflow:visible;visibility:visible;opacity:1;isolation:auto;mix-blend-mode:normal;color-interpolation:sRGB;color-interpolation-filters:linearRGB;solid-color:#000000;solid-opacity:1;vector-effect:none;fill:#000000;fill-opacity:1;fill-rule:nonzero;stroke:none;stroke-width:1.5;stroke-linecap:round;stroke-linejoin:round;stroke-miterlimit:4;stroke-dasharray:none;stroke-dashoffset:0;stroke-opacity:1;color-rendering:auto;image-rendering:auto;shape-rendering:auto;text-rendering:auto;enable-background:accumulate"
     d="m 5.109375,10.75 -1.7871094,0.84375 -0.53125,0.753906 -0.6289062,1.78125 v 3.742188 l 0.6289062,1.78125 0.53125,0.753906 L 5.109375,21.25 h 1.78125 l 1.7871094,-0.84375 0.53125,-0.753906 0.6289062,-1.78125 V 14.128906 L 9.2089844,12.347656 8.6777344,11.59375 6.890625,10.75 Z m 0,-9 L 3.4257812,2.5449219 2.8671875,4.1289062 V 6.8710938 L 3.4257812,8.4550781 5.109375,9.25 h 1.78125 L 8.5742188,8.4550781 9.1328125,6.8710938 V 4.1289062 L 8.5742188,2.5449219 6.890625,1.75 Z M 4.9609375,0.24609375 A 0.750075,0.750075 0 0 1 5.0371094,0.25 h 2.0214844 a 0.750075,0.750075 0 0 1 0.3203124,0.0722656 L 9.4960938,1.3222656 A 0.750075,0.750075 0 0 1 9.8828125,1.75 l 0.7070315,2 A 0.750075,0.750075 0 0 1 10.632812,4 v 3 a 0.750075,0.750075 0 0 1 -0.04297,0.25 l -0.7070315,2 A 0.750075,0.750075 0 0 1 9.4960938,9.6777344 L 8.8144531,10 9.4960938,10.322266 a 0.750075,0.750075 0 0 1 0.2929687,0.246093 l 0.7050785,1 a 0.750075,0.750075 0 0 1 0.0957,0.181641 l 0.705078,2 a 0.750075,0.750075 0 0 1 0.04297,0.25 v 4 a 0.750075,0.750075 0 0 1 -0.04297,0.25 l -0.705078,2 a 0.750075,0.750075 0 0 1 -0.0957,0.181641 l -0.7050785,1 a 0.750075,0.750075 0 0 1 -0.2929687,0.246093 l -2.1171876,1 A 0.750075,0.750075 0 0 1 7.0585938,22.75 H 4.9414062 a 0.750075,0.750075 0 0 1 -0.3203124,-0.07227 l -2.1171876,-1 A 0.750075,0.750075 0 0 1 2.2109375,21.431641 l -0.7050781,-1 A 0.750075,0.750075 0 0 1 1.4101562,20.25 l -0.70507808,-2 A 0.750075,0.750075 0 0 1 0.66210938,18 v -4 a 0.750075,0.750075 0 0 1 0.0429687,-0.25 l 0.70507808,-2 a 0.750075,0.750075 0 0 1 0.095703,-0.181641 l 0.7050781,-1 A 0.750075,0.750075 0 0 1 2.5039062,10.322266 L 3.1855469,10 2.5039062,9.6777344 A 0.750075,0.750075 0 0 1 2.1171875,9.25 l -0.7070313,-2 A 0.750075,0.750075 0 0 1 1.3671875,7 V 4 a 0.750075,0.750075 0 0 1 0.042969,-0.25 l 0.7070313,-2 A 0.750075,0.750075 0 0 1 2.5039062,1.3222656 L 4.5371094,0.36132812 a 0.750075,0.750075 0 0 1 0.1972656,-0.0839844 0.750075,0.750075 0 0 1 0.056641,-0.0136719 0.750075,0.750075 0 0 1 0.1699219,-0.0175781 z"
     id="path2" />
</svg>
