<?xml version="1.0" encoding="UTF-8"?>
<glyph name="j" format="1">
  <advance width="346"/>
  <unicode hex="006A"/>
  <outline>
    <contour>
      <point x="174" y="449" type="line"/>
      <point x="177" y="449" type="line"/>
      <point x="199" y="449" type="line"/>
      <point x="202" y="449" type="line" smooth="yes"/>
      <point x="206" y="449"/>
      <point x="215" y="446"/>
      <point x="218" y="443" type="curve" smooth="yes"/>
      <point x="219" y="441" type="line" smooth="yes"/>
      <point x="222" y="438"/>
      <point x="224" y="431"/>
      <point x="224" y="427" type="curve" smooth="yes"/>
      <point x="224" y="424" type="line"/>
      <point x="224" y="-94" type="line" smooth="yes"/>
      <point x="224" y="-97"/>
      <point x="223" y="-101"/>
      <point x="222" y="-103" type="curve" smooth="yes"/>
      <point x="194" y="-162" type="line" smooth="yes"/>
      <point x="192" y="-165"/>
      <point x="187" y="-170"/>
      <point x="184" y="-172" type="curve" smooth="yes"/>
      <point x="126" y="-199" type="line" smooth="yes"/>
      <point x="123" y="-201"/>
      <point x="119" y="-202"/>
      <point x="116" y="-202" type="curve" smooth="yes"/>
      <point x="112" y="-202" type="line"/>
      <point x="58" y="-202" type="line" smooth="yes"/>
      <point x="54" y="-202"/>
      <point x="46" y="-199"/>
      <point x="43" y="-196" type="curve" smooth="yes"/>
      <point x="13" y="-167" type="line" smooth="yes"/>
      <point x="10" y="-164"/>
      <point x="8" y="-156"/>
      <point x="8" y="-152" type="curve" smooth="yes"/>
      <point x="8" y="-123" type="line" smooth="yes"/>
      <point x="8" y="-119"/>
      <point x="10" y="-111"/>
      <point x="13" y="-108" type="curve" smooth="yes"/>
      <point x="43" y="-78" type="line" smooth="yes"/>
      <point x="46" y="-75"/>
      <point x="52" y="-73"/>
      <point x="58" y="-73" type="curve" smooth="yes"/>
      <point x="64" y="-73"/>
      <point x="71" y="-75"/>
      <point x="74" y="-78" type="curve" smooth="yes"/>
      <point x="102" y="-108" type="line" smooth="yes"/>
      <point x="105" y="-111"/>
      <point x="109" y="-117"/>
      <point x="109" y="-123" type="curve" smooth="yes"/>
      <point x="109" y="-129"/>
      <point x="105" y="-136"/>
      <point x="102" y="-139" type="curve" smooth="yes"/>
      <point x="81" y="-160" type="line"/>
      <point x="107" y="-160" type="line"/>
      <point x="126" y="-139" type="line"/>
      <point x="152" y="-89" type="line"/>
      <point x="152" y="406" type="line"/>
      <point x="87" y="406" type="line" smooth="yes"/>
      <point x="75" y="406"/>
      <point x="65" y="415"/>
      <point x="65" y="427" type="curve" smooth="yes"/>
      <point x="65" y="439"/>
      <point x="75" y="449"/>
      <point x="87" y="449" type="curve" smooth="yes"/>
      <point x="170" y="449" type="line"/>
    </contour>
    <contour>
      <point x="173" y="651" type="line"/>
      <point x="174" y="651" type="line" smooth="yes"/>
      <point x="181" y="651"/>
      <point x="188" y="646"/>
      <point x="191" y="642" type="curve" smooth="yes"/>
      <point x="218" y="616" type="line" smooth="yes"/>
      <point x="221" y="613"/>
      <point x="224" y="607"/>
      <point x="224" y="601" type="curve" smooth="yes"/>
      <point x="224" y="595"/>
      <point x="221" y="588"/>
      <point x="218" y="585" type="curve" smooth="yes"/>
      <point x="189" y="557" type="line" smooth="yes"/>
      <point x="186" y="554"/>
      <point x="180" y="550"/>
      <point x="174" y="550" type="curve" smooth="yes"/>
      <point x="168" y="550"/>
      <point x="161" y="554"/>
      <point x="158" y="557" type="curve" smooth="yes"/>
      <point x="130" y="585" type="line" smooth="yes"/>
      <point x="127" y="588"/>
      <point x="123" y="595"/>
      <point x="123" y="601" type="curve" smooth="yes"/>
      <point x="123" y="607"/>
      <point x="127" y="613"/>
      <point x="130" y="616" type="curve" smooth="yes"/>
      <point x="156" y="642" type="line" smooth="yes"/>
      <point x="159" y="646"/>
      <point x="166" y="650"/>
      <point x="172" y="651" type="curve" smooth="yes"/>
    </contour>
  </outline>
  <lib>
    <dict>
      <key>com.fontlab.hintData</key>
      <dict>
        <key>hhints</key>
        <array>
          <dict>
            <key>position</key>
            <integer>-202</integer>
            <key>width</key>
            <integer>43</integer>
          </dict>
          <dict>
            <key>position</key>
            <integer>-202</integer>
            <key>width</key>
            <integer>130</integer>
          </dict>
          <dict>
            <key>position</key>
            <integer>406</integer>
            <key>width</key>
            <integer>43</integer>
          </dict>
          <dict>
            <key>position</key>
            <integer>550</integer>
            <key>width</key>
            <integer>101</integer>
          </dict>
        </array>
        <key>vhints</key>
        <array>
          <dict>
            <key>position</key>
            <integer>8</integer>
            <key>width</key>
            <integer>101</integer>
          </dict>
          <dict>
            <key>position</key>
            <integer>123</integer>
            <key>width</key>
            <integer>101</integer>
          </dict>
          <dict>
            <key>position</key>
            <integer>152</integer>
            <key>width</key>
            <integer>73</integer>
          </dict>
        </array>
      </dict>
    </dict>
  </lib>
</glyph>
