<?xml version="1.0" encoding="UTF-8" standalone="no"?>
<svg
   xmlns:dc="http://purl.org/dc/elements/1.1/"
   xmlns:cc="http://creativecommons.org/ns#"
   xmlns:rdf="http://www.w3.org/1999/02/22-rdf-syntax-ns#"
   xmlns:svg="http://www.w3.org/2000/svg"
   xmlns="http://www.w3.org/2000/svg"
   xmlns:sodipodi="http://sodipodi.sourceforge.net/DTD/sodipodi-0.dtd"
   xmlns:inkscape="http://www.inkscape.org/namespaces/inkscape"
   data-dec="82"
   width="19"
   height="40"
   version="1.1"
   id="svg4"
   sodipodi:docname="82.svg"
   inkscape:version="0.92.4 (unknown)">
  <metadata
     id="metadata10">
    <rdf:RDF>
      <cc:Work
         rdf:about="">
        <dc:format>image/svg+xml</dc:format>
        <dc:type
           rdf:resource="http://purl.org/dc/dcmitype/StillImage" />
      </cc:Work>
    </rdf:RDF>
  </metadata>
  <defs
     id="defs8" />
  <sodipodi:namedview
     pagecolor="#ffffff"
     bordercolor="#666666"
     borderopacity="1"
     objecttolerance="10"
     gridtolerance="10"
     guidetolerance="10"
     inkscape:pageopacity="0"
     inkscape:pageshadow="2"
     inkscape:window-width="640"
     inkscape:window-height="480"
     id="namedview6"
     showgrid="false"
     inkscape:zoom="5.9"
     inkscape:cx="9.5"
     inkscape:cy="20"
     inkscape:window-x="0"
     inkscape:window-y="27"
     inkscape:window-maximized="0"
     inkscape:current-layer="svg4" />
  <path
     style="color:#000000;font-style:normal;font-variant:normal;font-weight:normal;font-stretch:normal;font-size:medium;line-height:normal;font-family:sans-serif;font-variant-ligatures:normal;font-variant-position:normal;font-variant-caps:normal;font-variant-numeric:normal;font-variant-alternates:normal;font-feature-settings:normal;text-indent:0;text-align:start;text-decoration:none;text-decoration-line:none;text-decoration-style:solid;text-decoration-color:#000000;letter-spacing:normal;word-spacing:normal;text-transform:none;writing-mode:lr-tb;direction:ltr;text-orientation:mixed;dominant-baseline:auto;baseline-shift:baseline;text-anchor:start;white-space:normal;shape-padding:0;clip-rule:nonzero;display:inline;overflow:visible;visibility:visible;opacity:1;isolation:auto;mix-blend-mode:normal;color-interpolation:sRGB;color-interpolation-filters:linearRGB;solid-color:#000000;solid-opacity:1;vector-effect:none;fill:#000000;fill-opacity:1;fill-rule:nonzero;stroke:none;stroke-width:1.5;stroke-linecap:round;stroke-linejoin:round;stroke-miterlimit:4;stroke-dasharray:none;stroke-dashoffset:0;stroke-opacity:1;color-rendering:auto;image-rendering:auto;shape-rendering:auto;text-rendering:auto;enable-background:accumulate"
     d="m 5.75,1.75 v 9.5 h 4.125 a 0.750075,0.750075 0 0 1 0.00586,0 0.750075,0.750075 0 0 1 0.00781,-0.002 l 0.00586,-0.002 L 12.712891,10.304688 14.441406,9.4414062 15.25,7.8222656 V 6.1777344 L 14.382812,4.4433594 12.595703,2.65625 9.8808594,1.75 Z M 3.9882812,0.24023438 A 0.750075,0.750075 0 0 1 4.1230469,0.25 h 0.7539062 a 0.750075,0.750075 0 0 1 0.2460938,0 H 9.921875 a 0.750075,0.750075 0 0 1 0.185547,0.007813 0.750075,0.750075 0 0 1 0.05859,0.009766 0.750075,0.750075 0 0 1 0.01563,0.003906 l 4,1.00000002 A 0.750075,0.750075 0 0 1 14.53125,1.46875 l 2,2 a 0.750075,0.750075 0 0 1 0.138672,0.1953125 l 1,2 A 0.750075,0.750075 0 0 1 17.75,6 v 2 a 0.750075,0.750075 0 0 1 -0.08008,0.3359375 l -1,2.0000005 a 0.750075,0.750075 0 0 1 -0.333984,0.333984 l -2,1 a 0.750075,0.750075 0 0 1 -0.154297,0.05859 l -2.291016,0.572265 0.804687,2.41211 0.955079,1.910156 1.93164,2.898437 1.949219,1.947266 A 0.750075,0.750075 0 0 1 16.583984,22.625 l -3,-2 A 0.750075,0.750075 0 0 1 13.375,20.416016 l -2,-3 a 0.750075,0.750075 0 0 1 -0.04492,-0.08008 l -1,-2 a 0.750075,0.750075 0 0 1 -0.04102,-0.09961 L 9.4609375,12.75 H 5.75 v 7.9375 L 6.3105469,21.25 H 7 a 0.750075,0.750075 0 0 1 0,1.5 H 6 5.1230469 a 0.750075,0.750075 0 0 1 -0.2460938,0 H 4.1230469 a 0.750075,0.750075 0 0 1 -0.2460938,0 H 3 2 a 0.750075,0.750075 0 0 1 0,-1.5 H 2.6894531 L 3.25,20.6875 V 2.3125 L 2.6894531,1.75 H 2 a 0.750075,0.750075 0 0 1 0,-1.5 h 1 0.8769531 a 0.750075,0.750075 0 0 1 0.1113281,-0.009766 z"
     id="path2" />
</svg>
