{
  "fontname": "Times-Triplex-Italic",
  "height": 40,
  "data-date": "la date",
  "chars": [
    {
      "dec": "111",
      "width": "20",
      "d": "M9,8 L6,9 4,12 3,15 3,17 4,20 5,21 8,22 11,22 14,21 16,18 17,15 17,13 16,10 15,9 12,8 9,8 M6,10 L5,12 4,15 4,18 5,20 M14,20 L15,18 16,15 16,12 15,10 M9,8 L7,10 6,12 5,15 5,18 6,21 8,22 M11,22 L13,20 14,18 15,15 15,12 14,9 12,8 "
    },
    {
      "dec": "83",
      "width": "24",
      "d": "M19,3 L20,3 21,1 20,7 20,5 19,3 18,2 15,1 11,1 8,2 6,4 6,7 7,9 9,11 15,14 16,16 16,19 15,21 M7,7 L8,9 15,13 16,15 M8,2 L7,4 7,6 8,8 14,11 16,13 17,15 17,18 16,20 15,21 12,22 8,22 5,21 4,20 3,18 3,16 2,22 3,20 4,20 "
    },
    {
      "dec": "43",
      "width": "26",
      "d": "M12,4 L12,21 13,21 M12,4 L13,4 13,21 M4,12 L21,12 21,13 M4,12 L4,13 21,13 "
    },
    {
      "dec": "81",
      "width": "22",
      "d": "M12,1 L9,2 7,4 5,7 4,10 3,14 3,17 4,20 5,21 7,22 10,22 13,21 15,19 17,16 18,13 19,9 19,6 18,3 17,2 15,1 12,1 M8,4 L6,7 5,10 4,14 4,18 5,20 M14,19 L16,16 17,13 18,9 18,5 17,3 M12,1 L10,2 8,5 7,7 6,10 5,14 5,19 6,21 7,22 M10,22 L12,21 14,18 15,16 16,13 17,9 17,4 16,2 15,1 M5,19 L6,17 8,16 9,16 11,17 12,19 13,24 14,25 15,25 16,24 M13,25 L14,26 15,26 M12,19 L12,26 13,27 15,27 16,24 16,23 "
    },
    {
      "dec": "86",
      "width": "20",
      "d": "M6,1 L6,3 7,20 7,22 M7,2 L8,19 M8,1 L9,18 M19,2 L7,22 M4,1 L11,1 M16,1 L22,1 M5,1 L6,3 M9,1 L8,3 M10,1 L7,2 M17,1 L19,2 M21,1 L19,2 "
    },
    {
      "dec": "70",
      "width": "20",
      "d": "M9,1 L3,22 M10,1 L4,22 M11,1 L5,22 M15,7 L13,15 M6,1 L21,1 20,7 M8,11 L14,11 M0,22 L8,22 M7,1 L10,2 M8,1 L9,3 M12,1 L10,3 M13,1 L10,2 M17,1 L20,2 M18,1 L20,3 M19,1 L20,4 M20,1 L20,7 M15,7 L13,11 13,15 M14,9 L12,11 13,13 M14,10 L11,11 13,12 M4,21 L1,22 M4,20 L2,22 M5,20 L6,22 M4,21 L7,22 "
    },
    {
      "dec": "50",
      "width": "22",
      "d": "M7,6 L7,5 8,5 8,7 6,7 6,5 7,3 8,2 11,1 14,1 17,2 18,4 18,6 17,8 15,10 5,16 3,18 1,22 M16,2 L17,4 17,6 16,8 14,10 11,12 M14,1 L15,2 16,4 16,6 15,8 13,10 5,16 M2,20 L3,19 5,19 10,20 15,20 16,19 M5,19 L10,21 15,21 M5,19 L10,22 13,22 15,21 16,19 16,18 "
    },
    {
      "dec": "180",
      "width": "12",
      "d": "M 8,1 3,7 M 8,1 9,2 3,7 "
    },
    {
      "dec": "100",
      "width": "22",
      "d": "M18,1 L15,12 14,16 14,19 15,21 16,22 18,22 20,20 21,18 M19,1 L16,12 15,16 15,21 M15,1 L20,1 16,15 15,19 M14,15 L14,12 13,9 11,8 9,8 6,9 4,12 3,15 3,17 4,20 5,21 7,22 9,22 11,21 12,20 13,18 14,15 M6,10 L5,12 4,15 4,18 5,20 M9,8 L7,10 6,12 5,15 5,18 6,21 7,22 M16,1 L19,2 M17,1 L18,3 "
    },
    {
      "dec": "102",
      "width": "16",
      "d": "M16,3 L16,2 15,2 15,4 17,4 17,2 16,1 14,1 12,2 10,4 9,6 8,9 7,13 5,22 4,25 3,27 1,29 M10,5 L9,8 8,13 6,22 5,25 M14,1 L12,3 11,5 10,8 9,13 7,21 6,24 5,26 3,28 1,29 -1,29 -2,28 -2,26 0,26 0,28 -1,28 -1,27 M4,8 L15,8 "
    },
    {
      "dec": "121",
      "width": "22",
      "d": "M1,12 L2,10 4,8 6,8 7,9 8,11 8,14 6,19 M7,9 L7,13 6,17 6,21 M7,11 L5,16 5,19 6,21 8,22 10,22 12,21 14,19 16,15 M18,8 L14,22 13,25 11,28 9,29 M19,8 L15,22 13,26 M18,8 L20,8 16,22 14,26 12,28 9,29 6,29 4,28 3,27 3,25 5,25 5,27 4,27 4,26 "
    },
    {
      "dec": "93",
      "width": "14",
      "d": "M9,-3 L9,29 M10,-3 L10,29 M3,-3 L10,-3 M3,29 L10,29 "
    },
    {
      "dec": "109",
      "width": "34",
      "d": "M1,12 L2,10 4,8 6,8 7,9 8,11 8,14 6,22 M7,9 L7,14 5,22 M7,11 L6,15 4,22 6,22 M8,14 L10,11 12,9 14,8 16,8 18,9 19,11 19,14 17,22 M18,9 L18,14 16,22 M18,11 L17,15 15,22 17,22 M19,14 L21,11 23,9 25,8 27,8 29,9 30,11 30,14 28,19 M29,9 L29,13 28,17 28,21 M29,11 L27,16 27,19 28,21 29,22 31,22 33,20 34,18 "
    },
    {
      "dec": "45",
      "width": "26",
      "d": "M4,13 L22,13 "
    },
    {
      "dec": "184",
      "width": "18",
      "d": "m 9,26 h 1 l 1,-1 -1,-1 H 9 l 2,-2 "
    },
    {
      "dec": "120",
      "width": "22",
      "d": "M3,12 L5,9 7,8 9,8 11,9 12,11 12,13 M9,8 L10,9 10,13 9,17 8,19 6,21 4,22 2,22 1,21 1,19 3,19 3,21 2,21 2,20 M11,10 L11,13 10,17 10,20 M19,10 L19,9 18,9 18,11 20,11 20,9 19,8 17,8 15,9 13,11 12,13 11,17 11,21 12,22 M9,17 L9,19 10,21 12,22 14,22 16,21 18,18 "
    },
    {
      "dec": "71",
      "width": "24",
      "d": "M18,3 L19,3 20,1 19,7 19,5 18,3 17,2 15,1 12,1 9,2 7,4 5,7 4,10 3,14 3,17 4,20 5,21 8,22 10,22 13,21 15,19 17,15 M9,3 L7,5 6,7 5,10 4,14 4,18 5,20 M14,19 L15,18 16,15 M12,1 L10,2 8,5 7,7 6,10 5,14 5,19 6,21 8,22 M10,22 L12,21 14,18 15,15 M12,15 L20,15 M13,15 L15,16 M14,15 L15,18 M18,15 L16,17 M19,15 L16,16 "
    },
    {
      "dec": "65",
      "width": "20",
      "d": "M13,1 L1,21 M11,5 L12,22 M12,3 L13,21 M13,1 L13,3 14,20 14,22 M4,16 L12,16 M-2,22 L4,22 M9,22 L16,22 M1,21 L-1,22 M1,21 L3,22 M12,21 L10,22 M12,20 L11,22 M14,20 L15,22 "
    },
    {
      "dec": "104",
      "width": "22",
      "d": "M8,1 L2,22 4,22 M9,1 L3,22 M5,1 L10,1 4,22 M6,15 L8,11 10,9 12,8 14,8 16,9 17,11 17,14 15,19 M16,9 L16,13 15,17 15,21 M16,11 L14,16 14,19 15,21 16,22 18,22 20,20 21,18 M6,1 L9,2 M7,1 L8,3 "
    },
    {
      "dec": "60",
      "width": "24",
      "d": "M20,4 L4,13 20,22 "
    },
    {
      "dec": "49",
      "width": "22",
      "d": "M12,5 L7,22 9,22 M15,1 L13,5 8,22 M15,1 L9,22 M15,1 L12,4 9,6 7,7 M12,5 L10,6 7,7 "
    },
    {
      "dec": "97",
      "width": "22",
      "d": "M16,8 L14,15 14,19 15,21 16,22 18,22 20,20 21,18 M17,8 L15,15 15,21 M16,8 L18,8 16,15 15,19 M14,15 L14,12 13,9 11,8 9,8 6,9 4,12 3,15 3,17 4,20 5,21 7,22 9,22 11,21 12,20 13,18 14,15 M7,9 L5,12 4,15 4,18 5,20 M9,8 L7,10 6,12 5,15 5,18 6,21 7,22 "
    },
    {
      "dec": "187",
      "width": "15",
      "d": "M 3,8 7,14 1,20 M 9,8 13,14 7,20 M 7,20 14,14 9,8 M 7,20 12,14 9,8 M 1,20 8,14 3,8 M 1,20 6,14 3,8 "
    },
    {
      "dec": "171",
      "width": "15",
      "d": "M 14,8 8,14 12,20 M 8,8 2,14 6,20 m 0,0 L 1,14 8,8 M 6,20 3,14 8,8 M 12,20 7,14 14,8 M 12,20 9,14 14,8 "
    },
    {
      "dec": "79",
      "width": "22",
      "d": "M12,1 L9,2 7,4 5,7 4,10 3,14 3,17 4,20 5,21 7,22 10,22 13,21 15,19 17,16 18,13 19,9 19,6 18,3 17,2 15,1 12,1 M8,4 L6,7 5,10 4,14 4,18 5,20 M14,19 L16,16 17,13 18,9 18,5 17,3 M12,1 L10,2 8,5 7,7 6,10 5,14 5,19 6,21 7,22 M10,22 L12,21 14,18 15,16 16,13 17,9 17,4 16,2 15,1 "
    },
    {
      "dec": "44",
      "width": "12",
      "d": "M4,22 L3,22 2,21 2,20 3,19 4,19 5,20 5,22 4,24 3,25 1,26 M3,20 L3,21 4,21 4,20 3,20 M4,22 L4,23 3,25 "
    },
    {
      "dec": "66",
      "width": "24",
      "d": "M9,1 L3,22 M10,1 L4,22 M11,1 L5,22 M6,1 L17,1 20,2 21,4 21,6 20,9 19,10 16,11 M19,2 L20,4 20,6 19,9 18,10 M17,1 L18,2 19,4 19,6 18,9 16,11 M8,11 L16,11 18,12 19,14 19,16 18,19 16,21 12,22 0,22 M17,12 L18,14 18,16 17,19 15,21 M16,11 L17,13 17,16 16,19 14,21 12,22 M7,1 L10,2 M8,1 L9,3 M12,1 L10,3 M13,1 L10,2 M4,21 L1,22 M4,20 L2,22 M5,20 L6,22 M4,21 L7,22 "
    },
    {
      "dec": "101",
      "width": "18",
      "d": "M4,17 L8,16 11,15 14,13 15,11 14,9 12,8 9,8 6,9 4,12 3,15 3,17 4,20 5,21 7,22 9,22 12,21 14,19 M6,10 L5,12 4,15 4,18 5,20 M9,8 L7,10 6,12 5,15 5,18 6,21 7,22 "
    },
    {
      "dec": "87",
      "width": "26",
      "d": "M8,1 L8,3 6,20 6,22 M9,2 L7,19 M10,1 L8,18 M16,1 L8,18 6,22 M16,1 L16,3 14,20 14,22 M17,2 L15,19 M18,1 L16,18 M24,2 L16,18 14,22 M5,1 L13,1 M16,1 L18,1 M21,1 L27,1 M6,1 L9,2 M7,1 L8,3 M11,1 L9,4 M12,1 L9,2 M22,1 L24,2 M26,1 L24,2 "
    },
    {
      "dec": "85",
      "width": "26",
      "d": "M8,1 L5,12 4,16 4,19 5,21 8,22 12,22 15,21 17,19 18,16 22,2 M9,1 L6,12 5,16 5,20 6,21 M10,1 L7,12 6,16 6,20 8,22 M5,1 L13,1 M19,1 L25,1 M6,1 L9,2 M7,1 L8,3 M11,1 L9,3 M12,1 L9,2 M20,1 L22,2 M24,1 L22,2 "
    },
    {
      "dec": "110",
      "width": "24",
      "d": "M1,12 L2,10 4,8 6,8 7,9 8,11 8,14 6,22 M7,9 L7,14 5,22 M7,11 L6,15 4,22 6,22 M8,14 L10,11 12,9 14,8 16,8 18,9 19,11 19,14 17,19 M18,9 L18,13 17,17 17,21 M18,11 L16,16 16,19 17,21 18,22 20,22 22,20 23,18 "
    },
    {
      "dec": "119",
      "width": "30",
      "d": "M1,12 L2,10 4,8 6,8 7,9 8,11 8,14 6,19 M7,9 L7,13 6,17 6,21 M7,11 L5,16 5,19 6,21 8,22 10,22 12,21 14,19 15,16 M17,8 L15,16 15,19 16,21 18,22 20,22 22,21 24,19 26,16 27,12 27,8 26,8 26,9 27,11 M18,8 L16,16 16,21 M17,8 L19,8 17,15 16,19 "
    },
    {
      "dec": "47",
      "width": "24",
      "d": "M20,-3 L2,29 3,29 M20,-3 L21,-3 3,29 "
    },
    {
      "dec": "125",
      "width": "14",
      "d": "M5,-3 L7,-2 8,-1 9,1 9,3 8,5 7,6 6,8 6,10 8,12 M7,-2 L8,0 8,2 7,4 6,5 5,7 5,9 6,11 10,13 6,15 5,17 5,19 6,21 7,22 8,24 8,26 7,28 M8,14 L6,16 6,18 7,20 8,21 9,23 9,25 8,27 7,28 5,29 "
    },
    {
      "dec": "55",
      "width": "22",
      "d": "M6,1 L4,7 M19,1 L18,4 16,7 12,12 10,15 9,18 8,22 M10,14 L8,18 7,22 M16,7 L10,13 8,16 7,18 6,22 8,22 M5,4 L8,1 10,1 15,4 M7,2 L10,2 15,4 M5,4 L7,3 10,3 15,4 17,4 18,3 19,1 "
    },
    {
      "dec": "339",
      "width": "28",
      "d": "m 15,17 4,-1 3,-1 3,-2 1,-2 -1,-2 -2,-1 h -3 l -3,1 L 15,12 14,15 v 2 l 1,3 1,1 2,1 h 2 l 3,-1 2,-2 m -8,-9 -1,2 -1,3 v 3 l 1,2 M 20,8 18,10 l -1,2 -1,3 v 3 l 1,3 1,1 M 8,8 l -3,1 L 3,12 2,15 v 2 l 1,3 1,1 3,1 h 3 l 3,-1 2,-3 1,-3 v -2 l -1,-3 -1,-1 -3,-1 H 8 M 5,10 4,12 3,15 v 3 l 1,2 m 9,0 1,-2 1,-3 V 12 L 14,10 M 8,8 6,10 5,12 4,15 v 3 l 1,3 2,1 m 3,0 2,-2 1,-2 1,-3 v -3 l -1,-3 -2,-1 "
    },
    {
      "dec": "62",
      "width": "24",
      "d": "M4,4 L20,13 4,22 "
    },
    {
      "dec": "95",
      "width": "20",
      "d": "M0,29 L20,29 "
    },
    {
      "dec": "69",
      "width": "22",
      "d": "M9,1 L3,22 M10,1 L4,22 M11,1 L5,22 M15,7 L13,15 M6,1 L21,1 20,7 M8,11 L14,11 M0,22 L15,22 17,17 M7,1 L10,2 M8,1 L9,3 M12,1 L10,3 M13,1 L10,2 M17,1 L20,2 M18,1 L20,3 M19,1 L20,4 M20,1 L20,7 M15,7 L13,11 13,15 M14,9 L12,11 13,13 M14,10 L11,11 13,12 M4,21 L1,22 M4,20 L2,22 M5,20 L6,22 M4,21 L7,22 M10,22 L15,21 M12,22 L15,20 M15,20 L17,17 "
    },
    {
      "dec": "8212",
      "width": "20",
      "d": "M 0,14 H 20 "
    },
    {
      "dec": "103",
      "width": "22",
      "d": "M16,8 L12,22 11,25 9,28 7,29 M17,8 L13,22 11,26 M16,8 L18,8 14,22 12,26 10,28 7,29 4,29 2,28 1,27 1,25 3,25 3,27 2,27 2,26 M14,15 L14,12 13,9 11,8 9,8 6,9 4,12 3,15 3,17 4,20 5,21 7,22 9,22 11,21 12,20 13,18 14,15 M6,10 L5,12 4,15 4,18 5,20 M9,8 L7,10 6,12 5,15 5,18 6,21 7,22 "
    },
    {
      "dec": "33",
      "width": "12",
      "d": "M9,1 L8,1 7,2 5,15 M9,2 L8,2 5,15 M9,2 L9,3 5,15 M9,1 L10,2 10,3 5,15 M3,19 L2,20 2,21 3,22 4,22 5,21 5,20 4,19 3,19 M3,20 L3,21 4,21 4,20 3,20 "
    },
    {
      "dec": "56",
      "width": "22",
      "d": "M11,1 L8,2 7,3 6,5 6,8 7,10 9,11 12,11 15,10 17,9 18,7 18,4 17,2 15,1 11,1 M13,1 L8,2 M8,3 L7,5 7,9 8,10 M7,10 L10,11 M11,11 L15,10 M16,9 L17,7 17,4 16,2 M17,2 L13,1 M11,1 L9,3 8,5 8,9 9,11 M12,11 L14,10 15,9 16,7 16,3 15,1 M9,11 L5,12 3,14 2,16 2,19 3,21 6,22 10,22 14,21 15,20 16,18 16,15 15,13 14,12 12,11 M10,11 L5,12 M6,12 L4,14 3,16 3,19 4,21 M3,21 L8,22 14,21 M14,20 L15,18 15,15 14,13 M14,12 L11,11 M9,11 L7,12 5,14 4,16 4,19 5,21 6,22 M10,22 L12,21 13,20 14,18 14,14 13,12 12,11 "
    },
    {
      "dec": "48",
      "width": "22",
      "d": "M12,1 L9,2 7,4 5,7 4,10 3,14 3,17 4,20 5,21 7,22 9,22 12,21 14,19 16,16 17,13 18,9 18,6 17,3 16,2 14,1 12,1 M9,3 L7,5 6,7 5,10 4,14 4,18 5,20 M12,20 L14,18 15,16 16,13 17,9 17,5 16,3 M12,1 L10,2 8,5 7,7 6,10 5,14 5,19 6,21 7,22 M9,22 L11,21 13,18 14,16 15,13 16,9 16,4 15,2 14,1 "
    },
    {
      "dec": "90",
      "width": "22",
      "d": "M19,1 L1,22 M20,1 L2,22 M21,1 L3,22 M21,1 L7,1 5,7 M1,22 L15,22 17,16 M8,1 L5,7 M9,1 L6,4 M11,1 L7,2 M11,22 L15,21 M13,22 L16,19 M14,22 L17,16 "
    },
    {
      "dec": "35",
      "width": "22",
      "d": "M11,-3 L4,29 M17,-3 L10,29 M4,10 L18,10 M3,16 L17,16 "
    },
    {
      "dec": "61",
      "width": "26",
      "d": "M4,8 L21,8 21,9 M4,8 L4,9 21,9 M4,16 L21,16 21,17 M4,16 L4,17 21,17 "
    },
    {
      "dec": "80",
      "width": "22",
      "d": "M9,1 L3,22 M10,1 L4,22 M11,1 L5,22 M6,1 L18,1 21,2 22,4 22,6 21,9 19,11 15,12 7,12 M20,2 L21,4 21,6 20,9 18,11 M18,1 L19,2 20,4 20,6 19,9 17,11 15,12 M0,22 L8,22 M7,1 L10,2 M8,1 L9,3 M12,1 L10,3 M13,1 L10,2 M4,21 L1,22 M4,20 L2,22 M5,20 L6,22 M4,21 L7,22 "
    },
    {
      "dec": "169",
      "width": "24",
      "d": "m 17,9 1,-3 v 6 L 17,9 15,7 13,6 H 11 L 8,8 6,10 5,13 v 2 l 1,3 2,2 3,2 h 2 l 2,-1 2,-2 1,-2 M 11,6 10,7 8,10 7,12 v 4 l 1,2 2,3 1,1 M 7,3 5,4 3,6 2,8 1,12 v 3 l 1,4 1,2 3,3 4,1 h 4 l 4,-1 3,-3 1,-2 1,-4 V 12 L 22,8 21,6 19,4 17,3 14,2 H 10 L 7,3 "
    },
    {
      "dec": "38",
      "width": "26",
      "d": "M23,10 L23,9 22,9 22,11 24,11 24,9 23,8 22,8 20,9 18,11 13,19 11,21 9,22 6,22 3,21 2,19 2,17 3,15 4,14 6,13 11,11 13,10 15,8 16,6 16,4 15,2 13,1 11,2 10,4 10,7 11,13 12,16 13,18 15,21 17,22 19,22 20,20 20,19 M7,22 L3,21 M4,21 L3,19 3,17 4,15 5,14 7,13 M11,11 L12,14 15,20 17,21 M6,22 L5,21 4,19 4,17 5,15 6,14 8,13 13,10 M10,7 L11,10 12,13 14,17 16,20 18,21 19,21 20,20 "
    },
    {
      "dec": "115",
      "width": "18",
      "d": "M14,11 L14,10 13,10 13,12 15,12 15,10 14,9 11,8 8,8 5,9 4,10 4,12 5,14 7,15 10,16 12,17 13,19 M5,9 L4,12 M5,13 L7,14 10,15 12,16 M13,17 L12,21 M4,10 L5,12 7,13 10,14 12,15 13,17 13,19 12,21 9,22 6,22 3,21 2,20 2,18 4,18 4,20 3,20 3,19 "
    },
    {
      "dec": "76",
      "width": "20",
      "d": "M9,1 L3,22 M10,1 L4,22 M11,1 L5,22 M6,1 L14,1 M0,22 L15,22 17,16 M7,1 L10,2 M8,1 L9,3 M12,1 L10,3 M13,1 L10,2 M4,21 L1,22 M4,20 L2,22 M5,20 L6,22 M4,21 L7,22 M10,22 L15,21 M12,22 L16,19 M14,22 L17,16 "
    },
    {
      "dec": "46",
      "width": "12",
      "d": "M3,19 L2,20 2,21 3,22 4,22 5,21 5,20 4,19 3,19 M3,20 L3,21 4,21 4,20 3,20 "
    },
    {
      "dec": "122",
      "width": "20",
      "d": "M17,8 L16,10 14,12 6,18 4,20 3,22 M16,10 L7,10 5,11 4,13 M14,10 L10,9 7,9 6,10 M14,10 L10,8 7,8 5,10 4,13 M4,20 L13,20 15,19 16,17 M6,20 L10,21 13,21 14,20 M6,20 L10,22 13,22 15,20 16,17 "
    },
    {
      "dec": "64",
      "width": "28",
      "d": "M18,9 L17,7 15,6 12,6 10,7 9,8 8,11 8,14 9,16 11,17 14,17 16,16 17,14 M12,6 L10,8 9,11 9,14 10,16 11,17 M18,6 L17,14 17,16 19,17 21,17 23,15 24,12 24,10 23,7 22,5 20,3 18,2 15,1 12,1 9,2 7,3 5,5 4,7 3,10 3,13 4,16 5,18 7,20 9,21 12,22 15,22 18,21 20,20 21,19 M19,6 L18,14 18,16 19,17 "
    },
    {
      "dec": "82",
      "width": "24",
      "d": "M9,1 L3,22 M10,1 L4,22 M11,1 L5,22 M6,1 L17,1 20,2 21,4 21,6 20,9 19,10 16,11 8,11 M19,2 L20,4 20,6 19,9 18,10 M17,1 L18,2 19,4 19,6 18,9 16,11 M12,11 L14,12 15,13 17,19 18,20 19,20 20,19 M17,20 L18,21 19,21 M15,13 L16,21 17,22 19,22 20,19 20,18 M0,22 L8,22 M7,1 L10,2 M8,1 L9,3 M12,1 L10,3 M13,1 L10,2 M4,21 L1,22 M4,20 L2,22 M5,20 L6,22 M4,21 L7,22 "
    },
    {
      "dec": "94",
      "width": "22",
      "d": "M3,15 L11,10 19,15 M3,15 L11,11 19,15 "
    },
    {
      "dec": "8208",
      "width": "26",
      "d": "M 4,14 H 22 "
    },
    {
      "dec": "8220",
      "width": "14",
      "d": "M 8,6 9,5 h 1 l 1,1 V 7 L 10,8 H 9 L 8,7 V 4 L 9,2 11,1 M 10,7 V 6 H 9 v 1 h 1 M 9,5 8,4 M 8,6 9,2 M 3,6 4,5 H 5 L 6,6 V 7 L 5,8 H 4 L 3,7 V 4 L 4,2 6,1 M 5,7 V 6 H 4 V 7 H 5 M 4,5 3,4 M 3,6 4,2 "
    },
    {
      "dec": "37",
      "width": "24",
      "d": "M21,1 L3,22 M8,1 L10,3 10,5 9,7 7,8 5,8 3,6 3,4 4,2 6,1 8,1 10,2 13,3 16,3 19,2 21,1 M17,15 L15,16 14,18 14,20 16,22 18,22 20,21 21,19 21,17 19,15 17,15 "
    },
    {
      "dec": "68",
      "width": "22",
      "d": "M9,1 L3,22 M10,1 L4,22 M11,1 L5,22 M6,1 L15,1 18,2 19,3 20,6 20,10 19,14 17,18 15,20 13,21 9,22 0,22 M17,2 L18,3 19,6 19,10 18,14 16,18 14,20 M15,1 L17,3 18,6 18,10 17,14 15,18 12,21 9,22 M7,1 L10,2 M8,1 L9,3 M12,1 L10,3 M13,1 L10,2 M4,21 L1,22 M4,20 L2,22 M5,20 L6,22 M4,21 L7,22 "
    },
    {
      "dec": "36",
      "width": "22",
      "d": "M12,-3 L4,26 M17,-3 L9,26 M18,6 L18,5 17,5 17,7 19,7 19,5 18,3 17,2 14,1 10,1 7,2 5,4 5,7 6,9 8,11 14,14 15,16 15,19 14,21 M6,7 L7,9 14,13 15,15 M7,2 L6,4 6,6 7,8 13,11 15,13 16,15 16,18 15,20 14,21 11,22 7,22 4,21 3,20 2,18 2,16 4,16 4,18 3,18 3,17 "
    },
    {
      "dec": "105",
      "width": "12",
      "d": "M8,1 L8,3 10,3 10,1 8,1 M9,1 L9,3 M8,2 L10,2 M1,12 L2,10 4,8 6,8 7,9 8,11 8,14 6,19 M7,9 L7,13 6,17 6,21 M7,11 L5,16 5,19 6,21 7,22 9,22 11,20 12,18 "
    },
    {
      "dec": "75",
      "width": "22",
      "d": "M9,1 L3,22 M10,1 L4,22 M11,1 L5,22 M22,2 L7,13 M11,10 L15,22 M12,10 L16,22 M13,9 L17,21 M6,1 L14,1 M19,1 L25,1 M0,22 L8,22 M12,22 L19,22 M7,1 L10,2 M8,1 L9,3 M12,1 L10,3 M13,1 L10,2 M20,1 L22,2 M24,1 L22,2 M4,21 L1,22 M4,20 L2,22 M5,20 L6,22 M4,21 L7,22 M15,21 L13,22 M15,20 L14,22 M16,20 L18,22 "
    },
    {
      "dec": "51",
      "width": "22",
      "d": "M7,6 L7,5 8,5 8,7 6,7 6,5 7,3 8,2 11,1 14,1 17,2 18,4 18,6 17,8 16,9 14,10 11,11 M16,2 L17,4 17,6 16,8 15,9 M14,1 L15,2 16,4 16,6 15,8 13,10 11,11 M9,11 L11,11 14,12 15,13 16,15 16,18 15,20 13,21 10,22 7,22 4,21 3,20 2,18 2,16 4,16 4,18 3,18 3,17 M14,13 L15,15 15,18 14,20 M11,11 L13,12 14,14 14,18 13,20 12,21 10,22 "
    },
    {
      "dec": "34",
      "width": "18",
      "d": "M7,1 L5,8 M8,1 L5,8 M16,1 L14,8 M17,1 L14,8 "
    },
    {
      "dec": "98",
      "width": "20",
      "d": "M7,1 L5,8 4,14 4,18 5,20 6,21 8,22 10,22 13,21 15,18 16,15 16,13 15,10 14,9 12,8 10,8 8,9 7,10 6,12 5,15 M8,1 L6,8 5,12 5,18 6,21 M13,20 L14,18 15,15 15,12 14,10 M4,1 L9,1 7,8 5,15 M10,22 L12,20 13,18 14,15 14,12 13,9 12,8 M5,1 L8,2 M6,1 L7,3 "
    },
    {
      "dec": "96",
      "width": "12",
      "d": "M4,1 L9,7 M4,1 L3,2 9,7 "
    },
    {
      "dec": "74",
      "width": "20",
      "d": "M14,1 L9,18 8,20 6,22 M15,1 L11,14 10,17 9,19 M16,1 L12,14 10,19 8,21 6,22 4,22 2,21 1,19 1,17 2,16 3,16 4,17 4,18 3,19 2,19 M2,17 L2,18 3,18 3,17 2,17 M11,1 L19,1 M12,1 L15,2 M13,1 L14,3 M17,1 L15,3 M18,1 L15,2 "
    },
    {
      "dec": "58",
      "width": "12",
      "d": "M6,8 L5,9 5,10 6,11 7,11 8,10 8,9 7,8 6,8 M6,9 L6,10 7,10 7,9 6,9 M3,19 L2,20 2,21 3,22 4,22 5,21 5,20 4,19 3,19 M3,20 L3,21 4,21 4,20 3,20 "
    },
    {
      "dec": "57",
      "width": "22",
      "d": "M16,9 L15,11 14,12 12,13 9,13 7,12 6,11 5,9 5,6 6,4 8,2 11,1 14,1 16,2 17,3 18,6 18,9 17,13 16,16 14,19 12,21 9,22 6,22 4,21 3,19 3,17 5,17 5,19 4,19 4,18 M7,11 L6,9 6,6 7,4 M16,3 L17,5 17,9 16,13 15,16 13,19 M9,13 L8,12 7,10 7,6 8,3 9,2 11,1 M14,1 L15,2 16,4 16,9 15,13 14,16 13,18 11,21 9,22 "
    },
    {
      "dec": "73",
      "width": "14",
      "d": "M9,1 L3,22 M10,1 L4,22 M11,1 L5,22 M6,1 L14,1 M0,22 L8,22 M7,1 L10,2 M8,1 L9,3 M12,1 L10,3 M13,1 L10,2 M4,21 L1,22 M4,20 L2,22 M5,20 L6,22 M4,21 L7,22 "
    },
    {
      "dec": "84",
      "width": "22",
      "d": "M13,1 L7,22 M14,1 L8,22 M15,1 L9,22 M6,1 L4,7 M22,1 L21,7 M6,1 L22,1 M4,22 L12,22 M7,1 L4,7 M9,1 L5,4 M11,1 L6,2 M18,1 L21,2 M19,1 L21,3 M20,1 L21,4 M21,1 L21,7 M8,21 L5,22 M8,20 L6,22 M9,20 L10,22 M8,21 L11,22 "
    },
    {
      "dec": "8211",
      "width": "14",
      "d": "M 2,14 H 12 "
    },
    {
      "dec": "108",
      "width": "12",
      "d": "M8,1 L5,12 4,16 4,19 5,21 6,22 8,22 10,20 11,18 M9,1 L6,12 5,16 5,21 M5,1 L10,1 6,15 5,19 M6,1 L9,2 M7,1 L8,3 "
    },
    {
      "dec": "63",
      "width": "22",
      "d": "M7,6 L7,5 8,5 8,7 6,7 6,5 7,3 8,2 11,1 15,1 18,2 19,4 19,6 18,8 17,9 15,10 11,11 9,12 9,14 11,15 12,15 M13,1 L18,2 M17,2 L18,4 18,6 17,8 16,9 14,10 M15,1 L16,2 17,4 17,6 16,8 15,9 11,11 10,12 10,14 11,15 M8,19 L7,20 7,21 8,22 9,22 10,21 10,20 9,19 8,19 M8,20 L8,21 9,21 9,20 8,20 "
    },
    {
      "dec": "8221",
      "width": "14",
      "d": "M 6,3 5,4 H 4 L 3,3 V 2 L 4,1 H 5 L 6,2 V 5 L 5,7 3,8 M 4,2 V 3 H 5 V 2 H 4 M 5,4 6,5 M 6,3 5,7 M 11,3 10,4 H 9 L 8,3 V 2 L 9,1 h 1 l 1,1 V 5 L 10,7 8,8 M 9,2 v 1 h 1 V 2 H 9 m 1,2 1,1 m 0,-2 -1,4 "
    },
    {
      "dec": "338",
      "width": "32",
      "d": "M 18,1 12,22 M 19,1 13,22 M 20,1 14,22 M 24,7 22,15 M 15,1 h 15 l -1,6 M 17,11 h 6 M 9,22 h 15 l 2,-5 M 16,1 l 3,1 m -2,-1 1,2 m 3,-2 -2,2 m 3,-2 -3,1 m 7,-1 3,1 m -2,-1 2,2 m -1,-2 1,3 m 0,-3 v 6 m -5,0 L 22,11 v 4 M 23,9 21,11 l 1,2 m 1,-3 -3,1 2,1 m -9,9 -3,1 m 3,-2 -2,2 m 3,-2 1,2 m -2,-1 3,1 m 3,0 5,-1 m -3,1 3,-2 m 0,0 2,-3 M 11,1 l -3,1 -2,2 -2,3 L 3,10 2,14 v 3 l 1,3 1,1 2,1 H 9 M 15,1 h -4 m -4,3 -2,3 L 4,10 3,14 v 4 l 1,2 m 7,-19 -2,1 -2,3 -1,2 L 5,10 4,14 v 5 l 1,2 1,1 "
    },
    {
      "dec": "118",
      "width": "20",
      "d": "M1,12 L2,10 4,8 6,8 7,9 8,11 8,14 6,19 M7,9 L7,13 6,17 6,21 M7,11 L5,16 5,19 6,21 8,22 10,22 12,21 14,19 16,16 17,12 17,8 16,8 16,9 17,11 "
    },
    {
      "dec": "126",
      "width": "24",
      "d": "M3,16 L3,14 4,11 6,10 8,10 10,11 14,14 16,15 18,15 20,14 21,12 M3,14 L4,12 6,11 8,11 10,12 14,15 16,16 18,16 20,15 21,12 21,10 "
    },
    {
      "dec": "42",
      "width": "18",
      "d": "M10,1 L9,2 11,12 10,13 M10,1 L10,13 M10,1 L11,2 9,12 10,13 M5,4 L6,4 14,10 15,10 M5,4 L15,10 M5,4 L5,5 15,9 15,10 M15,4 L14,4 6,10 5,10 M15,4 L5,10 M15,4 L15,5 5,9 5,10 "
    },
    {
      "dec": "106",
      "width": "12",
      "d": "M10,1 L10,3 12,3 12,1 10,1 M11,1 L11,3 M10,2 L12,2 M2,12 L3,10 5,8 7,8 8,9 9,11 9,14 7,21 6,24 5,26 3,28 1,29 -1,29 -2,28 -2,26 0,26 0,28 -1,28 -1,27 M8,9 L8,14 6,21 5,24 4,26 M8,11 L7,15 5,22 4,25 3,27 1,29 "
    },
    {
      "dec": "91",
      "width": "14",
      "d": "M4,-3 L4,29 M5,-3 L5,29 M4,-3 L11,-3 M4,29 L11,29 "
    },
    {
      "dec": "8230",
      "width": "15",
      "d": "m 12,18 -1,1 v 1 l 1,1 h 1 l 1,-1 v -1 l -1,-1 h -1 m 0,1 v 1 h 1 V 19 H 12 M 7,18 6,19 v 1 l 1,1 H 8 L 9,20 V 19 L 8,18 H 7 m 0,1 v 1 H 8 V 19 H 7 M 2,18 1,19 v 1 l 1,1 H 3 L 4,20 V 19 L 3,18 H 2 m 0,1 v 1 H 3 V 19 H 2 "
    },
    {
      "dec": "112",
      "width": "22",
      "d": "M1,12 L2,10 4,8 6,8 7,9 8,11 8,14 7,18 4,29 M7,9 L7,14 6,18 3,29 M7,11 L6,15 2,29 M8,15 L9,12 10,10 11,9 13,8 15,8 17,9 18,10 19,13 19,15 18,18 16,21 13,22 11,22 9,21 8,18 8,15 M17,10 L18,12 18,15 17,18 16,20 M15,8 L16,9 17,12 17,15 16,18 15,20 13,22 M-1,29 L7,29 M3,28 L0,29 M3,27 L1,29 M4,27 L5,29 M3,28 L6,29 "
    },
    {
      "dec": "41",
      "width": "16",
      "d": "M9,-3 L11,0 12,3 13,7 13,12 12,16 10,20 8,23 5,26 2,28 0,29 M12,3 L12,11 11,16 9,20 7,23 M9,-3 L10,-1 11,2 12,11 M12,3 L11,12 10,16 9,19 8,21 6,24 3,27 0,29 "
    },
    {
      "dec": "78",
      "width": "26",
      "d": "M9,1 L3,21 M9,1 L16,22 M10,1 L16,19 M11,1 L17,19 M22,2 L17,19 16,22 M6,1 L11,1 M19,1 L25,1 M0,22 L6,22 M7,1 L10,2 M8,1 L10,3 M20,1 L22,2 M24,1 L22,2 M3,21 L1,22 M3,21 L5,22 "
    },
    {
      "dec": "59",
      "width": "12",
      "d": "M6,8 L5,9 5,10 6,11 7,11 8,10 8,9 7,8 6,8 M6,9 L6,10 7,10 7,9 6,9 M4,22 L3,22 2,21 2,20 3,19 4,19 5,20 5,22 4,24 3,25 1,26 M3,20 L3,21 4,21 4,20 3,20 M4,22 L4,23 3,25 "
    },
    {
      "dec": "168",
      "width": "15",
      "d": "M 4,2 3,3 V 4 L 4,5 H 5 L 6,4 V 3 L 5,2 H 4 M 4,3 V 4 H 5 V 3 H 4 M 10,2 9,3 v 1 l 1,1 h 1 L 12,4 V 3 L 11,2 h -1 m 0,1 v 1 h 1 V 3 h -1 "
    },
    {
      "dec": "88",
      "width": "22",
      "d": "M7,1 L13,22 M8,1 L14,22 M9,1 L15,22 M20,2 L2,21 M5,1 L12,1 M17,1 L23,1 M-1,22 L5,22 M10,22 L17,22 M6,1 L8,3 M10,1 L9,3 M11,1 L9,2 M18,1 L20,2 M22,1 L20,2 M2,21 L0,22 M2,21 L4,22 M13,21 L11,22 M13,20 L12,22 M14,20 L16,22 "
    },
    {
      "dec": "8216",
      "width": "7",
      "d": "m 2,6 1,-1 h 1 l 1,1 v 1 l -1,1 H 3 l -1,-1 v -3 l 1,-2 2,-1 m -1,6 v -1 H 3 v 1 h 1 m -1,-2 -1,-1 m 0,2 1,-4 "
    },
    {
      "dec": "89",
      "width": "22",
      "d": "M6,1 L10,11 7,22 M7,1 L11,11 8,22 M8,1 L12,11 9,22 M21,2 L12,11 M4,1 L11,1 M18,1 L24,1 M4,22 L12,22 M5,1 L7,2 M9,1 L8,3 M10,1 L7,2 M19,1 L21,2 M23,1 L21,2 M8,21 L5,22 M8,20 L6,22 M9,20 L10,22 M8,21 L11,22 "
    },
    {
      "dec": "114",
      "width": "18",
      "d": "M1,12 L2,10 4,8 6,8 7,9 8,11 8,15 6,22 M7,9 L7,15 5,22 M7,11 L6,15 4,22 6,22 M16,10 L16,9 15,9 15,11 17,11 17,9 16,8 14,8 12,9 10,11 8,15 "
    },
    {
      "dec": "116",
      "width": "14",
      "d": "M9,1 L6,12 5,16 5,19 6,21 7,22 9,22 11,20 12,18 M10,1 L7,12 6,16 6,21 M9,1 L11,1 7,15 6,19 M3,8 L13,8 "
    },
    {
      "dec": "54",
      "width": "22",
      "d": "M17,5 L17,4 16,4 16,6 18,6 18,4 17,2 15,1 12,1 9,2 7,4 5,7 4,10 3,14 3,17 4,20 5,21 7,22 10,22 13,21 15,19 16,17 16,14 15,12 14,11 12,10 9,10 7,11 6,12 5,14 M8,4 L6,7 5,10 4,14 4,18 5,20 M14,19 L15,17 15,14 14,12 M12,1 L10,2 8,5 7,7 6,10 5,14 5,19 6,21 7,22 M10,22 L12,21 13,20 14,17 14,13 13,11 12,10 "
    },
    {
      "dec": "117",
      "width": "24",
      "d": "M1,12 L2,10 4,8 6,8 7,9 8,11 8,14 6,19 M7,9 L7,13 6,17 6,21 M7,11 L5,16 5,19 6,21 8,22 10,22 12,21 14,19 16,16 M18,8 L16,16 16,19 17,21 18,22 20,22 22,20 23,18 M19,8 L17,16 17,21 M18,8 L20,8 18,15 17,19 "
    },
    {
      "dec": "124",
      "width": "8",
      "d": "M4,-3 L4,29 "
    },
    {
      "dec": "77",
      "width": "28",
      "d": "M9,1 L3,21 M9,2 L10,20 10,22 M10,1 L11,20 M11,1 L12,19 M23,1 L12,19 10,22 M23,1 L17,22 M24,1 L18,22 M25,1 L19,22 M6,1 L11,1 M23,1 L28,1 M0,22 L6,22 M14,22 L22,22 M7,1 L9,2 M8,1 L9,3 M26,1 L24,3 M27,1 L24,2 M3,21 L1,22 M3,21 L5,22 M18,21 L15,22 M18,20 L16,22 M19,20 L20,22 M18,21 L21,22 "
    },
    {
      "dec": "123",
      "width": "14",
      "d": "M9,-3 L7,-2 6,-1 5,1 5,3 6,5 7,6 8,8 8,10 6,12 M7,-2 L6,0 6,2 7,4 8,5 9,7 9,9 8,11 4,13 8,15 9,17 9,19 8,21 7,22 6,24 6,26 7,28 M6,14 L8,16 8,18 7,20 6,21 5,23 5,25 6,27 7,28 9,29 "
    },
    {
      "dec": "72",
      "width": "26",
      "d": "M9,1 L3,22 M10,1 L4,22 M11,1 L5,22 M21,1 L15,22 M22,1 L16,22 M23,1 L17,22 M6,1 L14,1 M18,1 L26,1 M7,11 L19,11 M0,22 L8,22 M12,22 L20,22 M7,1 L10,2 M8,1 L9,3 M12,1 L10,3 M13,1 L10,2 M19,1 L22,2 M20,1 L21,3 M24,1 L22,3 M25,1 L22,2 M4,21 L1,22 M4,20 L2,22 M5,20 L6,22 M4,21 L7,22 M16,21 L13,22 M16,20 L14,22 M17,20 L18,22 M16,21 L19,22 "
    },
    {
      "dec": "53",
      "width": "22",
      "d": "M9,1 L4,11 M9,1 L19,1 M9,2 L17,2 M8,3 L13,3 17,2 19,1 M4,11 L5,10 8,9 11,9 14,10 15,11 16,13 16,16 15,19 13,21 9,22 6,22 4,21 3,20 2,18 2,16 4,16 4,18 3,18 3,17 M14,11 L15,13 15,16 14,19 12,21 M11,9 L13,10 14,12 14,16 13,19 11,21 9,22 "
    },
    {
      "dec": "52",
      "width": "22",
      "d": "M15,5 L10,22 12,22 M18,1 L16,5 11,22 M18,1 L12,22 M18,1 L2,16 18,16 "
    },
    {
      "dec": "8217",
      "width": "7",
      "d": "M 5,3 4,4 H 3 L 2,3 V 2 L 3,1 H 4 L 5,2 V 5 L 4,7 2,8 M 3,2 V 3 H 4 V 2 H 3 M 4,4 5,5 M 5,3 4,7 "
    },
    {
      "dec": "40",
      "width": "16",
      "d": "M16,-3 L14,-2 11,0 8,3 6,6 4,10 3,14 3,19 4,23 5,26 7,29 M9,3 L7,6 5,10 4,15 4,23 M16,-3 L13,-1 10,2 8,5 7,7 6,10 5,14 4,23 M4,15 L5,24 6,27 7,29 "
    },
    {
      "dec": "99",
      "width": "18",
      "d": "M14,12 L14,11 13,11 13,13 15,13 15,11 14,9 12,8 9,8 6,9 4,12 3,15 3,17 4,20 5,21 7,22 9,22 12,21 14,18 M6,10 L5,12 4,15 4,18 5,20 M9,8 L7,10 6,12 5,15 5,18 6,21 7,22 "
    },
    {
      "dec": "127",
      "width": "16",
      "d": "M0,1 L0,22 1,22 1,1 2,1 2,22 3,22 3,1 4,1 4,22 5,22 5,1 6,1 6,22 7,22 7,1 8,1 8,22 9,22 9,1 10,1 10,22 11,22 11,1 12,1 12,22 13,22 13,1 14,1 14,22 15,22 15,1 16,1 16,22 "
    },
    {
      "dec": "39",
      "width": "10",
      "d": "M7,1 L5,8 M8,1 L5,8 "
    },
    {
      "dec": "92",
      "width": "14",
      "d": "M0,1 L14,25 "
    },
    {
      "dec": "107",
      "width": "22",
      "d": "M8,1 L2,22 4,22 M9,1 L3,22 M5,1 L10,1 4,22 M18,10 L18,9 17,9 17,11 19,11 19,9 18,8 16,8 14,9 10,13 8,14 M6,14 L8,14 10,15 11,16 13,20 14,21 16,21 M10,16 L12,20 13,21 M8,14 L9,15 11,21 12,22 14,22 16,21 18,18 M6,1 L9,2 M7,1 L8,3 "
    },
    {
      "dec": "113",
      "width": "20",
      "d": "M16,8 L10,29 M17,8 L11,29 M16,8 L18,8 12,29 M14,15 L14,12 13,9 11,8 9,8 6,9 4,12 3,15 3,17 4,20 5,21 7,22 9,22 11,21 12,20 13,18 14,15 M6,10 L5,12 4,15 4,18 5,20 M9,8 L7,10 6,12 5,15 5,18 6,21 7,22 M7,29 L15,29 M11,28 L8,29 M11,27 L9,29 M12,27 L13,29 M11,28 L14,29 "
    },
    {
      "dec": "67",
      "width": "22",
      "d": "M18,3 L19,3 20,1 19,7 19,5 18,3 17,2 15,1 12,1 9,2 7,4 5,7 4,10 3,14 3,17 4,20 5,21 8,22 11,22 13,21 15,19 16,17 M9,3 L7,5 6,7 5,10 4,14 4,18 5,20 M12,1 L10,2 8,5 7,7 6,10 5,14 5,19 6,21 8,22 "
    }
  ]
}