<?xml version="1.0" encoding="UTF-8" standalone="no"?>
<svg
   xmlns:dc="http://purl.org/dc/elements/1.1/"
   xmlns:cc="http://creativecommons.org/ns#"
   xmlns:rdf="http://www.w3.org/1999/02/22-rdf-syntax-ns#"
   xmlns:svg="http://www.w3.org/2000/svg"
   xmlns="http://www.w3.org/2000/svg"
   xmlns:sodipodi="http://sodipodi.sourceforge.net/DTD/sodipodi-0.dtd"
   xmlns:inkscape="http://www.inkscape.org/namespaces/inkscape"
   data-dec="122"
   width="17"
   height="40"
   version="1.1"
   id="svg4"
   sodipodi:docname="122.svg"
   inkscape:version="0.92.4 5da689c313, 2019-01-14">
  <metadata
     id="metadata10">
    <rdf:RDF>
      <cc:Work
         rdf:about="">
        <dc:format>image/svg+xml</dc:format>
        <dc:type
           rdf:resource="http://purl.org/dc/dcmitype/StillImage" />
        <dc:title></dc:title>
      </cc:Work>
    </rdf:RDF>
  </metadata>
  <defs
     id="defs8" />
  <sodipodi:namedview
     pagecolor="#ffffff"
     bordercolor="#666666"
     borderopacity="1"
     objecttolerance="10"
     gridtolerance="10"
     guidetolerance="10"
     inkscape:pageopacity="0"
     inkscape:pageshadow="2"
     inkscape:window-width="1920"
     inkscape:window-height="1043"
     id="namedview6"
     showgrid="false"
     inkscape:zoom="5.9"
     inkscape:cx="8.5"
     inkscape:cy="20"
     inkscape:window-x="0"
     inkscape:window-y="37"
     inkscape:window-maximized="0"
     inkscape:current-layer="svg4" />
  <path
     style="color:#000000;font-style:normal;font-variant:normal;font-weight:normal;font-stretch:normal;font-size:medium;line-height:normal;font-family:sans-serif;font-variant-ligatures:normal;font-variant-position:normal;font-variant-caps:normal;font-variant-numeric:normal;font-variant-alternates:normal;font-feature-settings:normal;text-indent:0;text-align:start;text-decoration:none;text-decoration-line:none;text-decoration-style:solid;text-decoration-color:#000000;letter-spacing:normal;word-spacing:normal;text-transform:none;writing-mode:lr-tb;direction:ltr;text-orientation:mixed;dominant-baseline:auto;baseline-shift:baseline;text-anchor:start;white-space:normal;shape-padding:0;clip-rule:nonzero;display:inline;overflow:visible;visibility:visible;opacity:1;isolation:auto;mix-blend-mode:normal;color-interpolation:sRGB;color-interpolation-filters:linearRGB;solid-color:#000000;solid-opacity:1;vector-effect:none;fill:#000000;fill-opacity:1;fill-rule:nonzero;stroke:none;stroke-width:0.5;stroke-linecap:round;stroke-linejoin:round;stroke-miterlimit:4;stroke-dasharray:none;stroke-dashoffset:0;stroke-opacity:1;color-rendering:auto;image-rendering:auto;shape-rendering:auto;text-rendering:auto;enable-background:accumulate"
     d="M 4.25,21.605469 V 21.75 H 4.3945312 Z M 2.75,21.560547 2.5742188,21.75 H 2.75 Z M 4.6054688,21.25 l 0.4980468,0.5 h 6.7910154 l 0.5,-0.5 z M 3.25,21.25 v 0.5 h 0.5 v -0.5 z m 10.857422,-0.02344 A 0.250025,0.250025 0 0 1 14,21.25 h -0.896484 l -0.498047,0.5 h 1.242187 z m 0.335937,-0.669921 -0.394531,0.197265 a 0.250025,0.250025 0 0 1 0.199219,0.19336 z M 3.75,20.482422 3.5019531,20.75 H 3.75 Z M 13.25,9.25 V 9.5175781 L 13.498047,9.25 Z M 2.7519531,9.0527344 2.5566406,9.4433594 2.953125,9.2460938 A 0.250025,0.250025 0 0 1 2.7519531,9.0527344 Z M 14.25,8.25 V 8.4394531 L 14.425781,8.25 Z m -1,0 v 0.5 h 0.5 v -0.5 z m -0.644531,0 L 12.75,8.3945312 V 8.25 Z m -7.5000002,0 -0.5,0.5 h 7.7890622 l -0.5,-0.5 z m -1.953125,0 -0.2597657,0.5234375 A 0.250025,0.250025 0 0 1 3,8.75 h 0.8945312 l 0.5,-0.5 z M 12.996094,7.7460938 A 0.250025,0.250025 0 0 1 13.046875,7.75 h 0.912109 a 0.250025,0.250025 0 0 1 0.08789,0 h 0.914063 a 0.250025,0.250025 0 0 1 0.208984,0.0625 0.250025,0.250025 0 0 1 0.02148,0.023437 0.250025,0.250025 0 0 1 0.01563,0.019531 0.250025,0.250025 0 0 1 0.0098,0.013672 0.250025,0.250025 0 0 1 0.0039,0.00781 0.250025,0.250025 0 0 1 0.0078,0.013672 0.250025,0.250025 0 0 1 0.0039,0.00781 0.250025,0.250025 0 0 1 0.0059,0.015625 0.250025,0.250025 0 0 1 0.0078,0.025391 0.250025,0.250025 0 0 1 0.002,0.00781 0.250025,0.250025 0 0 1 0.002,0.015625 0.250025,0.250025 0 0 1 0.002,0.050781 0.250025,0.250025 0 0 1 0,0.00781 0.250025,0.250025 0 0 1 -0.002,0.015625 0.250025,0.250025 0 0 1 -0.01367,0.048828 0.250025,0.250025 0 0 1 -0.002,0.00781 0.250025,0.250025 0 0 1 -0.0078,0.015625 0.250025,0.250025 0 0 1 -0.04297,0.060547 0.250025,0.250025 0 0 1 -0.02149,0.023437 h -0.002 L 4.2460938,19.949219 A 0.250025,0.250025 0 0 1 4.25,20 v 0.75 h 8.693359 l 1.945313,-0.972656 a 0.250025,0.250025 0 0 1 0.333984,0.333984 l -1,2 A 0.250025,0.250025 0 0 1 13.960938,22.25 h -1.931641 a 0.250025,0.250025 0 0 1 -0.06055,0 h -6.9902344 -0.9375 a 0.250025,0.250025 0 0 1 -0.087891,0 H 3.0410156 a 0.250025,0.250025 0 0 1 -0.087891,0 H 2.0390625 a 0.250025,0.250025 0 0 1 -0.2089844,-0.0625 0.250025,0.250025 0 0 1 -0.00586,-0.0059 0.250025,0.250025 0 0 1 -0.011719,-0.01172 0.250025,0.250025 0 0 1 -0.00391,-0.0059 0.250025,0.250025 0 0 1 -0.015625,-0.01953 0.250025,0.250025 0 0 1 -0.00977,-0.01367 0.250025,0.250025 0 0 1 -0.00391,-0.0078 0.250025,0.250025 0 0 1 -0.00781,-0.01367 0.250025,0.250025 0 0 1 -0.00195,-0.002 0.250025,0.250025 0 0 1 -0.00781,-0.02148 0.250025,0.250025 0 0 1 -0.00781,-0.02539 0.250025,0.250025 0 0 1 -0.00195,-0.0078 0.250025,0.250025 0 0 1 -0.00195,-0.01563 0.250025,0.250025 0 0 1 -0.00195,-0.05078 0.250025,0.250025 0 0 1 0,-0.0078 0.250025,0.250025 0 0 1 0.00195,-0.01563 0.250025,0.250025 0 0 1 0.013672,-0.04883 0.250025,0.250025 0 0 1 0.00195,-0.0078 0.250025,0.250025 0 0 1 0.00781,-0.01563 0.250025,0.250025 0 0 1 0.042969,-0.06055 l 0.00391,-0.0059 a 0.250025,0.250025 0 0 1 0.017578,-0.01758 h 0.00195 L 12.753906,10.050781 A 0.250025,0.250025 0 0 1 12.75,10 V 9.25 H 4.0566406 L 2.1113281,10.222656 A 0.250025,0.250025 0 0 1 1.7773438,9.8886719 L 2.7539062,7.9335938 a 0.250025,0.250025 0 0 1 0.00195,-0.00391 0.250025,0.250025 0 0 1 0.058594,-0.097656 0.250025,0.250025 0 0 1 0.00586,-0.00781 0.250025,0.250025 0 0 1 0.00977,-0.00977 0.250025,0.250025 0 0 1 0.00781,-0.00781 0.250025,0.250025 0 0 1 0.011719,-0.00781 0.250025,0.250025 0 0 1 0.019531,-0.013672 0.250025,0.250025 0 0 1 0.00977,-0.00586 0.250025,0.250025 0 0 1 0.013672,-0.00781 0.250025,0.250025 0 0 1 0.00977,-0.00391 0.250025,0.250025 0 0 1 0.013672,-0.00586 0.250025,0.250025 0 0 1 0.00977,-0.00195 0.250025,0.250025 0 0 1 0.048828,-0.00977 0.250025,0.250025 0 0 1 0.064453,0 h 1.9316406 a 0.250025,0.250025 0 0 1 0.060547,0 h 6.929688 a 0.250025,0.250025 0 0 1 0.07422,0 h 0.923828 a 0.250025,0.250025 0 0 1 0.03711,-0.00391 z"
     id="path2" />
</svg>
