<?xml version="1.0" encoding="UTF-8" standalone="no"?>
<svg
   xmlns:dc="http://purl.org/dc/elements/1.1/"
   xmlns:cc="http://creativecommons.org/ns#"
   xmlns:rdf="http://www.w3.org/1999/02/22-rdf-syntax-ns#"
   xmlns:svg="http://www.w3.org/2000/svg"
   xmlns="http://www.w3.org/2000/svg"
   xmlns:sodipodi="http://sodipodi.sourceforge.net/DTD/sodipodi-0.dtd"
   xmlns:inkscape="http://www.inkscape.org/namespaces/inkscape"
   data-dec="115"
   width="18"
   height="40"
   version="1.1"
   id="svg4"
   sodipodi:docname="115.svg"
   inkscape:version="0.92.4 (unknown)">
  <metadata
     id="metadata10">
    <rdf:RDF>
      <cc:Work
         rdf:about="">
        <dc:format>image/svg+xml</dc:format>
        <dc:type
           rdf:resource="http://purl.org/dc/dcmitype/StillImage" />
      </cc:Work>
    </rdf:RDF>
  </metadata>
  <defs
     id="defs8" />
  <sodipodi:namedview
     pagecolor="#ffffff"
     bordercolor="#666666"
     borderopacity="1"
     objecttolerance="10"
     gridtolerance="10"
     guidetolerance="10"
     inkscape:pageopacity="0"
     inkscape:pageshadow="2"
     inkscape:window-width="640"
     inkscape:window-height="480"
     id="namedview6"
     showgrid="false"
     inkscape:zoom="5.9"
     inkscape:cx="9"
     inkscape:cy="20"
     inkscape:window-x="0"
     inkscape:window-y="27"
     inkscape:window-maximized="0"
     inkscape:current-layer="svg4" />
  <path
     style="color:#000000;font-style:normal;font-variant:normal;font-weight:normal;font-stretch:normal;font-size:medium;line-height:normal;font-family:sans-serif;font-variant-ligatures:normal;font-variant-position:normal;font-variant-caps:normal;font-variant-numeric:normal;font-variant-alternates:normal;font-feature-settings:normal;text-indent:0;text-align:start;text-decoration:none;text-decoration-line:none;text-decoration-style:solid;text-decoration-color:#000000;letter-spacing:normal;word-spacing:normal;text-transform:none;writing-mode:lr-tb;direction:ltr;text-orientation:mixed;dominant-baseline:auto;baseline-shift:baseline;text-anchor:start;white-space:normal;shape-padding:0;clip-rule:nonzero;display:inline;overflow:visible;visibility:visible;opacity:1;isolation:auto;mix-blend-mode:normal;color-interpolation:sRGB;color-interpolation-filters:linearRGB;solid-color:#000000;solid-opacity:1;vector-effect:none;fill:#013272;fill-opacity:1;fill-rule:nonzero;stroke:none;stroke-width:2;stroke-linecap:round;stroke-linejoin:round;stroke-miterlimit:4;stroke-dasharray:none;stroke-dashoffset:0;stroke-opacity:1;color-rendering:auto;image-rendering:auto;shape-rendering:auto;text-rendering:auto;enable-background:accumulate"
     d="m 6,7 h 4 a 1.0001,1.0001 0 0 1 0.447266,0.1054688 l 2,1 a 1.0001,1.0001 0 0 1 0.259765,0.1875 l 0.353516,0.3515624 A 1.0001,1.0001 0 0 1 15,9 v 3 a 1.0001,1.0001 0 0 1 -1.894531,0.447266 L 12.177734,10.591797 11.408203,9.8222656 9.7636719,9 H 6.2363281 L 4.5917969,9.8222656 4,10.414062 v 1.171876 l 0.5917969,0.591796 1.7363281,0.867188 4.867187,0.974609 a 1.0001,1.0001 0 0 1 0.251954,0.08594 l 2,1 a 1.0001,1.0001 0 0 1 0.259765,0.1875 l 1,1 A 1.0001,1.0001 0 0 1 15,17 v 3 a 1.0001,1.0001 0 0 1 -0.292969,0.707031 l -1,1 a 1.0001,1.0001 0 0 1 -0.259765,0.1875 l -2,1 A 1.0001,1.0001 0 0 1 11,23 H 7 A 1.0001,1.0001 0 0 1 6.5527344,22.894531 l -2,-1 a 1.0001,1.0001 0 0 1 -0.2597656,-0.1875 L 4,21.414062 V 22 A 1.0001,1.0001 0 1 1 2,22 V 18 A 1.0001,1.0001 0 0 1 3.8945312,17.552734 L 4.8222656,19.408203 5.5917969,20.177734 7.2363281,21 H 10.763672 L 12.408203,20.177734 13,19.585938 V 17.414062 L 12.408203,16.822266 10.671875,15.955078 5.8046875,14.980469 a 1.0001,1.0001 0 0 1 -0.2519531,-0.08594 l -2,-1 a 1.0001,1.0001 0 0 1 -0.2597656,-0.1875 l -1,-1 A 1.0001,1.0001 0 0 1 2,12 V 10 A 1.0001,1.0001 0 0 1 2.2929688,9.2929688 l 1,-1 a 1.0001,1.0001 0 0 1 0.2597656,-0.1875 l 2,-1 A 1.0001,1.0001 0 0 1 6,7 Z"
     id="path2" />
</svg>
