<?xml version="1.0" encoding="UTF-8" standalone="no"?>
<svg
   xmlns:dc="http://purl.org/dc/elements/1.1/"
   xmlns:cc="http://creativecommons.org/ns#"
   xmlns:rdf="http://www.w3.org/1999/02/22-rdf-syntax-ns#"
   xmlns:svg="http://www.w3.org/2000/svg"
   xmlns="http://www.w3.org/2000/svg"
   xmlns:sodipodi="http://sodipodi.sourceforge.net/DTD/sodipodi-0.dtd"
   xmlns:inkscape="http://www.inkscape.org/namespaces/inkscape"
   data-dec="80"
   width="22"
   height="40"
   version="1.1"
   id="svg4"
   sodipodi:docname="80.svg"
   inkscape:version="0.92.4 (unknown)">
  <metadata
     id="metadata10">
    <rdf:RDF>
      <cc:Work
         rdf:about="">
        <dc:format>image/svg+xml</dc:format>
        <dc:type
           rdf:resource="http://purl.org/dc/dcmitype/StillImage" />
      </cc:Work>
    </rdf:RDF>
  </metadata>
  <defs
     id="defs8" />
  <sodipodi:namedview
     pagecolor="#ffffff"
     bordercolor="#666666"
     borderopacity="1"
     objecttolerance="10"
     gridtolerance="10"
     guidetolerance="10"
     inkscape:pageopacity="0"
     inkscape:pageshadow="2"
     inkscape:window-width="640"
     inkscape:window-height="480"
     id="namedview6"
     showgrid="false"
     inkscape:zoom="5.9"
     inkscape:cx="11"
     inkscape:cy="20"
     inkscape:window-x="0"
     inkscape:window-y="27"
     inkscape:window-maximized="0"
     inkscape:current-layer="svg4" />
  <path
     style="color:#000000;font-style:normal;font-variant:normal;font-weight:normal;font-stretch:normal;font-size:medium;line-height:normal;font-family:sans-serif;font-variant-ligatures:normal;font-variant-position:normal;font-variant-caps:normal;font-variant-numeric:normal;font-variant-alternates:normal;font-feature-settings:normal;text-indent:0;text-align:start;text-decoration:none;text-decoration-line:none;text-decoration-style:solid;text-decoration-color:#000000;letter-spacing:normal;word-spacing:normal;text-transform:none;writing-mode:lr-tb;direction:ltr;text-orientation:mixed;dominant-baseline:auto;baseline-shift:baseline;text-anchor:start;white-space:normal;shape-padding:0;clip-rule:nonzero;display:inline;overflow:visible;visibility:visible;opacity:1;isolation:auto;mix-blend-mode:normal;color-interpolation:sRGB;color-interpolation-filters:linearRGB;solid-color:#000000;solid-opacity:1;vector-effect:none;fill:#013272;fill-opacity:1;fill-rule:nonzero;stroke:none;stroke-width:0.5;stroke-linecap:round;stroke-linejoin:round;stroke-miterlimit:4;stroke-dasharray:none;stroke-dashoffset:0;stroke-opacity:1;color-rendering:auto;image-rendering:auto;shape-rendering:auto;text-rendering:auto;enable-background:accumulate"
     d="m 20.292969,2.0292969 0.929687,1.859375 A 0.250025,0.250025 0 0 1 21.25,4 v 2 a 0.250025,0.250025 0 0 1 -0.01367,0.078125 l -1,3 a 0.250025,0.250025 0 0 1 -0.05859,0.099609 L 18.484375,10.871094 18.873047,10.773438 20.78125,8.8652344 21.75,5.9589844 V 4.0585938 L 20.822266,2.2050781 Z M 10.1875,1.25 l -3,10.5 h 7.775391 L 17.865234,10.78125 19.78125,8.8652344 20.75,5.9589844 V 4.0585938 L 19.814453,2.1855469 17.943359,1.25 Z m -1,0 -5.8554688,20.5 H 3.8125 L 9.6679688,1.25 Z M 8.9921875,0.74609375 A 0.250025,0.250025 0 0 1 9.0410156,0.75 h 0.9179688 a 0.250025,0.250025 0 0 1 0.082032,0 h 7.925781 a 0.250025,0.250025 0 0 1 0.03906,0 0.250025,0.250025 0 0 1 0.02539,0.001953 0.250025,0.250025 0 0 1 0.02344,0.003906 0.250025,0.250025 0 0 1 0.0098,0.001953 0.250025,0.250025 0 0 1 0.03516,0.0136719 l 2.978516,0.99218752 a 0.250025,0.250025 0 0 1 0.144531,0.125 l 1,2 A 0.250025,0.250025 0 0 1 22.25,4 v 2 a 0.250025,0.250025 0 0 1 -0.01367,0.078125 l -1,3 a 0.250025,0.250025 0 0 1 -0.05859,0.099609 l -2,1.9999996 a 0.250025,0.250025 0 0 1 -0.117187,0.06445 l -3.994141,0.998046 -0.0059,0.002 a 0.250025,0.250025 0 0 1 -0.01172,0.002 0.250025,0.250025 0 0 1 -0.02344,0.0039 0.250025,0.250025 0 0 1 -0.01172,0.002 0.250025,0.250025 0 0 1 -0.01367,0 0.250025,0.250025 0 0 1 -0.02344,0 H 7.0449219 l -2.7128907,9.5 H 7 a 0.250025,0.250025 0 1 1 0,0.5 H 4.0410156 a 0.250025,0.250025 0 0 1 -0.082031,0 H 3.0410156 a 0.250025,0.250025 0 0 1 -0.082031,0 H 0 a 0.250025,0.250025 0 1 1 0,-0.5 H 2.8125 L 8.6679688,1.25 H 6 a 0.250025,0.250025 0 1 1 0,-0.5 h 2.9589844 a 0.250025,0.250025 0 0 1 0.033203,-0.003906 z"
     id="path2" />
</svg>
