<?xml version="1.0" encoding="UTF-8" standalone="no"?>
<svg
   xmlns:dc="http://purl.org/dc/elements/1.1/"
   xmlns:cc="http://creativecommons.org/ns#"
   xmlns:rdf="http://www.w3.org/1999/02/22-rdf-syntax-ns#"
   xmlns:svg="http://www.w3.org/2000/svg"
   xmlns="http://www.w3.org/2000/svg"
   xmlns:sodipodi="http://sodipodi.sourceforge.net/DTD/sodipodi-0.dtd"
   xmlns:inkscape="http://www.inkscape.org/namespaces/inkscape"
   data-dec="111"
   width="20"
   height="40"
   version="1.1"
   id="svg4"
   sodipodi:docname="111.svg"
   inkscape:version="0.92.4 (unknown)">
  <metadata
     id="metadata10">
    <rdf:RDF>
      <cc:Work
         rdf:about="">
        <dc:format>image/svg+xml</dc:format>
        <dc:type
           rdf:resource="http://purl.org/dc/dcmitype/StillImage" />
      </cc:Work>
    </rdf:RDF>
  </metadata>
  <defs
     id="defs8" />
  <sodipodi:namedview
     pagecolor="#ffffff"
     bordercolor="#666666"
     borderopacity="1"
     objecttolerance="10"
     gridtolerance="10"
     guidetolerance="10"
     inkscape:pageopacity="0"
     inkscape:pageshadow="2"
     inkscape:window-width="640"
     inkscape:window-height="480"
     id="namedview6"
     showgrid="false"
     inkscape:zoom="5.9"
     inkscape:cx="10"
     inkscape:cy="20"
     inkscape:window-x="0"
     inkscape:window-y="27"
     inkscape:window-maximized="0"
     inkscape:current-layer="svg4" />
  <path
     style="color:#000000;font-style:normal;font-variant:normal;font-weight:normal;font-stretch:normal;font-size:medium;line-height:normal;font-family:sans-serif;font-variant-ligatures:normal;font-variant-position:normal;font-variant-caps:normal;font-variant-numeric:normal;font-variant-alternates:normal;font-feature-settings:normal;text-indent:0;text-align:start;text-decoration:none;text-decoration-line:none;text-decoration-style:solid;text-decoration-color:#000000;letter-spacing:normal;word-spacing:normal;text-transform:none;writing-mode:lr-tb;direction:ltr;text-orientation:mixed;dominant-baseline:auto;baseline-shift:baseline;text-anchor:start;white-space:normal;shape-padding:0;clip-rule:nonzero;display:inline;overflow:visible;visibility:visible;opacity:1;isolation:auto;mix-blend-mode:normal;color-interpolation:sRGB;color-interpolation-filters:linearRGB;solid-color:#000000;solid-opacity:1;vector-effect:none;fill:#013272;fill-opacity:1;fill-rule:nonzero;stroke:none;stroke-width:2.5;stroke-linecap:round;stroke-linejoin:round;stroke-miterlimit:4;stroke-dasharray:none;stroke-dashoffset:0;stroke-opacity:1;color-rendering:auto;image-rendering:auto;shape-rendering:auto;text-rendering:auto;enable-background:accumulate"
     d="M 9.2929688,9.25 7.7402344,10.027344 6.0917969,11.675781 5.25,14.203125 v 1.59375 L 6.0917969,18.324219 7.7402344,19.972656 9.2929688,20.75 H 10.707031 L 12.259766,19.972656 13.908203,18.324219 14.75,15.796875 v -1.59375 L 13.908203,11.675781 12.259766,10.027344 10.707031,9.25 Z M 9.0058594,6.7421875 a 1.250125,1.250125 0 0 1 0.044922,0.00195 1.250125,1.250125 0 0 1 0.00781,0 1.250125,1.250125 0 0 1 0.011719,0.00195 1.250125,1.250125 0 0 1 0.074219,0.00391 h 1.7128908 a 1.250125,1.250125 0 0 1 0.58789,0.080078 l 0.0098,0.00391 2.939453,0.9804687 a 1.250125,1.250125 0 0 1 0.490235,0.3007813 l 2,1.9999996 a 1.250125,1.250125 0 0 1 0.300781,0.490235 l 1,3 A 1.250125,1.250125 0 0 1 18.25,14 v 2 a 1.250125,1.250125 0 0 1 -0.06445,0.394531 l -1,3 a 1.250125,1.250125 0 0 1 -0.300781,0.490235 l -2,2 a 1.250125,1.250125 0 0 1 -0.490235,0.300781 l -2.914062,0.970703 a 1.250125,1.250125 0 0 1 -0.01953,0.0078 A 1.250125,1.250125 0 0 1 10.855469,23.25 H 9.1425781 a 1.250125,1.250125 0 0 1 -0.5878906,-0.08008 1.250125,1.250125 0 0 1 -0.00977,-0.0039 L 5.6054688,22.185547 A 1.250125,1.250125 0 0 1 5.1152344,21.884766 l -2,-2 A 1.250125,1.250125 0 0 1 2.8144531,19.394531 l -1,-3 A 1.250125,1.250125 0 0 1 1.75,16 v -2 a 1.250125,1.250125 0 0 1 0.064453,-0.394531 l 1,-3 a 1.250125,1.250125 0 0 1 0.3007813,-0.490235 l 2,-1.9999996 A 1.250125,1.250125 0 0 1 5.6054688,7.8144531 L 8.4824219,6.8554688 a 1.250125,1.250125 0 0 1 0.2480469,-0.078125 1.250125,1.250125 0 0 1 0.021484,-0.00586 1.250125,1.250125 0 0 1 0.00586,-0.00195 1.250125,1.250125 0 0 1 0.052734,-0.00781 1.250125,1.250125 0 0 1 0.1132812,-0.013672 1.250125,1.250125 0 0 1 0.023437,-0.00195 1.250125,1.250125 0 0 1 0.058594,-0.00391 z"
     id="path2" />
</svg>
