<?xml version="1.0" encoding="UTF-8" standalone="no"?>
<svg
   xmlns:dc="http://purl.org/dc/elements/1.1/"
   xmlns:cc="http://creativecommons.org/ns#"
   xmlns:rdf="http://www.w3.org/1999/02/22-rdf-syntax-ns#"
   xmlns:svg="http://www.w3.org/2000/svg"
   xmlns="http://www.w3.org/2000/svg"
   xmlns:sodipodi="http://sodipodi.sourceforge.net/DTD/sodipodi-0.dtd"
   xmlns:inkscape="http://www.inkscape.org/namespaces/inkscape"
   data-dec="115"
   width="18"
   height="40"
   version="1.1"
   id="svg4"
   sodipodi:docname="115.svg"
   inkscape:version="0.92.4 (unknown)">
  <metadata
     id="metadata10">
    <rdf:RDF>
      <cc:Work
         rdf:about="">
        <dc:format>image/svg+xml</dc:format>
        <dc:type
           rdf:resource="http://purl.org/dc/dcmitype/StillImage" />
      </cc:Work>
    </rdf:RDF>
  </metadata>
  <defs
     id="defs8" />
  <sodipodi:namedview
     pagecolor="#ffffff"
     bordercolor="#666666"
     borderopacity="1"
     objecttolerance="10"
     gridtolerance="10"
     guidetolerance="10"
     inkscape:pageopacity="0"
     inkscape:pageshadow="2"
     inkscape:window-width="640"
     inkscape:window-height="480"
     id="namedview6"
     showgrid="false"
     inkscape:zoom="5.9"
     inkscape:cx="9"
     inkscape:cy="20"
     inkscape:window-x="0"
     inkscape:window-y="27"
     inkscape:window-maximized="0"
     inkscape:current-layer="svg4" />
  <path
     style="color:#000000;font-style:normal;font-variant:normal;font-weight:normal;font-stretch:normal;font-size:medium;line-height:normal;font-family:sans-serif;font-variant-ligatures:normal;font-variant-position:normal;font-variant-caps:normal;font-variant-numeric:normal;font-variant-alternates:normal;font-feature-settings:normal;text-indent:0;text-align:start;text-decoration:none;text-decoration-line:none;text-decoration-style:solid;text-decoration-color:#000000;letter-spacing:normal;word-spacing:normal;text-transform:none;writing-mode:lr-tb;direction:ltr;text-orientation:mixed;dominant-baseline:auto;baseline-shift:baseline;text-anchor:start;white-space:normal;shape-padding:0;clip-rule:nonzero;display:inline;overflow:visible;visibility:visible;opacity:1;isolation:auto;mix-blend-mode:normal;color-interpolation:sRGB;color-interpolation-filters:linearRGB;solid-color:#000000;solid-opacity:1;vector-effect:none;fill:#000000;fill-opacity:1;fill-rule:nonzero;stroke:none;stroke-width:1;stroke-linecap:round;stroke-linejoin:round;stroke-miterlimit:4;stroke-dasharray:none;stroke-dashoffset:0;stroke-opacity:1;color-rendering:auto;image-rendering:auto;shape-rendering:auto;text-rendering:auto;enable-background:accumulate"
     d="m 14.494141,11.103516 a 0.50005,0.50005 0 0 1 -0.314453,0.36914 L 14.207031,11.5 H 14.5 V 11.117188 Z M 10.011719,7.4980469 A 0.50005,0.50005 0 0 1 10.037109,7.5 H 11 a 0.50005,0.50005 0 0 1 0.158203,0.025391 l 3,1 a 0.50005,0.50005 0 0 1 0.289063,0.2519532 l 1,2.0000002 A 0.50005,0.50005 0 0 1 15.5,11 v 1 A 0.50005,0.50005 0 0 1 15,12.5 h -0.933594 a 0.50005,0.50005 0 0 1 -0.126953,0 H 13 A 0.50005,0.50005 0 0 1 12.5,12 V 11.117188 L 12.191406,10.5 H 12 a 0.50005,0.50005 0 0 1 -0.121094,-0.01563 L 9,9.765625 6.1738281,10.472656 5.7050781,10.707031 5.5585938,11 l 0.4804687,0.960938 1.1660156,0.582031 4.9804689,1.992187 a 0.50005,0.50005 0 0 1 0.03711,0.01758 l 2,1 a 0.50005,0.50005 0 0 1 0.22461,0.22461 l 1,2 A 0.50005,0.50005 0 0 1 15.5,18 v 1 a 0.50005,0.50005 0 0 1 -0.05273,0.222656 l -1,2 a 0.50005,0.50005 0 0 1 -0.289063,0.251953 l -3,1 A 0.50005,0.50005 0 0 1 11,22.5 h -0.945312 a 0.50005,0.50005 0 0 1 -0.089844,0 H 7.9882812 7 a 0.50005,0.50005 0 0 1 -0.1582031,-0.02539 l -3,-1 A 0.50005,0.50005 0 0 1 3.5527344,21.222656 l -1,-2 A 0.50005,0.50005 0 0 1 2.5,19 V 18.082031 A 0.50005,0.50005 0 0 1 2.984375,17.5 0.50005,0.50005 0 0 1 3,17.5 h 0.9199219 a 0.50005,0.50005 0 0 1 0.1582031,0 H 5 a 0.50005,0.50005 0 0 1 0.4746094,0.341797 L 5.9375,19.230469 6.2558594,19.548828 8.6796875,20.154297 11.753906,19.539062 12.5,18.792969 V 18.117188 L 11.960938,17.039062 10.794922,16.457031 5.8144531,14.464844 a 0.50005,0.50005 0 0 1 -0.037109,-0.01758 l -2,-1 a 0.50005,0.50005 0 0 1 -0.2246094,-0.22461 l -1,-2 a 0.50005,0.50005 0 0 1 0,-0.445312 l 1,-2.0000002 A 0.50005,0.50005 0 0 1 3.8417969,8.5253906 l 3,-1 A 0.50005,0.50005 0 0 1 7,7.5 h 1 1.9628906 a 0.50005,0.50005 0 0 1 0.048828,-0.00195 z"
     id="path2" />
</svg>
