<?xml version="1.0" encoding="UTF-8" standalone="no"?>
<svg
   xmlns:dc="http://purl.org/dc/elements/1.1/"
   xmlns:cc="http://creativecommons.org/ns#"
   xmlns:rdf="http://www.w3.org/1999/02/22-rdf-syntax-ns#"
   xmlns:svg="http://www.w3.org/2000/svg"
   xmlns="http://www.w3.org/2000/svg"
   xmlns:sodipodi="http://sodipodi.sourceforge.net/DTD/sodipodi-0.dtd"
   xmlns:inkscape="http://www.inkscape.org/namespaces/inkscape"
   data-dec="68"
   width="22"
   height="40"
   version="1.1"
   id="svg4"
   sodipodi:docname="68.svg"
   inkscape:version="0.92.4 (unknown)">
  <metadata
     id="metadata10">
    <rdf:RDF>
      <cc:Work
         rdf:about="">
        <dc:format>image/svg+xml</dc:format>
        <dc:type
           rdf:resource="http://purl.org/dc/dcmitype/StillImage" />
      </cc:Work>
    </rdf:RDF>
  </metadata>
  <defs
     id="defs8" />
  <sodipodi:namedview
     pagecolor="#ffffff"
     bordercolor="#666666"
     borderopacity="1"
     objecttolerance="10"
     gridtolerance="10"
     guidetolerance="10"
     inkscape:pageopacity="0"
     inkscape:pageshadow="2"
     inkscape:window-width="615"
     inkscape:window-height="417"
     id="namedview6"
     showgrid="false"
     inkscape:zoom="5.9"
     inkscape:cx="11"
     inkscape:cy="20"
     inkscape:window-x="0"
     inkscape:window-y="27"
     inkscape:window-maximized="0"
     inkscape:current-layer="svg4" />
  <path
     style="color:#000000;font-style:normal;font-variant:normal;font-weight:normal;font-stretch:normal;font-size:medium;line-height:normal;font-family:sans-serif;font-variant-ligatures:normal;font-variant-position:normal;font-variant-caps:normal;font-variant-numeric:normal;font-variant-alternates:normal;font-feature-settings:normal;text-indent:0;text-align:start;text-decoration:none;text-decoration-line:none;text-decoration-style:solid;text-decoration-color:#000000;letter-spacing:normal;word-spacing:normal;text-transform:none;writing-mode:lr-tb;direction:ltr;text-orientation:mixed;dominant-baseline:auto;baseline-shift:baseline;text-anchor:start;white-space:normal;shape-padding:0;clip-rule:nonzero;display:inline;overflow:visible;visibility:visible;opacity:1;isolation:auto;mix-blend-mode:normal;color-interpolation:sRGB;color-interpolation-filters:linearRGB;solid-color:#000000;solid-opacity:1;vector-effect:none;fill:#013272;fill-opacity:1;fill-rule:nonzero;stroke:none;stroke-width:1.5;stroke-linecap:round;stroke-linejoin:round;stroke-miterlimit:4;stroke-dasharray:none;stroke-dashoffset:0;stroke-opacity:1;color-rendering:auto;image-rendering:auto;shape-rendering:auto;text-rendering:auto;enable-background:accumulate"
     d="m 10.564453,1.75 -5.5703124,19.5 h 3.8867188 l 2.8320316,-0.945312 1.84375,-0.921876 1.826171,-1.826171 1.910157,-3.81836 L 18.25,9.9082031 V 6.1210938 L 17.34375,3.4042969 16.556641,2.6171875 14.824219,1.75 Z M 8.9746094,0.24023438 A 0.750075,0.750075 0 0 1 9.125,0.25 h 0.7539062 a 0.750075,0.750075 0 0 1 0.2460938,0 h 4.773438 a 0.750075,0.750075 0 0 1 0.265624,0.0175781 0.750075,0.750075 0 0 1 0.07227,0.0214844 0.750075,0.750075 0 0 1 0.03125,0.009766 l 0.0059,0.001953 2.96289,0.98828125 A 0.750075,0.750075 0 0 1 18.53125,1.46875 l 1,1 a 0.750075,0.750075 0 0 1 0.179688,0.2949219 l 1,3 A 0.750075,0.750075 0 0 1 20.75,6 v 4 a 0.750075,0.750075 0 0 1 -0.02148,0.181641 l -1,4 a 0.750075,0.750075 0 0 1 -0.05859,0.154297 l -2,4 A 0.750075,0.750075 0 0 1 17.53125,18.53125 l -2,2 a 0.750075,0.750075 0 0 1 -0.195312,0.138672 l -2,1 a 0.750075,0.750075 0 0 1 -0.154297,0.05859 l -3.994141,0.998046 -0.00586,0.002 a 0.750075,0.750075 0 0 1 -0.021484,0.0039 0.750075,0.750075 0 0 1 -0.011719,0.002 A 0.750075,0.750075 0 0 1 8.9277344,22.75 H 4.1210938 A 0.750075,0.750075 0 0 1 3.875,22.75 H 3.1210938 A 0.750075,0.750075 0 0 1 2.875,22.75 H 0 a 0.750075,0.750075 0 1 1 0,-1.5 H 2.4355469 L 8.0058594,1.75 H 6 a 0.750075,0.750075 0 1 1 0,-1.5 h 2.8789062 a 0.750075,0.750075 0 0 1 0.095703,-0.009766 z"
     id="path2" />
</svg>
