<?xml version="1.0" encoding="UTF-8" standalone="no"?>
<svg
   xmlns:dc="http://purl.org/dc/elements/1.1/"
   xmlns:cc="http://creativecommons.org/ns#"
   xmlns:rdf="http://www.w3.org/1999/02/22-rdf-syntax-ns#"
   xmlns:svg="http://www.w3.org/2000/svg"
   xmlns="http://www.w3.org/2000/svg"
   xmlns:sodipodi="http://sodipodi.sourceforge.net/DTD/sodipodi-0.dtd"
   xmlns:inkscape="http://www.inkscape.org/namespaces/inkscape"
   data-dec="111"
   width="20"
   height="40"
   version="1.1"
   id="svg4"
   sodipodi:docname="111.svg"
   inkscape:version="0.92.4 (unknown)">
  <metadata
     id="metadata10">
    <rdf:RDF>
      <cc:Work
         rdf:about="">
        <dc:format>image/svg+xml</dc:format>
        <dc:type
           rdf:resource="http://purl.org/dc/dcmitype/StillImage" />
      </cc:Work>
    </rdf:RDF>
  </metadata>
  <defs
     id="defs8" />
  <sodipodi:namedview
     pagecolor="#ffffff"
     bordercolor="#666666"
     borderopacity="1"
     objecttolerance="10"
     gridtolerance="10"
     guidetolerance="10"
     inkscape:pageopacity="0"
     inkscape:pageshadow="2"
     inkscape:window-width="640"
     inkscape:window-height="480"
     id="namedview6"
     showgrid="false"
     inkscape:zoom="5.9"
     inkscape:cx="10"
     inkscape:cy="20"
     inkscape:window-x="0"
     inkscape:window-y="27"
     inkscape:window-maximized="0"
     inkscape:current-layer="svg4" />
  <path
     style="color:#000000;font-style:normal;font-variant:normal;font-weight:normal;font-stretch:normal;font-size:medium;line-height:normal;font-family:sans-serif;font-variant-ligatures:normal;font-variant-position:normal;font-variant-caps:normal;font-variant-numeric:normal;font-variant-alternates:normal;font-feature-settings:normal;text-indent:0;text-align:start;text-decoration:none;text-decoration-line:none;text-decoration-style:solid;text-decoration-color:#000000;letter-spacing:normal;word-spacing:normal;text-transform:none;writing-mode:lr-tb;direction:ltr;text-orientation:mixed;dominant-baseline:auto;baseline-shift:baseline;text-anchor:start;white-space:normal;shape-padding:0;clip-rule:nonzero;display:inline;overflow:visible;visibility:visible;opacity:1;isolation:auto;mix-blend-mode:normal;color-interpolation:sRGB;color-interpolation-filters:linearRGB;solid-color:#000000;solid-opacity:1;vector-effect:none;fill:#013272;fill-opacity:1;fill-rule:nonzero;stroke:none;stroke-width:2;stroke-linecap:round;stroke-linejoin:round;stroke-miterlimit:4;stroke-dasharray:none;stroke-dashoffset:0;stroke-opacity:1;color-rendering:auto;image-rendering:auto;shape-rendering:auto;text-rendering:auto;enable-background:accumulate"
     d="M 9.4140625,9 7.8222656,10.591797 6.9257812,12.382812 6,15.162109 v 2.675782 L 6.8183594,20.291016 8.2363281,21 H 10.585938 L 12.177734,19.408203 13.074219,17.617188 14,14.837891 V 12.162109 L 13.181641,9.7089844 11.763672,9 Z M 8.9804688,6.9902344 A 1.0001,1.0001 0 0 1 9.1464844,7 h 2.7441406 a 1.0001,1.0001 0 0 1 0.425781,0.050781 l 0.0078,0.00195 a 1.0001,1.0001 0 0 1 0.03125,0.011719 l 2.960937,0.9863281 a 1.0001,1.0001 0 0 1 0.390625,0.2421876 l 1,1 a 1.0001,1.0001 0 0 1 0.242188,0.390625 l 1,3.0000002 A 1.0001,1.0001 0 0 1 18,13 v 2 a 1.0001,1.0001 0 0 1 -0.05078,0.316406 l -1,3 a 1.0001,1.0001 0 0 1 -0.117188,0.238282 l -2,3 a 1.0001,1.0001 0 0 1 -0.515625,0.394531 l -2.90625,0.96875 a 1.0001,1.0001 0 0 1 -0.0039,0.002 A 1.0001,1.0001 0 0 1 10.853516,23 H 8.109375 a 1.0001,1.0001 0 0 1 -0.4257812,-0.05078 l -0.039063,-0.01367 -2.9609374,-0.986328 a 1.0001,1.0001 0 0 1 -0.390625,-0.242188 l -1,-1 A 1.0001,1.0001 0 0 1 3.0507812,20.316406 l -1,-3 A 1.0001,1.0001 0 0 1 2,17 v -2 a 1.0001,1.0001 0 0 1 0.050781,-0.316406 l 1,-3 a 1.0001,1.0001 0 0 1 0.1171876,-0.238282 l 2,-2.9999995 a 1.0001,1.0001 0 0 1 0.515625,-0.3945313 l 2.90625,-0.96875 a 1.0001,1.0001 0 0 1 0.00977,-0.00391 1.0001,1.0001 0 0 1 0.00977,-0.00391 1.0001,1.0001 0 0 1 0.3710938,-0.083984 z"
     id="path2" />
</svg>
