<?xml version="1.0" encoding="UTF-8" standalone="no"?>
<svg
   xmlns:dc="http://purl.org/dc/elements/1.1/"
   xmlns:cc="http://creativecommons.org/ns#"
   xmlns:rdf="http://www.w3.org/1999/02/22-rdf-syntax-ns#"
   xmlns:svg="http://www.w3.org/2000/svg"
   xmlns="http://www.w3.org/2000/svg"
   xmlns:sodipodi="http://sodipodi.sourceforge.net/DTD/sodipodi-0.dtd"
   xmlns:inkscape="http://www.inkscape.org/namespaces/inkscape"
   data-dec="338"
   width="32"
   height="40"
   version="1.1"
   id="svg4"
   sodipodi:docname="338.svg"
   inkscape:version="0.92.4 (unknown)">
  <metadata
     id="metadata10">
    <rdf:RDF>
      <cc:Work
         rdf:about="">
        <dc:format>image/svg+xml</dc:format>
        <dc:type
           rdf:resource="http://purl.org/dc/dcmitype/StillImage" />
      </cc:Work>
    </rdf:RDF>
  </metadata>
  <defs
     id="defs8" />
  <sodipodi:namedview
     pagecolor="#ffffff"
     bordercolor="#666666"
     borderopacity="1"
     objecttolerance="10"
     gridtolerance="10"
     guidetolerance="10"
     inkscape:pageopacity="0"
     inkscape:pageshadow="2"
     inkscape:window-width="615"
     inkscape:window-height="417"
     id="namedview6"
     showgrid="false"
     inkscape:zoom="5.9"
     inkscape:cx="16"
     inkscape:cy="20"
     inkscape:window-x="0"
     inkscape:window-y="27"
     inkscape:window-maximized="0"
     inkscape:current-layer="svg4" />
  <path
     style="color:#000000;font-style:normal;font-variant:normal;font-weight:normal;font-stretch:normal;font-size:medium;line-height:normal;font-family:sans-serif;font-variant-ligatures:normal;font-variant-position:normal;font-variant-caps:normal;font-variant-numeric:normal;font-variant-alternates:normal;font-feature-settings:normal;text-indent:0;text-align:start;text-decoration:none;text-decoration-line:none;text-decoration-style:solid;text-decoration-color:#000000;letter-spacing:normal;word-spacing:normal;text-transform:none;writing-mode:lr-tb;direction:ltr;text-orientation:mixed;dominant-baseline:auto;baseline-shift:baseline;text-anchor:start;white-space:normal;shape-padding:0;clip-rule:nonzero;display:inline;overflow:visible;visibility:visible;opacity:1;isolation:auto;mix-blend-mode:normal;color-interpolation:sRGB;color-interpolation-filters:linearRGB;solid-color:#000000;solid-opacity:1;vector-effect:none;fill:#013272;fill-opacity:1;fill-rule:nonzero;stroke:none;stroke-width:0.30000001;stroke-linecap:round;stroke-linejoin:round;stroke-miterlimit:4;stroke-dasharray:none;stroke-dashoffset:0;stroke-opacity:1;color-rendering:auto;image-rendering:auto;shape-rendering:auto;text-rendering:auto;enable-background:accumulate"
     d="m 10.945312,21.84375 -0.01953,0.0059 h 0.01367 z m 10.197266,-0.119141 -0.628906,0.125 h 0.439453 z m -6.867187,-0.140625 -0.07617,0.265625 h 0.558593 l -0.06445,-0.126953 z m -2.28711,-0.08789 -0.410156,0.136718 -0.216797,0.216797 h 0.525391 z m 1.373047,-0.216797 -0.162109,0.570312 h 0.6875 l 0.103515,-0.361328 z M 13,21.158203 l -0.666016,0.222656 -0.134765,0.46875 h 0.6875 l 0.189453,-0.666015 z m 1.402344,-0.01758 -0.04492,0.154297 0.146484,0.04883 z m -2.304688,-0.02734 -0.04297,0.04297 0.0332,-0.0098 z m 13.226563,-2.830078 -1.191407,1.787109 -0.0078,0.01367 a 0.15001501,0.15001501 0 0 1 -0.0059,0.0078 0.15001501,0.15001501 0 0 1 -0.002,0.0039 0.15001501,0.15001501 0 0 1 -0.0078,0.0078 0.15001501,0.15001501 0 0 1 -0.002,0.002 0.15001501,0.15001501 0 0 1 -0.0098,0.0078 0.15001501,0.15001501 0 0 1 -0.002,0.002 0.15001501,0.15001501 0 0 1 -0.0098,0.0078 0.15001501,0.15001501 0 0 1 -0.002,0.002 0.15001501,0.15001501 0 0 1 -0.0098,0.0059 l -1.501953,1.001953 1.398437,-0.279296 a 0.15001501,0.15001501 0 1 1 0.05859,0.292968 l -2.111328,0.421875 -0.421875,0.28125 h 2.402344 z m -3.65625,-6.28125 0.18164,0.361328 V 12.09375 Z m 0.482422,-0.851562 v 0.828125 a 0.15001501,0.15001501 0 0 1 0,0.04492 v 0.96289 a 0.15001501,0.15001501 0 0 1 0,0.0293 v 0.759766 l 0.65625,-2.625 z m -0.908203,0 0.203124,0.404297 0.404297,0.203124 v -0.607421 z m -0.605469,0 0.361328,0.179687 -0.0918,-0.179687 z m 0.308593,-0.306641 -0.01953,0.0059 h 0.01367 z m 1.158204,-0.386719 -0.525391,0.175781 -0.216797,0.216797 h 0.544922 z m 0.957031,-0.320312 a 0.15001501,0.15001501 0 0 1 -0.01367,0.0059 l -0.541016,0.179688 -0.263671,0.527343 h 0.640624 z m -0.607422,-0.3789065 -0.398437,0.3984375 0.238281,-0.07813 z m 1.066406,-1.4628906 -0.376953,0.7578125 a 0.15001501,0.15001501 0 0 1 -0.01758,0.03125 l -0.427734,0.859375 0.255859,-0.085937 a 0.15001501,0.15001501 0 0 1 0.164063,0.046875 z M 6.9980469,3.8476562 A 0.15001501,0.15001501 0 0 1 7.125,4.0839844 L 5.1367188,7.0664062 4.1445312,10.041016 3.1503906,14.017578 v 3.947266 l 0.984375,1.96875 a 0.15023822,0.15023822 0 1 1 -0.2695312,0.132812 l -1,-2 A 0.15001501,0.15001501 0 0 1 2.8496094,18 v -4 a 0.15001501,0.15001501 0 0 1 0.00391,-0.03711 l 1,-4.0000004 a 0.15001501,0.15001501 0 0 1 0.00391,-0.00977 l 1,-3 A 0.15001501,0.15001501 0 0 1 4.875,6.9160156 l 2,-3 A 0.15001501,0.15001501 0 0 1 6.9980469,3.8476562 Z M 28.84375,3.0546875 l 0.0059,0.019531 v -0.013672 z m -0.355469,-1.0664063 0.144531,0.4335938 0.216797,0.2167969 v -0.53125 z M 19.566406,1.96875 19.068359,2.1347656 a 0.15001501,0.15001501 0 0 1 -0.01367,0.00586 l -0.0078,0.00195 a 0.15001501,0.15001501 0 0 1 -0.05078,0.00781 0.15001501,0.15001501 0 0 1 -0.0039,0 0.15001501,0.15001501 0 0 1 -0.0098,-0.00195 0.15001501,0.15001501 0 0 1 -0.0039,0 0.15001501,0.15001501 0 0 1 -0.01172,-0.00195 0.15001501,0.15001501 0 0 1 -0.0039,0 0.15001501,0.15001501 0 0 1 -0.0098,-0.00391 h -0.0039 a 0.15001501,0.15001501 0 0 1 -0.01367,-0.00586 l -0.0957,-0.03125 -5.394532,18.8847652 0.626954,0.208985 0.130859,-0.457031 -0.337891,-0.675782 a 0.15023858,0.15023858 0 1 1 0.269532,-0.132812 l 0.191406,0.380859 2.61914,-9.173828 A 0.15001501,0.15001501 0 0 1 17,10.849609 h 0.0293 L 19.296875,2.9140625 19.105469,3.1054688 A 0.15001501,0.15001501 0 1 1 18.894531,2.8945312 l 0.570313,-0.5703124 z m 8.488282,-0.125 0.101562,0.1015625 -0.02539,-0.076172 z m -8.109376,0 -0.0332,0.00977 -0.0098,0.033203 z M 9.0449219,1.8085938 8.0800781,2.1308594 6.1171875,4.0957031 4.1367188,7.0664062 3.1445312,10.041016 2.1503906,14.017578 v 2.958984 l 0.9804688,2.94336 0.9570312,0.957031 1.1542969,0.576172 -0.3476563,-0.347656 a 0.15001501,0.15001501 0 0 1 -0.029297,-0.03906 l -1,-2 A 0.15001501,0.15001501 0 0 1 3.8496094,19 v -5 a 0.15001501,0.15001501 0 0 1 0.00391,-0.03711 l 1,-4.0000004 a 0.15001501,0.15001501 0 0 1 0.00391,-0.00977 l 1,-3 a 0.15001501,0.15001501 0 0 1 0.00781,-0.019531 l 1,-2 A 0.15001501,0.15001501 0 0 1 6.875,4.9160156 l 2,-3 a 0.15001501,0.15001501 0 0 1 0.058594,-0.050781 z m 8.8828121,-0.00781 -0.130859,0.4570313 0.337891,0.6757813 A 0.1502606,0.1502606 0 1 1 17.865234,3.0664062 L 17.673828,2.6855469 12.703125,20.085938 12.894531,19.894531 a 0.15001501,0.15001501 0 1 1 0.210938,0.210938 l -0.570313,0.570312 -0.101562,0.355469 0.498047,-0.166016 a 0.15001501,0.15001501 0 0 1 0.02148,-0.0078 0.15001501,0.15001501 0 0 1 0.0059,-0.002 0.15001501,0.15001501 0 0 1 0.04492,-0.0059 0.15001501,0.15001501 0 0 1 0.0039,0 0.15001501,0.15001501 0 0 1 0.0098,0.002 0.15001501,0.15001501 0 0 1 0.0039,0 0.15001501,0.15001501 0 0 1 0.01172,0.002 0.15001501,0.15001501 0 0 1 0.0039,0 0.15001501,0.15001501 0 0 1 0.0098,0.0039 0.15001501,0.15001501 0 0 1 0.0039,0 l 0.01367,0.0059 0.0957,0.03125 5.394532,-18.8847654 z M 17.496094,1.65625 17.597656,1.859375 17.642578,1.7050781 Z M 29.150391,1.1503906 v 0.8300782 a 0.15001501,0.15001501 0 0 1 0,0.037109 v 0.9648438 a 0.15001501,0.15001501 0 0 1 0,0.029297 v 0.9804687 a 0.15001501,0.15001501 0 0 1 0,0.015625 v 1.1738281 l 0.671875,-4.03125 z m -0.941407,0 0.160157,0.4804688 0.480468,0.1601562 v -0.640625 z m -0.847656,0 0.216797,0.2167969 0.433594,0.1445313 -0.119141,-0.3613282 z m -0.435547,0 0.01953,0.00586 -0.0059,-0.00586 z m -5.865234,0 -0.0059,0.00586 0.01953,-0.00586 z m -0.947266,0 -0.101562,0.3535156 0.410156,-0.1367187 0.216797,-0.2167969 z m -1,0 -0.189453,0.6660156 0.07617,0.025391 0.666016,-0.2226563 0.134765,-0.46875 z m -1,0 -0.103515,0.3613282 0.628906,0.2089843 0.162109,-0.5703125 z m -0.871093,0 0.06445,0.1269532 0.417968,0.1386718 0.07617,-0.265625 z m -6.207032,0 L 9.1035156,2.1171875 7.1308594,5.0761719 6.1386719,7.0566406 5.1445312,10.041016 4.1503906,14.017578 v 4.947266 l 0.9726563,1.947265 0.9375,0.9375 H 8.984375 9 a 0.15001501,0.15001501 0 0 1 0.00977,0 h 0.9667969 l 1.4453125,-0.482421 0.84375,-0.84375 L 17.476562,2.2871094 17.09375,1.5234375 15.976562,1.1503906 H 15.015625 15 h -0.0098 z m 5.951172,-0.30273435 a 0.15001501,0.15001501 0 0 1 0.03125,0.001953 h 0.962891 a 0.15001501,0.15001501 0 0 1 0.04492,0 h 0.955078 a 0.15001501,0.15001501 0 0 1 0.04492,0 h 0.955078 a 0.15001501,0.15001501 0 0 1 0.04492,0 h 0.957031 a 0.15001501,0.15001501 0 0 1 0.0293,0 h 0.980469 0.01562 3.980469 0.01563 0.980469 a 0.15001501,0.15001501 0 0 1 0.0293,0 h 0.964844 a 0.15001501,0.15001501 0 0 1 0.04492,0 h 0.958984 a 0.15001501,0.15001501 0 0 1 0.04492,0 H 30 a 0.15001501,0.15001501 0 0 1 0.148438,0.17578122 l -0.998047,5.984375 a 0.15001501,0.15001501 0 0 1 -0.0098,0.044922 0.15001501,0.15001501 0 0 1 -0.0039,0.00781 0.15001501,0.15001501 0 0 1 -0.01758,0.03125 0.15001501,0.15001501 0 0 1 -0.0039,0.00391 0.15001501,0.15001501 0 0 1 -0.01367,0.013672 0.15001501,0.15001501 0 0 1 -0.01172,0.00977 0.15001501,0.15001501 0 0 1 -0.0039,0.00391 0.15001501,0.15001501 0 0 1 -0.0039,0.00195 0.15001501,0.15001501 0 0 1 -0.03516,0.017578 0.15001501,0.15001501 0 0 1 -0.0098,0.00195 0.15001501,0.15001501 0 0 1 -0.0059,0.00195 0.15001501,0.15001501 0 0 1 -0.0039,0 0.15001501,0.15001501 0 0 1 -0.03516,0.00391 0.15001501,0.15001501 0 0 1 -0.0059,0 0.15001501,0.15001501 0 0 1 -0.0098,-0.00195 0.15001501,0.15001501 0 0 1 -0.0039,0 0.15001501,0.15001501 0 0 1 -0.02344,-0.00781 0.15001501,0.15001501 0 0 1 -0.002,0 0.15001501,0.15001501 0 0 1 -0.0039,-0.00195 0.15001501,0.15001501 0 0 1 -0.0098,-0.00391 0.15001501,0.15001501 0 0 1 -0.0039,-0.00195 0.15001501,0.15001501 0 0 1 -0.0078,-0.00391 0.15001501,0.15001501 0 0 1 -0.0039,-0.00391 0.15001501,0.15001501 0 0 1 -0.0098,-0.00586 0.15001501,0.15001501 0 0 1 -0.0039,-0.00195 0.15001501,0.15001501 0 0 1 -0.0039,-0.00391 0.15001501,0.15001501 0 0 1 -0.0059,-0.00781 0.15001501,0.15001501 0 0 1 -0.0078,-0.00586 0.15001501,0.15001501 0 0 1 -0.002,-0.00391 0.15001501,0.15001501 0 0 1 -0.0078,-0.00781 0.15001501,0.15001501 0 0 1 -0.002,-0.00391 0.15001501,0.15001501 0 0 1 -0.0059,-0.00977 0.15001501,0.15001501 0 0 1 0,-0.00195 0.15001501,0.15001501 0 0 1 -0.0059,-0.011719 0.15001501,0.15001501 0 0 1 -0.002,-0.00391 0.15001501,0.15001501 0 0 1 -0.0039,-0.00977 0.15001501,0.15001501 0 0 1 -0.002,-0.00391 0.15001501,0.15001501 0 0 1 0,-0.00586 0.15001501,0.15001501 0 0 1 -0.0039,-0.013672 0.15001501,0.15001501 0 0 1 0,-0.00586 0.15001501,0.15001501 0 0 1 -0.002,-0.013672 0.15001501,0.15001501 0 0 1 0,-0.00586 V 6.9902344 4.0234375 L 28.367188,2.578125 27.421875,1.6328125 25.976562,1.1503906 h -3.953124 l -1.445313,0.4824219 -0.84375,0.84375 -2.392578,8.3730465 h 2.634765 L 21.421875,10.367188 22.875,8.9140625 23.863281,6.9394531 a 0.15001501,0.15001501 0 0 1 0.002,-0.00586 0.15001501,0.15001501 0 0 1 0.002,-0.00391 0.15001501,0.15001501 0 0 1 0.0039,-0.00586 0.15001501,0.15001501 0 0 1 0.0059,-0.00977 0.15001501,0.15001501 0 0 1 0.002,-0.00391 0.15001501,0.15001501 0 0 1 0.0059,-0.00781 0.15001501,0.15001501 0 0 1 0.0039,-0.00391 0.15001501,0.15001501 0 0 1 0.0078,-0.00781 0.15001501,0.15001501 0 0 1 0.002,-0.00195 0.15001501,0.15001501 0 0 1 0.0098,-0.00781 0.15001501,0.15001501 0 0 1 0.002,-0.00195 0.15001501,0.15001501 0 0 1 0.0098,-0.00781 0.15001501,0.15001501 0 0 1 0.002,0 0.15001501,0.15001501 0 0 1 0.02734,-0.013672 0.15001501,0.15001501 0 0 1 0.05664,-0.00977 0.15001501,0.15001501 0 0 1 0.002,0 0.15001501,0.15001501 0 0 1 0.01172,0.00195 0.15001501,0.15001501 0 0 1 0.0039,0 0.15001501,0.15001501 0 0 1 0.0039,0 0.15001501,0.15001501 0 0 1 0.02148,0.00586 0.15001501,0.15001501 0 0 1 0.0039,0.00195 0.15001501,0.15001501 0 0 1 0.0098,0.00391 0.15001501,0.15001501 0 0 1 0.0039,0.00195 0.15001501,0.15001501 0 0 1 0.02148,0.013672 0.15001501,0.15001501 0 0 1 0.04102,0.042969 0.15001501,0.15001501 0 0 1 0.0098,0.017578 0.15001501,0.15001501 0 0 1 0.0039,0.00977 0.15001501,0.15001501 0 0 1 0.0039,0.019531 0.15001501,0.15001501 0 0 1 0.002,0.00977 0.15001501,0.15001501 0 0 1 0.002,0.015625 0.15001501,0.15001501 0 0 1 0,0.00195 0.15001501,0.15001501 0 0 1 0,0.011719 0.15001501,0.15001501 0 0 1 0,0.00391 0.15001501,0.15001501 0 0 1 -0.002,0.011719 0.15001501,0.15001501 0 0 1 0,0.00391 0.15001501,0.15001501 0 0 1 0,0.00391 0.15001501,0.15001501 0 0 1 -0.002,0.00781 l -0.99414,3.9765626 a 0.15001501,0.15001501 0 0 1 -0.0098,0.03711 0.15001501,0.15001501 0 0 1 -0.002,0.0059 l -0.992187,3.96875 a 0.15001501,0.15001501 0 0 1 -0.0039,0.01953 0.15001501,0.15001501 0 0 1 -0.002,0.002 0.15001501,0.15001501 0 0 1 -0.002,0.0078 0.15001501,0.15001501 0 0 1 -0.0039,0.0059 0.15001501,0.15001501 0 0 1 -0.002,0.0078 0.15001501,0.15001501 0 0 1 -0.0039,0.0059 0.15001501,0.15001501 0 0 1 -0.0039,0.0078 0.15001501,0.15001501 0 0 1 -0.0039,0.0039 0.15001501,0.15001501 0 0 1 -0.0039,0.0078 0.15001501,0.15001501 0 0 1 -0.0059,0.0059 0.15001501,0.15001501 0 0 1 -0.0039,0.0059 0.15001501,0.15001501 0 0 1 -0.0059,0.0039 0.15001501,0.15001501 0 0 1 -0.01758,0.01563 0.15001501,0.15001501 0 0 1 -0.0059,0.0039 0.15001501,0.15001501 0 0 1 -0.01172,0.0078 0.15001501,0.15001501 0 0 1 -0.02148,0.0078 0.15001501,0.15001501 0 0 1 -0.05273,0.0078 0.15001501,0.15001501 0 0 1 -0.0078,0 0.15001501,0.15001501 0 0 1 -0.0059,-0.002 0.15001501,0.15001501 0 0 1 -0.0078,0 0.15001501,0.15001501 0 0 1 -0.0078,-0.002 0.15001501,0.15001501 0 0 1 -0.02148,-0.0078 0.15001501,0.15001501 0 0 1 -0.0059,-0.002 0.15001501,0.15001501 0 0 1 -0.0039,-0.002 0.15001501,0.15001501 0 0 1 -0.0098,-0.0059 0.15001501,0.15001501 0 0 1 -0.0059,-0.0039 0.15001501,0.15001501 0 0 1 -0.0078,-0.0039 0.15001501,0.15001501 0 0 1 -0.002,-0.002 0.15001501,0.15001501 0 0 1 -0.0078,-0.0078 0.15001501,0.15001501 0 0 1 -0.0059,-0.0059 0.15001501,0.15001501 0 0 1 -0.0059,-0.0039 0.15001501,0.15001501 0 0 1 -0.0039,-0.0059 0.15001501,0.15001501 0 0 1 -0.0059,-0.0059 0.15001501,0.15001501 0 0 1 -0.0039,-0.0059 0.15001501,0.15001501 0 0 1 -0.0039,-0.0059 0.15001501,0.15001501 0 0 1 -0.0039,-0.0078 0.15001501,0.15001501 0 0 1 -0.0039,-0.0059 0.15001501,0.15001501 0 0 1 -0.002,-0.0078 0.15001501,0.15001501 0 0 1 -0.0039,-0.0059 0.15001501,0.15001501 0 0 1 -0.002,-0.0078 0.15001501,0.15001501 0 0 1 -0.002,-0.0078 0.15001501,0.15001501 0 0 1 0,-0.0078 0.15001501,0.15001501 0 0 1 -0.002,-0.0059 0.15001501,0.15001501 0 0 1 0,-0.002 0.15001501,0.15001501 0 0 1 -0.002,-0.01367 0.15001501,0.15001501 0 0 1 0,-0.0078 v -0.0059 -1.958985 l -0.628906,-1.255859 -1.255859,-0.628906 h -2.708985 l -2.732421,9.5625 0.382812,0.763671 1.117188,0.373047 h 2.966796 l 2.804688,-0.560547 2.095703,-1.398437 1.980469,-2.96875 a 0.15001501,0.15001501 0 0 1 0.0039,-0.0059 0.15001501,0.15001501 0 0 1 0.0059,-0.0078 0.15001501,0.15001501 0 0 1 0.0098,-0.01172 0.15001501,0.15001501 0 0 1 0.119141,-0.04883 0.15001501,0.15001501 0 0 1 0.002,0 0.15001501,0.15001501 0 0 1 0.01367,0.002 0.15001501,0.15001501 0 0 1 0.002,0 0.15001501,0.15001501 0 0 1 0.02734,0.0078 0.15001501,0.15001501 0 0 1 0.002,0.002 0.15001501,0.15001501 0 0 1 0.01172,0.0039 0.15001501,0.15001501 0 0 1 0.002,0.002 0.15001501,0.15001501 0 0 1 0.02344,0.01563 0.15001501,0.15001501 0 0 1 0.01172,0.0098 0.15001501,0.15001501 0 0 1 0.0098,0.0098 0.15001501,0.15001501 0 0 1 0,0.002 0.15001501,0.15001501 0 0 1 0.0098,0.0098 0.15001501,0.15001501 0 0 1 0,0.002 0.15001501,0.15001501 0 0 1 0.01953,0.03906 0.15001501,0.15001501 0 0 1 0,0.002 0.15001501,0.15001501 0 0 1 0.0039,0.01172 0.15001501,0.15001501 0 0 1 0,0.002 0.15001501,0.15001501 0 0 1 0.002,0.01367 0.15001501,0.15001501 0 0 1 0,0.01563 0.15001501,0.15001501 0 0 1 0,0.01367 0.15001501,0.15001501 0 0 1 0,0.002 0.15001501,0.15001501 0 0 1 -0.002,0.01367 0.15001501,0.15001501 0 0 1 0,0.002 0.15001501,0.15001501 0 0 1 -0.0039,0.01172 0.15001501,0.15001501 0 0 1 -0.01172,0.0293 l -1.99414,4.986329 A 0.15001501,0.15001501 0 0 1 24,22.150391 h -2.982422 -0.0293 -1.984375 -0.01563 -2.976562 -0.01563 -0.96875 a 0.15001501,0.15001501 0 0 1 -0.04492,0 h -0.962891 a 0.15001501,0.15001501 0 0 1 -0.04492,0 h -0.955078 a 0.15001501,0.15001501 0 0 1 -0.04492,0 h -0.955078 a 0.15001501,0.15001501 0 0 1 -0.04492,0 h -0.957031 a 0.15001501,0.15001501 0 0 1 -0.0293,0 H 10.007812 9.9921875 9.015625 A 0.15001501,0.15001501 0 0 1 9,22.150391 H 8.9902344 6.015625 a 0.15001501,0.15001501 0 0 1 -0.025391,0 0.15001501,0.15001501 0 0 1 -0.00391,0 0.15001501,0.15001501 0 0 1 -0.011719,-0.002 0.15001501,0.15001501 0 0 1 -0.00195,0 0.15001501,0.15001501 0 0 1 -0.011719,-0.0039 0.15001501,0.15001501 0 0 1 -0.00391,0 0.15001501,0.15001501 0 0 1 -0.00977,-0.0039 0.15001501,0.15001501 0 0 1 -0.013672,-0.0059 l -0.00391,-0.002 A 0.15001501,0.15001501 0 0 1 5.9160156,22.125 L 3.9335938,21.134766 a 0.15001501,0.15001501 0 0 1 -0.039063,-0.0293 l -1,-1 a 0.15001501,0.15001501 0 0 1 -0.037109,-0.05859 l -1,-3 A 0.15001501,0.15001501 0 0 1 1.8496094,17 v -3 a 0.15001501,0.15001501 0 0 1 0.00391,-0.03711 l 1,-4.0000004 a 0.15001501,0.15001501 0 0 1 0.00391,-0.00977 l 1,-3 A 0.15001501,0.15001501 0 0 1 3.875,6.9160156 l 2,-3 a 0.15001501,0.15001501 0 0 1 0.019531,-0.021484 l 2,-2 a 0.15001501,0.15001501 0 0 1 0.058594,-0.037109 l 2.974609,-0.9902344 a 0.15001501,0.15001501 0 0 1 0.0059,-0.001953 0.15001501,0.15001501 0 0 1 0.0078,-0.003906 0.15001501,0.15001501 0 0 1 0.0078,-0.001953 0.15001501,0.15001501 0 0 1 0.0039,-0.001953 0.15001501,0.15001501 0 0 1 0.002,-0.001953 0.15001501,0.15001501 0 0 1 0.002,0 0.15001501,0.15001501 0 0 1 0.002,0 0.15001501,0.15001501 0 0 1 0.01758,-0.003906 0.15001501,0.15001501 0 0 1 0.002,0 0.15001501,0.15001501 0 0 1 0.0059,-0.001953 0.15001501,0.15001501 0 0 1 0.01563,0 0.15001501,0.15001501 0 0 1 0.0078,0 0.15001501,0.15001501 0 0 1 0.0078,0 H 14.984375 15 a 0.15001501,0.15001501 0 0 1 0.0098,0 h 0.978515 0.01563 0.96875 a 0.15001501,0.15001501 0 0 1 0.01367,-0.001953 z"
     id="path2" />
</svg>
