<?xml version="1.0" encoding="UTF-8" standalone="no"?>
<svg
   xmlns:dc="http://purl.org/dc/elements/1.1/"
   xmlns:cc="http://creativecommons.org/ns#"
   xmlns:rdf="http://www.w3.org/1999/02/22-rdf-syntax-ns#"
   xmlns:svg="http://www.w3.org/2000/svg"
   xmlns="http://www.w3.org/2000/svg"
   xmlns:sodipodi="http://sodipodi.sourceforge.net/DTD/sodipodi-0.dtd"
   xmlns:inkscape="http://www.inkscape.org/namespaces/inkscape"
   data-dec="52"
   width="22"
   height="40"
   version="1.1"
   id="svg4"
   sodipodi:docname="52.svg"
   inkscape:version="0.92.4 (unknown)">
  <metadata
     id="metadata10">
    <rdf:RDF>
      <cc:Work
         rdf:about="">
        <dc:format>image/svg+xml</dc:format>
        <dc:type
           rdf:resource="http://purl.org/dc/dcmitype/StillImage" />
      </cc:Work>
    </rdf:RDF>
  </metadata>
  <defs
     id="defs8" />
  <sodipodi:namedview
     pagecolor="#ffffff"
     bordercolor="#666666"
     borderopacity="1"
     objecttolerance="10"
     gridtolerance="10"
     guidetolerance="10"
     inkscape:pageopacity="0"
     inkscape:pageshadow="2"
     inkscape:window-width="615"
     inkscape:window-height="417"
     id="namedview6"
     showgrid="false"
     inkscape:zoom="5.9"
     inkscape:cx="11"
     inkscape:cy="20"
     inkscape:window-x="0"
     inkscape:window-y="27"
     inkscape:window-maximized="0"
     inkscape:current-layer="svg4" />
  <path
     style="color:#000000;font-style:normal;font-variant:normal;font-weight:normal;font-stretch:normal;font-size:medium;line-height:normal;font-family:sans-serif;font-variant-ligatures:normal;font-variant-position:normal;font-variant-caps:normal;font-variant-numeric:normal;font-variant-alternates:normal;font-feature-settings:normal;text-indent:0;text-align:start;text-decoration:none;text-decoration-line:none;text-decoration-style:solid;text-decoration-color:#000000;letter-spacing:normal;word-spacing:normal;text-transform:none;writing-mode:lr-tb;direction:ltr;text-orientation:mixed;dominant-baseline:auto;baseline-shift:baseline;text-anchor:start;white-space:normal;shape-padding:0;clip-rule:nonzero;display:inline;overflow:visible;visibility:visible;opacity:1;isolation:auto;mix-blend-mode:normal;color-interpolation:sRGB;color-interpolation-filters:linearRGB;solid-color:#000000;solid-opacity:1;vector-effect:none;fill:#013272;fill-opacity:1;fill-rule:nonzero;stroke:none;stroke-width:1;stroke-linecap:round;stroke-linejoin:round;stroke-miterlimit:4;stroke-dasharray:none;stroke-dashoffset:0;stroke-opacity:1;color-rendering:auto;image-rendering:auto;shape-rendering:auto;text-rendering:auto;enable-background:accumulate"
     d="M 14.482422,4.9824219 3.265625,15.5 h 8.125 z m 1.820312,-1.7050781 -1.298828,1.2167968 a 0.50005,0.50005 0 0 1 0.494141,0.4375 l 0.02148,-0.072266 a 0.50005,0.50005 0 0 1 0.0332,-0.082031 z m 1.673828,-2.78320318 a 0.50005,0.50005 0 0 1 0.0293,0 0.50005,0.50005 0 0 1 0.02148,0 0.50005,0.50005 0 0 1 0.0059,0 0.50005,0.50005 0 0 1 0.04492,0.005859 0.50005,0.50005 0 0 1 0.0059,0 0.50005,0.50005 0 0 1 0.04297,0.009766 0.50005,0.50005 0 0 1 0.02734,0.007813 0.50005,0.50005 0 0 1 0.002,0 0.50005,0.50005 0 0 1 0.01758,0.005859 0.50005,0.50005 0 0 1 0.0059,0.001953 0.50005,0.50005 0 0 1 0.02148,0.009766 0.50005,0.50005 0 0 1 0.0059,0.001953 0.50005,0.50005 0 0 1 0.01367,0.005859 0.50005,0.50005 0 0 1 0.002,0.001953 0.50005,0.50005 0 0 1 0.002,0 0.50005,0.50005 0 0 1 0.0098,0.005859 0.50005,0.50005 0 0 1 0.0098,0.003906 0.50005,0.50005 0 0 1 0.002,0.001953 0.50005,0.50005 0 0 1 0.002,0.001953 0.50005,0.50005 0 0 1 0.0039,0.001953 0.50005,0.50005 0 0 1 0.01172,0.005859 0.50005,0.50005 0 0 1 0.0059,0.003906 0.50005,0.50005 0 0 1 0.01953,0.0136719 0.50005,0.50005 0 0 1 0.0078,0.005859 0.50005,0.50005 0 0 1 0.0078,0.005859 0.50005,0.50005 0 0 1 0.0059,0.003906 0.50005,0.50005 0 0 1 0.0039,0.003906 0.50005,0.50005 0 0 1 0.0039,0.003906 0.50005,0.50005 0 0 1 0.0098,0.005859 0.50005,0.50005 0 0 1 0.0078,0.007813 0.50005,0.50005 0 0 1 0.0078,0.005859 0.50005,0.50005 0 0 1 0.0039,0.005859 0.50005,0.50005 0 0 1 0.01758,0.015625 0.50005,0.50005 0 0 1 0.01367,0.015625 0.50005,0.50005 0 0 1 0.0039,0.003906 0.50005,0.50005 0 0 1 0.02734,0.0351563 0.50005,0.50005 0 0 1 0.002,0.003906 0.50005,0.50005 0 0 1 0.01367,0.0195313 0.50005,0.50005 0 0 1 0.01172,0.0175781 0.50005,0.50005 0 0 1 0.002,0.005859 0.50005,0.50005 0 0 1 0.0039,0.005859 0.50005,0.50005 0 0 1 0.05664,0.17773437 0.50005,0.50005 0 0 1 0.0039,0.0488281 0.50005,0.50005 0 0 1 -0.0078,0.0996093 0.50005,0.50005 0 0 1 -0.03125,0.1074219 L 14.376953,15.5 H 18 a 0.50005,0.50005 0 1 1 0,1 h -3.908203 l -1.587891,5.554688 a 0.50005,0.50005 0 0 1 -0.169922,0.322265 0.50005,0.50005 0 0 1 -0.0332,0.02539 0.50005,0.50005 0 0 1 -0.0059,0.0059 0.50005,0.50005 0 0 1 -0.01172,0.0078 A 0.50005,0.50005 0 0 1 11.916016,22.5 h -0.841797 a 0.50005,0.50005 0 0 1 -0.16211,0 H 10 A 0.50005,0.50005 0 0 1 9.5195312,21.859375 L 11.095703,16.5 H 2 A 0.50005,0.50005 0 0 1 1.6582031,15.634766 L 17.623047,0.66796875 a 0.50005,0.50005 0 0 1 0.0039,-0.003906 0.50005,0.50005 0 0 1 0.0039,-0.005859 0.50005,0.50005 0 0 1 0.03125,-0.0292969 0.50005,0.50005 0 0 1 0.0293,-0.0253906 0.50005,0.50005 0 0 1 0.01367,-0.0117187 0.50005,0.50005 0 0 1 0.03516,-0.0234375 0.50005,0.50005 0 0 1 0.03516,-0.0195313 0.50005,0.50005 0 0 1 0.01563,-0.007813 0.50005,0.50005 0 0 1 0.03906,-0.0175781 0.50005,0.50005 0 0 1 0.0059,-0.001953 0.50005,0.50005 0 0 1 0.04297,-0.0117188 0.50005,0.50005 0 0 1 0.0059,-0.001953 0.50005,0.50005 0 0 1 0.02148,-0.003906 0.50005,0.50005 0 0 1 0.0039,0 0.50005,0.50005 0 0 1 0.01758,-0.003906 0.50005,0.50005 0 0 1 0.03516,-0.003906 0.50005,0.50005 0 0 1 0.01367,-0.001953 z"
     id="path2" />
</svg>
