<?xml version="1.0" encoding="UTF-8" standalone="no"?>
<svg
   xmlns:dc="http://purl.org/dc/elements/1.1/"
   xmlns:cc="http://creativecommons.org/ns#"
   xmlns:rdf="http://www.w3.org/1999/02/22-rdf-syntax-ns#"
   xmlns:svg="http://www.w3.org/2000/svg"
   xmlns="http://www.w3.org/2000/svg"
   xmlns:sodipodi="http://sodipodi.sourceforge.net/DTD/sodipodi-0.dtd"
   xmlns:inkscape="http://www.inkscape.org/namespaces/inkscape"
   data-dec="103"
   width="20"
   height="40"
   version="1.1"
   id="svg4"
   sodipodi:docname="103.svg"
   inkscape:version="0.92.4 (unknown)">
  <metadata
     id="metadata10">
    <rdf:RDF>
      <cc:Work
         rdf:about="">
        <dc:format>image/svg+xml</dc:format>
        <dc:type
           rdf:resource="http://purl.org/dc/dcmitype/StillImage" />
      </cc:Work>
    </rdf:RDF>
  </metadata>
  <defs
     id="defs8" />
  <sodipodi:namedview
     pagecolor="#ffffff"
     bordercolor="#666666"
     borderopacity="1"
     objecttolerance="10"
     gridtolerance="10"
     guidetolerance="10"
     inkscape:pageopacity="0"
     inkscape:pageshadow="2"
     inkscape:window-width="640"
     inkscape:window-height="480"
     id="namedview6"
     showgrid="false"
     inkscape:zoom="5.9"
     inkscape:cx="10"
     inkscape:cy="20"
     inkscape:window-x="0"
     inkscape:window-y="27"
     inkscape:window-maximized="0"
     inkscape:current-layer="svg4" />
  <path
     style="color:#000000;font-style:normal;font-variant:normal;font-weight:normal;font-stretch:normal;font-size:medium;line-height:normal;font-family:sans-serif;font-variant-ligatures:normal;font-variant-position:normal;font-variant-caps:normal;font-variant-numeric:normal;font-variant-alternates:normal;font-feature-settings:normal;text-indent:0;text-align:start;text-decoration:none;text-decoration-line:none;text-decoration-style:solid;text-decoration-color:#000000;letter-spacing:normal;word-spacing:normal;text-transform:none;writing-mode:lr-tb;direction:ltr;text-orientation:mixed;dominant-baseline:auto;baseline-shift:baseline;text-anchor:start;white-space:normal;shape-padding:0;clip-rule:nonzero;display:inline;overflow:visible;visibility:visible;opacity:1;isolation:auto;mix-blend-mode:normal;color-interpolation:sRGB;color-interpolation-filters:linearRGB;solid-color:#000000;solid-opacity:1;vector-effect:none;fill:#000000;fill-opacity:1;fill-rule:nonzero;stroke:none;stroke-width:2;stroke-linecap:round;stroke-linejoin:round;stroke-miterlimit:4;stroke-dasharray:none;stroke-dashoffset:0;stroke-opacity:1;color-rendering:auto;image-rendering:auto;shape-rendering:auto;text-rendering:auto;enable-background:accumulate"
     d="M 8.1621094,11 7.0410156,11.373047 6.875,11.541016 6,14.162109 v 1.675782 L 6.875,18.458984 7.0410156,18.626953 8.1621094,19 H 12.585938 L 13.125,18.458984 14,15.835938 V 14.164062 L 13.125,11.541016 12.585938,11 Z M 15.984375,6.9863281 A 1.0001,1.0001 0 0 1 16.167969,7 h 0.673828 a 1.0001,1.0001 0 0 1 0.849609,0.2636719 1.0001,1.0001 0 0 1 0.01367,0.013672 1.0001,1.0001 0 0 1 0.0059,0.00586 A 1.0001,1.0001 0 0 1 18,8.1679688 V 23 a 1.0001,1.0001 0 0 1 -0.05078,0.316406 l -1,3 a 1.0001,1.0001 0 0 1 -0.242188,0.390625 l -2,2 a 1.0001,1.0001 0 0 1 -0.259765,0.1875 l -2,1 A 1.0001,1.0001 0 0 1 12,30 H 11 9 8 A 1.0001,1.0001 0 0 1 7.5527344,29.894531 l -2,-1 a 1.0001,1.0001 0 0 1 -0.2597656,-0.1875 L 3.3828125,26.796875 a 1.0001,1.0001 0 0 1 -0.00586,-0.0039 A 1.0001,1.0001 0 0 1 3.0253906,25.722656 1.0001,1.0001 0 0 1 3.0761719,25.585938 1.0001,1.0001 0 0 1 4.1269531,25 h 0.7265625 a 1.0001,1.0001 0 0 1 0.2734375,0 H 6 7 a 1.0001,1.0001 0 0 1 0.7070312,0.292969 l 0.8847657,0.884765 1.0839843,0.542969 1.9414068,-0.646484 1.564453,-0.783203 L 14,22.837891 v -0.720703 l -1.552734,0.777343 A 1.0001,1.0001 0 0 1 12,23 H 11 9 8 A 1.0001,1.0001 0 0 1 7.5527344,22.894531 l -2,-1 a 1.0001,1.0001 0 0 1 -0.2597656,-0.1875 l -2,-2 A 1.0001,1.0001 0 0 1 3.0507812,19.316406 l -1,-3 A 1.0001,1.0001 0 0 1 2,16 v -2 a 1.0001,1.0001 0 0 1 0.050781,-0.316406 l 1,-3 a 1.0001,1.0001 0 0 1 0.2421876,-0.390625 l 2,-2.0000002 a 1.0001,1.0001 0 0 1 0.2597656,-0.1875 l 2,-1 A 1.0001,1.0001 0 0 1 8,7 h 1 2 1 a 1.0001,1.0001 0 0 1 0.447266,0.1054688 l 1.560546,0.7792968 A 1.0001,1.0001 0 0 1 15,7 h 0.841797 a 1.0001,1.0001 0 0 1 0.142578,-0.013672 z"
     id="path2" />
</svg>
