<?xml version="1.0" encoding="UTF-8" standalone="no"?>
<svg
   xmlns:dc="http://purl.org/dc/elements/1.1/"
   xmlns:cc="http://creativecommons.org/ns#"
   xmlns:rdf="http://www.w3.org/1999/02/22-rdf-syntax-ns#"
   xmlns:svg="http://www.w3.org/2000/svg"
   xmlns="http://www.w3.org/2000/svg"
   xmlns:sodipodi="http://sodipodi.sourceforge.net/DTD/sodipodi-0.dtd"
   xmlns:inkscape="http://www.inkscape.org/namespaces/inkscape"
   data-dec="50"
   width="20"
   height="40"
   version="1.1"
   id="svg4"
   sodipodi:docname="50.svg"
   inkscape:version="0.92.4 (unknown)">
  <metadata
     id="metadata10">
    <rdf:RDF>
      <cc:Work
         rdf:about="">
        <dc:format>image/svg+xml</dc:format>
        <dc:type
           rdf:resource="http://purl.org/dc/dcmitype/StillImage" />
      </cc:Work>
    </rdf:RDF>
  </metadata>
  <defs
     id="defs8" />
  <sodipodi:namedview
     pagecolor="#ffffff"
     bordercolor="#666666"
     borderopacity="1"
     objecttolerance="10"
     gridtolerance="10"
     guidetolerance="10"
     inkscape:pageopacity="0"
     inkscape:pageshadow="2"
     inkscape:window-width="640"
     inkscape:window-height="480"
     id="namedview6"
     showgrid="false"
     inkscape:zoom="5.9"
     inkscape:cx="10"
     inkscape:cy="20"
     inkscape:window-x="0"
     inkscape:window-y="27"
     inkscape:window-maximized="0"
     inkscape:current-layer="svg4" />
  <path
     style="color:#000000;font-style:normal;font-variant:normal;font-weight:normal;font-stretch:normal;font-size:medium;line-height:normal;font-family:sans-serif;font-variant-ligatures:normal;font-variant-position:normal;font-variant-caps:normal;font-variant-numeric:normal;font-variant-alternates:normal;font-feature-settings:normal;text-indent:0;text-align:start;text-decoration:none;text-decoration-line:none;text-decoration-style:solid;text-decoration-color:#000000;letter-spacing:normal;word-spacing:normal;text-transform:none;writing-mode:lr-tb;direction:ltr;text-orientation:mixed;dominant-baseline:auto;baseline-shift:baseline;text-anchor:start;white-space:normal;shape-padding:0;clip-rule:nonzero;display:inline;overflow:visible;visibility:visible;opacity:1;isolation:auto;mix-blend-mode:normal;color-interpolation:sRGB;color-interpolation-filters:linearRGB;solid-color:#000000;solid-opacity:1;vector-effect:none;fill:#013272;fill-opacity:1;fill-rule:nonzero;stroke:none;stroke-width:2;stroke-linecap:round;stroke-linejoin:round;stroke-miterlimit:4;stroke-dasharray:none;stroke-dashoffset:0;stroke-opacity:1;color-rendering:auto;image-rendering:auto;shape-rendering:auto;text-rendering:auto;enable-background:accumulate"
     d="m 8,0 h 4 a 1.0001,1.0001 0 0 1 0.316406,0.05078125 l 3,0.99999995 a 1.0001,1.0001 0 0 1 0.390625,0.2421876 l 1,1 a 1.0001,1.0001 0 0 1 0.1875,0.2597656 l 1,2 A 1.0001,1.0001 0 0 1 18,5 v 2 a 1.0001,1.0001 0 0 1 -0.105469,0.4472656 l -1,2 a 1.0001,1.0001 0 0 1 -0.339843,0.3847656 l -3,1.9999998 a 1.0001,1.0001 0 0 1 -0.183594,0.0957 L 8.4101562,13.912109 6.5917969,14.822266 4.875,16.541016 4.3886719,18 h 1.4941406 a 1.0001,1.0001 0 0 1 0.3789063,0.03125 1.0001,1.0001 0 0 1 0.00586,0.002 1.0001,1.0001 0 0 1 0.068359,0.02148 1.0001,1.0001 0 0 1 0.2871094,0.152343 l 0.00391,0.0039 L 11.277344,21 h 3.308594 L 15.177734,20.408203 16,18.763672 V 17 a 1.0001,1.0001 0 1 1 2,0 v 2 a 1.0001,1.0001 0 0 1 -0.105469,0.447266 l -1,2 a 1.0001,1.0001 0 0 1 -0.1875,0.259765 l -1,1 A 1.0001,1.0001 0 0 1 15,23 H 11 A 1.0001,1.0001 0 0 1 10.486328,22.857422 L 5.7246094,20 H 4.4140625 L 4,20.414062 V 22 A 1.0001,1.0001 0 1 1 2,22 V 20.146484 A 1.0001,1.0001 0 0 1 2,19.873047 V 19 a 1.0001,1.0001 0 0 1 0.050781,-0.316406 l 1,-3 a 1.0001,1.0001 0 0 1 0.2421876,-0.390625 l 2,-2 a 1.0001,1.0001 0 0 1 0.2597656,-0.1875 l 2,-1 a 1.0001,1.0001 0 0 1 0.076172,-0.0332 L 12.53125,10.109375 15.224609,8.3144531 16,6.7636719 V 5.2363281 L 15.177734,3.5917969 14.458984,2.875 11.837891,2 H 8.1621094 L 5.5410156,2.875 4.8222656,3.5917969 4.1152344,5.0078125 A 1.0001,1.0001 0 0 1 5,6 V 7 A 1.0001,1.0001 0 0 1 3.2929688,7.7070312 L 2.3828125,6.796875 A 1.0001,1.0001 0 0 1 2.3769531,6.7929688 1.0001,1.0001 0 0 1 2,5.8320312 V 5 A 1.0001,1.0001 0 0 1 2.1054688,4.5527344 l 1,-2 a 1.0001,1.0001 0 0 1 0.1875,-0.2597656 l 1,-1 a 1.0001,1.0001 0 0 1 0.390625,-0.2421876 l 3,-0.99999995 A 1.0001,1.0001 0 0 1 8,0 Z"
     id="path2" />
</svg>
