<?xml version="1.0" encoding="UTF-8" standalone="no"?>
<svg
   xmlns:dc="http://purl.org/dc/elements/1.1/"
   xmlns:cc="http://creativecommons.org/ns#"
   xmlns:rdf="http://www.w3.org/1999/02/22-rdf-syntax-ns#"
   xmlns:svg="http://www.w3.org/2000/svg"
   xmlns="http://www.w3.org/2000/svg"
   xmlns:sodipodi="http://sodipodi.sourceforge.net/DTD/sodipodi-0.dtd"
   xmlns:inkscape="http://www.inkscape.org/namespaces/inkscape"
   data-dec="35"
   width="22"
   height="40"
   version="1.1"
   id="svg4"
   sodipodi:docname="35.svg"
   inkscape:version="0.92.4 (unknown)">
  <metadata
     id="metadata10">
    <rdf:RDF>
      <cc:Work
         rdf:about="">
        <dc:format>image/svg+xml</dc:format>
        <dc:type
           rdf:resource="http://purl.org/dc/dcmitype/StillImage" />
      </cc:Work>
    </rdf:RDF>
  </metadata>
  <defs
     id="defs8" />
  <sodipodi:namedview
     pagecolor="#ffffff"
     bordercolor="#666666"
     borderopacity="1"
     objecttolerance="10"
     gridtolerance="10"
     guidetolerance="10"
     inkscape:pageopacity="0"
     inkscape:pageshadow="2"
     inkscape:window-width="640"
     inkscape:window-height="480"
     id="namedview6"
     showgrid="false"
     inkscape:zoom="5.9"
     inkscape:cx="11"
     inkscape:cy="20"
     inkscape:window-x="0"
     inkscape:window-y="27"
     inkscape:window-maximized="0"
     inkscape:current-layer="svg4" />
  <path
     style="color:#000000;font-style:normal;font-variant:normal;font-weight:normal;font-stretch:normal;font-size:medium;line-height:normal;font-family:sans-serif;font-variant-ligatures:normal;font-variant-position:normal;font-variant-caps:normal;font-variant-numeric:normal;font-variant-alternates:normal;font-feature-settings:normal;text-indent:0;text-align:start;text-decoration:none;text-decoration-line:none;text-decoration-style:solid;text-decoration-color:#000000;letter-spacing:normal;word-spacing:normal;text-transform:none;writing-mode:lr-tb;direction:ltr;text-orientation:mixed;dominant-baseline:auto;baseline-shift:baseline;text-anchor:start;white-space:normal;shape-padding:0;clip-rule:nonzero;display:inline;overflow:visible;visibility:visible;opacity:1;isolation:auto;mix-blend-mode:normal;color-interpolation:sRGB;color-interpolation-filters:linearRGB;solid-color:#000000;solid-opacity:1;vector-effect:none;fill:#013272;fill-opacity:1;fill-rule:nonzero;stroke:none;stroke-width:2;stroke-linecap:round;stroke-linejoin:round;stroke-miterlimit:4;stroke-dasharray:none;stroke-dashoffset:0;stroke-opacity:1;color-rendering:auto;image-rendering:auto;shape-rendering:auto;text-rendering:auto;enable-background:accumulate"
     d="m 8.9609375,11 -0.875,4 h 3.9531245 l 0.875,-4 z M 17.027344,-4.0332031 a 1.0001,1.0001 0 0 1 0.949218,1.2460937 L 15.398438,9 H 18 a 1.0001,1.0001 0 1 1 0,2 h -3.039062 l -0.875,4 H 17 a 1.0001,1.0001 0 1 1 0,2 H 13.648438 L 10.976562,29.212891 A 1.0001,1.0001 0 1 1 9.0234375,28.787109 L 11.601562,17 H 7.6484375 L 4.9765625,29.212891 A 1.0001,1.0001 0 1 1 3.0234375,28.787109 L 5.6015625,17 H 3 a 1.0001,1.0001 0 1 1 0,-2 h 3.0390625 l 0.875,-4 H 4 A 1.0001,1.0001 0 1 1 4,9 H 7.3515625 L 10.023438,-3.2128906 a 1.0001,1.0001 0 0 1 0.980468,-0.8007813 1.0001,1.0001 0 0 1 0.972656,1.2265625 L 9.3984375,9 h 3.9531245 l 2.671876,-12.2128906 a 1.0001,1.0001 0 0 1 1.003906,-0.8203125 z"
     id="path2" />
</svg>
