<?xml version="1.0" encoding="UTF-8" standalone="no"?>
<svg
   xmlns:dc="http://purl.org/dc/elements/1.1/"
   xmlns:cc="http://creativecommons.org/ns#"
   xmlns:rdf="http://www.w3.org/1999/02/22-rdf-syntax-ns#"
   xmlns:svg="http://www.w3.org/2000/svg"
   xmlns="http://www.w3.org/2000/svg"
   xmlns:sodipodi="http://sodipodi.sourceforge.net/DTD/sodipodi-0.dtd"
   xmlns:inkscape="http://www.inkscape.org/namespaces/inkscape"
   data-dec="49"
   width="22"
   height="40"
   version="1.1"
   id="svg4"
   sodipodi:docname="49.svg"
   inkscape:version="0.92.4 (unknown)">
  <metadata
     id="metadata10">
    <rdf:RDF>
      <cc:Work
         rdf:about="">
        <dc:format>image/svg+xml</dc:format>
        <dc:type
           rdf:resource="http://purl.org/dc/dcmitype/StillImage" />
      </cc:Work>
    </rdf:RDF>
  </metadata>
  <defs
     id="defs8" />
  <sodipodi:namedview
     pagecolor="#ffffff"
     bordercolor="#666666"
     borderopacity="1"
     objecttolerance="10"
     gridtolerance="10"
     guidetolerance="10"
     inkscape:pageopacity="0"
     inkscape:pageshadow="2"
     inkscape:window-width="640"
     inkscape:window-height="480"
     id="namedview6"
     showgrid="false"
     inkscape:zoom="5.9"
     inkscape:cx="11"
     inkscape:cy="20"
     inkscape:window-x="0"
     inkscape:window-y="27"
     inkscape:window-maximized="0"
     inkscape:current-layer="svg4" />
  <path
     style="color:#000000;font-style:normal;font-variant:normal;font-weight:normal;font-stretch:normal;font-size:medium;line-height:normal;font-family:sans-serif;font-variant-ligatures:normal;font-variant-position:normal;font-variant-caps:normal;font-variant-numeric:normal;font-variant-alternates:normal;font-feature-settings:normal;text-indent:0;text-align:start;text-decoration:none;text-decoration-line:none;text-decoration-style:solid;text-decoration-color:#000000;letter-spacing:normal;word-spacing:normal;text-transform:none;writing-mode:lr-tb;direction:ltr;text-orientation:mixed;dominant-baseline:auto;baseline-shift:baseline;text-anchor:start;white-space:normal;shape-padding:0;clip-rule:nonzero;display:inline;overflow:visible;visibility:visible;opacity:1;isolation:auto;mix-blend-mode:normal;color-interpolation:sRGB;color-interpolation-filters:linearRGB;solid-color:#000000;solid-opacity:1;vector-effect:none;fill:#013272;fill-opacity:1;fill-rule:nonzero;stroke:none;stroke-width:2.5;stroke-linecap:round;stroke-linejoin:round;stroke-miterlimit:4;stroke-dasharray:none;stroke-dashoffset:0;stroke-opacity:1;color-rendering:auto;image-rendering:auto;shape-rendering:auto;text-rendering:auto;enable-background:accumulate"
     d="m 13.958984,-0.265625 a 1.250125,1.250125 0 0 1 0.50586,0.0878906 1.250125,1.250125 0 0 1 0.09766,0.0429688 1.250125,1.250125 0 0 1 0.01563,0.007813 1.250125,1.250125 0 0 1 0.09375,0.05273437 1.250125,1.250125 0 0 1 0.01563,0.0097656 1.250125,1.250125 0 0 1 0.08789,0.06249999 1.250125,1.250125 0 0 1 0.388671,1.47656253 v 0.00195 L 9.2011719,22.34375 A 1.250125,1.250125 0 0 1 7.4960938,23.162109 1.250125,1.250125 0 0 1 5.8007812,21.646484 L 10.162109,6.8144531 9.5585938,7.1171875 A 1.250125,1.250125 0 0 1 9.3945312,7.1855469 L 6.4804688,8.15625 a 1.250125,1.250125 0 0 1 -0.019531,0.00781 1.250125,1.250125 0 0 1 -0.2714844,0.074219 1.250125,1.250125 0 0 1 -0.1132812,0.013672 1.250125,1.250125 0 0 1 -0.00977,0.00195 1.250125,1.250125 0 0 1 -0.013672,0 1.250125,1.250125 0 0 1 -0.1035156,0.00195 1.250125,1.250125 0 0 1 -0.019531,-0.00195 A 1.250125,1.250125 0 0 1 5.8164062,8.2441406 1.250125,1.250125 0 0 1 5.6933594,8.2207031 1.250125,1.250125 0 0 1 5.5742188,8.1875 1.250125,1.250125 0 0 1 5.4589844,8.140625 a 1.250125,1.250125 0 0 1 -0.00195,0 1.250125,1.250125 0 0 1 -0.00195,-0.00195 1.250125,1.250125 0 0 1 -0.1054687,-0.056641 1.250125,1.250125 0 0 1 -0.00195,0 1.250125,1.250125 0 0 1 -0.00391,-0.00195 1.250125,1.250125 0 0 1 -0.082031,-0.054687 1.250125,1.250125 0 0 1 -0.035156,-0.023437 1.250125,1.250125 0 0 1 -0.080078,-0.068359 1.250125,1.250125 0 0 1 -0.082031,-0.080078 1.250125,1.250125 0 0 1 -0.021484,-0.023437 1.250125,1.250125 0 0 1 -0.060547,-0.076172 1.250125,1.250125 0 0 1 -0.00977,-0.013672 1.250125,1.250125 0 0 1 -0.050781,-0.074219 1.250125,1.250125 0 0 1 -0.037109,-0.064453 1.250125,1.250125 0 0 1 -0.015625,-0.029297 1.250125,1.250125 0 0 1 -0.035156,-0.078125 1.250125,1.250125 0 0 1 -0.019531,-0.044922 1.250125,1.250125 0 0 1 -0.03125,-0.097656 1.250125,1.250125 0 0 1 -0.025391,-0.109375 1.250125,1.250125 0 0 1 -0.00586,-0.021484 1.250125,1.250125 0 0 1 -0.013672,-0.1074219 1.250125,1.250125 0 0 1 0,-0.015625 1.250125,1.250125 0 0 1 -0.00391,-0.09375 1.250125,1.250125 0 0 1 0.00195,-0.041016 1.250125,1.250125 0 0 1 0.00781,-0.1054687 1.250125,1.250125 0 0 1 0.017578,-0.1132813 1.250125,1.250125 0 0 1 0.00391,-0.015625 1.250125,1.250125 0 0 1 0.078125,-0.2324218 1.250125,1.250125 0 0 1 0.056641,-0.1113282 1.250125,1.250125 0 0 1 0.060547,-0.097656 1.250125,1.250125 0 0 1 0.011719,-0.015625 1.250125,1.250125 0 0 1 0.072266,-0.089844 1.250125,1.250125 0 0 1 0.2871093,-0.2402344 1.250125,1.250125 0 0 1 0.1699219,-0.089844 L 7.3710938,4.9160156 10.203125,3.0292969 13.041016,0.18945312 A 1.250125,1.250125 0 0 1 13.958984,-0.265625 Z"
     id="path2" />
</svg>
