<?xml version="1.0" encoding="UTF-8" standalone="no"?>
<svg
   xmlns:dc="http://purl.org/dc/elements/1.1/"
   xmlns:cc="http://creativecommons.org/ns#"
   xmlns:rdf="http://www.w3.org/1999/02/22-rdf-syntax-ns#"
   xmlns:svg="http://www.w3.org/2000/svg"
   xmlns="http://www.w3.org/2000/svg"
   xmlns:sodipodi="http://sodipodi.sourceforge.net/DTD/sodipodi-0.dtd"
   xmlns:inkscape="http://www.inkscape.org/namespaces/inkscape"
   data-dec="81"
   width="22"
   height="40"
   version="1.1"
   id="svg4"
   sodipodi:docname="81.svg"
   inkscape:version="0.92.4 (unknown)">
  <metadata
     id="metadata10">
    <rdf:RDF>
      <cc:Work
         rdf:about="">
        <dc:format>image/svg+xml</dc:format>
        <dc:type
           rdf:resource="http://purl.org/dc/dcmitype/StillImage" />
      </cc:Work>
    </rdf:RDF>
  </metadata>
  <defs
     id="defs8" />
  <sodipodi:namedview
     pagecolor="#ffffff"
     bordercolor="#666666"
     borderopacity="1"
     objecttolerance="10"
     gridtolerance="10"
     guidetolerance="10"
     inkscape:pageopacity="0"
     inkscape:pageshadow="2"
     inkscape:window-width="640"
     inkscape:window-height="480"
     id="namedview6"
     showgrid="false"
     inkscape:zoom="5.9"
     inkscape:cx="11"
     inkscape:cy="20"
     inkscape:window-x="0"
     inkscape:window-y="27"
     inkscape:window-maximized="0"
     inkscape:current-layer="svg4" />
  <path
     style="color:#000000;font-style:normal;font-variant:normal;font-weight:normal;font-stretch:normal;font-size:medium;line-height:normal;font-family:sans-serif;font-variant-ligatures:normal;font-variant-position:normal;font-variant-caps:normal;font-variant-numeric:normal;font-variant-alternates:normal;font-feature-settings:normal;text-indent:0;text-align:start;text-decoration:none;text-decoration-line:none;text-decoration-style:solid;text-decoration-color:#000000;letter-spacing:normal;word-spacing:normal;text-transform:none;writing-mode:lr-tb;direction:ltr;text-orientation:mixed;dominant-baseline:auto;baseline-shift:baseline;text-anchor:start;white-space:normal;shape-padding:0;clip-rule:nonzero;display:inline;overflow:visible;visibility:visible;opacity:1;isolation:auto;mix-blend-mode:normal;color-interpolation:sRGB;color-interpolation-filters:linearRGB;solid-color:#000000;solid-opacity:1;vector-effect:none;fill:#013272;fill-opacity:1;fill-rule:nonzero;stroke:none;stroke-width:0.30000001;stroke-linecap:round;stroke-linejoin:round;stroke-miterlimit:4;stroke-dasharray:none;stroke-dashoffset:0;stroke-opacity:1;color-rendering:auto;image-rendering:auto;shape-rendering:auto;text-rendering:auto;enable-background:accumulate"
     d="m 14.986328,22.847656 a 0.15001501,0.15001501 0 0 1 0.148438,0.08594 l 0.988281,1.978515 0.939453,0.9375 H 18 a 0.150391,0.150391 0 0 1 0,0.300782 h -1 a 0.15001501,0.15001501 0 0 1 -0.105469,-0.04492 l -1,-1 a 0.15001501,0.15001501 0 0 1 -0.0293,-0.03906 l -1,-2 a 0.15001501,0.15001501 0 0 1 0.121094,-0.21875 z m -0.25,-1.601562 -0.199219,0.06641 0.607422,3.640625 0.947266,1.896484 h 1.816406 l 0.941406,-1.884765 v -0.603516 l -0.74414,0.744141 A 0.15001501,0.15001501 0 0 1 18,25.150391 h -1 a 0.15001501,0.15001501 0 0 1 -0.105469,-0.04492 l -1,-1 a 0.15001501,0.15001501 0 0 1 -0.0332,-0.04883 z M 14.181641,21 14.125,21.083984 a 0.15001501,0.15001501 0 0 1 -0.05859,0.05078 l -0.111328,0.05664 0.244141,-0.08203 z m 0.285156,-0.429688 -0.04102,0.06445 0.0625,0.378906 0.136719,-0.04687 z m -4.431641,-4.419921 -1.9238279,0.960937 -0.9765625,1.955078 a 0.15001501,0.15001501 0 0 1 -0.1933594,0.07422 l 1.1621094,1.742187 1.9316404,0.966797 h 1.929688 l 1.93164,-0.966797 0.212891,-0.318359 -0.253906,-1.517578 -0.966797,-1.935547 -1.923828,-0.960937 z M 15.986328,3.8476562 a 0.15001501,0.15001501 0 0 1 0.148438,0.085938 l 1,2 a 0.15001501,0.15001501 0 0 1 0.0078,0.019531 l 1,3 A 0.15001501,0.15001501 0 0 1 18.150391,9 v 5 a 0.15001501,0.15001501 0 0 1 -0.0078,0.04687 l -1,3 a 0.15001501,0.15001501 0 0 1 -0.0078,0.01953 l -1,2 a 0.15023858,0.15023858 0 0 1 -0.269532,-0.132812 l 0.996094,-1.990235 0.988281,-2.966797 V 9.0234375 L 16.861328,6.0566406 15.865234,4.0664062 a 0.15001501,0.15001501 0 0 1 0.121094,-0.21875 z m -9.9921874,0 a 0.15001501,0.15001501 0 0 1 0.140625,0.21875 L 5.1386719,6.0566406 4.1503906,9.0234375 v 4.9531245 l 0.9882813,2.966797 0.9960937,1.990235 a 0.15023914,0.15023914 0 0 1 -0.2695312,0.132812 l -1,-2 a 0.15001501,0.15001501 0 0 1 -0.00781,-0.01953 l -1,-3 A 0.15001501,0.15001501 0 0 1 3.8496094,14 V 9 a 0.15001501,0.15001501 0 0 1 0.00781,-0.046875 l 1,-3 a 0.15001501,0.15001501 0 0 1 0.00781,-0.019531 l 1,-2 a 0.15001501,0.15001501 0 0 1 0.1289062,-0.085938 z m 7.9609374,-2.0390624 0.111328,0.056641 a 0.15001501,0.15001501 0 0 1 0.05859,0.050781 l 2,3 a 0.15001501,0.15001501 0 0 1 0.02148,0.046875 l 1,4 A 0.15001501,0.15001501 0 0 1 17.150391,9 v 5 a 0.15001501,0.15001501 0 0 1 -0.0039,0.03711 l -1,4 a 0.15001501,0.15001501 0 0 1 -0.02148,0.04687 l -1.457031,2.185547 0.242187,0.603516 0.0098,-0.0039 1.957031,-1.957032 0.982422,-1.964843 0.990234,-3.964844 V 10.017578 L 17.859375,6.0527344 16.876953,4.0878906 14.919922,2.1308594 Z m -5.9101561,0 L 7.0800781,2.1308594 5.1230469,4.0878906 4.140625,6.0527344 3.1503906,10.017578 v 2.964844 l 0.9902344,3.964844 0.9824219,1.964843 1.9570312,1.957032 0.9648438,0.322265 -0.1113281,-0.05664 A 0.15001501,0.15001501 0 0 1 7.875,21.083984 l -2,-3 a 0.15001501,0.15001501 0 0 1 -0.021484,-0.04687 l -1,-4 A 0.15001501,0.15001501 0 0 1 4.8496094,14 V 9 a 0.15001501,0.15001501 0 0 1 0.00391,-0.037109 l 1,-4 A 0.15001501,0.15001501 0 0 1 5.875,4.9160156 l 2,-3 a 0.15001501,0.15001501 0 0 1 0.058594,-0.050781 z M 10.035156,1.1503906 8.1035156,2.1171875 6.1386719,5.0625 5.1503906,9.0175781 v 4.9648439 l 0.9882813,3.955078 0.7109375,1.066406 a 0.15001501,0.15001501 0 0 1 0.015625,-0.07031 l 1,-2 a 0.15001501,0.15001501 0 0 1 0.068359,-0.06836 l 2,-1 A 0.15001501,0.15001501 0 0 1 10,15.849609 h 1 a 0.15001501,0.15001501 0 0 1 0.06641,0.01563 l 2,1 a 0.15001501,0.15001501 0 0 1 0.06836,0.06836 l 0.998046,1.996094 0.002,0.0039 a 0.15001501,0.15001501 0 0 1 0.0039,0.0098 0.15001501,0.15001501 0 0 1 0.002,0.0039 l 0.002,0.0039 a 0.15001501,0.15001501 0 0 1 0.002,0.0098 l 0.388672,0.96875 1.328125,-1.992188 0.988281,-3.955078 V 9.0175781 L 15.861328,5.0625 13.896484,2.1171875 11.964844,1.1503906 Z M 9.9824219,0.84960938 a 0.15001501,0.15001501 0 0 1 0.00195,0 0.15001501,0.15001501 0 0 1 0.015625,0 0.15001501,0.15001501 0 0 1 0.0078,0 h 0.0078 1.964844 H 12 a 0.15001501,0.15001501 0 0 1 0.0098,0 0.15001501,0.15001501 0 0 1 0.0078,0.001953 0.15001501,0.15001501 0 0 1 0.0078,0 0.15001501,0.15001501 0 0 1 0.0078,0.001953 0.15001501,0.15001501 0 0 1 0.0332,0.0117188 l 2.980469,0.99218752 a 0.15001501,0.15001501 0 0 1 0.05859,0.037109 l 2,2 a 0.15001501,0.15001501 0 0 1 0.0293,0.039063 l 1,2 a 0.15001501,0.15001501 0 0 1 0.01172,0.029297 l 1,4 A 0.15001501,0.15001501 0 0 1 19.150391,10 v 3 a 0.15001501,0.15001501 0 0 1 -0.0039,0.03711 l -1,4 a 0.15001501,0.15001501 0 0 1 -0.01172,0.0293 l -1,2 a 0.15001501,0.15001501 0 0 1 -0.0293,0.03906 l -2,2 a 0.15001501,0.15001501 0 0 1 -0.05859,0.03711 l -0.02539,0.0078 1.105469,2.765625 0.935547,0.933593 h 0.875 l 0.912109,-0.910156 V 23 a 0.150391,0.150391 0 0 1 0.300782,0 v 0.984375 a 0.15001501,0.15001501 0 0 1 0,0.0293 V 25 a 0.15001501,0.15001501 0 0 1 -0.01563,0.06641 l -1,2 A 0.15001501,0.15001501 0 0 1 18,27.150391 h -2 a 0.15001501,0.15001501 0 0 1 -0.134766,-0.08398 l -1,-2 a 0.15001501,0.15001501 0 0 1 -0.01367,-0.04102 l -0.603515,-3.617188 -2.181641,0.726563 a 0.15001501,0.15001501 0 0 1 -0.01563,0.0059 l -0.0039,0.002 A 0.15001501,0.15001501 0 0 1 12,22.150391 h -0.01563 -1.964844 -0.01367 a 0.15001501,0.15001501 0 0 1 -0.00977,0 0.15001501,0.15001501 0 0 1 -0.00586,0 0.15001501,0.15001501 0 0 1 -0.00781,-0.002 0.15001501,0.15001501 0 0 1 -0.00781,0 0.15001501,0.15001501 0 0 1 -0.00781,-0.002 0.15001501,0.15001501 0 0 1 -0.00586,-0.002 0.15001501,0.15001501 0 0 1 -0.00781,-0.002 l -0.00586,-0.002 a 0.15001501,0.15001501 0 0 1 -0.013672,-0.0059 L 6.953125,21.142578 a 0.15001501,0.15001501 0 0 1 -0.058594,-0.03711 l -2,-2 a 0.15001501,0.15001501 0 0 1 -0.029297,-0.03906 l -1,-2 a 0.15001501,0.15001501 0 0 1 -0.011719,-0.0293 l -1,-4 A 0.15001501,0.15001501 0 0 1 2.8496094,13 v -3 a 0.15001501,0.15001501 0 0 1 0.00391,-0.037109 l 1,-4 a 0.15001501,0.15001501 0 0 1 0.011719,-0.029297 l 1,-2 a 0.15001501,0.15001501 0 0 1 0.029297,-0.039063 l 2,-2 A 0.15001501,0.15001501 0 0 1 6.953125,1.8574219 L 9.9277344,0.8671875 a 0.15001501,0.15001501 0 0 1 0.00586,-0.001953 0.15001501,0.15001501 0 0 1 0.00781,-0.003906 0.15001501,0.15001501 0 0 1 0.00781,-0.001953 0.15001501,0.15001501 0 0 1 0.00391,-0.001953 0.15001501,0.15001501 0 0 1 0.00195,-0.001953 0.15001501,0.15001501 0 0 1 0.00195,0 0.15001501,0.15001501 0 0 1 0.00195,0 0.15001501,0.15001501 0 0 1 0.017578,-0.003906 0.15001501,0.15001501 0 0 1 0.00195,0 0.15001501,0.15001501 0 0 1 0.00391,-0.001953 z"
     id="path2" />
</svg>
