<?xml version="1.0" encoding="UTF-8" standalone="no"?>
<svg
   xmlns:dc="http://purl.org/dc/elements/1.1/"
   xmlns:cc="http://creativecommons.org/ns#"
   xmlns:rdf="http://www.w3.org/1999/02/22-rdf-syntax-ns#"
   xmlns:svg="http://www.w3.org/2000/svg"
   xmlns="http://www.w3.org/2000/svg"
   xmlns:sodipodi="http://sodipodi.sourceforge.net/DTD/sodipodi-0.dtd"
   xmlns:inkscape="http://www.inkscape.org/namespaces/inkscape"
   data-dec="100"
   width="22"
   height="40"
   version="1.1"
   id="svg4"
   sodipodi:docname="100.svg"
   inkscape:version="0.92.4 (unknown)">
  <metadata
     id="metadata10">
    <rdf:RDF>
      <cc:Work
         rdf:about="">
        <dc:format>image/svg+xml</dc:format>
        <dc:type
           rdf:resource="http://purl.org/dc/dcmitype/StillImage" />
      </cc:Work>
    </rdf:RDF>
  </metadata>
  <defs
     id="defs8" />
  <sodipodi:namedview
     pagecolor="#ffffff"
     bordercolor="#666666"
     borderopacity="1"
     objecttolerance="10"
     gridtolerance="10"
     guidetolerance="10"
     inkscape:pageopacity="0"
     inkscape:pageshadow="2"
     inkscape:window-width="640"
     inkscape:window-height="480"
     id="namedview6"
     showgrid="false"
     inkscape:zoom="5.9"
     inkscape:cx="11"
     inkscape:cy="20"
     inkscape:window-x="0"
     inkscape:window-y="27"
     inkscape:window-maximized="0"
     inkscape:current-layer="svg4" />
  <path
     style="color:#000000;font-style:normal;font-variant:normal;font-weight:normal;font-stretch:normal;font-size:medium;line-height:normal;font-family:sans-serif;font-variant-ligatures:normal;font-variant-position:normal;font-variant-caps:normal;font-variant-numeric:normal;font-variant-alternates:normal;font-feature-settings:normal;text-indent:0;text-align:start;text-decoration:none;text-decoration-line:none;text-decoration-style:solid;text-decoration-color:#000000;letter-spacing:normal;word-spacing:normal;text-transform:none;writing-mode:lr-tb;direction:ltr;text-orientation:mixed;dominant-baseline:auto;baseline-shift:baseline;text-anchor:start;white-space:normal;shape-padding:0;clip-rule:nonzero;display:inline;overflow:visible;visibility:visible;opacity:1;isolation:auto;mix-blend-mode:normal;color-interpolation:sRGB;color-interpolation-filters:linearRGB;solid-color:#000000;solid-opacity:1;vector-effect:none;fill:#013272;fill-opacity:1;fill-rule:nonzero;stroke:none;stroke-width:0.30000001;stroke-linecap:round;stroke-linejoin:round;stroke-miterlimit:4;stroke-dasharray:none;stroke-dashoffset:0;stroke-opacity:1;color-rendering:auto;image-rendering:auto;shape-rendering:auto;text-rendering:auto;enable-background:accumulate"
     d="m 5.9941406,9.8476562 a 0.15001501,0.15001501 0 0 1 0.140625,0.2187498 l -0.9960937,1.990235 -0.9882813,2.966797 v 2.941406 l 0.984375,1.96875 a 0.15023822,0.15023822 0 0 1 -0.2695312,0.132812 l -1,-2 A 0.15001501,0.15001501 0 0 1 3.8496094,18 v -3 a 0.15001501,0.15001501 0 0 1 0.00781,-0.04687 l 1,-3 a 0.15001501,0.15001501 0 0 1 0.00781,-0.01953 l 1,-2.0000002 A 0.15001501,0.15001501 0 0 1 5.9941406,9.8476562 Z M 8.4453125,8.34375 6.0957031,9.1269531 4.1367188,12.066406 3.1503906,15.023438 v 1.953124 l 0.9804688,2.94336 0.9570312,0.957031 1.1542969,0.576172 -0.3476563,-0.347656 a 0.15001501,0.15001501 0 0 1 -0.037109,-0.05859 l -1,-3 A 0.15001501,0.15001501 0 0 1 4.8496094,18 v -3 a 0.15001501,0.15001501 0 0 1 0.00781,-0.04687 l 1,-3 a 0.15001501,0.15001501 0 0 1 0.00781,-0.01953 l 1,-2.0000002 a 0.15001501,0.15001501 0 0 1 0.029297,-0.039063 z m 0.6152344,-0.1933594 -1.9375,1.9375004 -0.984375,1.96875 -0.9882813,2.966797 v 2.953124 l 0.9804688,2.94336 0.9296875,0.929687 h 1.9042969 l 1.9472652,-0.972656 0.964844,-0.964844 0.984375,-1.96875 0.988281,-2.966797 V 12.023438 L 12.876953,9.1054688 10.964844,8.1503906 Z m 8.8750001,-6.3476562 -0.128906,0.4746094 0.328125,0.65625 A 0.15023867,0.15023867 0 0 1 17.865234,3.0664062 L 17.6875,2.7128906 l -2.542969,9.3242184 -0.99414,3.980469 v 2.947266 l 0.699218,1.40039 v -1.357422 a 0.15001501,0.15001501 0 0 1 0,-0.01367 V 16 a 0.15001501,0.15001501 0 0 1 0.0039,-0.03711 l 1,-4 a 0.15001501,0.15001501 0 0 1 0.002,-0.002 l 2.71289,-9.9472661 z M 17.496094,1.65625 17.605469,1.875 17.652344,1.7089844 Z m 1.617187,-0.5058594 -0.18164,0.6679688 0.115234,0.039063 a 0.15008591,0.15008591 0 1 1 -0.09375,0.2851562 l -0.09961,-0.033203 -2.708985,9.927734 -0.99414,3.980469 v 1.757813 l 0.703125,-2.8125 a 0.15001501,0.15001501 0 0 1 0.002,-0.0039 L 19.800781,1.1503906 Z m -1,0 -0.09766,0.3632813 0.630859,0.2109375 0.158204,-0.5742188 z m -0.871093,0 0.06445,0.1269532 0.423828,0.140625 0.07422,-0.2675782 z m -0.25586,-0.30273435 a 0.15001501,0.15001501 0 0 1 0.03125,0.001953 h 0.960938 a 0.15001501,0.15001501 0 0 1 0.04492,0 h 0.955078 a 0.15001501,0.15001501 0 0 1 0.04492,0 H 20 a 0.15001501,0.15001501 0 0 1 0.144531,0.19140622 l -4,13.9980464 -0.99414,3.982422 v 1.917969 l 0.912109,0.910156 h 1.875 l 1.939453,-1.9375 0.988281,-1.978515 a 0.15023858,0.15023858 0 0 1 0.269532,0.132812 l -1,2 a 0.15001501,0.15001501 0 0 1 -0.0293,0.03906 l -2,2 A 0.15001501,0.15001501 0 0 1 18,22.150391 h -2 a 0.15001501,0.15001501 0 0 1 -0.105469,-0.04492 l -0.976562,-0.978516 -0.0039,-0.002 a 0.15001501,0.15001501 0 0 1 -0.01953,-0.01758 0.15001501,0.15001501 0 0 1 -0.002,-0.0039 0.15001501,0.15001501 0 0 1 -0.01953,-0.02344 0.15001501,0.15001501 0 0 1 -0.0059,-0.0078 0.15001501,0.15001501 0 0 1 -0.002,-0.0059 l -0.0039,-0.0078 a 0.15001501,0.15001501 0 0 1 -0.0059,-0.01367 L 13.865234,19.066406 A 0.15001501,0.15001501 0 0 1 13.849609,19 v -3 a 0.15001501,0.15001501 0 0 1 0.0039,-0.03711 l 0.04883,-0.195313 -0.759766,2.279297 a 0.15001501,0.15001501 0 0 1 -0.0078,0.01953 l -1,2 a 0.15001501,0.15001501 0 0 1 -0.0293,0.03906 l -1,1 a 0.15001501,0.15001501 0 0 1 -0.03906,0.0293 l -1.9999998,1 A 0.15001501,0.15001501 0 0 1 9,22.150391 H 7.015625 a 0.15001501,0.15001501 0 0 1 -0.025391,0 0.15001501,0.15001501 0 0 1 -0.00391,0 0.15001501,0.15001501 0 0 1 -0.011719,-0.002 0.15001501,0.15001501 0 0 1 -0.00195,0 0.15001501,0.15001501 0 0 1 -0.011719,-0.0039 0.15001501,0.15001501 0 0 1 -0.00391,0 0.15001501,0.15001501 0 0 1 -0.00977,-0.0039 0.15001501,0.15001501 0 0 1 -0.013672,-0.0059 l -0.00391,-0.002 A 0.15001501,0.15001501 0 0 1 6.9160156,22.125 L 4.9335938,21.134766 a 0.15001501,0.15001501 0 0 1 -0.039063,-0.0293 l -1,-1 a 0.15001501,0.15001501 0 0 1 -0.037109,-0.05859 l -1,-3 A 0.15001501,0.15001501 0 0 1 2.8496094,17 v -2 a 0.15001501,0.15001501 0 0 1 0.00781,-0.04687 l 1,-3 A 0.15001501,0.15001501 0 0 1 3.875,11.916016 l 2,-3.0000004 A 0.15001501,0.15001501 0 0 1 5.953125,8.8574219 L 8.9375,7.8632812 a 0.15001501,0.15001501 0 0 1 0.017578,-0.00586 0.15001501,0.15001501 0 0 1 0.056641,-0.00781 H 11 a 0.15001501,0.15001501 0 0 1 0.06641,0.015625 l 2,1 a 0.15001501,0.15001501 0 0 1 0.07617,0.087891 l 1,3 A 0.15001501,0.15001501 0 0 1 14.150391,12 v 2.775391 l 0.703125,-2.8125 a 0.15001501,0.15001501 0 0 1 0.002,-0.002 L 17.488281,2.3105469 17.09375,1.5234375 15.976562,1.1503906 H 15 a 0.15039061,0.15039061 0 0 1 0,-0.30078122 h 0.988281 0.01563 0.96875 a 0.15001501,0.15001501 0 0 1 0.01367,-0.001953 z"
     id="path2" />
</svg>
