<?xml version="1.0" encoding="UTF-8" standalone="no"?>
<svg
   xmlns:dc="http://purl.org/dc/elements/1.1/"
   xmlns:cc="http://creativecommons.org/ns#"
   xmlns:rdf="http://www.w3.org/1999/02/22-rdf-syntax-ns#"
   xmlns:svg="http://www.w3.org/2000/svg"
   xmlns="http://www.w3.org/2000/svg"
   xmlns:sodipodi="http://sodipodi.sourceforge.net/DTD/sodipodi-0.dtd"
   xmlns:inkscape="http://www.inkscape.org/namespaces/inkscape"
   data-dec="184"
   width="5"
   height="40"
   version="1.1"
   id="svg4"
   sodipodi:docname="184.svg"
   inkscape:version="0.92.4 (unknown)">
  <metadata
     id="metadata10">
    <rdf:RDF>
      <cc:Work
         rdf:about="">
        <dc:format>image/svg+xml</dc:format>
        <dc:type
           rdf:resource="http://purl.org/dc/dcmitype/StillImage" />
      </cc:Work>
    </rdf:RDF>
  </metadata>
  <defs
     id="defs8" />
  <sodipodi:namedview
     pagecolor="#ffffff"
     bordercolor="#666666"
     borderopacity="1"
     objecttolerance="10"
     gridtolerance="10"
     guidetolerance="10"
     inkscape:pageopacity="0"
     inkscape:pageshadow="2"
     inkscape:window-width="640"
     inkscape:window-height="480"
     id="namedview6"
     showgrid="false"
     inkscape:zoom="5.9"
     inkscape:cx="2.5"
     inkscape:cy="20"
     inkscape:window-x="0"
     inkscape:window-y="27"
     inkscape:window-maximized="0"
     inkscape:current-layer="svg4" />
  <path
     style="color:#000000;font-style:normal;font-variant:normal;font-weight:normal;font-stretch:normal;font-size:medium;line-height:normal;font-family:sans-serif;font-variant-ligatures:normal;font-variant-position:normal;font-variant-caps:normal;font-variant-numeric:normal;font-variant-alternates:normal;font-feature-settings:normal;text-indent:0;text-align:start;text-decoration:none;text-decoration-line:none;text-decoration-style:solid;text-decoration-color:#000000;letter-spacing:normal;word-spacing:normal;text-transform:none;writing-mode:lr-tb;direction:ltr;text-orientation:mixed;dominant-baseline:auto;baseline-shift:baseline;text-anchor:start;white-space:normal;shape-padding:0;clip-rule:nonzero;display:inline;overflow:visible;visibility:visible;opacity:1;isolation:auto;mix-blend-mode:normal;color-interpolation:sRGB;color-interpolation-filters:linearRGB;solid-color:#000000;solid-opacity:1;vector-effect:none;fill:#000000;fill-opacity:1;fill-rule:nonzero;stroke:none;stroke-width:2;stroke-linecap:round;stroke-linejoin:round;stroke-miterlimit:4;stroke-dasharray:none;stroke-dashoffset:0;stroke-opacity:1;color-rendering:auto;image-rendering:auto;shape-rendering:auto;text-rendering:auto;enable-background:accumulate"
     d="M 2.9804688,20.990234 A 1.0001,1.0001 0 0 1 3.1464844,21 H 4 a 1.0001,1.0001 0 0 1 0.7070312,1.707031 L 3.9140625,23.5 4.7070312,24.292969 a 1.0001,1.0001 0 0 1 -0.2597656,1.601562 l -2,1 A 1.0001,1.0001 0 0 1 2,27 H 1.0957031 a 1.0001,1.0001 0 0 1 -0.98046872,-0.507812 1.0001,1.0001 0 0 1 -0.04492188,-0.08984 1.0001,1.0001 0 0 1 -0.03125,-0.08008 1.0001,1.0001 0 0 1 -0.0058594,-0.01563 1.0001,1.0001 0 0 1 -0.01953124,-0.08008 1.0001,1.0001 0 0 1 -0.00585938,-0.02734 1.0001,1.0001 0 0 1 -0.00585937,-0.03125 1.0001,1.0001 0 0 1 -0.01171876,-0.08008 1.0001,1.0001 0 0 1 0,-0.0078 1.0001,1.0001 0 0 1 -0.00195312,-0.0957 1.0001,1.0001 0 0 1 0.00585937,-0.09961 1.0001,1.0001 0 0 1 0.63476563,-0.81836 L 0.76367188,25 0.55273438,24.894531 A 1.0001,1.0001 0 0 1 0.29296875,23.292969 L 2.1894531,21.396484 a 1.0001,1.0001 0 0 1 0.3847657,-0.30664 1.0001,1.0001 0 0 1 0.035156,-0.01563 1.0001,1.0001 0 0 1 0.3710938,-0.08398 z"
     id="path2" />
</svg>
