{
  "fontname": "Futura-Triplex",
  "height": 40,
  "data-date": "la date",
  "chars": [
    {
      "dec": "111",
      "width": "20",
      "d": "M 9,8 7,9 5,11 4,14 v 2 l 1,3 2,2 2,1 h 3 l 2,-1 2,-2 1,-3 V 14 L 16,11 14,9 12,8 H 9 m -1,2 -2,1 -2,4 1,-2 v 3 1 l 1,2 2,1 h 4 l 2,-1 1,-2 v 2 l 1,-3 v -2 1 L 14,11 12,10 H 8 M 8,8 6,9 4,11 3,14 v 2 l 1,3 2,2 2,1 h 3 l 2,-1 2,-2 1,-3 V 14 L 15,11 13,9 11,8 H 8 m 0,1 -2,1 -1,1 -1,3 v 2 l 1,3 1,1 2,1 h 3 l 2,-1 1,-1 1,-2 V 13 L 14,11 13,10 11,9 H 8 "
    },
    {
      "dec": "83",
      "width": "20",
      "d": "M 17,5 16,3 13,2 H 7 L 5,3 4,4 v 3 l 2,2 5,2 4,2 2,3 v 2 l -1,2 -3,1 H 8 L 5,20 4,19 v -1 0 0 m 9,2 2,-1 1,-1 v -2 0 M 18,4 18,5 M 6,3 5,4 v 2 h 0 l 1,2 2,1 5,2 2,1 2,2 1,2 v 3 l -2,2 -3,1 H 9 L 5,21 3,19 v -1 h 2 l 1,1 1,1 H 9 13 M 9,1 h 4 l 3,1 2,2 M 12,1 H 8 L 5,2 3,4 v 2 l 1,2 1,1 2,1 5,2 2,1 1,1 1,2 M 18,5 H 16 L 15,4 13,3 H 6 "
    },
    {
      "dec": "43",
      "width": "26",
      "d": "m 13,4 v 17 h 1 M 13,4 h 1 V 21 M 5,12 h 17 v 2 M 4,12 v 2 H 22 M 12,4 v 17 h 1 M 12,4 h 1 V 21 M 4,12 h 17 v 1 M 4,12 v 1 h 17 "
    },
    {
      "dec": "81",
      "width": "22",
      "d": "m 13,19 5,5 h 1 M 12,18 h 1 l 6,6 M 10,2 v 0 m -5,4 -1,3 m 0,5 1,3 1,2 3,2 h 5 l 3,-2 1,-2 1,-3 v -5 l -1,-3 -1,-2 -3,-2 h -1 m 1,20 2,-1 2,-2 1,-2 1,-3 v -5 l -1,-3 -1,-2 -2,-2 -2,-1 H 9 m 9,16 1,-3 v -5 m -3,-5 -2,-1 H 9 l -2,1 -1,2 -1,3 v 5 l 1,3 1,2 2,1 h 5 l 2,-1 1,-2 1,-3 v -5 l -1,-3 -1,-2 m -3,-2 H 9 m 0,-1 -2,1 -2,2 -1,2 -1,3 v 5 l 1,3 1,2 2,2 2,1 h 5 m -5,-20 -2,1 -2,3 -1,3 v 5 M 11,18 l 6,6 h 1 m -7,-6 h 1 L 18,24 "
    },
    {
      "dec": "86",
      "width": "20",
      "d": "M 4,1 H 3 m 1,0 v 0 m 6,21 h 1 M 4,1 11,19 M 18,2 18,1 10,22 M 19,1 11,22 M 2,1 10,22 M 2,1 h 1 l 8,21 M 19,1 h -2 l -7,18 "
    },
    {
      "dec": "70",
      "width": "18",
      "d": "M 5,2 V 21 M 17,1 V 3 H 6 v 7 h 6 v 2 m -6,0 h 6 M 4,1 V 22 H 6 V 12 M 4,1 H 17 M 5,2 H 16 M 5,11 h 6 "
    },
    {
      "dec": "50",
      "width": "20",
      "d": "M 5,6 V 5 l 1,-2 2,-2 5,1 -1,-1 3,1 1,1 1,2 V 7 L 16,9 14,12 5,22 M 5,6 H 6 V 5 L 7,3 11,2 h 2 l 2,1 1,2 v 2 l -1,2 -2,3 -9,10 m 2,-2 h 12 v 2 M 4,22 H 18 M 4,6 V 5 L 5,3 6,2 8,1 h 4 l 2,1 1,1 1,2 V 7 L 15,9 13,12 4,22 M 4,6 H 5 V 5 L 6,3 8,2 h 2 l 4,1 1,2 v 2 l -1,2 -2,3 -9,10 m 1,-1 h 13 v 1 M 3,22 h 14 "
    },
    {
      "dec": "180",
      "width": "12",
      "d": "M 9,1 4,7 M 9,1 10,2 4,7 H 3 L 8,3 V 3 M 8,1 3,7 M 8,1 H 9 L 3,7 "
    },
    {
      "dec": "100",
      "width": "20",
      "d": "m 16,1 v 21 h 1 M 16,1 h 1 V 22 M 16,11 14,9 12,8 H 9 L 7,9 5,11 4,14 v 2 l 1,3 2,2 2,1 h 3 l 2,-1 2,-2 M 15,14 14,11 10,9 7,10 6,11 5,14 v 2 l 1,3 1,1 3,1 4,-2 1,-3 M 15,1 v 21 h 1 M 15,1 h 1 V 22 M 15,11 13,9 11,8 H 8 L 6,9 4,11 3,14 v 2 l 1,3 2,2 2,1 h 3 l 2,-1 2,-2 M 15,11 11,9 H 8 l -2,1 -1,1 -1,3 v 2 l 1,3 1,1 2,1 h 3 l 4,-2 "
    },
    {
      "dec": "102",
      "width": "16",
      "d": "M 12,1 C 11,1 11,1 10,1 9,1 9,2 8,2 8,3 7,4 7,5 7,11 7,16 7,22 c 0,0 1,0 1,0 M 12,1 c 0,1 0,1 0,2 C 11,3 10,3 9,3 9,3 8,4 8,4 M 9,2 C 9,3 8,4 8,5 8,11 8,16 8,22 M 3,8 c 3,0 5,0 8,0 0,1 0,1 0,2 M 3,8 c 0,1 0,1 0,2 3,0 5,0 8,0 M 11,1 C 10,1 10,1 9,1 8,1 8,2 7,2 7,3 6,4 6,5 6,11 6,16 6,22 c 0,0 1,0 1,0 M 11,1 c 0,0 0,1 0,1 C 10,2 10,2 9,2 9,3 8,3 8,4 M 8,2 C 8,3 7,4 7,5 7,11 7,16 7,22 M 3,8 c 2,0 5,0 7,0 0,0 0,1 0,1 M 3,8 c 0,0 0,1 0,1 2,0 5,0 7,0 "
    },
    {
      "dec": "121",
      "width": "16",
      "d": "M 3,8 9,22 M 3,8 H 4 L 9,20 M 15,8 H 14 L 9,20 5,29 M 15,8 9,22 6,29 H 5 M 2,8 8,22 M 2,8 H 3 L 8,20 M 14,8 H 13 L 8,20 4,29 M 14,8 8,22 5,29 H 4 "
    },
    {
      "dec": "93",
      "width": "14",
      "d": "M9,-3 L9,29 M10,-3 L10,29 M3,-3 L10,-3 M3,29 L10,29 "
    },
    {
      "dec": "32",
      "width": "18",
      "d": "M 0,0 "
    },
    {
      "dec": "109",
      "width": "32",
      "d": "M 5,8 V 22 H 6 M 5,8 H 6 V 22 M 6,12 9,9 11,8 h 3 l 2,1 1,3 V 22 M 6,13 8,11 9,10 12,9 h 2 l 2,3 v 10 h 1 m 0,-10 3,-3 2,-1 h 3 l 2,1 1,3 v 10 m -11,-9 2,-2 1,-1 3,-1 h 2 l 2,3 v 10 h 1 M 4,8 V 22 H 5 M 4,8 H 5 V 22 M 5,12 8,9 10,8 h 3 l 2,1 1,3 V 22 M 5,12 8,10 10,9 h 2 l 2,1 1,2 v 10 h 1 m 0,-10 3,-3 2,-1 h 3 l 2,1 1,3 V 22 M 16,12 19,10 21,9 h 2 l 2,1 1,2 v 10 h 1 "
    },
    {
      "dec": "45",
      "width": "26",
      "d": "m 18,13 v 1 M 8,13 v 1 m 0,0 H 18 M 8,13 h 10 "
    },
    {
      "dec": "184",
      "width": "5",
      "d": "M 1,26 H 2 L 4,25 3,24 H 2 L 4,22 H 3 m -2,4 v 0 l 2,-1 v 0 L 1,24 3,22 "
    },
    {
      "dec": "120",
      "width": "18",
      "d": "m 4,8 11,14 h 1 M 4,8 H 5 L 16,22 M 16,8 H 15 L 4,22 M 16,8 5,22 H 4 M 3,8 14,22 h 1 M 3,8 H 4 L 15,22 M 15,8 H 14 L 3,22 M 15,8 4,22 H 3 "
    },
    {
      "dec": "71",
      "width": "22",
      "d": "M 19,6 18,4 16,2 14,1 M 5,6 V 6 L 4,9 v 5 l 1,3 1,2 M 19,6 H 18 M 14,2 H 9 L 6,4 5,6 4,9 v 5 l 1,3 1,2 1,1 2,1 h 5 l 2,-1 1,-1 1,-2 V 14 H 14 M 18,6 17,4 14,2 M 14,1 H 9 L 7,2 5,4 4,6 3,9 v 5 l 1,3 1,2 2,2 2,1 h 1 4 l 2,-1 2,-2 1,-2 v -4 h -5 m 0,0 H 13 M 18,6 H 17 L 16,4 14,3 H 13 10 9 L 7,4 6,6 5,9 v 5 l 1,3 1,2 2,1 h 4 1 l 2,-1 1,-2 v -2 h -4 v -2 "
    },
    {
      "dec": "65",
      "width": "21",
      "d": "M 5,16 H 16 M 18,22 10,1 M 3,22 C 6,16 8,7 11,1 M 2,22 10,1 h 1 l 8,21 M 11,3 4,22 H 2 M 10,3 11,5 17,22 h 2 M 5,15 H 16 M 4,17 h 13 "
    },
    {
      "dec": "104",
      "width": "20",
      "d": "M 5,1 V 22 H 6 M 5,1 H 6 V 22 M 6,12 9,9 11,8 h 3 l 2,1 1,3 V 22 M 6,13 8,11 10,10 h 2 l 3,1 1,1 v 10 h 1 M 4,1 V 22 H 5 M 4,1 H 5 V 22 M 5,12 8,9 10,8 h 2 l 3,2 1,2 V 22 M 5,12 8,10 10,9 h 2 l 2,1 1,2 v 10 h 1 "
    },
    {
      "dec": "60",
      "width": "24",
      "d": "m 20,22 h 1 M 20,4 h 1 m 0,0 -16,9 16,9 M 20,4 4,13 20,22 "
    },
    {
      "dec": "49",
      "width": "20",
      "d": "M 7,5 9,4 12,1 V 22 M 7,5 V 6 L 9,5 11,3 v 19 h 1 M 6,5 v 1 h 1 l 3,-3 v 19 h 1 M 6,5 8,4 11,1 h 1 v 0 "
    },
    {
      "dec": "97",
      "width": "20",
      "d": "m 16,8 v 14 h 1 M 16,8 h 1 V 22 M 16,11 14,9 12,8 H 9 L 7,9 5,11 4,14 v 2 l 1,3 2,2 2,1 h 3 l 2,-1 2,-2 m 0,-8 -1,4 -1,-4 -3,-1 H 8 l -2,1 v 0 l -1,3 v 2 l 1,3 2,1 h 3 L 14,19 15,15 16,19 M 15,8 v 14 h 1 M 15,8 h 1 V 22 M 15,11 13,9 11,8 H 8 L 6,9 4,11 3,14 v 2 l 1,3 2,2 2,1 h 3 l 2,-1 2,-2 M 15,11 11,9 H 8 l -2,1 -1,1 -1,3 v 2 l 1,3 1,1 2,1 h 3 l 4,-2 "
    },
    {
      "dec": "187",
      "width": "14",
      "d": "M 7,20 13,14 7,8 M 7,20 12,14 7,8 M 1,20 7,14 1,8 M 1,20 6,14 1,8 "
    },
    {
      "dec": "171",
      "width": "14",
      "d": "M 7,20 1,14 7,8 M 7,20 2,14 7,8 m 6,12 -6,-6 6,-6 m 0,12 -5,-6 5,-6 "
    },
    {
      "dec": "79",
      "width": "22",
      "d": "M 10,2 V 2 M 5,6 4,9 m 0,5 1,3 1,2 3,2 h 5 l 3,-2 1,-2 1,-3 V 9 L 18,6 17,4 14,2 h -1 m 1,20 2,-1 2,-2 1,-2 1,-3 V 9 L 19,6 18,4 16,2 14,1 H 9 m 9,16 1,-3 V 9 M 16,4 14,3 H 9 L 7,4 6,6 5,9 v 5 l 1,3 1,2 2,1 h 5 l 2,-1 1,-2 1,-3 V 9 L 17,6 16,4 M 13,2 H 9 M 9,1 7,2 5,4 4,6 3,9 v 5 l 1,3 1,2 2,2 2,1 h 5 M 9,2 7,3 5,6 4,9 v 5 "
    },
    {
      "dec": "44",
      "width": "12",
      "d": "m 7,23 v 2 l -2,2 v 0 m 0,-7 2,2 m 0,-2 -2,2 m 3,0 -1,1 H 5 L 4,22 v -2 l 1,-1 h 2 l 1,1 v 4 l -1,2 -2,1 m 0,-7 v 2 H 7 V 20 H 5 m 2,3 1,1 m 0,-2 -1,4 "
    },
    {
      "dec": "66",
      "width": "20",
      "d": "M 5,1 V 22 M 6,2 V 21 M 5,1 h 8 l 3,1 1,1 1,2 v 3 l -1,2 -1,1 -3,1 M 6,3 h 7 l 3,1 1,1 v 3 l -1,1 -3,1 m -7,0 h 7 l 3,2 1,1 1,2 v 3 l -1,2 -1,1 -3,1 H 5 M 6,12 h 7 l 3,1 1,2 v 3 l -1,1 -3,1 H 6 M 4,1 V 22 M 5,2 V 21 M 4,1 h 8 l 3,1 1,1 1,2 v 3 l -1,2 -1,1 -3,1 M 5,2 H 5 12 l 3,1 1,2 v 3 l -1,2 -3,1 m -7,0 h 7 l 3,1 1,1 1,2 v 3 l -1,2 -1,1 -3,1 H 4 M 5,12 h 7 l 3,1 1,2 v 3 l -1,2 -3,1 H 5 "
    },
    {
      "dec": "101",
      "width": "18",
      "d": "M 5,16 H 16 l 0,-4 -1,-2 -1,-1 -2,-1 H 9 l -2,1 -2,2 -1,3 v 2 l 1,3 2,2 2,1 h 3 l 2,-1 2,-2 M 5,14 H 15 V 12 H 15 l -2,-2 -3,-1 -3,1 -1,1 -1,3 v 2 l 1,3 H 6 l 4,2 v 0 l 4,-2 v -1 l 2,1 M 4,15 H 15 V 12 L 14,10 13,9 11,8 H 8 L 6,9 4,11 3,14 v 2 l 1,3 2,2 2,1 h 3 l 2,-1 2,-2 M 4,14 H 14 V 12 L 13,10 11,9 H 8 l -2,1 -1,1 -1,3 v 2 l 1,3 1,1 2,1 h 3 l 2,-1 1,-2 1,1 "
    },
    {
      "dec": "87",
      "width": "26",
      "d": "m 18,22 h 1 M 8,22 H 9 M 13,1 h 1 V 1 M 3,1 9,22 M 3,1 H 4 L 9,19 M 14,1 9,19 M 14,4 9,22 M 14,4 19,22 M 14,1 19,19 M 25,1 H 24 L 19,19 M 25,1 19,22 M 2,1 8,22 M 2,1 H 3 L 8,19 M 13,4 8,22 M 13,4 18,22 M 24,1 H 23 L 18,19 13,1 8,19 M 24,1 18,22 "
    },
    {
      "dec": "85",
      "width": "22",
      "d": "m 6,1 v 15 l 1,3 L 10,20 v 0 m 0,0 h 3 M 18,16 18,2 M 4,1 v 15 l 1,3 2,2 3,1 M 4,1 H 6 M 5,16 l 1,3 1,1 3,1 h 3 l 3,-1 1,-1 1,-3 m -5,4 3,-1 1,-3 V 1 h 2 v 15 l -1,3 -2,2 -3,1 H 10 M 5,16 5,2 "
    },
    {
      "dec": "110",
      "width": "20",
      "d": "M 5,8 V 22 H 6 M 5,8 H 6 V 22 M 6,12 9,9 11,8 h 3 l 2,1 1,3 V 22 M 6,13 9,10 12,9 h 2 l 1,1 1,2 v 10 h 1 M 4,8 V 22 H 5 M 4,8 H 5 V 22 M 5,12 8,9 10,8 h 3 l 2,1 1,3 V 22 M 5,12 8,10 10,9 h 2 l 2,1 1,2 v 10 h 1 "
    },
    {
      "dec": "119",
      "width": "24",
      "d": "m 12,8 h 1 m 3,14 h 1 m -9,0 h 1 v 0 M 4,8 9,22 M 4,8 H 5 L 9,19 M 13,8 9,19 m 4,-8 -4,11 m 4,-11 4,11 M 13,8 17,19 M 22,8 H 21 L 17,19 M 22,8 17,22 M 3,8 8,22 M 3,8 H 4 L 8,19 M 12,8 8,19 m 4,-8 -4,11 m 4,-11 4,11 M 12,8 16,19 M 21,8 H 20 L 16,19 M 21,8 16,22 "
    },
    {
      "dec": "47",
      "width": "24",
      "d": "M 21,-3 3,29 H 4 M 21,-3 h 1 L 4,29 M 20,-3 2,29 H 3 M 20,-3 h 1 L 3,29 "
    },
    {
      "dec": "125",
      "width": "14",
      "d": "M4,-3 L11,13 4,29 "
    },
    {
      "dec": "55",
      "width": "20",
      "d": "M 4,1 H 18 L 8,22 M 4,1 V 2 H 17 M 17,1 7,22 H 8 M 3,1 H 17 L 7,22 M 3,1 V 3 H 16 M 16,1 6,22 h 1 "
    },
    {
      "dec": "339",
      "width": "30",
      "d": "M 9,8 7,9 5,11 4,14 v 2 l 1,3 2,2 2,1 h 3 l 2,-1 2,-2 1,-3 V 14 L 16,11 14,9 12,8 H 9 m 0,1 -2,1 -1,1 -1,3 v 2 l 1,3 2,2 v 0 h 4 l 2,-1 1,-1 1,-3 V 14 L 15,11 14,10 12,9 7,10 m 10,5 H 28 V 12 L 27,10 26,9 24,8 h -3 l -2,1 -2,2 -1,3 v 2 l 1,3 2,2 2,1 h 3 l 2,-1 2,-2 M 17,13 H 27 V 12 L 26,10 24,9 h -3 l -2,1 -1,1 -1,2 v 3 l 1,3 1,1 h 4 2 l -2,1 3,-3 2,1 M 8,8 6,9 4,11 3,14 v 2 l 1,3 2,2 2,1 h 3 l 2,-1 2,-2 1,-3 V 14 L 15,11 13,9 11,8 H 8 m 0,1 -2,1 -1,1 -1,3 v 2 l 1,3 1,1 6,1 H 9 l 4,-1 1,-1 1,-3 v -2 l -1,-3 -1,-1 v 0 L 8,9 m 8,6 H 27 V 12 L 26,10 25,9 23,8 h -3 l -2,1 -2,2 -1,3 v 2 l 1,3 2,2 2,1 h 3 l 2,-1 2,-2 M 16,14 H 26 V 12 L 25,10 23,9 h -3 l -2,1 -1,1 -1,3 v 2 l 1,3 1,1 2,1 h 3 l 2,-1 1,-2 1,1 "
    },
    {
      "dec": "62",
      "width": "24",
      "d": "M 5,22 H 4 M 5,4 H 4 M 5,4 21,13 5,22 M 4,4 20,13 4,22 "
    },
    {
      "dec": "95",
      "width": "20",
      "d": "M 20,28 V 27 M 0,28 v -1 m 0,0 H 20 M 0,28 h 20 "
    },
    {
      "dec": "69",
      "width": "20",
      "d": "M 17,1 V 3 H 6 v 7 h 6 v 2 M 4,1 V 22 H 17 V 20 H 6 v -8 h 6 M 5,2 V 21 M 4,1 H 17 M 5,2 H 16 M 5,11 h 6 v 0 M 5,21 h 11 "
    },
    {
      "dec": "8212",
      "width": "26",
      "d": "m 0,13 v 1 H 26 V 13 M 0,13 h 26 "
    },
    {
      "dec": "103",
      "width": "20",
      "d": "m 17,8 h -1 v 15 l -1,3 -1,1 -2,1 H 10 L 8,27 7,26 H 5 M 17,8 v 15 l -1,3 -2,2 -2,1 H 9 L 7,28 5,26 M 16,11 14,9 12,8 H 9 L 7,9 5,11 4,14 v 2 l 1,3 2,2 2,1 h 3 l 2,-1 2,-2 M 16,11 12,9 H 9 l -2,1 -1,1 -1,3 v 2 l 1,3 1,1 2,1 h 3 l 4,-2 M 16,8 H 15 V 23 L 14,26 12,27 9,28 7,27 6,26 v 0 H 4 M 16,8 v 15 l -1,3 -2,2 -2,1 H 8 L 6,28 4,26 M 15,11 13,9 11,8 H 8 L 6,9 4,11 3,14 v 2 l 1,3 2,2 2,1 h 3 l 2,-1 2,-2 m 0,-5 -1,-3 -1,-1 H 8 l -3,1 v 0 l -1,3 v 2 l 1,3 v 0 l 3,1 h 5 l 1,-1 1,-3 "
    },
    {
      "dec": "33",
      "width": "12",
      "d": "m 6,1 v 14 0 m 1,4 -2,2 M 5,1 V 15 H 7 M 5,1 h 2 v 14 m -2,3 -1,1 v 2 l 1,1 H 7 L 8,21 V 19 L 7,18 H 5 m 0,1 v 2 H 7 V 19 H 5 l 2,2 "
    },
    {
      "dec": "169",
      "width": "23",
      "d": "m 16,3 2,1 2,2 1,2 1,4 v 3 l -1,4 -1,2 -3,3 -4,1 H 10 L 6,24 3,21 2,19 1,15 V 12 L 2,8 3,6 5,4 7,3 10,2 h 3 l 3,1 M 5,10 6,8 8,6 10,5 h 3 l 2,1 2,2 1,3 v 5 l -1,3 -2,2 -2,1 H 10 L 8,21 6,19 5,17"
    },
    {
      "dec": "56",
      "width": "20",
      "d": "M 9,1 6,2 5,4 v 2 l 1,2 1,1 2,1 4,1 2,1 1,1 1,2 v 3 l -1,2 -5,1 -5,-1 v 0 L 5,18 v -3 l 1,-2 1,-1 2,-1 4,-1 2,-1 1,-1 1,-2 V 4 L 16,2 13,1 H 9 M 7,2 6,4 v 2 l 1,2 2,1 4,1 2,1 2,2 1,2 v 3 l -1,2 -1,1 -3,1 -2,-1 H 6 L 5,20 4,18 V 15 L 5,13 7,11 9,10 13,9 15,8 16,6 V 4 L 15,2 M 16,3 14,2 13,2 H 10 L 6,3 m -1,16 3,2 m 6,0 3,-2 M 8,1 5,2 4,4 v 2 l 1,2 1,1 2,1 4,1 2,1 1,1 1,2 v 3 L 15,20 9,21 6,20 5,19 4,18 v -3 l 1,-2 1,-1 2,-1 4,-1 2,-1 1,-1 1,-2 V 4 L 15,2 12,1 H 8 M 6,2 5,4 v 2 l 1,2 2,1 4,1 2,1 2,2 1,2 v 3 l -1,2 -1,1 -2,1 H 8 L 5,21 4,20 3,18 V 15 L 4,13 6,11 8,10 12,9 14,8 15,6 V 4 L 14,2 M 15,3 11,2 H 8 L 5,3 m -1,16 6,3 m 3,-1 3,-2 "
    },
    {
      "dec": "48",
      "width": "20",
      "d": "M 10,1 7,2 5,5 4,10 v 3 l 1,5 2,3 h 2 l 3,1 3,-1 2,-3 1,-5 V 10 L 17,5 15,2 12,1 9,2 M 8,2 6,5 5,10 v 3 l 1,5 3,4 M 5,20 12,21 v 0 l 3,-1 m -1,1 2,-3 1,-5 V 10 L 16,5 14,2 M 15,3 12,2 8,3 6,4 M 9,1 6,2 4,5 3,10 v 3 l 1,5 2,3 3,1 h 3 l 2,-1 2,-3 1,-5 V 10 L 16,5 14,2 12,1 H 9 M 7,2 5,5 4,10 v 3 l 1,5 2,3 m -1,-1 3,1 5,-1 1,-1 m -2,2 2,-3 1,-5 V 10 L 15,5 13,2 M 15,4 13,3 9,2 7,3 "
    },
    {
      "dec": "90",
      "width": "20",
      "d": "M 17,1 4,22 M 18,1 5,22 M 4,1 H 18 M 3,1 V 3 H 16 M 5,20 h 13 v 2 M 4,22 H 18 M 16,1 3,22 M 17,1 4,22 M 3,1 H 17 M 3,1 V 2 H 16 M 4,21 h 13 v 1 M 3,22 h 14 "
    },
    {
      "dec": "35",
      "width": "22",
      "d": "M11,-3 L4,29 M17,-3 L10,29 M4,10 L18,10 M3,16 L17,16 "
    },
    {
      "dec": "61",
      "width": "26",
      "d": "M 20,16 H 5 M 5,9 H 20 M 4,8 h 17 v 2 M 4,8 v 2 H 21 M 4,15 h 17 v 2 M 4,15 v 2 h 17 "
    },
    {
      "dec": "80",
      "width": "20",
      "d": "M 6,3 V 22 H 4 m 9,-21 3,1 1,1 1,2 v 3 l -1,2 -1,1 -2,1 H 6 M 6,3 h 8 l 2,1 v 5 l -2,1 H 6 M 4,1 V 22 M 5,2 V 21 M 4,1 h 9 m 1,11 H 6 M 5,2 h 8 l 3,1 1,2 v 3 l -1,2 -2,1 H 5 "
    },
    {
      "dec": "169",
      "width": "23",
      "d": "m 16,3 2,1 2,2 1,2 1,4 v 3 l -1,4 -1,2 -3,3 -4,1 H 10 L 6,24 3,21 2,19 1,15 V 12 L 2,8 3,6 5,4 7,3 10,2 h 3 l 3,1 M 5,10 6,8 8,6 10,5 h 3 l 2,1 2,2 1,3 v 5 l -1,3 -2,2 -2,1 H 10 L 8,21 6,19 5,17  "
    },
    {
      "dec": "38",
      "width": "26",
      "d": "m 22,20 h 1 m -2,-9 h 1 M 7,4 Z m 3,-3 3,3 M 9,2 Z m 1,-1 h 1 v 0 m 0,0 -3,3 v 0 m 14,5 -1,1 1,1 1,-1 V 9 L 22,8 h -1 l -1,1 -1,2 -2,5 -2,3 -2,2 -2,1 H 8 V 21 L 4,19 v -3 l 1,-2 6,-4 2,-2 1,-2 V 4 L 13,2 11,1 9,2 8,4 v 2 l 1,3 2,3 5,7 2,2 3,1 h 1 l 1,-1 V 20 M 8,6 l 1,2 8,11 2,2 2,1 M 8,12 6,14 5,16 v 3 l 1,2 h 5 l 4,-2 m 6,-10 -1,1 1,1 1,-1 V 9 L 21,8 h -1 l -1,1 -1,2 -2,5 -2,3 -5,2 -1,1 H 7 L 4,21 3,19 v -3 l 1,-2 6,-4 2,-2 1,-2 V 4 L 12,2 10,1 8,2 7,4 v 2 l 1,3 2,3 5,7 2,2 3,1 h 1 l 1,-1 V 20 M 8,22 5,21 4,19 v -3 l 1,-2 2,-2 m 0,-6 1,2 8,11 2,2 2,1 "
    },
    {
      "dec": "115",
      "width": "18",
      "d": "m 23,20 z m -16,1 3,1 M 6,9 10,8 m 3,8 1,2 v 1 l -1,2 M 14,20 10,21 6,20 5,19 M 6,21 5,18 H 3 M 13,9 v 3 h 2 V 11 L 14,9 11,8 H 8 l -3,1 -1,2 1,2 2,1 5,2 2,1 m 0,-7 H 12 L 8,9 5,10 m 1,-1 -1,2 1,2 m -1,-1 2,1 5,2 2,1 1,2 v 1 l -1,2 -3,1 H 8 L 5,21 4,18 M 14,11 13,9 10,8 H 7 l -3,1 -1,2 1,2 2,1 5,2 2,1 m -1,-1 1,2 v 1 l -1,2 m 1,-2 -1,1 -5,1 -3,-1 M 14,12 13,11 12,9 m 1,1 -3,-1 -4,1 -2,1 m 1,-2 -1,2 1,2 m -1,-1 2,1 5,2 2,1 1,2 v 1 l -1,2 -3,1 H 7 L 4,21 3,19 v -1 l 1,1 1,2 "
    },
    {
      "dec": "76",
      "width": "17",
      "d": "M 3,1 V 22 H 15 V 20 H 5 V 1 Z m 1,1 v 19 m 0,0 h 10 "
    },
    {
      "dec": "46",
      "width": "12",
      "d": "m 5,18 -1,1 v 2 l 1,1 H 7 L 8,21 V 19 L 7,18 H 5 m 0,1 v 2 H 7 V 19 H 5 M 7,19 5,21 m 5,19 2,2 "
    },
    {
      "dec": "122",
      "width": "18",
      "d": "M 14,9 4,22 M 16,8 6,21 M 4,8 H 16 M 4,8 V 9 H 14 M 6,21 h 10 v 1 M 4,22 H 16 M 13,9 3,22 M 15,8 5,21 M 3,8 H 15 M 3,8 v 2 H 13 M 6,20 h 10 v 2 M 3,22 h 13 "
    },
    {
      "dec": "64",
      "width": "28",
      "d": "m 19,19 h 1 M 18,7 V 7 L 16,6 h -4 l -1,1 -1,1 -1,3 v 3 l 2,2 3,1 v 0 l 3,-1 1,-2 M 13,6 10,8 9,11 v 3 l 2,2 4,0 M 19,6 18,14 v 2 h 1 1 1 l 1,-1 1,-3 V 10 L 22,7 21,5 19,3 C 18,3 15,2 15,2 H 13 12 L 8,3 6,5 5,7 4,10 v 3 l 1,3 2,3 2,1 3,1 h 3 l 3,-1 1,-1 m 0,-3 v 0 -2 l 1,-8 h -2 m -1,8 1,-6 V 8 L 16,6 12,6 9,8 8,11 v 3 l 1,2 2,1 h 3 l 2,-1 1,-2 M 12,6 9,8 v 3 3 l 1,2 2,0 L 14,17 m 4,-11 -1,8 v 2 l 2,1 h 2 l 2,-2 1,-3 V 10 L 23,7 22,5 20,3 18,2 15,1 H 12 L 9,2 7,3 5,5 4,7 3,10 v 3 l 1,3 1,2 2,2 2,1 3,1 h 3 l 3,-1 1,-1 1,-1 M 19,6 18,14 v 2 l 1,1 "
    },
    {
      "dec": "82",
      "width": "20",
      "d": "M 12,11 H 5 m 8,-1 H 6 V 3 3 3 m 0,9 V 22 H 5 M 6,3 h 7 l 2,1 1,1 v 3 l -1,1 -2,1 M 12,13 17,22 h 1 M 4,1 V 22 M 5,2 V 22 H 4 M 4,1 h 8 1 l 3,1 1,1 1,2 v 3 l -1,2 -1,1 -3,1 H 5 m 11,-9 1,2 v 3 l -1,2 -4,1 M 5,2 h 7 l 4,1 m -6,9 6,10 h 1 m -5,-10 6,10 "
    },
    {
      "dec": "94",
      "width": "22",
      "d": "m 11,2 c 1,0 1,0 1,0 V 2 M 5,7 12,2 18,7 M 5,7 12,3 17,6 17,7 18,7 M 5,7 11,2 18,7 M 5,7 11,3 18,7 "
    },
    {
      "dec": "8208",
      "width": "26",
      "d": "m 22,13 v 1 M 4,13 v 1 m 0,0 H 22 M 4,13 h 18 "
    },
    {
      "dec": "8201",
      "width": "6",
      "d": "M 0,0 "
    },
    {
      "dec": "8220",
      "width": "15",
      "d": "m 9,6 1,-1 h 1 l 1,1 V 7 L 11,8 H 10 L 9,7 V 4 L 10,2 12,1 M 11,7 V 6 h -1 v 1 h 1 M 10,5 9,4 M 9,6 10,2 M 3,6 4,5 H 5 L 6,6 V 7 L 5,8 H 4 L 3,7 V 4 L 4,2 6,1 M 5,7 V 6 H 4 V 7 H 5 M 4,5 3,4 M 3,6 4,2 "
    },
    {
      "dec": "37",
      "width": "24",
      "d": "M21,1 L3,22 M8,1 L10,3 10,5 9,7 7,8 5,8 3,6 3,4 4,2 6,1 8,1 10,2 13,3 16,3 19,2 21,1 M17,15 L15,16 14,18 14,20 16,22 18,22 20,21 21,19 21,17 19,15 17,15 "
    },
    {
      "dec": "68",
      "width": "22",
      "d": "m 5,2 v 19 0 m -1,1 h 8 l 3,-1 2,-2 1,-2 1,-3 V 9 L 18,6 17,4 15,2 12,1 H 11 4 m 2,19 h 6 1 m 3,-1 1,-2 1,-3 V 9 L 17,6 16,4 15,3 13,2 H 5 M 6,3 V 20 M 4,1 v 21 m 12,-18 1,2 1,3 v 5 l -1,3 -1,2 -3,2 M 6,3 h 5 2 l 2,1 1,2 1,3 v 5 l -1,3 -1,2 -2,1 m -8,1 h 6 2 "
    },
    {
      "dec": "36",
      "width": "20",
      "d": "M9,-3 L9,26 10,26 M9,-3 L10,-3 10,26 M14,4 L16,4 14,2 11,1 8,1 5,2 3,4 3,6 4,8 5,9 13,13 14,14 15,16 15,18 14,20 11,21 8,21 6,20 5,19 M14,4 L13,3 11,2 8,2 5,3 4,4 4,6 5,8 13,12 15,14 16,16 16,18 15,20 14,21 11,22 8,22 5,21 3,19 5,19 M15,19 L12,21 "
    },
    {
      "dec": "105",
      "width": "10",
      "d": "M 6,2 4,4 M 4,2 6,4 M 5,8 V 22 H 6 M 5,8 H 6 V 22 M 4,1 3,2 V 4 L 4,5 H 6 L 7,4 V 2 L 6,1 H 4 M 4,2 V 4 H 6 V 2 H 4 M 4,8 V 22 H 5 M 4,8 h 1 v 14 "
    },
    {
      "dec": "75",
      "width": "22",
      "d": "m 17,1 h 2 l -9,9 v 0 M 5,2 V 21 M 17,2 7,12 m 2,-2 8,11 M 4,1 v 21 0 H 6 V 1 H 4 V 1 M 17,1 6,12 Z M 8,10 17,22 17,22 h 2 m 0,0 -9,-12 -4,4 v 0 "
    },
    {
      "dec": "51",
      "width": "20",
      "d": "M 4,17 H 3 M 6,1 h 11 l -7,9 M 6,1 v 1 h 10 m 0,-1 -7,9 m 1,-1 h 2 l 3,1 2,2 1,3 v 1 l -1,3 -2,2 -3,1 H 9 L 6,21 5,20 4,17 v 0 m 5,-7 h 3 l 3,1 2,3 m -4,-4 3,2 1,3 v 1 l -1,3 -3,2 m 4,-4 -2,3 -3,1 H 11 L 6,20 4,17 M 9,21 5,19 M 5,1 H 16 L 9,10 M 5,1 v 2 h 9 M 15,1 8,10 M 9,9 h 2 l 3,1 2,2 1,3 v 1 l -1,3 -2,2 -3,1 H 8 L 5,21 4,20 3,18 v -1 m 5,-7 v 1 h 5 l 3,2 m -4,-3 3,2 1,3 v 1 l -1,3 -3,2 m 4,-4 -2,3 -5,1 H 8 L 5,20 3,17 m 4,4 -3,-2 "
    },
    {
      "dec": "34",
      "width": "18",
      "d": "M5,1 L4,2 4,8 M5,2 L4,8 M5,1 L6,2 4,8 M14,1 L13,2 13,8 M14,2 L13,8 M14,1 L15,2 13,8 "
    },
    {
      "dec": "98",
      "width": "20",
      "d": "M 6,11 9,9 h 4 m 0,12 H 9 L 6,19 M 5,1 V 22 H 6 M 5,1 H 6 V 22 M 5,11 8,9 10,8 h 3 l 2,1 2,2 1,3 v 2 l -1,3 -2,2 -2,1 H 10 L 8,21 6,19 m 0,-5 1,-3 2,-1 m 4,-1 2,1 1,1 1,3 v 2 l -1,3 -1,1 -2,1 M 9,20 7,19 6,16 M 4,1 V 22 H 5 M 4,1 H 5 V 22 M 5,11 7,9 9,8 h 3 l 2,1 2,2 1,3 v 2 l -1,3 -2,2 -2,1 H 9 L 7,21 5,19 m 4,-9 h 4 l 2,1 1,3 v 2 l -1,3 -1,1 H 9 L 5,19 "
    },
    {
      "dec": "96",
      "width": "12",
      "d": "m 5,1 5,6 M 5,1 H 4 l 6,6 H 9 M 4,1 9,7 M 4,1 3,2 9,7 "
    },
    {
      "dec": "74",
      "width": "18",
      "d": "m 5,19 z m -1,-2 1,3 2,1 h 3 l 2,-1 1,-3 V 2 2 M 12,1 v 16 l -1,3 H 9 7 6 L 5,17 H 3 M 12,1 h 2 v 16 l -1,3 -1,1 -2,1 H 7 L 5,21 4,20 3,17 "
    },
    {
      "dec": "58",
      "width": "12",
      "d": "m -4,16 z m 9,3 2,2 M 7,19 5,21 M 5,9 7,11 M 7,9 5,11 M 5,8 4,9 v 2 l 1,1 H 7 L 8,11 V 9 L 7,8 H 5 m 0,1 v 2 H 7 V 9 H 5 m 0,9 -1,1 v 2 l 1,1 H 7 L 8,21 V 19 L 7,18 H 5 m 0,1 v 2 H 7 V 19 H 5 "
    },
    {
      "dec": "57",
      "width": "20",
      "d": "m 16,11 -2,2 -3,1 H 10 L 7,13 5,11 4,8 V 7 L 5,4 7,2 10,1 h 1 l 3,1 2,2 1,4 v 5 l -1,5 -2,3 -3,1 H 9 L 4,18 h 1 l 1,1 2,2 m 8,-13 -1,3 -3,2 m 4,-4 -2,3 -3,1 H 10 L 7,12 5,9 M 11,13 6,11 5,8 V 7 L 6,4 11,2 M 5,6 7,3 10,2 h 1 l 3,1 2,3 m -8,-4 7,2 1,4 v 5 l -1,5 -2,3 m 2,-3 -5,3 H 7 L 5,19 m 10,-8 -2,2 -3,1 H 9 L 6,13 4,11 3,8 V 7 L 4,4 6,2 9,1 h 1 l 3,1 2,2 1,4 v 5 l -1,5 -2,3 -3,1 H 8 L 5,21 4,19 V 18 L 5,19 5,19 6,21 m 9,-13 -1,3 -5,2 m 6,-4 -2,3 -3,1 H 9 L 6,12 4,9 M 8,13 5,11 4,8 V 7 L 5,4 8,2 M 4,6 6,3 9,2 h 1 l 3,1 2,3 m -4,-4 3,2 1,4 v 5 l -1,5 -3,3 m 4,-2 -6,2 h 2 L 5,20 "
    },
    {
      "dec": "73",
      "width": "10",
      "d": "m 5,2 c 0,19 0,19 0,19 v 0 0 M 4,1 V 22 H 6 M 4,1 h 2 v 21 "
    },
    {
      "dec": "84",
      "width": "18",
      "d": "M 9,4 V 21 M 10,3 V 22 H 8 V 3 M 3,1 H 16 V 3 M 2,1 V 3 H 16 M 9,3 V 21 M 2,1 H 15 M 3,2 h 12 "
    },
    {
      "dec": "108",
      "width": "10",
      "d": "M 5,1 V 22 M 4,1 V 22 H 6 M 4,1 h 2 v 21 "
    },
    {
      "dec": "63",
      "width": "20",
      "d": "M 7,2 12,1 M 11,21 9,19 m 2,0 -2,2 M 4,6 V 5 L 5,3 6,2 9,1 h 3 l 3,1 1,1 1,2 v 2 l -1,2 -1,1 -2,1 -3,1 M 4,6 H 5 V 5 4 L 9,2 H 7 l 8,1 1,2 v 2 l -1,2 -2,1 -4,2 M 5,4 8,2 m 5,0 3,2 m 0,4 -4,3 m -2,-1 v 5 h 1 v -4 m -2,7 -1,1 v 2 l 1,1 h 2 l 1,-1 V 19 L 11,18 H 9 m 0,1 v 2 h 2 V 19 H 9 M 3,6 V 5 L 4,3 5,2 8,1 h 3 l 3,1 1,1 1,2 v 2 l -1,2 -1,1 -2,1 -3,1 M 3,6 H 4 V 5 L 5,3 8,2 h 3 l 3,1 1,2 v 2 l -1,2 -2,1 H 9 M 4,4 7,2 m 5,0 3,2 m 0,4 -4,3 M 9,10 v 5 h 1 v -4 "
    },
    {
      "dec": "8221",
      "width": "15",
      "d": "M 6,3 5,4 H 4 L 3,3 V 2 L 4,1 H 5 L 6,2 V 5 L 5,7 3,8 M 4,2 V 3 H 5 V 2 H 4 M 5,4 6,5 M 6,3 5,7 M 12,3 11,4 H 10 L 9,3 V 2 l 1,-1 h 1 l 1,1 V 5 L 11,7 9,8 m 1,-6 v 1 h 1 V 2 h -1 m 1,2 1,1 m 0,-2 -1,4 "
    },
    {
      "dec": "338",
      "width": "28",
      "d": "M 10,1 8,2 6,4 5,6 4,9 v 5 l 1,3 1,2 2,2 2,1 h 4 M 14,1 H 10 M 10,3 7,4 6,6 5,9 v 5 l 2,5 3,1 h 3 1 M 14,3 H 10 M 14,1 V 22 M 15,2 V 21 M 14,1 H 26 M 15,3 H 26 V 1 m -11,9 h 6 v 2 m -6,0 h 6 m -6,8 h 11 v 2 M 14,22 H 26 M 9,1 7,2 5,4 4,6 3,9 v 5 l 1,3 1,2 2,2 2,1 h 4 M 13,1 H 9 M 10,2 7,3 5,6 4,9 v 5 l 1,3 2,3 3,1 h 3 M 13,2 H 10 M 13,1 V 22 M 14,2 V 21 M 13,1 H 25 M 14,2 H 25 V 1 M 14,11 h 6 v 1 m -6,0 h 6 m -6,9 h 11 v 1 m -12,0 h 12 "
    },
    {
      "dec": "118",
      "width": "16",
      "d": "M 9,20 13,8 h 1 -1 M 3,8 9,22 14,8 9,22 H 8 M 3,8 H 4 L 9,20 M 2,8 8,22 M 2,8 H 3 M 13,8 8,22 M 13,8 H 12 L 8,20 "
    },
    {
      "dec": "126",
      "width": "24",
      "d": "M3,16 L3,14 4,11 6,10 8,10 10,11 14,14 16,15 18,15 20,14 21,12 M3,14 L4,12 6,11 8,11 10,12 14,15 16,16 18,16 20,15 21,12 21,10 "
    },
    {
      "dec": "42",
      "width": "16",
      "d": "M 9,1 H 8 l 2,11 -1,1 M 9,1 V 13 M 9,1 10,2 8,13 H 9 M 4,4 h 1 l 8,6 h 1 M 4,4 14,10 M 4,4 v 2 l 10,2 v 2 M 14,4 H 13 L 5,10 H 4 M 14,4 4,10 M 14,4 V 6 L 4,8 V 10 M 8,1 7,2 9,12 8,13 M 8,1 V 13 M 8,1 9,2 7,12 8,13 M 3,4 h 1 l 8,6 h 1 M 3,4 13,10 M 3,4 v 2 l 10,2 v 2 M 13,4 H 12 L 4,10 H 3 M 13,4 3,10 M 13,4 V 6 L 3,8 V 10 "
    },
    {
      "dec": "106",
      "width": "10",
      "d": "M 5,8 V 29 M 4,2 6,4 M 6,2 4,4 M 4,1 3,2 V 4 L 4,5 H 6 L 7,4 V 2 L 6,1 H 4 M 4,2 V 4 H 6 V 2 H 4 M 4,8 V 29 H 6 M 4,8 h 2 v 21 "
    },
    {
      "dec": "91",
      "width": "14",
      "d": "M4,-3 L4,29 M5,-3 L5,29 M4,-3 L11,-3 M4,29 L11,29 "
    },
    {
      "dec": "112",
      "width": "20",
      "d": "M 5,8 V 29 H 6 M 5,8 H 6 V 29 M 6,11 8,9 10,8 h 3 l 2,1 2,2 1,3 v 2 l -1,3 -2,2 -2,1 H 10 L 8,21 6,19 m 0,-5 1,-4 4,-1 3,1 2,1 1,3 v 2 l -1,3 -2,1 -3,1 L 7,20 6,17 M 4,8 V 29 H 5 M 4,8 H 5 V 29 M 5,11 7,9 9,8 h 3 l 2,1 2,2 1,3 v 2 l -1,3 -2,2 -2,1 H 9 L 7,21 5,19 M 5,11 9,9 h 3 l 2,1 1,1 1,3 v 2 l -1,3 -1,1 -2,1 H 9 L 5,19 "
    },
    {
      "dec": "41",
      "width": "14",
      "d": "m 3,-3 3,2 2,3 2,4 1,5 v 4 l -1,5 -2,4 -2,3 -3,2 m 3,-30 2,4 1,3 1,5 v 4 l -1,5 -1,3 -2,4 m -3,-30 2,2 2,3 2,4 1,5 v 4 l -1,5 -2,4 -2,3 -2,2 m 2,-30 2,4 1,3 1,5 v 4 l -1,5 -1,3 -2,4 "
    },
    {
      "dec": "78",
      "width": "22",
      "d": "M 18,2 V 22 L 5,1 v 20 0 M 4,1 H 6 V 1 L 17,19 M 4,1 V 22 M 6,4 V 22 H 4 M 17,1 V 19 M 17,1 h 2 M 6,4 17,22 h 2 V 1 1 "
    },
    {
      "dec": "59",
      "width": "12",
      "d": "M 7,11 5,9 m 2,0 -2,2 v 0 M 5,21 7,19 M 5,8 4,9 v 2 l 1,1 H 7 L 8,11 V 9 L 7,8 H 5 m 0,1 v 2 H 7 V 9 H 5 M 8,21 7,22 H 5 L 4,21 v -2 l 1,-1 h 2 l 1,1 v 4 L 7,25 5,26 M 8,21 7,25 M 8,23 7,22 v 2 l -2,2 m 0,-7 v 2 H 7 V 19 H 5 l 2,2 v 0 "
    },
    {
      "dec": "168",
      "width": "15",
      "d": "m 12,3 -2,2 m 0,-2 2,2 M 3,3 5,5 M 5,3 3,5 M 3,2 2,3 V 5 L 3,6 H 5 L 6,5 V 3 L 5,2 H 3 M 3,3 V 5 H 5 V 3 H 3 M 10,2 9,3 v 2 l 1,1 h 2 L 13,5 V 3 L 12,2 h -2 m 0,1 v 2 h 2 V 3 h -2 "
    },
    {
      "dec": "88",
      "width": "20",
      "d": "m 4,1 13,21 h 1 M 4,1 H 5 L 18,22 M 18,1 H 17 L 4,22 M 18,1 5,22 H 4 M 3,1 16,22 h 1 M 3,1 H 4 L 17,22 M 17,1 H 16 L 3,22 M 17,1 4,22 H 3 "
    },
    {
      "dec": "89",
      "width": "20",
      "d": "m 3,1 7,10 v 11 h 1 M 3,1 h 1 l 7,10 M 18,1 H 17 L 10,11 M 18,1 11,11 V 22 M 2,1 9,11 v 11 h 1 M 2,1 h 1 l 7,10 M 17,1 H 16 L 9,11 M 17,1 10,11 v 11 "
    },
    {
      "dec": "114",
      "width": "14",
      "d": "M 5,8 V 22 H 6 M 5,8 H 6 V 22 M 6,14 7,11 9,9 11,8 h 3 m -8,7 1,-2 1,-2 2,-1 h 4 V 8 M 4,8 V 22 H 5 M 4,8 H 5 V 22 M 5,14 6,11 8,9 10,8 h 3 m -8,6 1,-2 2,-2 2,-1 h 3 V 8 "
    },
    {
      "dec": "116",
      "width": "12",
      "d": "M 6,1 V 22 H 7 M 6,1 H 7 V 22 M 3,8 h 7 v 2 M 2,8 v 2 h 8 M 5,1 V 22 H 6 M 5,1 H 6 V 22 M 2,8 H 9 V 9 M 2,8 v 1 h 7 "
    },
    {
      "dec": "54",
      "width": "20",
      "d": "M 23,11 Z M 16,5 h 1 M 15,2 16,4 17,5 V 4 L 16,2 13,1 H 11 L 8,2 6,5 5,10 v 5 l 1,4 2,2 3,1 h 1 l 3,-1 2,-2 1,-3 V 15 L 17,12 15,10 12,9 H 11 L 8,10 6,12 M 16,3 13,2 H 10 L 7,4 M 9,2 7,5 6,10 v 5 l 1,4 3,2 m -4,-4 2,3 5,1 v 0 l 2,-1 2,-3 m -4,4 3,-2 1,-3 v -1 l -1,-3 -3,-2 m 4,4 -2,-3 -3,-1 h 1 L 7,11 6,14 M 9,10 7,12 6,15 M 14,2 15,4 16,5 15,2 12,1 H 10 L 7,2 5,5 4,10 v 5 l 1,4 2,2 3,1 h 1 l 3,-1 2,-2 1,-3 V 15 L 16,12 14,10 11,9 H 10 L 7,10 5,12 M 16,4 12,2 H 11 L 7,3 M 8,2 6,5 5,10 v 5 l 1,4 3,2 m -4,-4 2,3 3,1 h 1 l 3,-1 2,-3 m -5,4 4,-2 1,-3 v -1 l -1,-3 -3,-2 m 4,4 -2,-3 -5,-1 h 3 l -5,1 -2,3 m 4,-4 -3,2 -1,3 "
    },
    {
      "dec": "117",
      "width": "20",
      "d": "m 7,21 h 5 M 5,8 v 12 l 1,1 4,1 h 1 l 2,-1 3,-3 M 5,8 h 1 v 10 l 1,2 5,1 v 0 L 13,20 15,19 16,18 M 16,8 v 14 h 1 M 16,8 h 1 V 22 M 4,8 v 10 l 1,3 2,1 h 3 l 2,-1 3,-3 M 4,8 h 1 v 10 l 1,2 1,1 v 0 l 5,-1 2,-2 1,-2 m 0,-8 v 14 h 1 M 15,8 h 1 v 14 "
    },
    {
      "dec": "124",
      "width": "8",
      "d": "M4,-3 L4,29 "
    },
    {
      "dec": "77",
      "width": "24",
      "d": "M 13,22 5,3 V 21 M 5,1 13,20 M 20,3 V 21 M 20,5 13,22 H 12 L 5,5 V 5 M 6,7 V 22 H 4 V 1 l 9,21 v 0 M 4,1 H 5 M 21,1 12,22 M 19,7 v 15 h 2 V 1 M 12,20 20,1 h 1 v 0 "
    },
    {
      "dec": "123",
      "width": "14",
      "d": "M10,-3 L3,13 10,29 "
    },
    {
      "dec": "72",
      "width": "22",
      "d": "M 18,11 H 5 M 17,10 V 1 h 2 M 17,22 V 12 M 6,22 V 12 12 M 4,1 h 2 v 9 0 m 11,12 h 2 V 1 M 6,10 H 17 M 6,12 H 17 M 4,1 V 22 H 6 M 5,2 V 21 M 18,2 v 19 "
    },
    {
      "dec": "53",
      "width": "20",
      "d": "m 3,17 h 1 v 0 0 M 6,1 5,11 M 7,2 6,9 M 6,1 H 16 V 3 M 7,3 h 9 M 6,9 9,8 h 3 l 3,1 2,2 1,3 v 2 l -1,3 -2,2 -3,1 H 9 L 6,21 5,20 4,17 5,18 m 8,-9 3,2 1,3 v 2 l -1,3 -3,2 m 4,-4 -2,3 -7,1 h 5 L 6,20 5,18 M 8,21 5,19 M 17,13 15,10 12,9 H 10 L 6,10 5,11 H 4 v 0 0 M 5,1 4,10 M 6,2 5,9 M 5,1 H 15 V 2 M 6,2 h 9 M 5,9 8,8 h 3 l 3,1 2,2 1,3 v 2 l -1,3 -2,2 -3,1 H 8 L 5,21 4,20 3,18 v -1 m 1,-7 v 1 L 7,9 h 1 l 6,1 2,3 m -4,-4 3,2 1,3 v 2 l -1,3 -3,2 m 4,-4 -2,3 -3,1 H 8 L 5,20 4,19 m 3,2 -3,-3 "
    },
    {
      "dec": "52",
      "width": "20",
      "d": "m 14,4 v 18 h 1 M 15,1 V 22 M 14,4 5,17 m 1,-2 h 13 v 2 m 0,0 H 4 L 15,1 h -1 m -1,3 v 18 h 1 M 14,1 V 22 M 14,1 3,17 H 18 M 13,4 4,17 m 0,-1 h 14 v 1 "
    },
    {
      "dec": "40",
      "width": "14",
      "d": "M 12,-3 11,-2 10,-1 8,2 l -2,4 -1,5 v 4 l 1,5 2,4 2,3 2,2 m -2,-30 -2,4 -1,3 -1,5 v 4 l 1,5 1,3 2,4 m 2,-30 L 9,-1 7,2 5,6 4,11 v 4 l 1,5 2,4 2,3 3,2 M 9,-1 7,3 6,6 5,11 v 4 l 1,5 1,3 2,4 "
    },
    {
      "dec": "99",
      "width": "18",
      "d": "M 16,11 14,9 12,8 H 9 L 7,9 5,11 4,14 v 2 l 1,3 2,2 2,1 h 3 l 2,-1 2,-2 m 0,-8 -2,1 V 10 L 12,9 H 9 l -2,1 -1,1 -1,3 v 2 l 1,3 1,1 1,1 h 4 l 2,-1 v -2 l 2,1 M 15,11 13,9 11,8 H 8 L 6,9 4,11 3,14 v 2 l 1,3 2,2 2,1 h 3 l 2,-1 2,-2 M 16,11 14,12 13,10 10,9 8,10 6,11 H 5 l -1,3 v 2 l 1,3 h 1 l 2,1 2,1 3,-1 1,-2 2,1 "
    },
    {
      "dec": "127",
      "width": "16",
      "d": "M0,1 L0,22 1,22 1,1 2,1 2,22 3,22 3,1 4,1 4,22 5,22 5,1 6,1 6,22 7,22 7,1 8,1 8,22 9,22 9,1 10,1 10,22 11,22 11,1 12,1 12,22 13,22 13,1 14,1 14,22 15,22 15,1 16,1 16,22 "
    },
    {
      "dec": "39",
      "width": "10",
      "d": "M 4,2 6,4 M 6,2 4,4 M 7,4 6,5 H 4 L 3,4 V 2 L 4,1 H 6 L 7,2 V 6 L 6,8 4,9 M 4,2 V 4 H 6 V 2 H 4 M 7,4 6,8 M 7,6 6,5 V 7 L 4,9 "
    },
    {
      "dec": "92",
      "width": "14",
      "d": "M0,1 L14,25 "
    },
    {
      "dec": "107",
      "width": "18",
      "d": "m 9,15 6,7 M 5,1 V 22 H 6 M 5,1 H 6 V 22 M 17,8 H 16 L 6,18 M 17,8 6,19 m 5,-4 6,7 v 0 M 4,1 V 22 H 5 M 4,1 H 5 V 22 M 16,8 H 15 L 5,18 M 16,8 5,19 m 3,-4 6,7 h 3 m -7,-7 6,7 "
    },
    {
      "dec": "113",
      "width": "20",
      "d": "m 16,8 v 21 h 1 M 16,8 h 1 V 29 M 16,11 14,9 12,8 H 9 L 7,9 5,11 4,14 v 2 l 1,3 2,2 2,1 h 3 l 2,-1 2,-2 M 16,11 12,9 H 9 l -2,1 -1,1 -1,3 v 2 l 1,3 1,1 2,1 h 3 l 4,-2 M 15,8 v 21 h 1 M 15,8 h 1 V 29 M 15,11 13,9 11,8 H 8 L 6,9 4,11 3,14 v 2 l 1,3 2,2 2,1 h 3 l 2,-1 2,-2 m 0,-5 -1,-4 -4,-1 -3,1 -2,1 -1,3 v 2 l 1,3 2,1 3,1 4,-1 1,-3 "
    },
    {
      "dec": "67",
      "width": "22",
      "d": "m 17,6 h -1 l -1,-2 L 13,3 H 11 9 l -2,1 -1,2 -1,3 V 14 L 6,17 l 1,2 2,1 h 3 1 l 2,-1 1,-2 h 1 M 18,6 17,4 15,2 13,1 H 9 L 7,2 5,4 4,6 3,9 v 5 l 1,3 1,2 2,2 2,1 h 4 l 2,-1 2,-2 1,-2 M 18,6 H 17 L 16,4 15,3 13,2 H 9 L 7,3 5,6 4,9 v 5 l 1,3 2,3 2,1 h 4 l 2,-1 1,-1 1,-2 h 1 "
    }
  ]
}