<?xml version="1.0" encoding="UTF-8" standalone="no"?>
<svg
   xmlns:dc="http://purl.org/dc/elements/1.1/"
   xmlns:cc="http://creativecommons.org/ns#"
   xmlns:rdf="http://www.w3.org/1999/02/22-rdf-syntax-ns#"
   xmlns:svg="http://www.w3.org/2000/svg"
   xmlns="http://www.w3.org/2000/svg"
   xmlns:sodipodi="http://sodipodi.sourceforge.net/DTD/sodipodi-0.dtd"
   xmlns:inkscape="http://www.inkscape.org/namespaces/inkscape"
   data-dec="97"
   width="17"
   height="40"
   version="1.1"
   id="svg4"
   sodipodi:docname="97.svg"
   inkscape:version="0.92.4 (unknown)">
  <metadata
     id="metadata10">
    <rdf:RDF>
      <cc:Work
         rdf:about="">
        <dc:format>image/svg+xml</dc:format>
        <dc:type
           rdf:resource="http://purl.org/dc/dcmitype/StillImage" />
      </cc:Work>
    </rdf:RDF>
  </metadata>
  <defs
     id="defs8" />
  <sodipodi:namedview
     pagecolor="#ffffff"
     bordercolor="#666666"
     borderopacity="1"
     objecttolerance="10"
     gridtolerance="10"
     guidetolerance="10"
     inkscape:pageopacity="0"
     inkscape:pageshadow="2"
     inkscape:window-width="640"
     inkscape:window-height="480"
     id="namedview6"
     showgrid="false"
     inkscape:zoom="5.9"
     inkscape:cx="8.5"
     inkscape:cy="20"
     inkscape:window-x="0"
     inkscape:window-y="27"
     inkscape:window-maximized="0"
     inkscape:current-layer="svg4" />
  <path
     style="color:#000000;font-style:normal;font-variant:normal;font-weight:normal;font-stretch:normal;font-size:medium;line-height:normal;font-family:sans-serif;font-variant-ligatures:normal;font-variant-position:normal;font-variant-caps:normal;font-variant-numeric:normal;font-variant-alternates:normal;font-feature-settings:normal;text-indent:0;text-align:start;text-decoration:none;text-decoration-line:none;text-decoration-style:solid;text-decoration-color:#000000;letter-spacing:normal;word-spacing:normal;text-transform:none;writing-mode:lr-tb;direction:ltr;text-orientation:mixed;dominant-baseline:auto;baseline-shift:baseline;text-anchor:start;white-space:normal;shape-padding:0;clip-rule:nonzero;display:inline;overflow:visible;visibility:visible;opacity:1;isolation:auto;mix-blend-mode:normal;color-interpolation:sRGB;color-interpolation-filters:linearRGB;solid-color:#000000;solid-opacity:1;vector-effect:none;fill:#013272;fill-opacity:1;fill-rule:nonzero;stroke:none;stroke-width:3;stroke-linecap:round;stroke-linejoin:round;stroke-miterlimit:4;stroke-dasharray:none;stroke-dashoffset:0;stroke-opacity:1;color-rendering:auto;image-rendering:auto;shape-rendering:auto;text-rendering:auto;enable-background:accumulate"
     d="M 11.5,15.412109 A 1.50015,1.50015 0 0 1 11,15.5 H 5.3535156 L 4.1171875,16.117188 3.5,17.353516 v 1.292968 L 4.1171875,19.882812 5.3535156,20.5 H 7.7558594 L 10.189453,19.689453 11.5,18.378906 Z M 6,6.5 h 4 a 1.50015,1.50015 0 0 1 0.669922,0.1582031 l 2,1 a 1.50015,1.50015 0 0 1 0.671875,0.671875 L 14.25,10.148438 a 1.50015,1.50015 0 0 1 0.0059,0.01172 1.50015,1.50015 0 0 1 0.21875,0.541016 1.50015,1.50015 0 0 1 0.002,0.0078 1.50015,1.50015 0 0 1 0.02344,0.47461 v 1.574218 a 1.50015,1.50015 0 0 1 0,0.458985 v 5.429687 L 15.232422,20.111328 15.621094,20.5 H 16 a 1.50015,1.50015 0 1 1 0,3 h -1 a 1.50015,1.50015 0 0 1 -1.060547,-0.439453 l -1,-1 a 1.50015,1.50015 0 0 1 -0.28125,-0.390625 l -0.06836,-0.138672 -0.529297,0.529297 a 1.50015,1.50015 0 0 1 -0.585938,0.363281 l -2.9999996,1 A 1.50015,1.50015 0 0 1 8,23.5 H 5 A 1.50015,1.50015 0 0 1 4.3300781,23.341797 l -2,-1 a 1.50015,1.50015 0 0 1 -0.671875,-0.671875 l -0.99999998,-2 A 1.50015,1.50015 0 0 1 0.5,19 v -2 a 1.50015,1.50015 0 0 1 0.15820312,-0.669922 l 0.99999998,-2 a 1.50015,1.50015 0 0 1 0.671875,-0.671875 l 2,-1 A 1.50015,1.50015 0 0 1 5,12.5 h 5.646484 L 11.5,12.074219 V 11.353516 L 10.882812,10.117188 9.6464844,9.5 H 6.3535156 L 5.4980469,9.9277344 A 1.50015,1.50015 0 0 1 5.5,10 v 1 A 1.50015,1.50015 0 0 1 4,12.5 H 3 A 1.50015,1.50015 0 0 1 1.5,11 V 10 A 1.50015,1.50015 0 0 1 1.9394531,8.9394531 l 1,-1 a 1.50015,1.50015 0 0 1 0.390625,-0.28125 l 2,-1 A 1.50015,1.50015 0 0 1 6,6.5 Z"
     id="path2" />
</svg>
