<?xml version="1.0" encoding="UTF-8" standalone="no"?>
<svg
   xmlns:dc="http://purl.org/dc/elements/1.1/"
   xmlns:cc="http://creativecommons.org/ns#"
   xmlns:rdf="http://www.w3.org/1999/02/22-rdf-syntax-ns#"
   xmlns:svg="http://www.w3.org/2000/svg"
   xmlns="http://www.w3.org/2000/svg"
   xmlns:sodipodi="http://sodipodi.sourceforge.net/DTD/sodipodi-0.dtd"
   xmlns:inkscape="http://www.inkscape.org/namespaces/inkscape"
   data-dec="112"
   width="12"
   height="40"
   version="1.1"
   id="svg4"
   sodipodi:docname="112.svg"
   inkscape:version="0.92.4 5da689c313, 2019-01-14">
  <metadata
     id="metadata10">
    <rdf:RDF>
      <cc:Work
         rdf:about="">
        <dc:format>image/svg+xml</dc:format>
        <dc:type
           rdf:resource="http://purl.org/dc/dcmitype/StillImage" />
        <dc:title></dc:title>
      </cc:Work>
    </rdf:RDF>
  </metadata>
  <defs
     id="defs8" />
  <sodipodi:namedview
     pagecolor="#ffffff"
     bordercolor="#666666"
     borderopacity="1"
     objecttolerance="10"
     gridtolerance="10"
     guidetolerance="10"
     inkscape:pageopacity="0"
     inkscape:pageshadow="2"
     inkscape:window-width="1920"
     inkscape:window-height="1043"
     id="namedview6"
     showgrid="false"
     inkscape:zoom="5.9"
     inkscape:cx="6"
     inkscape:cy="20"
     inkscape:window-x="0"
     inkscape:window-y="37"
     inkscape:window-maximized="0"
     inkscape:current-layer="svg4" />
  <path
     style="color:#000000;font-style:normal;font-variant:normal;font-weight:normal;font-stretch:normal;font-size:medium;line-height:normal;font-family:sans-serif;font-variant-ligatures:normal;font-variant-position:normal;font-variant-caps:normal;font-variant-numeric:normal;font-variant-alternates:normal;font-feature-settings:normal;text-indent:0;text-align:start;text-decoration:none;text-decoration-line:none;text-decoration-style:solid;text-decoration-color:#000000;letter-spacing:normal;word-spacing:normal;text-transform:none;writing-mode:lr-tb;direction:ltr;text-orientation:mixed;dominant-baseline:auto;baseline-shift:baseline;text-anchor:start;white-space:normal;shape-padding:0;clip-rule:nonzero;display:inline;overflow:visible;visibility:visible;opacity:1;isolation:auto;mix-blend-mode:normal;color-interpolation:sRGB;color-interpolation-filters:linearRGB;solid-color:#000000;solid-opacity:1;vector-effect:none;fill:#000000;fill-opacity:1;fill-rule:nonzero;stroke:none;stroke-width:1.5;stroke-linecap:round;stroke-linejoin:round;stroke-miterlimit:4;stroke-dasharray:none;stroke-dashoffset:0;stroke-opacity:1;color-rendering:auto;image-rendering:auto;shape-rendering:auto;text-rendering:auto;enable-background:accumulate"
     d="M 5.9453125,8.75 4.9863281,9.5078125 3.9082031,11.216797 v 7.566406 L 4.9863281,20.492188 5.9453125,21.25 H 7.3183594 L 8.2753906,20.492188 9.3984375,18.712891 9.9863281,15.921875 V 13.115234 L 9.4199219,11.318359 8.2753906,9.5078125 7.3183594,8.75 Z M 3.1464844,7.2402344 a 0.750075,0.750075 0 0 1 0.5332031,0.2128906 0.750075,0.750075 0 0 1 0.00391,0.00195 0.750075,0.750075 0 0 1 0.00391,0.00391 0.750075,0.750075 0 0 1 0.046875,0.048828 0.750075,0.750075 0 0 1 0.00391,0.00586 0.750075,0.750075 0 0 1 0.1699219,0.609375 V 8.453125 a 0.750075,0.750075 0 0 1 0.046875,-0.041016 l 1.2636719,-1 A 0.750075,0.750075 0 0 1 5.6835938,7.25 H 7.578125 a 0.750075,0.750075 0 0 1 0.4667969,0.1621094 l 1.2636719,1 a 0.750075,0.750075 0 0 1 0.1679687,0.1875 l 1.2636715,1.9999996 a 0.750075,0.750075 0 0 1 0.08008,0.173829 l 0.63086,2 A 0.750075,0.750075 0 0 1 11.486328,13 v 3 a 0.750075,0.750075 0 0 1 -0.01563,0.154297 l -0.630859,3 a 0.750075,0.750075 0 0 1 -0.09961,0.246094 l -1.2636715,2 a 0.750075,0.750075 0 0 1 -0.1679687,0.1875 l -1.2636719,1 A 0.750075,0.750075 0 0 1 7.578125,22.75 H 5.6835938 A 0.750075,0.750075 0 0 1 5.21875,22.587891 l -1.2636719,-1 a 0.750075,0.750075 0 0 1 -0.046875,-0.04297 V 28.25 h 1.1445313 a 0.750075,0.750075 0 1 1 0,1.5 H 3.28125 a 0.750075,0.750075 0 0 1 -0.2460938,0 H 1.2636719 a 0.750075,0.750075 0 1 1 0,-1.5 h 1.1445312 v -9.166016 a 0.750075,0.750075 0 0 1 0,-0.177734 v -7.804688 a 0.750075,0.750075 0 0 1 0,-0.179687 V 8.75 H 1.2636719 a 0.750075,0.750075 0 1 1 0,-1.5 h 1.7714843 a 0.750075,0.750075 0 0 1 0.1113282,-0.00977 z"
     id="path2" />
</svg>
