<?xml version="1.0" encoding="UTF-8"?>
<glyph name="four" format="1">
  <advance width="578"/>
  <unicode hex="0034"/>
  <outline>
    <contour>
      <point x="348" y="415" type="line"/>
      <point x="240" y="260" type="line"/>
      <point x="348" y="260" type="line"/>
    </contour>
    <contour>
      <point x="405" y="666" type="curve" smooth="yes"/>
      <point x="408" y="666" type="line"/>
      <point x="410" y="666" type="line"/>
      <point x="430" y="666" type="line"/>
      <point x="434" y="666" type="line" smooth="yes"/>
      <point x="448" y="666"/>
      <point x="462" y="653"/>
      <point x="463" y="639" type="curve" smooth="yes"/>
      <point x="463" y="637" type="line"/>
      <point x="463" y="636" type="line"/>
      <point x="463" y="260" type="line"/>
      <point x="550" y="260" type="line" smooth="yes"/>
      <point x="566" y="260"/>
      <point x="579" y="247"/>
      <point x="579" y="231" type="curve" smooth="yes"/>
      <point x="579" y="178" type="line" smooth="yes"/>
      <point x="579" y="177"/>
      <point x="580" y="174"/>
      <point x="580" y="173" type="curve" smooth="yes"/>
      <point x="580" y="166"/>
      <point x="575" y="157"/>
      <point x="571" y="153" type="curve" smooth="yes"/>
      <point x="567" y="149"/>
      <point x="557" y="144"/>
      <point x="550" y="144" type="curve" smooth="yes"/>
      <point x="546" y="144" type="line"/>
      <point x="526" y="144" type="line"/>
      <point x="521" y="144" type="line"/>
      <point x="516" y="144" type="line"/>
      <point x="463" y="144" type="line"/>
      <point x="463" y="33" type="line"/>
      <point x="463" y="29" type="line" smooth="yes"/>
      <point x="463" y="22"/>
      <point x="459" y="13"/>
      <point x="455" y="9" type="curve"/>
      <point x="455" y="8" type="line"/>
      <point x="451" y="4"/>
      <point x="441" y="-1"/>
      <point x="434" y="-1" type="curve" smooth="yes"/>
      <point x="433" y="-1"/>
      <point x="430" y="0"/>
      <point x="429" y="0" type="curve" smooth="yes"/>
      <point x="410" y="0" type="line" smooth="yes"/>
      <point x="409" y="0"/>
      <point x="406" y="-1"/>
      <point x="405" y="-1" type="curve" smooth="yes"/>
      <point x="404" y="-1"/>
      <point x="401" y="0"/>
      <point x="400" y="0" type="curve" smooth="yes"/>
      <point x="376" y="0" type="line" smooth="yes"/>
      <point x="360" y="0"/>
      <point x="348" y="13"/>
      <point x="348" y="29" type="curve" smooth="yes"/>
      <point x="348" y="144" type="line"/>
      <point x="148" y="144" type="line"/>
      <point x="144" y="144" type="line"/>
      <point x="141" y="144" type="line"/>
      <point x="120" y="144" type="line"/>
      <point x="116" y="144" type="line"/>
      <point x="111" y="144" type="line"/>
      <point x="87" y="144" type="line" smooth="yes"/>
      <point x="71" y="144"/>
      <point x="58" y="157"/>
      <point x="58" y="173" type="curve" smooth="yes"/>
      <point x="58" y="179"/>
      <point x="60" y="185"/>
      <point x="63" y="189" type="curve" smooth="yes"/>
      <point x="378" y="649" type="line" smooth="yes"/>
      <point x="379" y="651"/>
      <point x="382" y="655"/>
      <point x="384" y="657" type="curve" smooth="yes"/>
      <point x="385" y="657" type="line"/>
      <point x="389" y="661"/>
      <point x="398" y="666"/>
    </contour>
  </outline>
  <lib>
    <dict>
      <key>com.fontlab.hintData</key>
      <dict>
        <key>hhints</key>
        <array>
          <dict>
            <key>position</key>
            <integer>-1</integer>
            <key>width</key>
            <integer>23</integer>
          </dict>
          <dict>
            <key>position</key>
            <integer>144</integer>
            <key>width</key>
            <integer>116</integer>
          </dict>
          <dict>
            <key>position</key>
            <integer>644</integer>
            <key>width</key>
            <integer>22</integer>
          </dict>
        </array>
        <key>vhints</key>
        <array>
          <dict>
            <key>position</key>
            <integer>348</integer>
            <key>width</key>
            <integer>116</integer>
          </dict>
        </array>
      </dict>
    </dict>
  </lib>
</glyph>
