<?xml version="1.0" encoding="UTF-8" standalone="no"?>
<svg
   xmlns:dc="http://purl.org/dc/elements/1.1/"
   xmlns:cc="http://creativecommons.org/ns#"
   xmlns:rdf="http://www.w3.org/1999/02/22-rdf-syntax-ns#"
   xmlns:svg="http://www.w3.org/2000/svg"
   xmlns="http://www.w3.org/2000/svg"
   xmlns:sodipodi="http://sodipodi.sourceforge.net/DTD/sodipodi-0.dtd"
   xmlns:inkscape="http://www.inkscape.org/namespaces/inkscape"
   data-dec="63"
   width="20"
   height="40"
   version="1.1"
   id="svg4"
   sodipodi:docname="63.svg"
   inkscape:version="0.92.4 (unknown)">
  <metadata
     id="metadata10">
    <rdf:RDF>
      <cc:Work
         rdf:about="">
        <dc:format>image/svg+xml</dc:format>
        <dc:type
           rdf:resource="http://purl.org/dc/dcmitype/StillImage" />
      </cc:Work>
    </rdf:RDF>
  </metadata>
  <defs
     id="defs8" />
  <sodipodi:namedview
     pagecolor="#ffffff"
     bordercolor="#666666"
     borderopacity="1"
     objecttolerance="10"
     gridtolerance="10"
     guidetolerance="10"
     inkscape:pageopacity="0"
     inkscape:pageshadow="2"
     inkscape:window-width="640"
     inkscape:window-height="480"
     id="namedview6"
     showgrid="false"
     inkscape:zoom="5.9"
     inkscape:cx="10"
     inkscape:cy="20"
     inkscape:window-x="0"
     inkscape:window-y="27"
     inkscape:window-maximized="0"
     inkscape:current-layer="svg4" />
  <path
     style="color:#000000;font-style:normal;font-variant:normal;font-weight:normal;font-stretch:normal;font-size:medium;line-height:normal;font-family:sans-serif;font-variant-ligatures:normal;font-variant-position:normal;font-variant-caps:normal;font-variant-numeric:normal;font-variant-alternates:normal;font-feature-settings:normal;text-indent:0;text-align:start;text-decoration:none;text-decoration-line:none;text-decoration-style:solid;text-decoration-color:#000000;letter-spacing:normal;word-spacing:normal;text-transform:none;writing-mode:lr-tb;direction:ltr;text-orientation:mixed;dominant-baseline:auto;baseline-shift:baseline;text-anchor:start;white-space:normal;shape-padding:0;clip-rule:nonzero;display:inline;overflow:visible;visibility:visible;opacity:1;isolation:auto;mix-blend-mode:normal;color-interpolation:sRGB;color-interpolation-filters:linearRGB;solid-color:#000000;solid-opacity:1;vector-effect:none;fill:#013272;fill-opacity:1;fill-rule:nonzero;stroke:none;stroke-width:0.30000001;stroke-linecap:round;stroke-linejoin:round;stroke-miterlimit:4;stroke-dasharray:none;stroke-dashoffset:0;stroke-opacity:1;color-rendering:auto;image-rendering:auto;shape-rendering:auto;text-rendering:auto;enable-background:accumulate"
     d="m 9.1503906,20.150391 v 0.699218 H 9.8496094 V 20.150391 Z M 8.9980469,19.847656 a 0.15001501,0.15001501 0 0 1 0.029297,0.002 H 10 A 0.15001501,0.15001501 0 0 1 10.150391,20 v 1 A 0.15001501,0.15001501 0 0 1 10,21.150391 H 9 A 0.15001501,0.15001501 0 0 1 8.8496094,21 v -0.982422 a 0.15001501,0.15001501 0 0 1 0.00977,-0.07227 0.15001501,0.15001501 0 0 1 0,-0.002 0.15001501,0.15001501 0 0 1 0.00586,-0.01172 0.15001501,0.15001501 0 0 1 0,-0.002 0.15001501,0.15001501 0 0 1 0.015625,-0.02344 0.15001501,0.15001501 0 0 1 0,-0.002 0.15001501,0.15001501 0 0 1 0.00586,-0.0039 0.15001501,0.15001501 0 0 1 0.015625,-0.01563 0.15001501,0.15001501 0 0 1 0.023437,-0.01758 0.15001501,0.15001501 0 0 1 0.029297,-0.01172 0.15001501,0.15001501 0 0 1 0.027344,-0.0059 0.15001501,0.15001501 0 0 1 0.00195,0 0.15001501,0.15001501 0 0 1 0.013672,-0.002 z m 0.0625,-0.697265 -0.9101563,0.912109 v 0.875 L 9.0625,21.849609 h 0.875 L 10.849609,20.9375 v -0.875 L 9.9375,19.150391 Z m -0.064453,-0.302735 a 0.15001501,0.15001501 0 0 1 0.015625,0.002 H 10 a 0.15001501,0.15001501 0 0 1 0.105469,0.04492 l 1,1 A 0.15001501,0.15001501 0 0 1 11.150391,20 v 1 a 0.15001501,0.15001501 0 0 1 -0.04492,0.105469 l -1,1 A 0.15001501,0.15001501 0 0 1 10,22.150391 H 9 a 0.15001501,0.15001501 0 0 1 -0.1054688,-0.04492 l -1,-1 A 0.15001501,0.15001501 0 0 1 7.8496094,21 v -1 a 0.15001501,0.15001501 0 0 1 0.044922,-0.105469 l 0.9785157,-0.976562 a 0.15001501,0.15001501 0 0 1 0.00195,-0.0039 0.15001501,0.15001501 0 0 1 0.017578,-0.01953 0.15001501,0.15001501 0 0 1 0.00977,-0.0078 0.15001501,0.15001501 0 0 1 0.023437,-0.01758 0.15001501,0.15001501 0 0 1 0.00195,-0.002 0.15001501,0.15001501 0 0 1 0.00586,-0.002 0.15001501,0.15001501 0 0 1 0.025391,-0.0098 0.15001501,0.15001501 0 0 1 0.023437,-0.0059 0.15001501,0.15001501 0 0 1 0.00195,0 0.15001501,0.15001501 0 0 1 0.011719,-0.002 z m 0.1542968,-6.697265 v 2.699218 H 9.8496094 V 12.150391 Z M 13.982422,2.8476562 a 0.15001501,0.15001501 0 0 1 0.01563,0 0.15001501,0.15001501 0 0 1 0.107422,0.046875 l 1,1 A 0.15001501,0.15001501 0 0 1 15.150391,4 v 4 a 0.15001501,0.15001501 0 0 1 -0.04492,0.1054688 l -1,1 A 0.15001501,0.15001501 0 1 1 13.894531,8.8945312 L 14.849609,7.9375 V 4.0625 L 13.894531,3.1054688 a 0.15001501,0.15001501 0 0 1 0.08789,-0.2578126 z m -1.027344,-1.0390624 0.111328,0.056641 a 0.15001501,0.15001501 0 0 1 0.06836,0.068359 l 1,2 A 0.15001501,0.15001501 0 0 1 14.150391,4 v 4 a 0.15001501,0.15001501 0 0 1 -0.01563,0.066406 l -1,1.9999998 a 0.15001501,0.15001501 0 0 1 -0.0293,0.03906 l -0.34961,0.349609 1.15625,-0.5781249 0.964844,-0.9648437 0.972656,-1.9472656 V 5.0351562 L 14.876953,3.0878906 13.919922,2.1308594 Z M 6.984375,0.84960938 a 0.15001501,0.15001501 0 0 1 0.015625,0 H 10.980469 11 a 0.15001501,0.15001501 0 0 1 0.0098,0 0.15001501,0.15001501 0 0 1 0.0078,0.001953 0.15001501,0.15001501 0 0 1 0.0078,0 0.15001501,0.15001501 0 0 1 0.0078,0.001953 0.15001501,0.15001501 0 0 1 0.0332,0.0117188 l 2.980469,0.99218752 a 0.15001501,0.15001501 0 0 1 0.05859,0.037109 l 1,1 a 0.15001501,0.15001501 0 0 1 0.0293,0.039063 l 1,2 A 0.15001501,0.15001501 0 0 1 16.150391,5 v 2 a 0.15001501,0.15001501 0 0 1 -0.01563,0.066406 l -1,2 a 0.15001501,0.15001501 0 0 1 -0.0293,0.039063 l -1,1.0000002 a 0.15001501,0.15001501 0 0 1 -0.03906,0.0293 l -1.992187,0.996093 a 0.15001501,0.15001501 0 0 1 -0.01367,0.0078 l -0.0039,0.002 -1.90625,0.953125 V 15 A 0.15001501,0.15001501 0 0 1 10,15.150391 H 9 A 0.15001501,0.15001501 0 0 1 8.8496094,15 v -2.982422 a 0.15001501,0.15001501 0 0 1 0.00977,-0.07227 0.15001501,0.15001501 0 0 1 0,-0.002 0.15001501,0.15001501 0 0 1 0.00586,-0.01172 0.15001501,0.15001501 0 0 1 0,-0.002 0.15001501,0.15001501 0 0 1 0.015625,-0.02344 0.15001501,0.15001501 0 0 1 0,-0.002 0.15001501,0.15001501 0 0 1 0.00586,-0.0039 0.15001501,0.15001501 0 0 1 0.068359,-0.04492 0.15001501,0.15001501 0 0 1 0.027344,-0.0059 0.15001501,0.15001501 0 0 1 0.00195,0 0.15001501,0.15001501 0 0 1 0.042969,0 h 0.9375 L 11.914062,10.875 12.876953,9.9121094 13.849609,7.9648438 V 4.0351562 L 12.888672,2.1113281 10.964844,1.1503906 H 7.0351562 L 5.0878906,2.1230469 4.1230469,3.0878906 3.1503906,5.0351562 V 6.8496094 H 4.8496094 V 5.1503906 H 4.1503906 V 6 A 0.1503906,0.1503906 0 1 1 3.8496094,6 V 5 A 0.15001501,0.15001501 0 0 1 4,4.8496094 H 5 A 0.15001501,0.15001501 0 0 1 5.1503906,5 V 7 A 0.15001501,0.15001501 0 0 1 5,7.1503906 H 3 A 0.15001501,0.15001501 0 0 1 2.8496094,7 V 5 a 0.15001501,0.15001501 0 0 1 0.015625,-0.066406 l 1,-2 a 0.15001501,0.15001501 0 0 1 0.029297,-0.039063 l 1,-1 a 0.15001501,0.15001501 0 0 1 0.039063,-0.029297 l 2,-1.00000002 a 0.15001501,0.15001501 0 0 1 0.050781,-0.015625 z"
     id="path2" />
</svg>
