<?xml version="1.0" encoding="UTF-8" standalone="no"?>
<svg
   xmlns:dc="http://purl.org/dc/elements/1.1/"
   xmlns:cc="http://creativecommons.org/ns#"
   xmlns:rdf="http://www.w3.org/1999/02/22-rdf-syntax-ns#"
   xmlns:svg="http://www.w3.org/2000/svg"
   xmlns="http://www.w3.org/2000/svg"
   xmlns:sodipodi="http://sodipodi.sourceforge.net/DTD/sodipodi-0.dtd"
   xmlns:inkscape="http://www.inkscape.org/namespaces/inkscape"
   data-dec="103"
   width="15"
   height="40"
   version="1.1"
   id="svg4"
   sodipodi:docname="103.svg"
   inkscape:version="0.92.4 5da689c313, 2019-01-14">
  <metadata
     id="metadata10">
    <rdf:RDF>
      <cc:Work
         rdf:about="">
        <dc:format>image/svg+xml</dc:format>
        <dc:type
           rdf:resource="http://purl.org/dc/dcmitype/StillImage" />
        <dc:title></dc:title>
      </cc:Work>
    </rdf:RDF>
  </metadata>
  <defs
     id="defs8" />
  <sodipodi:namedview
     pagecolor="#ffffff"
     bordercolor="#666666"
     borderopacity="1"
     objecttolerance="10"
     gridtolerance="10"
     guidetolerance="10"
     inkscape:pageopacity="0"
     inkscape:pageshadow="2"
     inkscape:window-width="1920"
     inkscape:window-height="1043"
     id="namedview6"
     showgrid="false"
     inkscape:zoom="5.9"
     inkscape:cx="7.5"
     inkscape:cy="20"
     inkscape:window-x="0"
     inkscape:window-y="37"
     inkscape:window-maximized="0"
     inkscape:current-layer="svg4" />
  <path
     style="color:#000000;font-style:normal;font-variant:normal;font-weight:normal;font-stretch:normal;font-size:medium;line-height:normal;font-family:sans-serif;font-variant-ligatures:normal;font-variant-position:normal;font-variant-caps:normal;font-variant-numeric:normal;font-variant-alternates:normal;font-feature-settings:normal;text-indent:0;text-align:start;text-decoration:none;text-decoration-line:none;text-decoration-style:solid;text-decoration-color:#000000;letter-spacing:normal;word-spacing:normal;text-transform:none;writing-mode:lr-tb;direction:ltr;text-orientation:mixed;dominant-baseline:auto;baseline-shift:baseline;text-anchor:start;white-space:normal;shape-padding:0;clip-rule:nonzero;display:inline;overflow:visible;visibility:visible;opacity:1;isolation:auto;mix-blend-mode:normal;color-interpolation:sRGB;color-interpolation-filters:linearRGB;solid-color:#000000;solid-opacity:1;vector-effect:none;fill:#000000;fill-opacity:1;fill-rule:nonzero;stroke:none;stroke-width:0.5;stroke-linecap:round;stroke-linejoin:round;stroke-miterlimit:4;stroke-dasharray:none;stroke-dashoffset:0;stroke-opacity:1;color-rendering:auto;image-rendering:auto;shape-rendering:auto;text-rendering:auto;enable-background:accumulate"
     d="M 3.4296875,24.923828 3.2050781,25.148438 2.25,27.058594 v 0.882812 l 0.9355469,1.873047 0.5917969,0.294922 -1,-1.998047 A 0.250025,0.250025 0 0 1 2.75,28 v -1 a 0.250025,0.250025 0 0 1 0.013672,-0.07813 z M 4.8515625,23.503906 4.2167969,24.138672 3.25,27.041016 v 0.90039 L 4.2050781,29.851562 5.1054688,30.75 H 9.9414062 L 11.814453,29.814453 12.75,27.941406 v -0.83789 l -1.880859,-1.88086 z M 3.25,21.056641 v 0.839843 l 0.8808594,0.88086 0.5722656,0.164062 0.1191406,-0.11914 a 0.250025,0.250025 0 0 1 0.4121094,0.269531 l 5.833984,1.667969 a 0.250025,0.250025 0 0 1 0.109375,0.0625 l 0.908204,0.908203 -0.291016,-0.582031 -0.925781,-0.925782 -6.9375004,-1.982422 A 0.250025,0.250025 0 0 1 3.7773438,22.111328 Z M 9.5703125,9.9238281 10.236328,11.921875 A 0.250025,0.250025 0 0 1 10.25,12 v 3 a 0.250025,0.250025 0 0 1 -0.01367,0.07813 L 9.5703125,17.076172 9.7949219,16.851562 10.75,14.941406 V 12.058594 L 9.796875,10.150391 a 0.250025,0.250025 0 0 1 -0.00195,-0.002 l -0.00391,-0.0039 z m -6.140625,0 L 3.2050781,10.148438 2.25,12.058594 v 2.882812 l 0.9550781,1.910156 0.2246094,0.22461 -0.6660156,-1.998047 A 0.250025,0.250025 0 0 1 2.75,15 v -3 a 0.250025,0.250025 0 0 1 0.013672,-0.07813 z M 6.0566406,8.25 4.2050781,9.1777344 3.25,12.041016 v 2.917968 l 0.9550781,2.863282 0.953125,0.478515 L 6.0585938,18.75 H 6.9414062 L 8.796875,17.822266 9.75,14.958984 V 12.041016 L 8.7949219,9.1777344 6.9433594,8.25 Z M 6.0019531,7.7480469 A 0.250025,0.250025 0 0 1 6.0253906,7.75 h 0.9414063 a 0.250025,0.250025 0 0 1 0.048828,0 0.250025,0.250025 0 0 1 0.00195,0 0.250025,0.250025 0 0 1 0.00195,0 0.250025,0.250025 0 0 1 0.041016,0.00781 0.250025,0.250025 0 0 1 0.029297,0.00781 0.250025,0.250025 0 0 1 0.052734,0.027344 l 1.96875,0.984375 a 0.250025,0.250025 0 0 1 0.00586,0.00195 0.250025,0.250025 0 0 1 0.013672,0.00781 0.250025,0.250025 0 0 1 0.00781,0.00391 0.250025,0.250025 0 0 1 0.011719,0.00977 0.250025,0.250025 0 0 1 0.00781,0.00586 0.250025,0.250025 0 0 1 0.011719,0.00977 0.250025,0.250025 0 0 1 0.00781,0.00586 0.250025,0.250025 0 0 1 0.00977,0.011719 L 10,9.6445312 11.822266,7.8222656 a 0.250025,0.250025 0 0 1 0.355468,0 l 1,1 A 0.250025,0.250025 0 0 1 13.25,9 v 1 a 0.250025,0.250025 0 0 1 -0.427734,0.177734 l -1,-0.9999996 A 0.25135412,0.25135412 0 1 1 12.177734,8.8222656 L 12.75,9.3945312 V 9.1035156 L 12,8.3554688 10.304688,10.050781 11.222656,11.888672 A 0.250025,0.250025 0 0 1 11.25,12 v 3 a 0.250025,0.250025 0 0 1 -0.02734,0.111328 l -1,2 a 0.250025,0.250025 0 0 1 -0.04492,0.06641 l -0.9843746,0.982422 a 0.250025,0.250025 0 0 1 -0.00781,0.0098 l -0.00781,0.0078 a 0.250025,0.250025 0 0 1 -0.019531,0.01758 0.250025,0.250025 0 0 1 -0.00391,0.002 0.250025,0.250025 0 0 1 -0.078125,0.04297 0.250025,0.250025 0 0 1 -0.00586,0.002 L 7.1113281,19.222656 A 0.250025,0.250025 0 0 1 7,19.25 H 6.0332031 a 0.250025,0.250025 0 0 1 -0.00781,0 0.250025,0.250025 0 0 1 -0.041016,0 H 4.1054688 l -0.8007813,0.798828 0.8691406,1.740234 6.8945309,1.970704 a 0.250025,0.250025 0 0 1 0.109375,0.0625 l 1,1 a 0.250025,0.250025 0 0 1 0.04492,0.06641 l 0.984375,1.970703 a 0.250025,0.250025 0 0 1 0.01172,0.02148 l 0.0039,0.0078 a 0.250025,0.250025 0 0 1 0.0078,0.01367 0.250025,0.250025 0 0 1 0.0039,0.0098 0.250025,0.250025 0 0 1 0.0039,0.01367 0.250025,0.250025 0 0 1 0.01172,0.09961 V 28 a 0.250025,0.250025 0 0 1 -0.02734,0.111328 l -1,2 a 0.250025,0.250025 0 0 1 -0.111328,0.111328 l -2,1 A 0.250025,0.250025 0 0 1 10,31.25 H 5.0390625 a 0.250025,0.250025 0 0 1 -0.1289063,-0.01563 0.250025,0.250025 0 0 1 -0.00586,-0.002 0.250025,0.250025 0 0 1 -0.042969,-0.02344 L 2.8886719,30.222656 A 0.250025,0.250025 0 0 1 2.7773438,30.111328 l -1,-2 A 0.250025,0.250025 0 0 1 1.75,28 v -1 a 0.250025,0.250025 0 0 1 0.027344,-0.111328 l 1,-2 a 0.250025,0.250025 0 0 1 0.044922,-0.06641 l 0.984375,-0.982422 a 0.250025,0.250025 0 0 1 0.025391,-0.02734 l 0.00977,-0.0078 0.4570312,-0.458985 -0.3671875,-0.105469 a 0.250025,0.250025 0 0 1 -0.109375,-0.0625 l -1,-1 A 0.250025,0.250025 0 0 1 2.75,22 v -1.996094 a 0.250025,0.250025 0 0 1 0,-0.0039 0.250025,0.250025 0 0 1 0,-0.02148 0.250025,0.250025 0 0 1 0.017578,-0.07227 0.250025,0.250025 0 0 1 0.011719,-0.02344 0.250025,0.250025 0 0 1 0.027344,-0.04102 0.250025,0.250025 0 0 1 0.015625,-0.01953 l 0.9804688,-0.980469 a 0.250025,0.250025 0 0 1 0.019531,-0.01953 0.250025,0.250025 0 0 1 0.00391,-0.002 A 0.250025,0.250025 0 0 1 4,18.75 H 4.9433594 L 3.8886719,18.222656 a 0.250025,0.250025 0 0 1 -0.019531,-0.0098 0.250025,0.250025 0 0 1 -0.00781,-0.0039 0.250025,0.250025 0 0 1 -0.011719,-0.0098 0.250025,0.250025 0 0 1 -0.00781,-0.0059 0.250025,0.250025 0 0 1 -0.011719,-0.0098 0.250025,0.250025 0 0 1 -0.00781,-0.0059 L 3.8125,18.166016 2.8222656,17.177734 a 0.250025,0.250025 0 0 1 -0.044922,-0.06641 l -1,-2 A 0.250025,0.250025 0 0 1 1.75,15 v -3 a 0.250025,0.250025 0 0 1 0.027344,-0.111328 l 1,-2.0000001 a 0.250025,0.250025 0 0 1 0.044922,-0.066406 l 1,-1 a 0.250025,0.250025 0 0 1 0.00391,-0.00195 0.250025,0.250025 0 0 1 0.019531,-0.017578 0.250025,0.250025 0 0 1 0.021484,-0.013672 0.250025,0.250025 0 0 1 0.021484,-0.011719 L 5.8515625,7.796875 a 0.250025,0.250025 0 0 1 0.074219,-0.037109 0.250025,0.250025 0 0 1 0.025391,-0.00586 0.250025,0.250025 0 0 1 0.023437,-0.00391 0.250025,0.250025 0 0 1 0.00195,0 0.250025,0.250025 0 0 1 0.025391,-0.00195 z"
     id="path2" />
</svg>
