<?xml version="1.0" encoding="UTF-8"?>
<glyph name="exclam" format="1">
  <advance width="289"/>
  <unicode hex="0021"/>
  <outline>
    <contour>
      <point x="144" y="116" type="curve" smooth="yes"/>
      <point x="145" y="116" type="line"/>
      <point x="147" y="116" type="line" smooth="yes"/>
      <point x="155" y="115"/>
      <point x="164" y="109"/>
      <point x="168" y="103" type="curve" smooth="yes"/>
      <point x="195" y="78" type="line" smooth="yes"/>
      <point x="199" y="74"/>
      <point x="202" y="64"/>
      <point x="202" y="57" type="curve" smooth="yes"/>
      <point x="202" y="50"/>
      <point x="199" y="41"/>
      <point x="195" y="37" type="curve" smooth="yes"/>
      <point x="165" y="8" type="line" smooth="yes"/>
      <point x="161" y="4"/>
      <point x="152" y="0"/>
      <point x="145" y="0" type="curve" smooth="yes"/>
      <point x="138" y="0"/>
      <point x="128" y="4"/>
      <point x="124" y="8" type="curve" smooth="yes"/>
      <point x="96" y="37" type="line" smooth="yes"/>
      <point x="92" y="41"/>
      <point x="87" y="50"/>
      <point x="87" y="57" type="curve" smooth="yes"/>
      <point x="87" y="64"/>
      <point x="92" y="74"/>
      <point x="96" y="78" type="curve" smooth="yes"/>
      <point x="121" y="103" type="line" smooth="yes"/>
      <point x="125" y="110"/>
      <point x="136" y="116"/>
    </contour>
    <contour>
      <point x="144" y="666" type="curve" smooth="yes"/>
      <point x="145" y="666" type="line" smooth="yes"/>
      <point x="161" y="666"/>
      <point x="174" y="653"/>
      <point x="174" y="637" type="curve" smooth="yes"/>
      <point x="174" y="231" type="line" smooth="yes"/>
      <point x="174" y="215"/>
      <point x="161" y="201"/>
      <point x="145" y="201" type="curve" smooth="yes"/>
      <point x="129" y="201"/>
      <point x="116" y="215"/>
      <point x="116" y="231" type="curve" smooth="yes"/>
      <point x="116" y="637" type="line" smooth="yes"/>
      <point x="116" y="652"/>
      <point x="129" y="666"/>
    </contour>
  </outline>
  <lib>
    <dict>
      <key>com.fontlab.hintData</key>
      <dict>
        <key>hhints</key>
        <array>
          <dict>
            <key>position</key>
            <integer>0</integer>
            <key>width</key>
            <integer>116</integer>
          </dict>
          <dict>
            <key>position</key>
            <integer>644</integer>
            <key>width</key>
            <integer>22</integer>
          </dict>
        </array>
        <key>vhints</key>
        <array>
          <dict>
            <key>position</key>
            <integer>87</integer>
            <key>width</key>
            <integer>116</integer>
          </dict>
          <dict>
            <key>position</key>
            <integer>116</integer>
            <key>width</key>
            <integer>58</integer>
          </dict>
        </array>
      </dict>
    </dict>
  </lib>
</glyph>
