<?xml version="1.0" encoding="UTF-8" standalone="no"?>
<svg
   xmlns:dc="http://purl.org/dc/elements/1.1/"
   xmlns:cc="http://creativecommons.org/ns#"
   xmlns:rdf="http://www.w3.org/1999/02/22-rdf-syntax-ns#"
   xmlns:svg="http://www.w3.org/2000/svg"
   xmlns="http://www.w3.org/2000/svg"
   xmlns:sodipodi="http://sodipodi.sourceforge.net/DTD/sodipodi-0.dtd"
   xmlns:inkscape="http://www.inkscape.org/namespaces/inkscape"
   data-dec="40"
   width="14"
   height="40"
   version="1.1"
   id="svg4"
   sodipodi:docname="40.svg"
   inkscape:version="0.92.4 (unknown)">
  <metadata
     id="metadata10">
    <rdf:RDF>
      <cc:Work
         rdf:about="">
        <dc:format>image/svg+xml</dc:format>
        <dc:type
           rdf:resource="http://purl.org/dc/dcmitype/StillImage" />
      </cc:Work>
    </rdf:RDF>
  </metadata>
  <defs
     id="defs8" />
  <sodipodi:namedview
     pagecolor="#ffffff"
     bordercolor="#666666"
     borderopacity="1"
     objecttolerance="10"
     gridtolerance="10"
     guidetolerance="10"
     inkscape:pageopacity="0"
     inkscape:pageshadow="2"
     inkscape:window-width="615"
     inkscape:window-height="417"
     id="namedview6"
     showgrid="false"
     inkscape:zoom="5.9"
     inkscape:cx="7"
     inkscape:cy="20"
     inkscape:window-x="0"
     inkscape:window-y="27"
     inkscape:window-maximized="0"
     inkscape:current-layer="svg4" />
  <path
     style="color:#000000;font-style:normal;font-variant:normal;font-weight:normal;font-stretch:normal;font-size:medium;line-height:normal;font-family:sans-serif;font-variant-ligatures:normal;font-variant-position:normal;font-variant-caps:normal;font-variant-numeric:normal;font-variant-alternates:normal;font-feature-settings:normal;text-indent:0;text-align:start;text-decoration:none;text-decoration-line:none;text-decoration-style:solid;text-decoration-color:#000000;letter-spacing:normal;word-spacing:normal;text-transform:none;writing-mode:lr-tb;direction:ltr;text-orientation:mixed;dominant-baseline:auto;baseline-shift:baseline;text-anchor:start;white-space:normal;shape-padding:0;clip-rule:nonzero;display:inline;overflow:visible;visibility:visible;opacity:1;isolation:auto;mix-blend-mode:normal;color-interpolation:sRGB;color-interpolation-filters:linearRGB;solid-color:#000000;solid-opacity:1;vector-effect:none;fill:#013272;fill-opacity:1;fill-rule:nonzero;stroke:none;stroke-width:1;stroke-linecap:round;stroke-linejoin:round;stroke-miterlimit:4;stroke-dasharray:none;stroke-dashoffset:0;stroke-opacity:1;color-rendering:auto;image-rendering:auto;shape-rendering:auto;text-rendering:auto;enable-background:accumulate"
     d="m 9.9902344,-3.5039062 a 0.50005,0.50005 0 0 1 0.3632816,0.8574218 L 8.4101562,-0.703125 7.4628906,1.1914062 6.4863281,4.1210938 5.5,10.041016 v 5.917968 l 0.9863281,5.919922 0.9765625,2.929688 0.9472656,1.894531 1.9433598,1.943359 A 0.50005,0.50005 0 1 1 9.6464844,29.353516 L 7.6816406,27.388672 a 0.50005,0.50005 0 0 1 -0.00781,-0.0059 0.50005,0.50005 0 0 1 -0.060547,-0.06445 0.50005,0.50005 0 0 1 -0.00781,-0.0098 0.50005,0.50005 0 0 1 -0.021484,-0.03125 l -0.00781,-0.0098 a 0.50005,0.50005 0 0 1 -0.00391,-0.0098 L 5.5839844,24.277344 a 0.50005,0.50005 0 0 1 -0.03125,-0.05469 l -2,-4 a 0.50005,0.50005 0 0 1 -0.042969,-0.125 l -1,-5 A 0.50005,0.50005 0 0 1 2.5,15 v -4 a 0.50005,0.50005 0 0 1 0.00977,-0.09766 l 1,-5.0000002 a 0.50005,0.50005 0 0 1 0.042969,-0.125 l 2,-4 a 0.50005,0.50005 0 0 1 0.03125,-0.054688 l 1.984375,-2.9765624 a 0.50005,0.50005 0 0 1 0.015625,-0.023438 0.50005,0.50005 0 0 1 0.0625,-0.076172 l 0.015625,-0.017578 a 0.50005,0.50005 0 0 1 0.017578,-0.015625 l 0.019531,-0.017578 1.9472656,-1.9492187 a 0.50005,0.50005 0 0 1 0.34375,-0.1503906 z"
     id="path2" />
</svg>
