StartFontMetrics 2.0
Comment Generated by FontForge 20170924
Comment Creation Date: Thu Mar 12 12:11:16 2020
FontName Hershey-Noailles-Times-Triplex-Bold
FullName Hershey-Noailles-Times-Triplex-Bold
FamilyName Hershey-Noailles-Times
Weight Bold
Notice (by Luuse (contact@luuse.io), SIL Open Font License)
ItalicAngle 0
IsFixedPitch false
UnderlinePosition 0
UnderlineThickness 26,4
Version 001.000
EncodingScheme ISO10646-1
FontBBox -85 -187 870 843
CapHeight 605
XHeight 421
Ascender 605
Descender -185
StartCharMetrics 159
C 32 ; WX 367 ; N space ; B 0 0 0 0 ;
C 33 ; WX 314 ; N exclam ; B 79 0 211 606 ;
C 34 ; WX 472 ; N quotedbl ; B 79 368 421 606 ;
C 35 ; WX 577 ; N numbersign ; B 51 -187 500 711 ;
C 36 ; WX 525 ; N dollar ; B 52 -107 474 710 ;
C 37 ; WX 630 ; N percent ; B 52 0 580 606 ;
C 38 ; WX 683 ; N ampersand ; B 79 -1 632 606 ;
C 39 ; WX 262 ; N quotesingle ; B 52 368 184 606 ;
C 40 ; WX 367 ; N parenleft ; B 52 -186 290 710 ;
C 41 ; WX 367 ; N parenright ; B 79 -186 317 710 ;
C 42 ; WX 420 ; N asterisk ; B 51 236 370 606 ;
C 43 ; WX 683 ; N plus ; B 79 26 580 527 ;
C 44 ; WX 314 ; N comma ; B 79 -107 211 131 ;
C 45 ; WX 235 ; N hyphen ; B 0 210 238 263 ;
C 46 ; WX 314 ; N period ; B 79 0 211 131 ;
C 47 ; WX 630 ; N slash ; B 26 -186 580 710 ;
C 48 ; WX 525 ; N zero ; B 52 -1 474 606 ;
C 49 ; WX 525 ; N one ; B 105 -1 421 606 ;
C 50 ; WX 525 ; N two ; B 51 -1 474 606 ;
C 51 ; WX 525 ; N three ; B 52 -1 474 606 ;
C 52 ; WX 525 ; N four ; B 26 -1 500 606 ;
C 53 ; WX 525 ; N five ; B 52 -1 474 606 ;
C 54 ; WX 525 ; N six ; B 52 -1 474 606 ;
C 55 ; WX 525 ; N seven ; B 51 -1 474 606 ;
C 56 ; WX 525 ; N eight ; B 52 -1 474 606 ;
C 57 ; WX 525 ; N nine ; B 52 -1 474 606 ;
C 58 ; WX 314 ; N colon ; B 79 0 211 421 ;
C 59 ; WX 314 ; N semicolon ; B 79 -107 211 421 ;
C 60 ; WX 630 ; N less ; B 79 -1 553 527 ;
C 61 ; WX 683 ; N equal ; B 79 130 580 421 ;
C 62 ; WX 630 ; N greater ; B 78 -1 553 527 ;
C 63 ; WX 525 ; N question ; B 52 0 448 606 ;
C 64 ; WX 735 ; N at ; B 52 0 659 606 ;
C 65 ; WX 525 ; N A ; B 0 -1 528 606 ;
C 66 ; WX 577 ; N B ; B 26 -1 527 606 ;
C 67 ; WX 525 ; N C ; B 52 -1 500 606 ;
C 68 ; WX 577 ; N D ; B 26 -1 527 606 ;
C 69 ; WX 525 ; N E ; B 26 -1 500 606 ;
C 70 ; WX 472 ; N F ; B 26 -1 500 606 ;
C 71 ; WX 630 ; N G ; B 52 -1 580 606 ;
C 72 ; WX 630 ; N H ; B 26 -1 607 606 ;
C 73 ; WX 314 ; N I ; B 26 -1 290 606 ;
C 74 ; WX 420 ; N J ; B 26 -1 395 606 ;
C 75 ; WX 525 ; N K ; B 26 -1 580 606 ;
C 76 ; WX 472 ; N L ; B 26 -1 474 606 ;
C 77 ; WX 683 ; N M ; B 26 -1 659 606 ;
C 78 ; WX 630 ; N N ; B 26 -1 607 606 ;
C 79 ; WX 577 ; N O ; B 52 -1 527 606 ;
C 80 ; WX 577 ; N P ; B 26 -1 527 606 ;
C 81 ; WX 577 ; N Q ; B 52 -132 528 606 ;
C 82 ; WX 577 ; N R ; B 26 -1 553 606 ;
C 83 ; WX 525 ; N S ; B 52 0 474 606 ;
C 84 ; WX 525 ; N T ; B 26 -1 500 606 ;
C 85 ; WX 630 ; N U ; B 26 -1 607 606 ;
C 86 ; WX 525 ; N V ; B 0 -1 528 606 ;
C 87 ; WX 630 ; N W ; B 0 -1 632 606 ;
C 88 ; WX 525 ; N X ; B 0 -1 528 606 ;
C 89 ; WX 577 ; N Y ; B 0 -1 580 606 ;
C 90 ; WX 525 ; N Z ; B 51 -1 474 606 ;
C 91 ; WX 367 ; N bracketleft ; B 79 -186 317 710 ;
C 92 ; WX 367 ; N backslash ; B -27 -80 395 606 ;
C 93 ; WX 367 ; N bracketright ; B 51 -186 290 710 ;
C 94 ; WX 577 ; N asciicircum ; B 51 183 528 369 ;
C 95 ; WX 525 ; N underscore ; B -28 -159 553 -106 ;
C 96 ; WX 314 ; N grave ; B 52 393 263 606 ;
C 97 ; WX 525 ; N a ; B 52 -1 500 421 ;
C 98 ; WX 525 ; N b ; B 26 -1 500 606 ;
C 99 ; WX 472 ; N c ; B 52 -1 449 421 ;
C 100 ; WX 577 ; N d ; B 52 -1 528 606 ;
C 101 ; WX 446 ; N e ; B 26 -1 421 421 ;
C 102 ; WX 367 ; N f ; B 26 -1 369 606 ;
C 103 ; WX 525 ; N g ; B 26 -186 474 421 ;
C 104 ; WX 630 ; N h ; B 26 -1 580 606 ;
C 105 ; WX 314 ; N i ; B 26 -1 290 606 ;
C 106 ; WX 314 ; N j ; B 0 -186 264 606 ;
C 107 ; WX 577 ; N k ; B 26 -1 553 606 ;
C 108 ; WX 314 ; N l ; B 26 -1 290 606 ;
C 109 ; WX 893 ; N m ; B 26 -1 870 421 ;
C 110 ; WX 604 ; N n ; B 26 -1 580 421 ;
C 111 ; WX 525 ; N o ; B 52 -1 474 421 ;
C 112 ; WX 525 ; N p ; B 26 -186 500 421 ;
C 113 ; WX 525 ; N q ; B 52 -186 528 421 ;
C 114 ; WX 420 ; N r ; B 26 -1 421 421 ;
C 115 ; WX 472 ; N s ; B 51 0 395 421 ;
C 116 ; WX 420 ; N t ; B 26 -1 395 606 ;
C 117 ; WX 630 ; N u ; B 26 -1 580 421 ;
C 118 ; WX 472 ; N v ; B 0 -1 474 421 ;
C 119 ; WX 630 ; N w ; B 0 -1 632 421 ;
C 120 ; WX 525 ; N x ; B 26 -1 500 421 ;
C 121 ; WX 472 ; N y ; B 0 -186 500 421 ;
C 122 ; WX 472 ; N z ; B 51 -1 421 421 ;
C 123 ; WX 367 ; N braceleft ; B 79 -186 263 710 ;
C 124 ; WX 210 ; N bar ; B 79 -186 132 710 ;
C 125 ; WX 367 ; N braceright ; B 105 -186 290 710 ;
C 126 ; WX 630 ; N asciitilde ; B 52 157 580 369 ;
C 127 ; WX 420 ; N uni007F ; B -27 -1 448 606 ;
C 168 ; WX 393 ; N dieresis ; B 52 447 342 580 ;
C 169 ; WX 630 ; N copyright ; B 0 -80 632 580 ;
C 171 ; WX 367 ; N guillemotleft ; B 0 51 211 421 ;
C 180 ; WX 314 ; N acute ; B 51 393 263 606 ;
C 184 ; WX 472 ; N cedilla ; B 210 -107 317 52 ;
C 187 ; WX 367 ; N guillemotright ; B 0 51 369 421 ;
C 192 ; WX 525 ; N Agrave ; B 0 -1 480 821 ;
C 193 ; WX 525 ; N Aacute ; B 0 -1 480 821 ;
C 194 ; WX 525 ; N Acircumflex ; B 0 -1 480 816 ;
C 195 ; WX 525 ; N Atilde ; B -5 -1 480 843 ;
C 196 ; WX 525 ; N Adieresis ; B 0 -1 480 745 ;
C 199 ; WX 525 ; N Ccedilla ; B 48 -145 455 550 ;
C 200 ; WX 525 ; N Egrave ; B 23 -1 455 821 ;
C 201 ; WX 525 ; N Eacute ; B 23 -1 455 821 ;
C 202 ; WX 525 ; N Ecircumflex ; B 20 -1 455 816 ;
C 203 ; WX 525 ; N Edieresis ; B 23 -1 455 745 ;
C 204 ; WX 314 ; N Igrave ; B 23 -1 264 821 ;
C 205 ; WX 314 ; N Iacute ; B 23 -1 264 821 ;
C 206 ; WX 314 ; N Icircumflex ; B -85 -1 348 816 ;
C 207 ; WX 314 ; N Idieresis ; B 8 -1 272 745 ;
C 210 ; WX 577 ; N Ograve ; B 48 -1 479 821 ;
C 211 ; WX 577 ; N Oacute ; B 48 -1 479 821 ;
C 212 ; WX 577 ; N Ocircumflex ; B 44 -1 479 816 ;
C 213 ; WX 577 ; N Otilde ; B 19 -1 498 843 ;
C 214 ; WX 577 ; N Odieresis ; B 48 -1 479 745 ;
C 217 ; WX 630 ; N Ugrave ; B 23 -1 551 821 ;
C 218 ; WX 630 ; N Uacute ; B 23 -1 551 821 ;
C 219 ; WX 630 ; N Ucircumflex ; B 23 -1 551 816 ;
C 220 ; WX 630 ; N Udieresis ; B 23 -1 551 745 ;
C 224 ; WX 525 ; N agrave ; B 48 -1 455 638 ;
C 225 ; WX 525 ; N aacute ; B 48 -1 455 638 ;
C 226 ; WX 525 ; N acircumflex ; B -6 -1 455 632 ;
C 227 ; WX 525 ; N atilde ; B -32 -1 455 659 ;
C 231 ; WX 472 ; N ccedilla ; B 48 -145 408 383 ;
C 232 ; WX 446 ; N egrave ; B 23 -1 383 638 ;
C 233 ; WX 446 ; N eacute ; B 23 -1 383 638 ;
C 234 ; WX 446 ; N ecircumflex ; B -6 -1 427 632 ;
C 235 ; WX 446 ; N edieresis ; B 23 -1 383 561 ;
C 236 ; WX 314 ; N igrave ; B 26 -1 290 656 ;
C 237 ; WX 314 ; N iacute ; B 26 -1 290 656 ;
C 238 ; WX 314 ; N icircumflex ; B -85 -1 348 651 ;
C 239 ; WX 314 ; N idieresis ; B 8 -1 290 580 ;
C 242 ; WX 525 ; N ograve ; B 48 -1 431 638 ;
C 243 ; WX 525 ; N oacute ; B 48 -1 431 638 ;
C 244 ; WX 525 ; N ocircumflex ; B 19 -1 452 632 ;
C 249 ; WX 630 ; N ugrave ; B 23 -1 527 638 ;
C 250 ; WX 630 ; N uacute ; B 23 -1 527 638 ;
C 251 ; WX 630 ; N ucircumflex ; B 20 -1 527 632 ;
C 252 ; WX 630 ; N udieresis ; B 23 -1 527 561 ;
C -1 ; WX 867 ; N glyph21 ; B 52 -1 817 606 ;
C -1 ; WX 762 ; N glyph10 ; B 26 -1 738 421 ;
C -1 ; WX 525 ; N glyph154 ; B 52 -154 474 606 ;
C -1 ; WX 472 ; N glyph155 ; B 51 -154 395 421 ;
C -1 ; WX 104 ; N glyph157 ; B 0 0 0 0 ;
C -1 ; WX 683 ; N glyph39 ; B 79 210 607 263 ;
C -1 ; WX 367 ; N glyph107 ; B 26 210 342 263 ;
C -1 ; WX 525 ; N glyph54 ; B -28 210 553 263 ;
C -1 ; WX 183 ; N glyph97 ; B 26 368 159 606 ;
C -1 ; WX 183 ; N glyph24 ; B 26 368 159 606 ;
C -1 ; WX 393 ; N glyph23 ; B 51 368 342 606 ;
C -1 ; WX 393 ; N glyph38 ; B 52 368 342 606 ;
C -1 ; WX 393 ; N glyph72 ; B 0 26 395 159 ;
C -1 ; WX 500 ; N .notdef ; B 50 0 450 491 ;
EndCharMetrics
EndFontMetrics
