<?xml version="1.0" encoding="UTF-8" standalone="no"?>
<svg
   xmlns:dc="http://purl.org/dc/elements/1.1/"
   xmlns:cc="http://creativecommons.org/ns#"
   xmlns:rdf="http://www.w3.org/1999/02/22-rdf-syntax-ns#"
   xmlns:svg="http://www.w3.org/2000/svg"
   xmlns="http://www.w3.org/2000/svg"
   xmlns:sodipodi="http://sodipodi.sourceforge.net/DTD/sodipodi-0.dtd"
   xmlns:inkscape="http://www.inkscape.org/namespaces/inkscape"
   data-dec="98"
   width="18"
   height="40"
   version="1.1"
   id="svg4"
   sodipodi:docname="98.svg"
   inkscape:version="0.92.4 (unknown)">
  <metadata
     id="metadata10">
    <rdf:RDF>
      <cc:Work
         rdf:about="">
        <dc:format>image/svg+xml</dc:format>
        <dc:type
           rdf:resource="http://purl.org/dc/dcmitype/StillImage" />
      </cc:Work>
    </rdf:RDF>
  </metadata>
  <defs
     id="defs8" />
  <sodipodi:namedview
     pagecolor="#ffffff"
     bordercolor="#666666"
     borderopacity="1"
     objecttolerance="10"
     gridtolerance="10"
     guidetolerance="10"
     inkscape:pageopacity="0"
     inkscape:pageshadow="2"
     inkscape:window-width="640"
     inkscape:window-height="480"
     id="namedview6"
     showgrid="false"
     inkscape:zoom="5.9"
     inkscape:cx="9"
     inkscape:cy="20"
     inkscape:window-x="0"
     inkscape:window-y="27"
     inkscape:window-maximized="0"
     inkscape:current-layer="svg4" />
  <path
     style="color:#000000;font-style:normal;font-variant:normal;font-weight:normal;font-stretch:normal;font-size:medium;line-height:normal;font-family:sans-serif;font-variant-ligatures:normal;font-variant-position:normal;font-variant-caps:normal;font-variant-numeric:normal;font-variant-alternates:normal;font-feature-settings:normal;text-indent:0;text-align:start;text-decoration:none;text-decoration-line:none;text-decoration-style:solid;text-decoration-color:#000000;letter-spacing:normal;word-spacing:normal;text-transform:none;writing-mode:lr-tb;direction:ltr;text-orientation:mixed;dominant-baseline:auto;baseline-shift:baseline;text-anchor:start;white-space:normal;shape-padding:0;clip-rule:nonzero;display:inline;overflow:visible;visibility:visible;opacity:1;isolation:auto;mix-blend-mode:normal;color-interpolation:sRGB;color-interpolation-filters:linearRGB;solid-color:#000000;solid-opacity:1;vector-effect:none;fill:#013272;fill-opacity:1;fill-rule:nonzero;stroke:none;stroke-width:0.5;stroke-linecap:round;stroke-linejoin:round;stroke-miterlimit:4;stroke-dasharray:none;stroke-dashoffset:0;stroke-opacity:1;color-rendering:auto;image-rendering:auto;shape-rendering:auto;text-rendering:auto;enable-background:accumulate"
     d="M 15.25,11.058594 V 15 a 0.250025,0.250025 0 0 1 -0.01367,0.07813 l -1,3 a 0.250025,0.250025 0 0 1 -0.02734,0.06055 l -1.880859,2.820312 0.511719,-0.169922 1.933594,-2.90039 L 15.75,14.958984 v -2.90039 z M 10.058594,8.25 8.1484375,9.2050781 6.21875,11.134766 5.25,14.035156 v 0.002 3.921875 L 6.2050781,20.822266 8.0585938,21.75 H 9.9433594 L 11.828125,20.806641 13.773438,17.888672 14.75,14.958984 v -3.90039 L 13.814453,9.1875 11.941406,8.25 Z M 8.1835938,1.25 4.25,14.037109 v 2.921875 l 0.96875,2.90625 0.2109375,0.210938 -0.6660156,-1.998047 A 0.250025,0.250025 0 0 1 4.75,18 v -3.96875 a 0.250025,0.250025 0 0 1 0,-0.01172 A 0.250025,0.250025 0 0 1 4.7480469,14 a 0.250025,0.250025 0 0 1 0,-0.0039 0.250025,0.250025 0 0 1 0,-0.0078 0.250025,0.250025 0 0 1 0.00195,-0.0059 0.250025,0.250025 0 0 1 0,-0.0078 0.250025,0.250025 0 0 1 0.00195,-0.0059 0.250025,0.250025 0 0 1 0.00195,-0.01172 0.250025,0.250025 0 0 1 0,-0.0059 0.250025,0.250025 0 0 1 0.00195,-0.0059 0.250025,0.250025 0 0 1 0,-0.002 0.250025,0.250025 0 0 1 0.00586,-0.01758 0.250025,0.250025 0 0 1 0.00391,-0.01563 0.250025,0.250025 0 0 1 0.00391,-0.0078 L 8.6621094,1.25 Z m -0.1875,-0.50390625 A 0.250025,0.250025 0 0 1 8.046875,0.75 h 0.9140625 a 0.250025,0.250025 0 0 1 0.1953125,0.0527344 0.250025,0.250025 0 0 1 0.00195,0 0.250025,0.250025 0 0 1 0.017578,0.015625 0.250025,0.250025 0 0 1 0.00195,0.001953 0.250025,0.250025 0 0 1 0.013672,0.015625 0.250025,0.250025 0 0 1 0.00195,0.001953 0.250025,0.250025 0 0 1 0.013672,0.0175781 0.250025,0.250025 0 0 1 0.00195,0.001953 0.250025,0.250025 0 0 1 0.011719,0.0195312 0.250025,0.250025 0 0 1 0.00195,0.001953 0.250025,0.250025 0 0 1 0.00195,0.007813 0.250025,0.250025 0 0 1 0.00195,0.22656245 0.250025,0.250025 0 0 1 -0.00195,0.00391 L 6.4238281,10.220703 7.8222656,8.8222656 a 0.250025,0.250025 0 0 1 0.066406,-0.044922 l 2,-1 A 0.250025,0.250025 0 0 1 10,7.75 h 2 a 0.250025,0.250025 0 0 1 0.111328,0.027344 l 1.960938,0.9804687 a 0.250025,0.250025 0 0 1 0.0059,0.00195 0.250025,0.250025 0 0 1 0.09961,0.0625 0.250025,0.250025 0 0 1 0.0039,0.00391 l 0.996093,0.9960937 a 0.250025,0.250025 0 0 1 0.04492,0.066406 l 1,2.0000001 A 0.250025,0.250025 0 0 1 16.25,12 v 3 a 0.250025,0.250025 0 0 1 -0.01367,0.07813 l -1,3 a 0.250025,0.250025 0 0 1 -0.02734,0.06055 l -2,3 a 0.250025,0.250025 0 0 1 -0.130859,0.09766 l -2.982422,0.994141 a 0.250025,0.250025 0 0 1 -0.02148,0.0078 0.250025,0.250025 0 0 1 -0.09961,0.01172 H 8 A 0.250025,0.250025 0 0 1 7.8886719,22.222656 L 5.9296875,21.242188 a 0.250025,0.250025 0 0 1 -0.00781,-0.0039 0.250025,0.250025 0 0 1 -0.052734,-0.02539 0.250025,0.250025 0 0 1 -0.00781,-0.0039 0.250025,0.250025 0 0 1 -0.011719,-0.0098 0.250025,0.250025 0 0 1 -0.00781,-0.0059 0.250025,0.250025 0 0 1 -0.011719,-0.0098 0.250025,0.250025 0 0 1 -0.00781,-0.0059 L 5.8125,21.166016 4.8222656,20.177734 a 0.250025,0.250025 0 0 1 -0.058594,-0.09961 l -1,-3 A 0.250025,0.250025 0 0 1 3.75,17 v -3 a 0.250025,0.250025 0 0 1 0.011719,-0.07422 L 7.6621094,1.25 H 5 a 0.250025,0.250025 0 1 1 0,-0.5 h 2.9609375 a 0.250025,0.250025 0 0 1 0.035156,-0.003906 z"
     id="path2" />
</svg>
