<?xml version="1.0" encoding="UTF-8" standalone="no"?>
<svg
   xmlns:dc="http://purl.org/dc/elements/1.1/"
   xmlns:cc="http://creativecommons.org/ns#"
   xmlns:rdf="http://www.w3.org/1999/02/22-rdf-syntax-ns#"
   xmlns:svg="http://www.w3.org/2000/svg"
   xmlns="http://www.w3.org/2000/svg"
   xmlns:sodipodi="http://sodipodi.sourceforge.net/DTD/sodipodi-0.dtd"
   xmlns:inkscape="http://www.inkscape.org/namespaces/inkscape"
   data-dec="87"
   width="26"
   height="40"
   version="1.1"
   id="svg4"
   sodipodi:docname="87.svg"
   inkscape:version="0.92.4 5da689c313, 2019-01-14">
  <metadata
     id="metadata10">
    <rdf:RDF>
      <cc:Work
         rdf:about="">
        <dc:format>image/svg+xml</dc:format>
        <dc:type
           rdf:resource="http://purl.org/dc/dcmitype/StillImage" />
        <dc:title></dc:title>
      </cc:Work>
    </rdf:RDF>
  </metadata>
  <defs
     id="defs8" />
  <sodipodi:namedview
     pagecolor="#ffffff"
     bordercolor="#666666"
     borderopacity="1"
     objecttolerance="10"
     gridtolerance="10"
     guidetolerance="10"
     inkscape:pageopacity="0"
     inkscape:pageshadow="2"
     inkscape:window-width="1920"
     inkscape:window-height="1043"
     id="namedview6"
     showgrid="false"
     inkscape:zoom="5.9"
     inkscape:cx="13"
     inkscape:cy="20"
     inkscape:window-x="0"
     inkscape:window-y="37"
     inkscape:window-maximized="0"
     inkscape:current-layer="svg4" />
  <path
     style="color:#000000;font-style:normal;font-variant:normal;font-weight:normal;font-stretch:normal;font-size:medium;line-height:normal;font-family:sans-serif;font-variant-ligatures:normal;font-variant-position:normal;font-variant-caps:normal;font-variant-numeric:normal;font-variant-alternates:normal;font-feature-settings:normal;text-indent:0;text-align:start;text-decoration:none;text-decoration-line:none;text-decoration-style:solid;text-decoration-color:#000000;letter-spacing:normal;word-spacing:normal;text-transform:none;writing-mode:lr-tb;direction:ltr;text-orientation:mixed;dominant-baseline:auto;baseline-shift:baseline;text-anchor:start;white-space:normal;shape-padding:0;clip-rule:nonzero;display:inline;overflow:visible;visibility:visible;opacity:1;isolation:auto;mix-blend-mode:normal;color-interpolation:sRGB;color-interpolation-filters:linearRGB;solid-color:#000000;solid-opacity:1;vector-effect:none;fill:#000000;fill-opacity:1;fill-rule:nonzero;stroke:none;stroke-width:1.5;stroke-linecap:round;stroke-linejoin:round;stroke-miterlimit:4;stroke-dasharray:none;stroke-dashoffset:0;stroke-opacity:1;color-rendering:auto;image-rendering:auto;shape-rendering:auto;text-rendering:auto;enable-background:accumulate"
     d="M 2.0019531,0.24023438 A 0.750075,0.750075 0 0 1 2.1132812,0.25 H 3 A 0.750075,0.750075 0 0 1 3.7226562,0.79882812 L 8,16.197266 12.257812,0.87109375 A 0.750075,0.750075 0 0 1 12.75,0.28320312 a 0.750075,0.750075 0 0 1 0.07227,-0.0214844 0.750075,0.750075 0 0 1 0.07226,-0.0136719 0.750075,0.750075 0 0 1 0.0625,-0.005859 0.750075,0.750075 0 0 1 0.05078,-0.001953 0.750075,0.750075 0 0 1 0.07422,0.003906 0.750075,0.750075 0 0 1 0.07422,0.0117188 0.750075,0.750075 0 0 1 0.142578,0.046875 0.750075,0.750075 0 0 1 0.06641,0.0332031 0.750075,0.750075 0 0 1 0.376954,0.53515625 L 18,16.197266 22.277344,0.79882812 A 0.750075,0.750075 0 0 1 23,0.25 h 0.878906 a 0.750075,0.750075 0 0 1 0.69336,0.25195312 0.750075,0.750075 0 0 1 0.02344,0.0292969 0.750075,0.750075 0 0 1 0.02344,0.03125 0.750075,0.750075 0 0 1 0.0039,0.003906 0.750075,0.750075 0 0 1 0.06641,0.74999995 L 18.742188,22.126953 a 0.750075,0.750075 0 0 1 -0.498047,0.591797 0.750075,0.750075 0 0 1 -0.07031,0.02148 0.750075,0.750075 0 0 1 -0.002,0 0.750075,0.750075 0 0 1 -0.0625,0.01172 0.750075,0.750075 0 0 1 -0.0098,0.002 0.750075,0.750075 0 0 1 -0.0098,0 0.750075,0.750075 0 0 1 -0.04687,0.0039 0.750075,0.750075 0 0 1 -0.01758,0.002 0.750075,0.750075 0 0 1 -0.06445,-0.002 0.750075,0.750075 0 0 1 -0.01758,0 0.750075,0.750075 0 0 1 -0.05078,-0.0059 0.750075,0.750075 0 0 1 -0.0332,-0.0059 0.750075,0.750075 0 0 1 -0.02734,-0.0059 0.750075,0.750075 0 0 1 -0.130859,-0.04297 0.750075,0.750075 0 0 1 -0.441406,-0.560547 L 13,6.8027344 8.7441406,22.123047 A 0.750075,0.750075 0 0 1 8.3203125,22.6875 0.750075,0.750075 0 0 1 8.25,22.716797 a 0.750075,0.750075 0 0 1 -0.072266,0.02148 0.750075,0.750075 0 0 1 -0.072266,0.01367 0.750075,0.750075 0 0 1 -0.064453,0.0059 0.750075,0.750075 0 0 1 -0.011719,0.002 0.750075,0.750075 0 0 1 -0.03125,0 0.750075,0.750075 0 0 1 -0.074219,-0.0039 0.750075,0.750075 0 0 1 -0.6679687,-0.628906 L 1.3125,1.3242188 a 0.750075,0.750075 0 0 1 0.013672,-0.67382818 0.750075,0.750075 0 0 1 0.00391,-0.005859 0.750075,0.750075 0 0 1 0.039063,-0.0644531 0.750075,0.750075 0 0 1 0.039063,-0.0546875 0.750075,0.750075 0 0 1 0.00391,-0.005859 0.750075,0.750075 0 0 1 0.5898437,-0.27929687 z"
     id="path2" />
</svg>
