<?xml version="1.0" encoding="UTF-8" standalone="no"?>
<svg
   xmlns:dc="http://purl.org/dc/elements/1.1/"
   xmlns:cc="http://creativecommons.org/ns#"
   xmlns:rdf="http://www.w3.org/1999/02/22-rdf-syntax-ns#"
   xmlns:svg="http://www.w3.org/2000/svg"
   xmlns="http://www.w3.org/2000/svg"
   xmlns:sodipodi="http://sodipodi.sourceforge.net/DTD/sodipodi-0.dtd"
   xmlns:inkscape="http://www.inkscape.org/namespaces/inkscape"
   data-dec="117"
   width="24"
   height="40"
   version="1.1"
   id="svg4"
   sodipodi:docname="117.svg"
   inkscape:version="0.92.4 (unknown)">
  <metadata
     id="metadata10">
    <rdf:RDF>
      <cc:Work
         rdf:about="">
        <dc:format>image/svg+xml</dc:format>
        <dc:type
           rdf:resource="http://purl.org/dc/dcmitype/StillImage" />
      </cc:Work>
    </rdf:RDF>
  </metadata>
  <defs
     id="defs8" />
  <sodipodi:namedview
     pagecolor="#ffffff"
     bordercolor="#666666"
     borderopacity="1"
     objecttolerance="10"
     gridtolerance="10"
     guidetolerance="10"
     inkscape:pageopacity="0"
     inkscape:pageshadow="2"
     inkscape:window-width="615"
     inkscape:window-height="417"
     id="namedview6"
     showgrid="false"
     inkscape:zoom="5.9"
     inkscape:cx="12"
     inkscape:cy="20"
     inkscape:window-x="0"
     inkscape:window-y="27"
     inkscape:window-maximized="0"
     inkscape:current-layer="svg4" />
  <path
     style="color:#000000;font-style:normal;font-variant:normal;font-weight:normal;font-stretch:normal;font-size:medium;line-height:normal;font-family:sans-serif;font-variant-ligatures:normal;font-variant-position:normal;font-variant-caps:normal;font-variant-numeric:normal;font-variant-alternates:normal;font-feature-settings:normal;text-indent:0;text-align:start;text-decoration:none;text-decoration-line:none;text-decoration-style:solid;text-decoration-color:#000000;letter-spacing:normal;word-spacing:normal;text-transform:none;writing-mode:lr-tb;direction:ltr;text-orientation:mixed;dominant-baseline:auto;baseline-shift:baseline;text-anchor:start;white-space:normal;shape-padding:0;clip-rule:nonzero;display:inline;overflow:visible;visibility:visible;opacity:1;isolation:auto;mix-blend-mode:normal;color-interpolation:sRGB;color-interpolation-filters:linearRGB;solid-color:#000000;solid-opacity:1;vector-effect:none;fill:#013272;fill-opacity:1;fill-rule:nonzero;stroke:none;stroke-width:1;stroke-linecap:round;stroke-linejoin:round;stroke-miterlimit:4;stroke-dasharray:none;stroke-dashoffset:0;stroke-opacity:1;color-rendering:auto;image-rendering:auto;shape-rendering:auto;text-rendering:auto;enable-background:accumulate"
     d="M 6.0625,14.691406 5.5,16.095703 v 0.880859 a 0.50005,0.50005 0 0 1 0.015625,-0.09766 z M 7.5,13.023438 a 0.50005,0.50005 0 0 1 -0.015625,0.09766 L 6.9375,15.308594 7.5,13.904297 Z M 17.966797,7.4941406 A 0.50005,0.50005 0 0 1 18.078125,7.5 h 0.839844 a 0.50005,0.50005 0 0 1 0.160156,0 H 20 a 0.50005,0.50005 0 0 1 0.480469,0.6367188 L 18.482422,15.128906 17.5,19.058594 v 1.734375 L 18.207031,21.5 h 1.585938 l 1.796875,-1.796875 0.96289,-1.925781 a 0.50005,0.50005 0 1 1 0.894532,0.445312 l -1,2 a 0.50005,0.50005 0 0 1 -0.09375,0.13086 l -2,2 A 0.50005,0.50005 0 0 1 20,22.5 H 18 A 0.50005,0.50005 0 0 1 17.646484,22.353516 L 16.697266,21.404297 A 0.50005,0.50005 0 0 1 16.53125,21.179688 L 15.552734,19.222656 A 0.50005,0.50005 0 0 1 15.5,19 v -1.347656 l -1.083984,1.625 a 0.50005,0.50005 0 0 1 -0.0625,0.07617 l -2,2 a 0.50005,0.50005 0 0 1 -0.13086,0.09375 l -2,1 A 0.50005,0.50005 0 0 1 10,22.5 H 8 A 0.50005,0.50005 0 0 1 7.7773438,22.447266 L 5.8476562,21.482422 A 0.50005,0.50005 0 0 1 5.53125,21.179688 L 4.5527344,19.222656 A 0.50005,0.50005 0 0 1 4.5,19 v -3 a 0.50005,0.50005 0 0 1 0.035156,-0.185547 L 6.5,10.902344 V 9.2070312 L 5.7929688,8.5 H 4.2070312 l -1.796875,1.796875 -0.9628906,1.925781 A 0.50005,0.50005 0 1 1 0.55273438,11.777344 L 1.5527344,9.7773438 a 0.50005,0.50005 0 0 1 0.09375,-0.1308594 l 2,-2 A 0.50005,0.50005 0 0 1 4,7.5 H 6 A 0.50005,0.50005 0 0 1 6.3535156,7.6464844 L 7.3027344,8.5957031 A 0.50005,0.50005 0 0 1 7.46875,8.8203125 L 8.4472656,10.777344 A 0.50005,0.50005 0 0 1 8.5,11 v 3 a 0.50005,0.50005 0 0 1 -0.035156,0.185547 L 6.5,19.097656 v 1.59375 L 8.1171875,21.5 h 1.765625 l 1.8203125,-0.910156 1.908203,-1.908203 1.925781,-2.888672 1.957032,-7.8261721 a 0.50005,0.50005 0 0 1 0.125,-0.296875 0.50005,0.50005 0 0 1 0.06836,-0.066406 0.50005,0.50005 0 0 1 0.0293,-0.019531 0.50005,0.50005 0 0 1 0.25,-0.089844 z"
     id="path2" />
</svg>
