<?xml version="1.0" encoding="UTF-8" standalone="no"?>
<svg
   xmlns:dc="http://purl.org/dc/elements/1.1/"
   xmlns:cc="http://creativecommons.org/ns#"
   xmlns:rdf="http://www.w3.org/1999/02/22-rdf-syntax-ns#"
   xmlns:svg="http://www.w3.org/2000/svg"
   xmlns="http://www.w3.org/2000/svg"
   xmlns:sodipodi="http://sodipodi.sourceforge.net/DTD/sodipodi-0.dtd"
   xmlns:inkscape="http://www.inkscape.org/namespaces/inkscape"
   data-dec="87"
   width="28"
   height="40"
   version="1.1"
   id="svg4"
   sodipodi:docname="87.svg"
   inkscape:version="0.92.4 (unknown)">
  <metadata
     id="metadata10">
    <rdf:RDF>
      <cc:Work
         rdf:about="">
        <dc:format>image/svg+xml</dc:format>
        <dc:type
           rdf:resource="http://purl.org/dc/dcmitype/StillImage" />
      </cc:Work>
    </rdf:RDF>
  </metadata>
  <defs
     id="defs8" />
  <sodipodi:namedview
     pagecolor="#ffffff"
     bordercolor="#666666"
     borderopacity="1"
     objecttolerance="10"
     gridtolerance="10"
     guidetolerance="10"
     inkscape:pageopacity="0"
     inkscape:pageshadow="2"
     inkscape:window-width="640"
     inkscape:window-height="480"
     id="namedview6"
     showgrid="false"
     inkscape:zoom="5.9"
     inkscape:cx="14"
     inkscape:cy="20"
     inkscape:window-x="0"
     inkscape:window-y="27"
     inkscape:window-maximized="0"
     inkscape:current-layer="svg4" />
  <path
     style="color:#000000;font-style:normal;font-variant:normal;font-weight:normal;font-stretch:normal;font-size:medium;line-height:normal;font-family:sans-serif;font-variant-ligatures:normal;font-variant-position:normal;font-variant-caps:normal;font-variant-numeric:normal;font-variant-alternates:normal;font-feature-settings:normal;text-indent:0;text-align:start;text-decoration:none;text-decoration-line:none;text-decoration-style:solid;text-decoration-color:#000000;letter-spacing:normal;word-spacing:normal;text-transform:none;writing-mode:lr-tb;direction:ltr;text-orientation:mixed;dominant-baseline:auto;baseline-shift:baseline;text-anchor:start;white-space:normal;shape-padding:0;clip-rule:nonzero;display:inline;overflow:visible;visibility:visible;opacity:1;isolation:auto;mix-blend-mode:normal;color-interpolation:sRGB;color-interpolation-filters:linearRGB;solid-color:#000000;solid-opacity:1;vector-effect:none;fill:#000000;fill-opacity:1;fill-rule:nonzero;stroke:none;stroke-width:1.5;stroke-linecap:round;stroke-linejoin:round;stroke-miterlimit:4;stroke-dasharray:none;stroke-dashoffset:0;stroke-opacity:1;color-rendering:auto;image-rendering:auto;shape-rendering:auto;text-rendering:auto;enable-background:accumulate"
     d="M 2.96875,0.24023438 A 0.750075,0.750075 0 0 1 3.1191406,0.25 h 0.7617188 a 0.750075,0.750075 0 0 1 0.234375,0 H 5 6 a 0.750075,0.750075 0 0 1 0,1.5 H 5.3105469 L 5.0917969,1.96875 10.34375,18.599609 12.710938,11.5 10.306641,4.2890625 9.3828125,2.4433594 8.6894531,1.75 H 8 a 0.750075,0.750075 0 0 1 0,-1.5 h 1 0.875 a 0.750075,0.750075 0 0 1 0.244141,0 h 0.761718 a 0.750075,0.750075 0 0 1 0.234375,0 H 12 13 a 0.750075,0.750075 0 0 1 0,1.5 h -0.689453 l -0.21875,0.21875 1.847656,5.8457031 1.330078,-3.9921875 a 0.750075,0.750075 0 0 1 0.0293,-0.089844 0.750075,0.750075 0 0 1 0.002,-0.00586 L 15.892578,1.953125 15.689453,1.75 H 15 a 0.750075,0.750075 0 0 1 0,-1.5 h 1 0.884766 a 0.750075,0.750075 0 0 1 0.236328,0 H 18 19 a 0.750075,0.750075 0 0 1 0,1.5 h -0.689453 l -0.697266,0.6992188 -0.919922,1.8398437 -1.986328,5.9589845 2.636719,8.351562 4.925781,-14.7773434 a 0.750075,0.750075 0 0 1 0.0293,-0.089844 0.750075,0.750075 0 0 1 0.002,-0.00586 L 22.892578,1.953125 22.689453,1.75 H 22 a 0.750075,0.750075 0 0 1 0,-1.5 h 1 0.884766 a 0.750075,0.750075 0 0 1 0.236328,0 H 25 26 a 0.750075,0.750075 0 0 1 0,1.5 H 25.310547 L 24.613281,2.4492188 23.693359,4.2890625 17.736328,22.158203 a 0.750075,0.750075 0 0 1 -0.523437,0.570313 0.750075,0.750075 0 0 1 -0.07227,0.01758 0.750075,0.750075 0 0 1 -0.06445,0.0098 0.750075,0.750075 0 0 1 -0.0098,0.002 0.750075,0.750075 0 0 1 -0.01563,0 0.750075,0.750075 0 0 1 -0.03906,0.002 0.750075,0.750075 0 0 1 -0.05664,-0.002 0.750075,0.750075 0 0 1 -0.07422,-0.0078 0.750075,0.750075 0 0 1 -0.07227,-0.01563 0.750075,0.750075 0 0 1 -0.548828,-0.587891 l -0.0039,-0.01367 L 13.5,13.869141 10.736328,22.158203 a 0.750075,0.750075 0 0 1 -0.523437,0.570313 0.750075,0.750075 0 0 1 -0.07227,0.01758 0.750075,0.750075 0 0 1 -0.06445,0.0098 0.750075,0.750075 0 0 1 -0.02539,0.002 0.750075,0.750075 0 0 1 -0.03906,0.002 0.750075,0.750075 0 0 1 -0.056641,-0.002 A 0.750075,0.750075 0 0 1 9.8808594,22.75 0.750075,0.750075 0 0 1 9.8085938,22.734375 0.750075,0.750075 0 0 1 9.2597656,22.146484 L 9.2558594,22.132812 3.3066406,4.2890625 2.3828125,2.4433594 1.6894531,1.75 H 1 a 0.750075,0.750075 0 0 1 0,-1.5 h 1 0.875 a 0.750075,0.750075 0 0 1 0.09375,-0.009766 z"
     id="path2" />
</svg>
