<?xml version="1.0" encoding="UTF-8"?>
<glyph name="M" format="1">
  <advance width="752"/>
  <unicode hex="004D"/>
  <outline>
    <contour>
      <point x="144" y="652" type="curve" smooth="yes"/>
      <point x="146" y="651" type="line"/>
      <point x="148" y="651" type="line"/>
      <point x="170" y="651" type="line" smooth="yes"/>
      <point x="171" y="651"/>
      <point x="173" y="652"/>
      <point x="174" y="652" type="curve" smooth="yes"/>
      <point x="177" y="652"/>
      <point x="183" y="650"/>
      <point x="186" y="648" type="curve" smooth="yes"/>
      <point x="187" y="647" type="line"/>
      <point x="188" y="646" type="line" smooth="yes"/>
      <point x="191" y="643"/>
      <point x="195" y="638"/>
      <point x="196" y="634" type="curve" smooth="yes"/>
      <point x="362" y="134" type="line"/>
      <point x="528" y="634" type="line" smooth="yes"/>
      <point x="529" y="637"/>
      <point x="533" y="643"/>
      <point x="535" y="645" type="curve" smooth="yes"/>
      <point x="535" y="646" type="line"/>
      <point x="536" y="647" type="line"/>
      <point x="538" y="648" type="line" smooth="yes"/>
      <point x="540" y="649"/>
      <point x="544" y="651"/>
      <point x="546" y="651" type="curve" smooth="yes"/>
      <point x="547" y="651"/>
      <point x="549" y="652"/>
      <point x="550" y="652" type="curve" smooth="yes"/>
      <point x="552" y="651" type="line"/>
      <point x="553" y="651" type="line"/>
      <point x="575" y="651" type="line" smooth="yes"/>
      <point x="576" y="651"/>
      <point x="578" y="652"/>
      <point x="579" y="652" type="curve" smooth="yes"/>
      <point x="580" y="652"/>
      <point x="582" y="651"/>
      <point x="583" y="651" type="curve" smooth="yes"/>
      <point x="666" y="651" type="line"/>
      <point x="667" y="651" type="line" smooth="yes"/>
      <point x="679" y="651"/>
      <point x="688" y="642"/>
      <point x="688" y="630" type="curve" smooth="yes"/>
      <point x="688" y="618"/>
      <point x="679" y="608"/>
      <point x="667" y="608" type="curve" smooth="yes"/>
      <point x="666" y="608" type="line"/>
      <point x="601" y="608" type="line"/>
      <point x="601" y="44" type="line"/>
      <point x="666" y="44" type="line"/>
      <point x="667" y="44" type="line" smooth="yes"/>
      <point x="679" y="44"/>
      <point x="688" y="34"/>
      <point x="688" y="22" type="curve" smooth="yes"/>
      <point x="688" y="10"/>
      <point x="679" y="0"/>
      <point x="667" y="0" type="curve" smooth="yes"/>
      <point x="666" y="0" type="line"/>
      <point x="583" y="0" type="line"/>
      <point x="579" y="0" type="line"/>
      <point x="575" y="0" type="line"/>
      <point x="553" y="0" type="line"/>
      <point x="550" y="0" type="line"/>
      <point x="547" y="0" type="line"/>
      <point x="463" y="0" type="line" smooth="yes"/>
      <point x="451" y="0"/>
      <point x="441" y="10"/>
      <point x="441" y="22" type="curve" smooth="yes"/>
      <point x="441" y="34"/>
      <point x="451" y="44"/>
      <point x="463" y="44" type="curve" smooth="yes"/>
      <point x="528" y="44" type="line"/>
      <point x="528" y="496" type="line"/>
      <point x="368" y="18" type="line" smooth="yes"/>
      <point x="367" y="11"/>
      <point x="360" y="3"/>
      <point x="353" y="1" type="curve" smooth="yes"/>
      <point x="352" y="1"/>
      <point x="352" y="0"/>
      <point x="351" y="0" type="curve" smooth="yes"/>
      <point x="350" y="0" type="line"/>
      <point x="349" y="0" type="line"/>
      <point x="348" y="0" type="line"/>
      <point x="346" y="0" type="line"/>
      <point x="344" y="0" type="line" smooth="yes"/>
      <point x="343" y="0"/>
      <point x="343" y="1"/>
      <point x="342" y="1" type="curve" smooth="yes"/>
      <point x="334" y="3"/>
      <point x="327" y="10"/>
      <point x="326" y="18" type="curve" smooth="yes"/>
      <point x="166" y="496" type="line"/>
      <point x="166" y="44" type="line"/>
      <point x="232" y="44" type="line" smooth="yes"/>
      <point x="244" y="44"/>
      <point x="254" y="34"/>
      <point x="254" y="22" type="curve" smooth="yes"/>
      <point x="254" y="10"/>
      <point x="244" y="0"/>
      <point x="232" y="0" type="curve" smooth="yes"/>
      <point x="148" y="0" type="line"/>
      <point x="145" y="0" type="line"/>
      <point x="141" y="0" type="line"/>
      <point x="58" y="0" type="line"/>
      <point x="57" y="0" type="line" smooth="yes"/>
      <point x="45" y="0"/>
      <point x="36" y="10"/>
      <point x="36" y="22" type="curve" smooth="yes"/>
      <point x="36" y="34"/>
      <point x="45" y="44"/>
      <point x="57" y="44" type="curve" smooth="yes"/>
      <point x="58" y="44" type="line"/>
      <point x="123" y="44" type="line"/>
      <point x="123" y="608" type="line"/>
      <point x="58" y="608" type="line"/>
      <point x="57" y="608" type="line" smooth="yes"/>
      <point x="45" y="608"/>
      <point x="36" y="618"/>
      <point x="36" y="630" type="curve" smooth="yes"/>
      <point x="36" y="642"/>
      <point x="45" y="651"/>
      <point x="57" y="651" type="curve" smooth="yes"/>
      <point x="58" y="651" type="line"/>
      <point x="141" y="651" type="line" smooth="yes"/>
      <point x="142" y="651"/>
      <point x="143" y="652"/>
    </contour>
  </outline>
  <lib>
    <dict>
      <key>com.fontlab.hintData</key>
      <dict>
        <key>hhints</key>
        <array>
          <dict>
            <key>position</key>
            <integer>0</integer>
            <key>width</key>
            <integer>44</integer>
          </dict>
          <dict>
            <key>position</key>
            <integer>608</integer>
            <key>width</key>
            <integer>43</integer>
          </dict>
        </array>
        <key>vhints</key>
        <array>
          <dict>
            <key>position</key>
            <integer>123</integer>
            <key>width</key>
            <integer>43</integer>
          </dict>
          <dict>
            <key>position</key>
            <integer>528</integer>
            <key>width</key>
            <integer>73</integer>
          </dict>
        </array>
      </dict>
    </dict>
  </lib>
</glyph>
