<?xml version="1.0" encoding="UTF-8" standalone="no"?>
<svg
   xmlns:dc="http://purl.org/dc/elements/1.1/"
   xmlns:cc="http://creativecommons.org/ns#"
   xmlns:rdf="http://www.w3.org/1999/02/22-rdf-syntax-ns#"
   xmlns:svg="http://www.w3.org/2000/svg"
   xmlns="http://www.w3.org/2000/svg"
   xmlns:sodipodi="http://sodipodi.sourceforge.net/DTD/sodipodi-0.dtd"
   xmlns:inkscape="http://www.inkscape.org/namespaces/inkscape"
   data-dec="90"
   width="20"
   height="40"
   version="1.1"
   id="svg4"
   sodipodi:docname="90.svg"
   inkscape:version="0.92.4 (unknown)">
  <metadata
     id="metadata10">
    <rdf:RDF>
      <cc:Work
         rdf:about="">
        <dc:format>image/svg+xml</dc:format>
        <dc:type
           rdf:resource="http://purl.org/dc/dcmitype/StillImage" />
      </cc:Work>
    </rdf:RDF>
  </metadata>
  <defs
     id="defs8" />
  <sodipodi:namedview
     pagecolor="#ffffff"
     bordercolor="#666666"
     borderopacity="1"
     objecttolerance="10"
     gridtolerance="10"
     guidetolerance="10"
     inkscape:pageopacity="0"
     inkscape:pageshadow="2"
     inkscape:window-width="640"
     inkscape:window-height="480"
     id="namedview6"
     showgrid="false"
     inkscape:zoom="5.9"
     inkscape:cx="10"
     inkscape:cy="20"
     inkscape:window-x="0"
     inkscape:window-y="27"
     inkscape:window-maximized="0"
     inkscape:current-layer="svg4" />
  <path
     style="color:#000000;font-style:normal;font-variant:normal;font-weight:normal;font-stretch:normal;font-size:medium;line-height:normal;font-family:sans-serif;font-variant-ligatures:normal;font-variant-position:normal;font-variant-caps:normal;font-variant-numeric:normal;font-variant-alternates:normal;font-feature-settings:normal;text-indent:0;text-align:start;text-decoration:none;text-decoration-line:none;text-decoration-style:solid;text-decoration-color:#000000;letter-spacing:normal;word-spacing:normal;text-transform:none;writing-mode:lr-tb;direction:ltr;text-orientation:mixed;dominant-baseline:auto;baseline-shift:baseline;text-anchor:start;white-space:normal;shape-padding:0;clip-rule:nonzero;display:inline;overflow:visible;visibility:visible;opacity:1;isolation:auto;mix-blend-mode:normal;color-interpolation:sRGB;color-interpolation-filters:linearRGB;solid-color:#000000;solid-opacity:1;vector-effect:none;fill:#000000;fill-opacity:1;fill-rule:nonzero;stroke:none;stroke-width:1;stroke-linecap:round;stroke-linejoin:round;stroke-miterlimit:4;stroke-dasharray:none;stroke-dashoffset:0;stroke-opacity:1;color-rendering:auto;image-rendering:auto;shape-rendering:auto;text-rendering:auto;enable-background:accumulate"
     d="M 17,20.5 A 0.50005,0.50005 0 0 1 17.5,21 V 20.5 Z M 2.9921875,0.4921875 A 0.50005,0.50005 0 0 1 3.0800781,0.5 H 4 15.923828 a 0.50005,0.50005 0 0 1 0.158203,0 h 0.841797 a 0.50005,0.50005 0 0 1 0.09961,-0.005859 0.50005,0.50005 0 0 1 0.04883,0.003906 0.50005,0.50005 0 0 1 0.0098,0.001953 h 0.841797 a 0.50005,0.50005 0 0 1 0.425781,0.13671875 0.50005,0.50005 0 0 1 0.02539,0.0234375 0.50005,0.50005 0 0 1 0.0098,0.0117188 0.50005,0.50005 0 0 1 0.02344,0.0273438 0.50005,0.50005 0 0 1 0.0078,0.0117188 0.50005,0.50005 0 0 1 0.02539,0.0429687 0.50005,0.50005 0 0 1 0.0078,0.015625 0.50005,0.50005 0 0 1 0.0078,0.015625 0.50005,0.50005 0 0 1 0.01953,0.046875 0.50005,0.50005 0 0 1 -0.08203,0.48437495 l -0.0039,0.00586 L 7.1367188,19.5 H 18 a 0.50005,0.50005 0 0 1 0.5,0.5 v 1.917969 a 0.50005,0.50005 0 0 1 -0.103516,0.394531 0.50005,0.50005 0 0 1 -0.002,0.0039 0.50005,0.50005 0 0 1 -0.03125,0.0332 0.50005,0.50005 0 0 1 -0.002,0.0039 0.50005,0.50005 0 0 1 -0.0332,0.03125 0.50005,0.50005 0 0 1 -0.0039,0.002 A 0.50005,0.50005 0 0 1 17.919922,22.5 h -0.837891 a 0.50005,0.50005 0 0 1 -0.162109,0 H 5.0761719 a 0.50005,0.50005 0 0 1 -0.1582031,0 H 4.0761719 a 0.50005,0.50005 0 0 1 -0.1484375,0.002 0.50005,0.50005 0 0 1 -0.00977,-0.002 H 3.0761719 A 0.50005,0.50005 0 0 1 2.6503906,22.363281 0.50005,0.50005 0 0 1 2.625,22.339844 a 0.50005,0.50005 0 0 1 -0.00977,-0.01172 0.50005,0.50005 0 0 1 -0.023437,-0.02734 0.50005,0.50005 0 0 1 -0.00781,-0.01172 0.50005,0.50005 0 0 1 -0.025391,-0.04297 0.50005,0.50005 0 0 1 -0.015625,-0.03125 0.50005,0.50005 0 0 1 -0.019531,-0.04687 0.50005,0.50005 0 0 1 0.082031,-0.484375 0.50005,0.50005 0 0 1 0.00391,-0.0059 L 13.863281,3.5 H 3 A 0.50005,0.50005 0 0 1 2.5,3 V 2 1.0820312 A 0.50005,0.50005 0 0 1 2.6035156,0.6875 a 0.50005,0.50005 0 0 1 0.00195,-0.003906 0.50005,0.50005 0 0 1 0.03125,-0.0332031 0.50005,0.50005 0 0 1 0.00195,-0.003906 0.50005,0.50005 0 0 1 0.017578,-0.0175781 0.50005,0.50005 0 0 1 0.019531,-0.015625 0.50005,0.50005 0 0 1 0.1230469,-0.078125 0.50005,0.50005 0 0 1 0.09375,-0.03125 0.50005,0.50005 0 0 1 0.099609,-0.0117188 z"
     id="path2" />
</svg>
