<?xml version="1.0" encoding="UTF-8" standalone="no"?>
<svg
   xmlns:dc="http://purl.org/dc/elements/1.1/"
   xmlns:cc="http://creativecommons.org/ns#"
   xmlns:rdf="http://www.w3.org/1999/02/22-rdf-syntax-ns#"
   xmlns:svg="http://www.w3.org/2000/svg"
   xmlns="http://www.w3.org/2000/svg"
   xmlns:sodipodi="http://sodipodi.sourceforge.net/DTD/sodipodi-0.dtd"
   xmlns:inkscape="http://www.inkscape.org/namespaces/inkscape"
   data-dec="117"
   width="22"
   height="40"
   version="1.1"
   id="svg4"
   sodipodi:docname="117.svg"
   inkscape:version="0.92.4 (unknown)">
  <metadata
     id="metadata10">
    <rdf:RDF>
      <cc:Work
         rdf:about="">
        <dc:format>image/svg+xml</dc:format>
        <dc:type
           rdf:resource="http://purl.org/dc/dcmitype/StillImage" />
      </cc:Work>
    </rdf:RDF>
  </metadata>
  <defs
     id="defs8" />
  <sodipodi:namedview
     pagecolor="#ffffff"
     bordercolor="#666666"
     borderopacity="1"
     objecttolerance="10"
     gridtolerance="10"
     guidetolerance="10"
     inkscape:pageopacity="0"
     inkscape:pageshadow="2"
     inkscape:window-width="640"
     inkscape:window-height="480"
     id="namedview6"
     showgrid="false"
     inkscape:zoom="5.9"
     inkscape:cx="11"
     inkscape:cy="20"
     inkscape:window-x="0"
     inkscape:window-y="27"
     inkscape:window-maximized="0"
     inkscape:current-layer="svg4" />
  <path
     style="color:#000000;font-style:normal;font-variant:normal;font-weight:normal;font-stretch:normal;font-size:medium;line-height:normal;font-family:sans-serif;font-variant-ligatures:normal;font-variant-position:normal;font-variant-caps:normal;font-variant-numeric:normal;font-variant-alternates:normal;font-feature-settings:normal;text-indent:0;text-align:start;text-decoration:none;text-decoration-line:none;text-decoration-style:solid;text-decoration-color:#000000;letter-spacing:normal;word-spacing:normal;text-transform:none;writing-mode:lr-tb;direction:ltr;text-orientation:mixed;dominant-baseline:auto;baseline-shift:baseline;text-anchor:start;white-space:normal;shape-padding:0;clip-rule:nonzero;display:inline;overflow:visible;visibility:visible;opacity:1;isolation:auto;mix-blend-mode:normal;color-interpolation:sRGB;color-interpolation-filters:linearRGB;solid-color:#000000;solid-opacity:1;vector-effect:none;fill:#013272;fill-opacity:1;fill-rule:nonzero;stroke:none;stroke-width:2.5;stroke-linecap:round;stroke-linejoin:round;stroke-miterlimit:4;stroke-dasharray:none;stroke-dashoffset:0;stroke-opacity:1;color-rendering:auto;image-rendering:auto;shape-rendering:auto;text-rendering:auto;enable-background:accumulate"
     d="M 4.9804688,6.7324219 A 1.250125,1.250125 0 0 1 5.203125,6.75 h 0.5976562 a 1.250125,1.250125 0 0 1 1.0664063,0.3320312 1.250125,1.250125 0 0 1 0.00781,0.00781 1.250125,1.250125 0 0 1 0.00586,0.00586 1.250125,1.250125 0 0 1 0.00781,0.00781 A 1.250125,1.250125 0 0 1 7.25,8.203125 V 18.705078 L 7.9316406,20.068359 9.2929688,20.75 H 10.796875 L 13.324219,19.908203 14.75,18.480469 V 9.25 H 13 a 1.250125,1.250125 0 1 1 0,-2.5 h 2.800781 a 1.250125,1.250125 0 0 1 0.402344,0 h 0.597656 a 1.250125,1.250125 0 0 1 1.066407,0.3320312 1.250125,1.250125 0 0 1 0.0078,0.00781 1.250125,1.250125 0 0 1 0.0059,0.00586 1.250125,1.250125 0 0 1 0.0078,0.00781 A 1.250125,1.250125 0 0 1 18.25,8.203125 V 20.75 H 20 a 1.250125,1.250125 0 1 1 0,2.5 h -2.800781 a 1.250125,1.250125 0 0 1 -0.402344,0 h -0.597656 a 1.250125,1.250125 0 0 1 -1.066407,-0.332031 1.250125,1.250125 0 0 1 -0.01367,-0.01367 1.250125,1.250125 0 0 1 -0.0078,-0.0078 1.250125,1.250125 0 0 1 -0.378906,-0.884765 1.250125,1.250125 0 0 1 -0.337891,0.173828 l -3,1 A 1.250125,1.250125 0 0 1 11,23.25 H 9.1425781 a 1.250125,1.250125 0 0 1 -0.5878906,-0.08008 1.250125,1.250125 0 0 1 -0.00977,-0.0039 L 5.6054688,22.185547 A 1.250125,1.250125 0 0 1 4.8828125,21.558594 l -1,-2 A 1.250125,1.250125 0 0 1 3.75,19 V 9.25 H 2 a 1.250125,1.250125 0 1 1 0,-2.5 h 2.8007812 a 1.250125,1.250125 0 0 1 0.1796876,-0.017578 z"
     id="path2" />
</svg>
