<?xml version="1.0" encoding="UTF-8" standalone="no"?>
<svg
   xmlns:dc="http://purl.org/dc/elements/1.1/"
   xmlns:cc="http://creativecommons.org/ns#"
   xmlns:rdf="http://www.w3.org/1999/02/22-rdf-syntax-ns#"
   xmlns:svg="http://www.w3.org/2000/svg"
   xmlns="http://www.w3.org/2000/svg"
   xmlns:sodipodi="http://sodipodi.sourceforge.net/DTD/sodipodi-0.dtd"
   xmlns:inkscape="http://www.inkscape.org/namespaces/inkscape"
   data-dec="101"
   width="18"
   height="40"
   version="1.1"
   id="svg4"
   sodipodi:docname="101.svg"
   inkscape:version="0.92.4 (unknown)">
  <metadata
     id="metadata10">
    <rdf:RDF>
      <cc:Work
         rdf:about="">
        <dc:format>image/svg+xml</dc:format>
        <dc:type
           rdf:resource="http://purl.org/dc/dcmitype/StillImage" />
      </cc:Work>
    </rdf:RDF>
  </metadata>
  <defs
     id="defs8" />
  <sodipodi:namedview
     pagecolor="#ffffff"
     bordercolor="#666666"
     borderopacity="1"
     objecttolerance="10"
     gridtolerance="10"
     guidetolerance="10"
     inkscape:pageopacity="0"
     inkscape:pageshadow="2"
     inkscape:window-width="615"
     inkscape:window-height="417"
     id="namedview6"
     showgrid="false"
     inkscape:zoom="5.9"
     inkscape:cx="9"
     inkscape:cy="20"
     inkscape:window-x="0"
     inkscape:window-y="27"
     inkscape:window-maximized="0"
     inkscape:current-layer="svg4" />
  <path
     style="color:#000000;font-style:normal;font-variant:normal;font-weight:normal;font-stretch:normal;font-size:medium;line-height:normal;font-family:sans-serif;font-variant-ligatures:normal;font-variant-position:normal;font-variant-caps:normal;font-variant-numeric:normal;font-variant-alternates:normal;font-feature-settings:normal;text-indent:0;text-align:start;text-decoration:none;text-decoration-line:none;text-decoration-style:solid;text-decoration-color:#000000;letter-spacing:normal;word-spacing:normal;text-transform:none;writing-mode:lr-tb;direction:ltr;text-orientation:mixed;dominant-baseline:auto;baseline-shift:baseline;text-anchor:start;white-space:normal;shape-padding:0;clip-rule:nonzero;display:inline;overflow:visible;visibility:visible;opacity:1;isolation:auto;mix-blend-mode:normal;color-interpolation:sRGB;color-interpolation-filters:linearRGB;solid-color:#000000;solid-opacity:1;vector-effect:none;fill:#013272;fill-opacity:1;fill-rule:nonzero;stroke:none;stroke-width:2;stroke-linecap:round;stroke-linejoin:round;stroke-miterlimit:4;stroke-dasharray:none;stroke-dashoffset:0;stroke-opacity:1;color-rendering:auto;image-rendering:auto;shape-rendering:auto;text-rendering:auto;enable-background:accumulate"
     d="M 9.4140625,9 7.8222656,10.591797 6.9257812,12.382812 6,15.162109 V 15.46875 L 7.7207031,15.039062 10.556641,14.09375 13.224609,12.314453 13.882812,11 13.253906,9.7460938 11.763672,9 Z M 8.9804688,6.9902344 A 1.0001,1.0001 0 0 1 9.1464844,7 H 12 a 1.0001,1.0001 0 0 1 0.447266,0.1054688 l 2,1 a 1.0001,1.0001 0 0 1 0.447265,0.4472656 l 1,1.9999996 a 1.0001,1.0001 0 0 1 0,0.894532 l -1,2 a 1.0001,1.0001 0 0 1 -0.339843,0.384765 l -3,2 a 1.0001,1.0001 0 0 1 -0.238282,0.117188 l -2.9999998,1 a 1.0001,1.0001 0 0 1 -0.074219,0.02148 L 6,17.53125 v 0.306641 L 6.875,20.458984 7.4140625,21 h 1.4238281 l 2.6210934,-0.875 1.833985,-1.832031 a 1.0001,1.0001 0 1 1 1.414062,1.414062 l -2,2 a 1.0001,1.0001 0 0 1 -0.390625,0.242188 l -2.9999998,1 A 1.0001,1.0001 0 0 1 9,23 H 7.1464844 A 1.0001,1.0001 0 0 1 6.4882812,22.863281 l -1.9355468,-0.96875 a 1.0001,1.0001 0 0 1 -0.2597656,-0.1875 l -1,-1 A 1.0001,1.0001 0 0 1 3.0507812,20.316406 l -1,-3 A 1.0001,1.0001 0 0 1 2,17 v -2 a 1.0001,1.0001 0 0 1 0.050781,-0.316406 l 1,-3 a 1.0001,1.0001 0 0 1 0.1171876,-0.238282 l 2,-2.9999995 a 1.0001,1.0001 0 0 1 0.515625,-0.3945313 l 2.90625,-0.96875 a 1.0001,1.0001 0 0 1 0.00391,-0.00195 1.0001,1.0001 0 0 1 0.3867188,-0.089844 z"
     id="path2" />
</svg>
