<?xml version="1.0" encoding="UTF-8" standalone="no"?>
<svg
   xmlns:dc="http://purl.org/dc/elements/1.1/"
   xmlns:cc="http://creativecommons.org/ns#"
   xmlns:rdf="http://www.w3.org/1999/02/22-rdf-syntax-ns#"
   xmlns:svg="http://www.w3.org/2000/svg"
   xmlns="http://www.w3.org/2000/svg"
   xmlns:sodipodi="http://sodipodi.sourceforge.net/DTD/sodipodi-0.dtd"
   xmlns:inkscape="http://www.inkscape.org/namespaces/inkscape"
   data-dec="75"
   width="22"
   height="40"
   version="1.1"
   id="svg4"
   sodipodi:docname="75.svg"
   inkscape:version="0.92.4 5da689c313, 2019-01-14">
  <metadata
     id="metadata10">
    <rdf:RDF>
      <cc:Work
         rdf:about="">
        <dc:format>image/svg+xml</dc:format>
        <dc:type
           rdf:resource="http://purl.org/dc/dcmitype/StillImage" />
        <dc:title></dc:title>
      </cc:Work>
    </rdf:RDF>
  </metadata>
  <defs
     id="defs8" />
  <sodipodi:namedview
     pagecolor="#ffffff"
     bordercolor="#666666"
     borderopacity="1"
     objecttolerance="10"
     gridtolerance="10"
     guidetolerance="10"
     inkscape:pageopacity="0"
     inkscape:pageshadow="2"
     inkscape:window-width="1920"
     inkscape:window-height="1043"
     id="namedview6"
     showgrid="false"
     inkscape:zoom="5.9"
     inkscape:cx="11"
     inkscape:cy="20"
     inkscape:window-x="0"
     inkscape:window-y="37"
     inkscape:window-maximized="0"
     inkscape:current-layer="svg4" />
  <path
     style="color:#000000;font-style:normal;font-variant:normal;font-weight:normal;font-stretch:normal;font-size:medium;line-height:normal;font-family:sans-serif;font-variant-ligatures:normal;font-variant-position:normal;font-variant-caps:normal;font-variant-numeric:normal;font-variant-alternates:normal;font-feature-settings:normal;text-indent:0;text-align:start;text-decoration:none;text-decoration-line:none;text-decoration-style:solid;text-decoration-color:#000000;letter-spacing:normal;word-spacing:normal;text-transform:none;writing-mode:lr-tb;direction:ltr;text-orientation:mixed;dominant-baseline:auto;baseline-shift:baseline;text-anchor:start;white-space:normal;shape-padding:0;clip-rule:nonzero;display:inline;overflow:visible;visibility:visible;opacity:1;isolation:auto;mix-blend-mode:normal;color-interpolation:sRGB;color-interpolation-filters:linearRGB;solid-color:#000000;solid-opacity:1;vector-effect:none;fill:#000000;fill-opacity:1;fill-rule:nonzero;stroke:none;stroke-width:0.5;stroke-linecap:round;stroke-linejoin:round;stroke-miterlimit:4;stroke-dasharray:none;stroke-dashoffset:0;stroke-opacity:1;color-rendering:auto;image-rendering:auto;shape-rendering:auto;text-rendering:auto;enable-background:accumulate"
     d="M 5.25,21.605469 V 21.75 h 0.1445312 z m -1.5,0 L 3.6054688,21.75 H 3.75 Z m 13.300781,-0.300781 -0.142578,0.142578 0.21875,0.302734 h 0.380859 L 17.259766,21.408203 Z M 17.605469,1.25 18,1.6445312 18.394531,1.25 Z M 5.25,1.25 V 1.3945312 L 5.3945312,1.25 Z m -1,0 v 0.7207031 a 0.250025,0.250025 0 0 1 0,0.060547 v 18.929688 a 0.250025,0.250025 0 0 1 0,0.07422 V 21.75 h 0.5 v -0.720703 a 0.250025,0.250025 0 0 1 0,-0.06055 v -5.929688 a 0.250025,0.250025 0 0 1 0,-0.07422 V 2.0390625 a 0.250025,0.250025 0 0 1 0,-0.074219 V 1.25 Z M 3.6054688,1.25 3.75,1.3945312 V 1.25 Z M 3.9960938,0.74609375 A 0.250025,0.250025 0 0 1 4.046875,0.75 h 0.9121094 a 0.250025,0.250025 0 0 1 0.087891,0 H 6 7 a 0.250025,0.250025 0 0 1 0,0.5 H 6.1035156 L 5.25,2.1054688 V 14.394531 l 3.5449219,-3.544922 a 0.250025,0.250025 0 0 1 0.052734,-0.05273 L 17.644531,2 16.896484,1.25 H 16 a 0.250025,0.250025 0 0 1 0,-0.5 h 1 0.02148 H 19 20 a 0.250025,0.250025 0 0 1 0,0.5 h -0.896484 l -0.900391,0.9023438 a 0.250025,0.250025 0 0 1 -0.02539,0.025391 0.250025,0.250025 0 0 1 -0.01367,0.015625 l -0.0098,0.00781 a 0.250025,0.250025 0 0 1 -0.0098,0.00781 l -8.816406,8.8183596 7.28125,10.009765 0.1875,-0.189453 a 0.250025,0.250025 0 0 1 0.02539,-0.02539 0.250025,0.250025 0 0 1 0.0059,-0.0078 l -7.03125,-9.667969 a 0.25043428,0.25043428 0 1 1 0.40625,-0.292968 L 17.597656,21.019531 19.056641,21.75 H 20 a 0.250025,0.250025 0 1 1 0,0.5 h -0.966797 a 0.250025,0.250025 0 0 1 -0.04883,0 h -0.947266 a 0.250025,0.250025 0 0 1 -0.07422,0 h -0.925782 a 0.250025,0.250025 0 0 1 -0.07422,0 H 16 15 a 0.250025,0.250025 0 0 1 0,-0.5 h 0.896484 L 16.25,21.394531 8.9707031,11.384766 5.25,15.105469 v 5.789062 L 6.1054688,21.75 H 7 a 0.250025,0.250025 0 1 1 0,0.5 H 6.0390625 a 0.250025,0.250025 0 0 1 -0.074219,0 H 5.0410156 a 0.250025,0.250025 0 0 1 -0.087891,0 H 4.0410156 a 0.250025,0.250025 0 0 1 -0.087891,0 H 3 2 a 0.250025,0.250025 0 0 1 0,-0.5 H 2.8964844 L 3.75,20.894531 V 2.1054688 L 2.8964844,1.25 H 2 a 0.250025,0.250025 0 0 1 0,-0.5 h 1.0214844 0.9375 a 0.250025,0.250025 0 0 1 0.037109,-0.003906 z"
     id="path2" />
</svg>
