<?xml version="1.0" encoding="UTF-8"?>
<glyph name="ograve" format="1">
  <advance width="578"/>
  <unicode hex="00F2"/>
  <outline>
    <component base="grave" xOffset="107" yOffset="45"/>
    <component base="o"/>
  </outline>
  <lib>
    <dict>
      <key>com.fontlab.hintData</key>
      <dict>
        <key>hhints</key>
        <array>
          <dict>
            <key>position</key>
            <integer>0</integer>
            <key>width</key>
            <integer>9</integer>
          </dict>
          <dict>
            <key>position</key>
            <integer>321</integer>
            <key>width</key>
            <integer>6</integer>
          </dict>
          <dict>
            <key>position</key>
            <integer>405</integer>
            <key>width</key>
            <integer>9</integer>
          </dict>
          <dict>
            <key>position</key>
            <integer>474</integer>
            <key>width</key>
            <integer>3</integer>
          </dict>
          <dict>
            <key>position</key>
            <integer>632</integer>
            <key>width</key>
            <integer>22</integer>
          </dict>
        </array>
        <key>vhints</key>
        <array>
          <dict>
            <key>position</key>
            <integer>82</integer>
            <key>width</key>
            <integer>9</integer>
          </dict>
          <dict>
            <key>position</key>
            <integer>111</integer>
            <key>width</key>
            <integer>9</integer>
          </dict>
          <dict>
            <key>position</key>
            <integer>141</integer>
            <key>width</key>
            <integer>9</integer>
          </dict>
          <dict>
            <key>position</key>
            <integer>373</integer>
            <key>width</key>
            <integer>180</integer>
          </dict>
          <dict>
            <key>position</key>
            <integer>430</integer>
            <key>width</key>
            <integer>9</integer>
          </dict>
          <dict>
            <key>position</key>
            <integer>459</integer>
            <key>width</key>
            <integer>9</integer>
          </dict>
          <dict>
            <key>position</key>
            <integer>487</integer>
            <key>width</key>
            <integer>9</integer>
          </dict>
        </array>
      </dict>
    </dict>
  </lib>
</glyph>
