<?xml version="1.0" encoding="UTF-8" standalone="no"?>
<svg
   xmlns:dc="http://purl.org/dc/elements/1.1/"
   xmlns:cc="http://creativecommons.org/ns#"
   xmlns:rdf="http://www.w3.org/1999/02/22-rdf-syntax-ns#"
   xmlns:svg="http://www.w3.org/2000/svg"
   xmlns="http://www.w3.org/2000/svg"
   xmlns:sodipodi="http://sodipodi.sourceforge.net/DTD/sodipodi-0.dtd"
   xmlns:inkscape="http://www.inkscape.org/namespaces/inkscape"
   data-dec="40"
   width="14"
   height="40"
   version="1.1"
   id="svg4"
   sodipodi:docname="40.svg"
   inkscape:version="0.92.4 5da689c313, 2019-01-14">
  <metadata
     id="metadata10">
    <rdf:RDF>
      <cc:Work
         rdf:about="">
        <dc:format>image/svg+xml</dc:format>
        <dc:type
           rdf:resource="http://purl.org/dc/dcmitype/StillImage" />
        <dc:title></dc:title>
      </cc:Work>
    </rdf:RDF>
  </metadata>
  <defs
     id="defs8" />
  <sodipodi:namedview
     pagecolor="#ffffff"
     bordercolor="#666666"
     borderopacity="1"
     objecttolerance="10"
     gridtolerance="10"
     guidetolerance="10"
     inkscape:pageopacity="0"
     inkscape:pageshadow="2"
     inkscape:window-width="1920"
     inkscape:window-height="1043"
     id="namedview6"
     showgrid="false"
     inkscape:zoom="5.9"
     inkscape:cx="7"
     inkscape:cy="20"
     inkscape:window-x="0"
     inkscape:window-y="37"
     inkscape:window-maximized="0"
     inkscape:current-layer="svg4" />
  <path
     style="color:#000000;font-style:normal;font-variant:normal;font-weight:normal;font-stretch:normal;font-size:medium;line-height:normal;font-family:sans-serif;font-variant-ligatures:normal;font-variant-position:normal;font-variant-caps:normal;font-variant-numeric:normal;font-variant-alternates:normal;font-feature-settings:normal;text-indent:0;text-align:start;text-decoration:none;text-decoration-line:none;text-decoration-style:solid;text-decoration-color:#000000;letter-spacing:normal;word-spacing:normal;text-transform:none;writing-mode:lr-tb;direction:ltr;text-orientation:mixed;dominant-baseline:auto;baseline-shift:baseline;text-anchor:start;white-space:normal;shape-padding:0;clip-rule:nonzero;display:inline;overflow:visible;visibility:visible;opacity:1;isolation:auto;mix-blend-mode:normal;color-interpolation:sRGB;color-interpolation-filters:linearRGB;solid-color:#000000;solid-opacity:1;vector-effect:none;fill:#000000;fill-opacity:1;fill-rule:nonzero;stroke:none;stroke-width:3;stroke-linecap:round;stroke-linejoin:round;stroke-miterlimit:4;stroke-dasharray:none;stroke-dashoffset:0;stroke-opacity:1;color-rendering:auto;image-rendering:auto;shape-rendering:auto;text-rendering:auto;enable-background:accumulate"
     d="m 10.970703,-4.5136719 a 1.50015,1.50015 0 0 1 1.089844,2.5742188 L 10.166016,-0.04492187 8.3007812,2.7539062 6.4316406,6.4902344 5.5,11.148438 v 3.703124 l 0.9316406,4.658204 1.8691406,3.736328 1.8652348,2.798828 1.894531,1.894531 a 1.50015,1.50015 0 1 1 -2.1210939,2.121094 l -2,-2 a 1.50015,1.50015 0 0 1 -0.1875,-0.228516 l -2,-3 a 1.50015,1.50015 0 0 1 -0.09375,-0.162109 l -2,-4 a 1.50015,1.50015 0 0 1 -0.1289062,-0.375 l -1,-5 A 1.50015,1.50015 0 0 1 2.5,15 v -4 a 1.50015,1.50015 0 0 1 0.029297,-0.294922 l 1,-4.9999999 a 1.50015,1.50015 0 0 1 0.1289062,-0.375 l 2,-4 a 1.50015,1.50015 0 0 1 0.09375,-0.1621093 l 2,-3 a 1.50015,1.50015 0 0 1 0.1875,-0.2285157 l 2,-2 a 1.50015,1.50015 0 0 1 1.0312499,-0.453125 z"
     id="path2" />
</svg>
