<?xml version="1.0" encoding="UTF-8" standalone="no"?>
<svg
   xmlns:dc="http://purl.org/dc/elements/1.1/"
   xmlns:cc="http://creativecommons.org/ns#"
   xmlns:rdf="http://www.w3.org/1999/02/22-rdf-syntax-ns#"
   xmlns:svg="http://www.w3.org/2000/svg"
   xmlns="http://www.w3.org/2000/svg"
   xmlns:sodipodi="http://sodipodi.sourceforge.net/DTD/sodipodi-0.dtd"
   xmlns:inkscape="http://www.inkscape.org/namespaces/inkscape"
   data-dec="46"
   id="dec_46"
   width="12"
   height="40"
   version="1.1"
   sodipodi:docname="46.svg"
   inkscape:version="0.91 r13725">
  <metadata
     id="metadata9">
    <rdf:RDF>
      <cc:Work
         rdf:about="">
        <dc:format>image/svg+xml</dc:format>
        <dc:type
           rdf:resource="http://purl.org/dc/dcmitype/StillImage" />
      </cc:Work>
    </rdf:RDF>
  </metadata>
  <defs
     id="defs7" />
  <sodipodi:namedview
     pagecolor="#ffffff"
     bordercolor="#666666"
     borderopacity="1"
     objecttolerance="10"
     gridtolerance="10"
     guidetolerance="10"
     inkscape:pageopacity="0"
     inkscape:pageshadow="2"
     inkscape:window-width="1333"
     inkscape:window-height="744"
     id="namedview5"
     showgrid="true"
     inkscape:zoom="23.6"
     inkscape:cx="3.0338983"
     inkscape:cy="19.745763"
     inkscape:window-x="33"
     inkscape:window-y="924"
     inkscape:window-maximized="1"
     inkscape:current-layer="dec_46">
    <inkscape:grid
       type="xygrid"
       id="grid11" />
  </sodipodi:namedview>
  <path
     style="color:#000000;font-style:normal;font-variant:normal;font-weight:normal;font-stretch:normal;font-size:medium;line-height:normal;font-family:sans-serif;text-indent:0;text-align:start;text-decoration:none;text-decoration-line:none;text-decoration-style:solid;text-decoration-color:#000000;letter-spacing:normal;word-spacing:normal;text-transform:none;direction:ltr;block-progression:tb;writing-mode:lr-tb;baseline-shift:baseline;text-anchor:start;white-space:normal;clip-rule:nonzero;display:inline;overflow:visible;visibility:visible;opacity:1;isolation:auto;mix-blend-mode:normal;color-interpolation:sRGB;color-interpolation-filters:linearRGB;solid-color:#000000;solid-opacity:1;fill:#000000;fill-opacity:1;fill-rule:nonzero;stroke:none;stroke-width:1;stroke-linecap:round;stroke-linejoin:round;stroke-miterlimit:4;stroke-dasharray:none;stroke-dashoffset:0;stroke-opacity:1;color-rendering:auto;image-rendering:auto;shape-rendering:auto;text-rendering:auto;enable-background:accumulate"
     d="M 4.9902344 17.496094 A 0.50005 0.50005 0 0 0 4.8515625 17.519531 A 0.50005 0.50005 0 0 0 4.8203125 17.53125 A 0.50005 0.50005 0 0 0 4.8046875 17.537109 A 0.50005 0.50005 0 0 0 4.796875 17.541016 A 0.50005 0.50005 0 0 0 4.7597656 17.558594 A 0.50005 0.50005 0 0 0 4.7460938 17.566406 A 0.50005 0.50005 0 0 0 4.5957031 17.697266 L 3.6464844 18.646484 A 0.50005 0.50005 0 0 0 3.5 19 L 3.5 21 A 0.50005 0.50005 0 0 0 3.6464844 21.353516 L 4.6464844 22.353516 A 0.50005 0.50005 0 0 0 5 22.5 L 7 22.5 A 0.50005 0.50005 0 0 0 7.3535156 22.353516 L 8.3535156 21.353516 A 0.50005 0.50005 0 0 0 8.5 21 L 8.5 19 A 0.50005 0.50005 0 0 0 8.3535156 18.646484 L 7.3535156 17.646484 A 0.50005 0.50005 0 0 0 7 17.5 L 5.0742188 17.5 A 0.50005 0.50005 0 0 0 4.9902344 17.496094 z "
     id="path2" />
</svg>
