<svg xmlns:dc="http://purl.org/dc/elements/1.1/" xmlns:cc="http://creativecommons.org/ns#" xmlns:rdf="http://www.w3.org/1999/02/22-rdf-syntax-ns#" xmlns:svg="http://www.w3.org/2000/svg" xmlns="http://www.w3.org/2000/svg" xmlns:sodipodi="http://sodipodi.sourceforge.net/DTD/sodipodi-0.dtd" xmlns:inkscape="http://www.inkscape.org/namespaces/inkscape" data-dec="66" id="dec_66" width="21" height="40" version="1.1" sodipodi:docname="66.svg" inkscape:version="0.92.2 5c3e80d, 2017-08-06">
  <metadata id="metadata9">
    <rdf:RDF>
      <cc:Work rdf:about="">
        <dc:format>image/svg+xml</dc:format>
        <dc:type rdf:resource="http://purl.org/dc/dcmitype/StillImage"/>
        <dc:title/>
      </cc:Work>
    </rdf:RDF>
  </metadata>
  <defs id="defs7"/>
  <sodipodi:namedview pagecolor="#ffffff" bordercolor="#666666" borderopacity="1" objecttolerance="10" gridtolerance="10" guidetolerance="10" inkscape:pageopacity="0" inkscape:pageshadow="2" inkscape:window-width="1364" inkscape:window-height="730" id="namedview5" showgrid="false" inkscape:zoom="8.4419261" inkscape:cx="-2.5224975" inkscape:cy="27.615743" inkscape:window-x="1920" inkscape:window-y="18" inkscape:window-maximized="0" inkscape:current-layer="dec_66"/>
  <path d="M 5,1 V 22 M 2,1 h 11 l 3,1 1,1 1,2 v 2 l -1,2 -1,1 -3,1 m -8,0 h 8 l 3,1 1,1 1,2 v 3 l -1,2 -1,1 -3,1 H 2 " style="fill:none;stroke:#000000;stroke-width:1;stroke-linecap:round;stroke-linejoin:round" id="path2" inkscape:connector-curvature="0" sodipodi:nodetypes="ccccccccccccccccccccc"/>
</svg>