<svg xmlns:dc="http://purl.org/dc/elements/1.1/" xmlns:cc="http://creativecommons.org/ns#" xmlns:rdf="http://www.w3.org/1999/02/22-rdf-syntax-ns#" xmlns:svg="http://www.w3.org/2000/svg" xmlns="http://www.w3.org/2000/svg" xmlns:sodipodi="http://sodipodi.sourceforge.net/DTD/sodipodi-0.dtd" xmlns:inkscape="http://www.inkscape.org/namespaces/inkscape" data-dec="64259" id="dec_110" width="22" height="40" version="1.1" sodipodi:docname="64259.svg" inkscape:version="0.92.3 (2405546, 2018-03-11)">
  <metadata id="metadata9">
    <rdf:RDF>
      <cc:Work rdf:about="">
        <dc:format>image/svg+xml</dc:format>
        <dc:type rdf:resource="http://purl.org/dc/dcmitype/StillImage"/>
        <dc:title/>
      </cc:Work>
    </rdf:RDF>
  </metadata>
  <defs id="defs7"/>
  <sodipodi:namedview pagecolor="#ffffff" bordercolor="#666666" borderopacity="1" objecttolerance="10" gridtolerance="10" guidetolerance="10" inkscape:pageopacity="0" inkscape:pageshadow="2" inkscape:window-width="1403" inkscape:window-height="872" id="namedview5" showgrid="true" inkscape:zoom="8.49139" inkscape:cx="-27.047298" inkscape:cy="15.115332" inkscape:window-x="37" inkscape:window-y="0" inkscape:window-maximized="1" inkscape:current-layer="dec_110" showguides="true" inkscape:guide-bbox="true">
    <inkscape:grid type="xygrid" id="grid812"/>
    <sodipodi:guide position="26,15" orientation="0,1" id="guide816" inkscape:locked="false"/>
    <sodipodi:guide position="15,36" orientation="0,1" id="guide873" inkscape:locked="false"/>
  </sodipodi:namedview>
  <path id="path815" style="fill:none;fill-rule:evenodd;stroke:#000000;stroke-width:1px;stroke-linecap:round;stroke-linejoin:round;stroke-opacity:1" d="m 8,22 h 5 m -2,-1 1,1 M 3,6 l 1,-3 1,-1 2,-1 H 9 L 11,3 M 3,22 H 6 5 l -1,-1 m -1,1 v -16 m 1,16 v -16 m 0,0 1,-3 2,-2 H 9 M 1,22 H 3 M 2,22 3,21 M 1,8 H 7 M 4,9 5,8 M 3,9 2,8 m 9,-6 -2,-1 m 2,1 L 12,3 m -2,19 v -16 m 1,16 v -16 m -1,0 1,-3 1,-1 2,-1 h 1 L 17,3 m -6,3 1,-3 2,-2 v 0 M 9,22 10,21 M 7,8 h 8 M 11,9 12,8 M 10,9 9,8 m 8,-6 -2,-1 M 17,4 16,3 m 2,0 -1,1 m 0,-2 1,1 m -2,0 1,-1 m 0,0 V 4 M 16,3 h 2 M 17,9 V 22 M 18,8 V 22 M 18,8 h -3 l 2,1 v 1 m 0,11 -1,1 h -1 5 -1 l -1,-1              "/>
</svg>