<?xml version="1.0" encoding="UTF-8" standalone="no"?>
<svg
   xmlns:dc="http://purl.org/dc/elements/1.1/"
   xmlns:cc="http://creativecommons.org/ns#"
   xmlns:rdf="http://www.w3.org/1999/02/22-rdf-syntax-ns#"
   xmlns:svg="http://www.w3.org/2000/svg"
   xmlns="http://www.w3.org/2000/svg"
   xmlns:sodipodi="http://sodipodi.sourceforge.net/DTD/sodipodi-0.dtd"
   xmlns:inkscape="http://www.inkscape.org/namespaces/inkscape"
   data-dec="106"
   width="9"
   height="40"
   version="1.1"
   id="svg4"
   sodipodi:docname="106.svg"
   inkscape:version="0.92.4 (unknown)">
  <metadata
     id="metadata10">
    <rdf:RDF>
      <cc:Work
         rdf:about="">
        <dc:format>image/svg+xml</dc:format>
        <dc:type
           rdf:resource="http://purl.org/dc/dcmitype/StillImage" />
      </cc:Work>
    </rdf:RDF>
  </metadata>
  <defs
     id="defs8" />
  <sodipodi:namedview
     pagecolor="#ffffff"
     bordercolor="#666666"
     borderopacity="1"
     objecttolerance="10"
     gridtolerance="10"
     guidetolerance="10"
     inkscape:pageopacity="0"
     inkscape:pageshadow="2"
     inkscape:window-width="640"
     inkscape:window-height="480"
     id="namedview6"
     showgrid="false"
     inkscape:zoom="5.9"
     inkscape:cx="4.5"
     inkscape:cy="20"
     inkscape:window-x="0"
     inkscape:window-y="27"
     inkscape:window-maximized="0"
     inkscape:current-layer="svg4" />
  <path
     style="color:#000000;font-style:normal;font-variant:normal;font-weight:normal;font-stretch:normal;font-size:medium;line-height:normal;font-family:sans-serif;font-variant-ligatures:normal;font-variant-position:normal;font-variant-caps:normal;font-variant-numeric:normal;font-variant-alternates:normal;font-feature-settings:normal;text-indent:0;text-align:start;text-decoration:none;text-decoration-line:none;text-decoration-style:solid;text-decoration-color:#000000;letter-spacing:normal;word-spacing:normal;text-transform:none;writing-mode:lr-tb;direction:ltr;text-orientation:mixed;dominant-baseline:auto;baseline-shift:baseline;text-anchor:start;white-space:normal;shape-padding:0;clip-rule:nonzero;display:inline;overflow:visible;visibility:visible;opacity:1;isolation:auto;mix-blend-mode:normal;color-interpolation:sRGB;color-interpolation-filters:linearRGB;solid-color:#000000;solid-opacity:1;vector-effect:none;fill:#000000;fill-opacity:1;fill-rule:nonzero;stroke:none;stroke-width:1.5;stroke-linecap:round;stroke-linejoin:round;stroke-miterlimit:4;stroke-dasharray:none;stroke-dashoffset:0;stroke-opacity:1;color-rendering:auto;image-rendering:auto;shape-rendering:auto;text-rendering:auto;enable-background:accumulate"
     d="m 5.9882812,7.2402344 a 0.750075,0.750075 0 0 1 0.3378907,0.076172 0.750075,0.750075 0 0 1 0.066406,0.035156 0.750075,0.750075 0 0 1 0.048828,0.033203 0.750075,0.750075 0 0 1 0.013672,0.00781 0.750075,0.750075 0 0 1 0.019531,0.015625 0.750075,0.750075 0 0 1 0.00586,0.00586 A 0.750075,0.750075 0 0 1 6.75,8.1191406 V 22.933594 a 0.750075,0.750075 0 0 1 -0.00977,0.193359 0.750075,0.750075 0 0 1 0,0.0039 0.750075,0.750075 0 0 1 -0.025391,0.105469 L 5.7285156,27.181641 A 0.750075,0.750075 0 0 1 5.53125,27.53125 l -2,2 -1,1 a 0.750075,0.750075 0 0 1 -0.035156,0.03125 0.750075,0.750075 0 0 1 -0.058594,0.04687 0.750075,0.750075 0 0 1 -0.064453,0.04102 0.750075,0.750075 0 0 1 -0.066406,0.0332 0.750075,0.750075 0 0 1 -0.070312,0.02734 l -2.99999998,1 a 0.750075,0.750075 0 0 1 -0.12304687,0.03125 0.750075,0.750075 0 0 1 -0.0742188,0.0098 0.750075,0.750075 0 0 1 -0.1484375,-0.0059 0.750075,0.750075 0 0 1 -0.2167969,-0.0625 0.750075,0.750075 0 0 1 -0.1855469,-0.123047 0.750075,0.750075 0 0 1 -0.1015624,-0.111328 0.750075,0.750075 0 0 1 -0.125,-0.269531 0.750075,0.750075 0 0 1 -0.021484,-0.148438 0.750075,0.750075 0 0 1 0.1582031,-0.490234 0.750075,0.750075 0 0 1 0.048828,-0.05664 0.750075,0.750075 0 0 1 0.054687,-0.05078 0.750075,0.750075 0 0 1 0.1914063,-0.119141 0.750075,0.750075 0 0 1 0.070312,-0.02539 L 1.5195312,29.369141 3.3046875,26.691406 4.25,22.904297 V 10.3125 L 3.6894531,9.75 H 3 A 0.750075,0.750075 0 0 1 2.7636719,8.2890625 L 5.6464844,7.328125 a 0.750075,0.750075 0 0 1 0.3417968,-0.087891 z m -1,-6 a 0.750075,0.750075 0 0 1 0.21875,0.029297 0.750075,0.750075 0 0 1 0.00391,0 0.750075,0.750075 0 0 1 0.068359,0.023438 0.750075,0.750075 0 0 1 0.00195,0.00195 0.750075,0.750075 0 0 1 0.066406,0.029297 0.750075,0.750075 0 0 1 0.00195,0.00195 0.750075,0.750075 0 0 1 0.0625,0.035156 0.750075,0.750075 0 0 1 0.00195,0.00195 0.750075,0.750075 0 0 1 0.1972656,0.1855469 L 6.453125,2.390625 a 0.750075,0.750075 0 0 1 0.2109375,0.2402344 0.750075,0.750075 0 0 1 0.00195,0.00195 0.750075,0.750075 0 0 1 0.03125,0.064453 0.750075,0.750075 0 0 1 0,0.00195 0.750075,0.750075 0 0 1 0.027344,0.068359 0.750075,0.750075 0 0 1 0,0.00195 0.750075,0.750075 0 0 1 0.00586,0.4375 0.750075,0.750075 0 0 1 0,0.00391 0.750075,0.750075 0 0 1 -0.023438,0.068359 0.750075,0.750075 0 0 1 -0.00195,0.00195 0.750075,0.750075 0 0 1 -0.029297,0.066406 0.750075,0.750075 0 0 1 -0.00195,0.00195 0.750075,0.750075 0 0 1 -0.035156,0.0625 0.750075,0.750075 0 0 1 -0.00195,0.00195 0.750075,0.750075 0 0 1 -0.1855469,0.1972656 L 5.609375,4.453125 a 0.750075,0.750075 0 0 1 -0.2402344,0.2109375 0.750075,0.750075 0 0 1 -0.00195,0.00195 0.750075,0.750075 0 0 1 -0.033203,0.015625 0.750075,0.750075 0 0 1 -0.1035156,0.042969 0.750075,0.750075 0 0 1 -0.4375,0.00586 0.750075,0.750075 0 0 1 -0.00391,0 0.750075,0.750075 0 0 1 -0.035156,-0.011719 0.750075,0.750075 0 0 1 -0.035156,-0.013672 0.750075,0.750075 0 0 1 -0.066406,-0.029297 0.750075,0.750075 0 0 1 -0.00195,-0.00195 0.750075,0.750075 0 0 1 -0.0625,-0.035156 0.750075,0.750075 0 0 1 -0.00195,-0.00195 A 0.750075,0.750075 0 0 1 4.3886719,4.4511719 L 3.546875,3.609375 a 0.750075,0.750075 0 0 1 -0.2109375,-0.2402344 0.750075,0.750075 0 0 1 -0.00195,-0.00195 0.750075,0.750075 0 0 1 -0.015625,-0.033203 0.750075,0.750075 0 0 1 -0.015625,-0.033203 0.750075,0.750075 0 0 1 -0.027344,-0.068359 0.750075,0.750075 0 0 1 0,-0.00195 0.750075,0.750075 0 0 1 -0.00586,-0.4375 0.750075,0.750075 0 0 1 0,-0.00391 0.750075,0.750075 0 0 1 0.011719,-0.035156 0.750075,0.750075 0 0 1 0.013672,-0.035156 0.750075,0.750075 0 0 1 0.029297,-0.066406 0.750075,0.750075 0 0 1 0.00195,-0.00195 0.750075,0.750075 0 0 1 0.035156,-0.0625 0.750075,0.750075 0 0 1 0.00195,-0.00195 0.750075,0.750075 0 0 1 0.1855469,-0.1972656 L 4.390625,1.546875 a 0.750075,0.750075 0 0 1 0.2402344,-0.2109375 0.750075,0.750075 0 0 1 0.00195,-0.00195 0.750075,0.750075 0 0 1 0.033203,-0.015625 0.750075,0.750075 0 0 1 0.1035156,-0.042969 0.750075,0.750075 0 0 1 0.21875,-0.035156 z"
     id="path2" />
</svg>
