<?xml version="1.0" encoding="UTF-8" standalone="no"?>
<svg
   xmlns:dc="http://purl.org/dc/elements/1.1/"
   xmlns:cc="http://creativecommons.org/ns#"
   xmlns:rdf="http://www.w3.org/1999/02/22-rdf-syntax-ns#"
   xmlns:svg="http://www.w3.org/2000/svg"
   xmlns="http://www.w3.org/2000/svg"
   xmlns:sodipodi="http://sodipodi.sourceforge.net/DTD/sodipodi-0.dtd"
   xmlns:inkscape="http://www.inkscape.org/namespaces/inkscape"
   data-dec="126"
   id="dec_126"
   width="24"
   height="40"
   version="1.1"
   inkscape:version="0.91 r13725"
   sodipodi:docname="126.svg">
  <metadata
     id="metadata9">
    <rdf:RDF>
      <cc:Work
         rdf:about="">
        <dc:format>image/svg+xml</dc:format>
        <dc:type
           rdf:resource="http://purl.org/dc/dcmitype/StillImage" />
      </cc:Work>
    </rdf:RDF>
  </metadata>
  <defs
     id="defs7" />
  <sodipodi:namedview
     pagecolor="#ffffff"
     bordercolor="#666666"
     borderopacity="1"
     objecttolerance="10"
     gridtolerance="10"
     guidetolerance="10"
     inkscape:pageopacity="0"
     inkscape:pageshadow="2"
     inkscape:window-width="640"
     inkscape:window-height="480"
     id="namedview5"
     showgrid="false"
     inkscape:zoom="5.9"
     inkscape:cx="12"
     inkscape:cy="20"
     inkscape:window-x="33"
     inkscape:window-y="24"
     inkscape:window-maximized="0"
     inkscape:current-layer="dec_126" />
  <path
     style="color:#000000;font-style:normal;font-variant:normal;font-weight:normal;font-stretch:normal;font-size:medium;line-height:normal;font-family:sans-serif;text-indent:0;text-align:start;text-decoration:none;text-decoration-line:none;text-decoration-style:solid;text-decoration-color:#000000;letter-spacing:normal;word-spacing:normal;text-transform:none;direction:ltr;block-progression:tb;writing-mode:lr-tb;baseline-shift:baseline;text-anchor:start;white-space:normal;clip-rule:nonzero;display:inline;overflow:visible;visibility:visible;opacity:1;isolation:auto;mix-blend-mode:normal;color-interpolation:sRGB;color-interpolation-filters:linearRGB;solid-color:#000000;solid-opacity:1;fill:#000000;fill-opacity:1;fill-rule:nonzero;stroke:none;stroke-width:1;stroke-linecap:round;stroke-linejoin:round;stroke-miterlimit:4;stroke-dasharray:none;stroke-dashoffset:0;stroke-opacity:1;color-rendering:auto;image-rendering:auto;shape-rendering:auto;text-rendering:auto;enable-background:accumulate"
     d="M 20.992188 9.4921875 A 0.50005 0.50005 0 0 0 20.5 10 L 20.5 11.882812 L 19.626953 13.626953 L 17.882812 14.5 L 16.117188 14.5 L 14.263672 13.572266 L 10.300781 10.599609 A 0.50005 0.50005 0 0 0 10.222656 10.552734 L 8.2226562 9.5527344 A 0.50005 0.50005 0 0 0 8 9.5 L 6 9.5 A 0.50005 0.50005 0 0 0 5.7773438 9.5527344 L 3.7773438 10.552734 A 0.50005 0.50005 0 0 0 3.5253906 10.841797 L 2.5332031 13.818359 A 0.50005 0.50005 0 0 0 2.53125 13.822266 L 2.5253906 13.841797 A 0.50005 0.50005 0 0 0 2.5 14.066406 L 2.5 16 A 0.50005 0.50005 0 1 0 3.5 16 L 3.5 14.117188 L 4.3730469 12.373047 L 6.1171875 11.5 L 7.8828125 11.5 L 9.7363281 12.427734 L 13.699219 15.400391 A 0.50005 0.50005 0 0 0 13.777344 15.447266 L 15.777344 16.447266 A 0.50005 0.50005 0 0 0 16 16.5 L 18 16.5 A 0.50005 0.50005 0 0 0 18.222656 16.447266 L 20.222656 15.447266 A 0.50005 0.50005 0 0 0 20.474609 15.158203 L 21.466797 12.181641 L 21.46875 12.177734 A 0.50005 0.50005 0 0 0 21.474609 12.158203 A 0.50005 0.50005 0 0 0 21.5 11.933594 L 21.5 10 A 0.50005 0.50005 0 0 0 20.992188 9.4921875 z "
     id="path3" />
</svg>
