<?xml version="1.0" encoding="UTF-8" standalone="no"?>
<svg
   xmlns:dc="http://purl.org/dc/elements/1.1/"
   xmlns:cc="http://creativecommons.org/ns#"
   xmlns:rdf="http://www.w3.org/1999/02/22-rdf-syntax-ns#"
   xmlns:svg="http://www.w3.org/2000/svg"
   xmlns="http://www.w3.org/2000/svg"
   xmlns:sodipodi="http://sodipodi.sourceforge.net/DTD/sodipodi-0.dtd"
   xmlns:inkscape="http://www.inkscape.org/namespaces/inkscape"
   data-dec="67"
   width="22"
   height="40"
   version="1.1"
   id="svg4"
   sodipodi:docname="67.svg"
   inkscape:version="0.92.4 (unknown)">
  <metadata
     id="metadata10">
    <rdf:RDF>
      <cc:Work
         rdf:about="">
        <dc:format>image/svg+xml</dc:format>
        <dc:type
           rdf:resource="http://purl.org/dc/dcmitype/StillImage" />
      </cc:Work>
    </rdf:RDF>
  </metadata>
  <defs
     id="defs8" />
  <sodipodi:namedview
     pagecolor="#ffffff"
     bordercolor="#666666"
     borderopacity="1"
     objecttolerance="10"
     gridtolerance="10"
     guidetolerance="10"
     inkscape:pageopacity="0"
     inkscape:pageshadow="2"
     inkscape:window-width="640"
     inkscape:window-height="480"
     id="namedview6"
     showgrid="false"
     inkscape:zoom="5.9"
     inkscape:cx="11"
     inkscape:cy="20"
     inkscape:window-x="0"
     inkscape:window-y="27"
     inkscape:window-maximized="0"
     inkscape:current-layer="svg4" />
  <path
     style="color:#000000;font-style:normal;font-variant:normal;font-weight:normal;font-stretch:normal;font-size:medium;line-height:normal;font-family:sans-serif;font-variant-ligatures:normal;font-variant-position:normal;font-variant-caps:normal;font-variant-numeric:normal;font-variant-alternates:normal;font-feature-settings:normal;text-indent:0;text-align:start;text-decoration:none;text-decoration-line:none;text-decoration-style:solid;text-decoration-color:#000000;letter-spacing:normal;word-spacing:normal;text-transform:none;writing-mode:lr-tb;direction:ltr;text-orientation:mixed;dominant-baseline:auto;baseline-shift:baseline;text-anchor:start;white-space:normal;shape-padding:0;clip-rule:nonzero;display:inline;overflow:visible;visibility:visible;opacity:1;isolation:auto;mix-blend-mode:normal;color-interpolation:sRGB;color-interpolation-filters:linearRGB;solid-color:#000000;solid-opacity:1;vector-effect:none;fill:#013272;fill-opacity:1;fill-rule:nonzero;stroke:none;stroke-width:0.30000001;stroke-linecap:round;stroke-linejoin:round;stroke-miterlimit:4;stroke-dasharray:none;stroke-dashoffset:0;stroke-opacity:1;color-rendering:auto;image-rendering:auto;shape-rendering:auto;text-rendering:auto;enable-background:accumulate"
     d="M 19.6875,1.9609375 19.134766,3.0664062 A 0.15001501,0.15001501 0 0 1 19,3.1503906 h -0.757812 l 0.892578,1.7832032 A 0.15001501,0.15001501 0 0 1 19.150391,5 V 5.1816406 Z M 10.044922,1.8085938 9.0800781,2.1308594 7.1171875,4.0957031 5.1367188,7.0664062 4.1445312,10.041016 3.1503906,14.017578 v 2.958984 l 0.9804688,2.94336 0.9492187,0.949219 0.9648438,0.322265 -0.1113281,-0.05664 a 0.15001501,0.15001501 0 0 1 -0.068359,-0.06836 l -1,-2 A 0.15001501,0.15001501 0 0 1 4.8496094,19 v -5 a 0.15001501,0.15001501 0 0 1 0.00391,-0.03711 l 1,-4.0000004 a 0.15001501,0.15001501 0 0 1 0.00391,-0.00977 l 1,-3 a 0.15001501,0.15001501 0 0 1 0.00781,-0.019531 l 1,-2 A 0.15001501,0.15001501 0 0 1 7.875,4.9160156 L 9.0351562,3.1757812 7.1230469,5.0878906 6.1386719,7.0566406 5.1445312,10.041016 4.1503906,14.017578 v 3.947266 l 0.984375,1.96875 a 0.15023822,0.15023822 0 0 1 -0.2695312,0.132812 l -1,-2 A 0.15001501,0.15001501 0 0 1 3.8496094,18 v -4 a 0.15001501,0.15001501 0 0 1 0.00391,-0.03711 l 1,-4.0000004 a 0.15001501,0.15001501 0 0 1 0.00391,-0.00977 l 1,-3 a 0.15001501,0.15001501 0 0 1 0.00781,-0.019531 l 1,-2 a 0.15001501,0.15001501 0 0 1 0.029297,-0.039063 l 2,-2 A 0.15001501,0.15001501 0 0 1 9.1523438,2.9980469 L 9.875,1.9160156 a 0.15001501,0.15001501 0 0 1 0.058594,-0.050781 z m 9.935547,-0.96093755 a 0.15001501,0.15001501 0 0 1 0.167969,0.17773435 l -1,6 A 0.15001501,0.15001501 0 0 1 18.849609,7 V 5.0351562 L 17.876953,3.0878906 17.875,3.0859375 16.912109,2.1230469 14.964844,1.1503906 H 12.035156 L 10.103516,2.1171875 8.1308594,5.0761719 7.1386719,7.0566406 6.1445312,10.041016 5.1503906,14.017578 v 4.947266 l 0.9609375,1.923828 1.9238281,0.960937 h 2.9296878 l 1.947265,-0.972656 1.964844,-1.964844 0.988281,-1.978515 a 0.15023858,0.15023858 0 0 1 0.269532,0.132812 l -1,2 a 0.15001501,0.15001501 0 0 1 -0.0293,0.03906 l -2,2 a 0.15001501,0.15001501 0 0 1 -0.03906,0.0293 l -2,1 A 0.15001501,0.15001501 0 0 1 11,22.150391 H 8.0195312 8.0058594 a 0.15001501,0.15001501 0 0 1 -0.00977,0 0.15001501,0.15001501 0 0 1 -0.00586,0 0.15001501,0.15001501 0 0 1 -0.00781,-0.002 0.15001501,0.15001501 0 0 1 -0.00781,0 0.15001501,0.15001501 0 0 1 -0.00781,-0.002 0.15001501,0.15001501 0 0 1 -0.00586,-0.002 0.15001501,0.15001501 0 0 1 -0.00781,-0.002 l -0.00586,-0.002 a 0.15001501,0.15001501 0 0 1 -0.013672,-0.0059 L 4.953125,21.142578 a 0.15001501,0.15001501 0 0 1 -0.058594,-0.03711 l -1,-1 a 0.15001501,0.15001501 0 0 1 -0.037109,-0.05859 l -1,-3 A 0.15001501,0.15001501 0 0 1 2.8496094,17 v -3 a 0.15001501,0.15001501 0 0 1 0.00391,-0.03711 l 1,-4.0000004 a 0.15001501,0.15001501 0 0 1 0.00391,-0.00977 l 1,-3 A 0.15001501,0.15001501 0 0 1 4.875,6.9160156 l 2,-3 a 0.15001501,0.15001501 0 0 1 0.019531,-0.021484 l 2,-2 a 0.15001501,0.15001501 0 0 1 0.058594,-0.037109 l 2.980469,-0.99218752 a 0.15001501,0.15001501 0 0 1 0.01953,-0.007813 0.15001501,0.15001501 0 0 1 0.0332,-0.007813 0.15001501,0.15001501 0 0 1 0.01367,0 0.15001501,0.15001501 0 0 1 0.01563,0 H 15 a 0.15001501,0.15001501 0 0 1 0.06641,0.015625 l 2,1.00000002 a 0.15001501,0.15001501 0 0 1 0.03906,0.029297 l 0.955078,0.9550782 h 0.847656 l 0.957031,-1.91601565 a 0.15001501,0.15001501 0 0 1 0.115235,-0.0859375 z"
     id="path2" />
</svg>
