<?xml version="1.0" encoding="UTF-8" standalone="no"?>
<svg
   xmlns:dc="http://purl.org/dc/elements/1.1/"
   xmlns:cc="http://creativecommons.org/ns#"
   xmlns:rdf="http://www.w3.org/1999/02/22-rdf-syntax-ns#"
   xmlns:svg="http://www.w3.org/2000/svg"
   xmlns="http://www.w3.org/2000/svg"
   xmlns:sodipodi="http://sodipodi.sourceforge.net/DTD/sodipodi-0.dtd"
   xmlns:inkscape="http://www.inkscape.org/namespaces/inkscape"
   data-dec="78"
   width="22"
   height="40"
   version="1.1"
   id="svg4"
   sodipodi:docname="78.svg"
   inkscape:version="0.92.4 (unknown)">
  <metadata
     id="metadata10">
    <rdf:RDF>
      <cc:Work
         rdf:about="">
        <dc:format>image/svg+xml</dc:format>
        <dc:type
           rdf:resource="http://purl.org/dc/dcmitype/StillImage" />
      </cc:Work>
    </rdf:RDF>
  </metadata>
  <defs
     id="defs8" />
  <sodipodi:namedview
     pagecolor="#ffffff"
     bordercolor="#666666"
     borderopacity="1"
     objecttolerance="10"
     gridtolerance="10"
     guidetolerance="10"
     inkscape:pageopacity="0"
     inkscape:pageshadow="2"
     inkscape:window-width="640"
     inkscape:window-height="480"
     id="namedview6"
     showgrid="false"
     inkscape:zoom="5.9"
     inkscape:cx="11"
     inkscape:cy="20"
     inkscape:window-x="0"
     inkscape:window-y="27"
     inkscape:window-maximized="0"
     inkscape:current-layer="svg4" />
  <path
     style="color:#000000;font-style:normal;font-variant:normal;font-weight:normal;font-stretch:normal;font-size:medium;line-height:normal;font-family:sans-serif;font-variant-ligatures:normal;font-variant-position:normal;font-variant-caps:normal;font-variant-numeric:normal;font-variant-alternates:normal;font-feature-settings:normal;text-indent:0;text-align:start;text-decoration:none;text-decoration-line:none;text-decoration-style:solid;text-decoration-color:#000000;letter-spacing:normal;word-spacing:normal;text-transform:none;writing-mode:lr-tb;direction:ltr;text-orientation:mixed;dominant-baseline:auto;baseline-shift:baseline;text-anchor:start;white-space:normal;shape-padding:0;clip-rule:nonzero;display:inline;overflow:visible;visibility:visible;opacity:1;isolation:auto;mix-blend-mode:normal;color-interpolation:sRGB;color-interpolation-filters:linearRGB;solid-color:#000000;solid-opacity:1;vector-effect:none;fill:#000000;fill-opacity:1;fill-rule:nonzero;stroke:none;stroke-width:1;stroke-linecap:round;stroke-linejoin:round;stroke-miterlimit:4;stroke-dasharray:none;stroke-dashoffset:0;stroke-opacity:1;color-rendering:auto;image-rendering:auto;shape-rendering:auto;text-rendering:auto;enable-background:accumulate"
     d="M 5.5,21.035156 A 0.50005,0.50005 0 0 1 5.0820312,21.5 H 5.5 Z M 4.5,21 v 0.5 H 4.9199219 A 0.50005,0.50005 0 0 1 4.5,21 Z m 13,-1.941406 a 0.50005,0.50005 0 0 1 -0.103516,0.253906 0.50005,0.50005 0 0 1 -0.06836,0.07227 0.50005,0.50005 0 0 1 -0.03906,0.03125 0.50005,0.50005 0 0 1 -0.08008,0.04492 0.50005,0.50005 0 0 1 -0.0078,0.0039 0.50005,0.50005 0 0 1 -0.01953,0.0078 0.50005,0.50005 0 0 1 -0.02734,0.0098 0.50005,0.50005 0 0 1 -0.01953,0.0059 0.50005,0.50005 0 0 1 -0.0039,0 0.50005,0.50005 0 0 1 -0.03711,0.0098 0.50005,0.50005 0 0 1 -0.0078,0.002 0.50005,0.50005 0 0 1 -0.0293,0.0039 0.50005,0.50005 0 0 1 -0.01172,0 v 0.002 L 17.5,20.240234 Z M 5.5,2.7597656 V 3.9414062 A 0.50005,0.50005 0 0 1 5.6035156,3.6875 a 0.50005,0.50005 0 0 1 0.068359,-0.072266 0.50005,0.50005 0 0 1 0.039063,-0.03125 0.50005,0.50005 0 0 1 0.080078,-0.044922 0.50005,0.50005 0 0 1 0.019531,-0.00781 0.50005,0.50005 0 0 1 0.019531,-0.00781 0.50005,0.50005 0 0 1 0.03125,-0.00977 0.50005,0.50005 0 0 1 0.00391,-0.00195 0.50005,0.50005 0 0 1 0.00391,0 0.50005,0.50005 0 0 1 0.037109,-0.00977 0.50005,0.50005 0 0 1 0.023437,-0.00391 0.50005,0.50005 0 0 1 0.013672,-0.00195 0.50005,0.50005 0 0 1 0.011719,0 v -0.00195 z M 18.080078,1.5 A 0.50005,0.50005 0 0 1 18.5,2 V 1.5 Z M 17.5,1.5 V 1.9648438 A 0.50005,0.50005 0 0 1 17.917969,1.5 Z M 3.9921875,0.4921875 A 0.50005,0.50005 0 0 1 4.0800781,0.5 H 5.0078125 6 A 0.50005,0.50005 0 0 1 6.4257812,0.74023438 L 16.5,17.224609 V 1.0820312 A 0.50005,0.50005 0 0 1 16.603516,0.6875 a 0.50005,0.50005 0 0 1 0.002,-0.003906 0.50005,0.50005 0 0 1 0.03125,-0.0332031 0.50005,0.50005 0 0 1 0.002,-0.003906 0.50005,0.50005 0 0 1 0.01758,-0.0175781 0.50005,0.50005 0 0 1 0.01953,-0.015625 A 0.50005,0.50005 0 0 1 17.080078,0.5 h 1.837891 a 0.50005,0.50005 0 0 1 0.394531,0.10351562 0.50005,0.50005 0 0 1 0.0039,0.001953 0.50005,0.50005 0 0 1 0.0332,0.03125 0.50005,0.50005 0 0 1 0.0039,0.001953 0.50005,0.50005 0 0 1 0.03125,0.0332031 0.50005,0.50005 0 0 1 0.002,0.003906 A 0.50005,0.50005 0 0 1 19.5,1.0800781 V 22 A 0.50005,0.50005 0 0 1 19,22.5 H 17.992188 17 A 0.50005,0.50005 0 0 1 16.574219,22.259766 L 6.5,5.7753906 V 22 A 0.50005,0.50005 0 0 1 6,22.5 H 4.0820312 A 0.50005,0.50005 0 0 1 3.6875,22.396484 a 0.50005,0.50005 0 0 1 -0.00391,-0.002 0.50005,0.50005 0 0 1 -0.033203,-0.03125 0.50005,0.50005 0 0 1 -0.00391,-0.002 0.50005,0.50005 0 0 1 -0.017578,-0.01758 0.50005,0.50005 0 0 1 -0.015625,-0.01953 A 0.50005,0.50005 0 0 1 3.5,21.919922 V 1.0820312 A 0.50005,0.50005 0 0 1 3.6035156,0.6875 a 0.50005,0.50005 0 0 1 0.00195,-0.003906 0.50005,0.50005 0 0 1 0.03125,-0.0332031 0.50005,0.50005 0 0 1 0.00195,-0.003906 0.50005,0.50005 0 0 1 0.017578,-0.0175781 0.50005,0.50005 0 0 1 0.019531,-0.015625 0.50005,0.50005 0 0 1 0.3164063,-0.12109375 z"
     id="path2" />
</svg>
