<?xml version="1.0" encoding="UTF-8" standalone="no"?>
<svg
   xmlns:dc="http://purl.org/dc/elements/1.1/"
   xmlns:cc="http://creativecommons.org/ns#"
   xmlns:rdf="http://www.w3.org/1999/02/22-rdf-syntax-ns#"
   xmlns:svg="http://www.w3.org/2000/svg"
   xmlns="http://www.w3.org/2000/svg"
   xmlns:sodipodi="http://sodipodi.sourceforge.net/DTD/sodipodi-0.dtd"
   xmlns:inkscape="http://www.inkscape.org/namespaces/inkscape"
   data-dec="99"
   id="dec_99"
   width="18"
   height="40"
   version="1.1"
   sodipodi:docname="99.svg"
   inkscape:version="0.91 r13725">
  <metadata
     id="metadata9">
    <rdf:RDF>
      <cc:Work
         rdf:about="">
        <dc:format>image/svg+xml</dc:format>
        <dc:type
           rdf:resource="http://purl.org/dc/dcmitype/StillImage" />
      </cc:Work>
    </rdf:RDF>
  </metadata>
  <defs
     id="defs7" />
  <sodipodi:namedview
     pagecolor="#ffffff"
     bordercolor="#666666"
     borderopacity="1"
     objecttolerance="10"
     gridtolerance="10"
     guidetolerance="10"
     inkscape:pageopacity="0"
     inkscape:pageshadow="2"
     inkscape:window-width="1407"
     inkscape:window-height="876"
     id="namedview5"
     showgrid="true"
     inkscape:zoom="33.37544"
     inkscape:cx="0.1912787"
     inkscape:cy="25.69325"
     inkscape:window-x="33"
     inkscape:window-y="24"
     inkscape:window-maximized="1"
     inkscape:current-layer="dec_99">
    <inkscape:grid
       type="xygrid"
       id="grid11" />
  </sodipodi:namedview>
  <path
     style="color:#000000;font-style:normal;font-variant:normal;font-weight:normal;font-stretch:normal;font-size:medium;line-height:normal;font-family:sans-serif;text-indent:0;text-align:start;text-decoration:none;text-decoration-line:none;text-decoration-style:solid;text-decoration-color:#000000;letter-spacing:normal;word-spacing:normal;text-transform:none;direction:ltr;block-progression:tb;writing-mode:lr-tb;baseline-shift:baseline;text-anchor:start;white-space:normal;clip-rule:nonzero;display:inline;overflow:visible;visibility:visible;opacity:1;isolation:auto;mix-blend-mode:normal;color-interpolation:sRGB;color-interpolation-filters:linearRGB;solid-color:#000000;solid-opacity:1;fill:#000000;fill-opacity:1;fill-rule:nonzero;stroke:none;stroke-width:1;stroke-linecap:round;stroke-linejoin:round;stroke-miterlimit:4;stroke-dasharray:none;stroke-dashoffset:0;stroke-opacity:1;color-rendering:auto;image-rendering:auto;shape-rendering:auto;text-rendering:auto;enable-background:accumulate"
     d="M 8 7.5 A 0.50005 0.50005 0 0 0 7.7773438 7.5527344 L 5.7773438 8.5527344 A 0.50005 0.50005 0 0 0 5.6464844 8.6464844 L 3.6464844 10.646484 A 0.50005 0.50005 0 0 0 3.5253906 10.841797 L 2.5253906 13.841797 A 0.50005 0.50005 0 0 0 2.5 14 L 2.5 16 A 0.50005 0.50005 0 0 0 2.5253906 16.158203 L 3.5253906 19.158203 A 0.50005 0.50005 0 0 0 3.6464844 19.353516 L 5.6464844 21.353516 A 0.50005 0.50005 0 0 0 5.7773438 21.447266 L 7.7773438 22.447266 A 0.50005 0.50005 0 0 0 8 22.5 L 9 22.5 L 11 22.5 L 12 22.5 A 0.50005 0.50005 0 0 0 12.222656 22.447266 L 14.222656 21.447266 A 0.50005 0.50005 0 0 0 14.353516 21.353516 L 16.296875 19.410156 A 0.50005 0.50005 0 0 0 16.335938 19.378906 A 0.50005 0.50005 0 0 0 16.373047 19.34375 A 0.50005 0.50005 0 0 0 16.404297 19.304688 A 0.50005 0.50005 0 0 0 16.433594 19.263672 A 0.50005 0.50005 0 0 0 16.457031 19.220703 A 0.50005 0.50005 0 0 0 16.476562 19.173828 A 0.50005 0.50005 0 0 0 16.496094 19.09375 A 0.50005 0.50005 0 0 0 16.5 19.078125 A 0.50005 0.50005 0 0 0 16.505859 19.027344 A 0.50005 0.50005 0 0 0 16.505859 18.994141 A 0.50005 0.50005 0 0 0 16.505859 18.976562 A 0.50005 0.50005 0 0 0 16.501953 18.945312 A 0.50005 0.50005 0 0 0 16.5 18.927734 A 0.50005 0.50005 0 0 0 16.496094 18.912109 A 0.50005 0.50005 0 0 0 16.494141 18.894531 A 0.50005 0.50005 0 0 0 16.490234 18.878906 A 0.50005 0.50005 0 0 0 16.482422 18.847656 A 0.50005 0.50005 0 0 0 16.478516 18.837891 A 0.50005 0.50005 0 0 0 16.476562 18.830078 A 0.50005 0.50005 0 0 0 16.470703 18.818359 A 0.50005 0.50005 0 0 0 16.464844 18.800781 A 0.50005 0.50005 0 0 0 16.457031 18.785156 A 0.50005 0.50005 0 0 0 16.15625 18.519531 L 14.222656 17.552734 A 0.50005 0.50005 0 0 0 14.177734 17.533203 A 0.50005 0.50005 0 0 0 14.130859 17.517578 A 0.50005 0.50005 0 0 0 14.082031 17.505859 A 0.50005 0.50005 0 0 0 13.982422 17.5 A 0.50005 0.50005 0 0 0 13.931641 17.503906 A 0.50005 0.50005 0 0 0 13.744141 17.570312 A 0.50005 0.50005 0 0 0 13.664062 17.628906 A 0.50005 0.50005 0 0 0 13.628906 17.664062 A 0.50005 0.50005 0 0 0 13.597656 17.703125 A 0.50005 0.50005 0 0 0 13.552734 17.777344 A 0.50005 0.50005 0 0 0 13.546875 17.789062 L 12.644531 19.591797 L 10.039062 20.460938 L 8.2226562 19.552734 L 6.4101562 18.646484 L 5.5 15.917969 L 5.5 14.082031 L 6.4101562 11.353516 L 8.2226562 10.447266 L 10.013672 9.5527344 L 12.652344 10.705078 L 13.552734 12.226562 A 0.50005 0.50005 0 0 0 13.570312 12.253906 A 0.50005 0.50005 0 0 0 13.595703 12.292969 A 0.50005 0.50005 0 0 0 13.605469 12.306641 A 0.50005 0.50005 0 0 0 13.623047 12.328125 A 0.50005 0.50005 0 0 0 13.628906 12.335938 A 0.50005 0.50005 0 0 0 13.652344 12.359375 A 0.50005 0.50005 0 0 0 13.677734 12.380859 A 0.50005 0.50005 0 0 0 13.699219 12.398438 A 0.50005 0.50005 0 0 0 13.703125 12.402344 A 0.50005 0.50005 0 0 0 13.730469 12.419922 A 0.50005 0.50005 0 0 0 13.767578 12.443359 A 0.50005 0.50005 0 0 0 13.78125 12.449219 A 0.50005 0.50005 0 0 0 13.794922 12.455078 A 0.50005 0.50005 0 0 0 13.833984 12.470703 A 0.50005 0.50005 0 0 0 13.84375 12.474609 A 0.50005 0.50005 0 0 0 13.875 12.484375 A 0.50005 0.50005 0 0 0 13.882812 12.486328 A 0.50005 0.50005 0 0 0 13.916016 12.492188 A 0.50005 0.50005 0 0 0 13.964844 12.498047 A 0.50005 0.50005 0 0 0 13.998047 12.5 A 0.50005 0.50005 0 0 0 14.03125 12.498047 A 0.50005 0.50005 0 0 0 14.064453 12.496094 A 0.50005 0.50005 0 0 0 14.070312 12.496094 A 0.50005 0.50005 0 0 0 14.113281 12.486328 A 0.50005 0.50005 0 0 0 14.130859 12.482422 A 0.50005 0.50005 0 0 0 14.150391 12.476562 A 0.50005 0.50005 0 0 0 14.177734 12.466797 A 0.50005 0.50005 0 0 0 14.222656 12.447266 L 16.152344 11.482422 A 0.50005 0.50005 0 0 0 16.462891 11.201172 A 0.50005 0.50005 0 0 0 16.480469 11.154297 A 0.50005 0.50005 0 0 0 16.492188 11.113281 A 0.50005 0.50005 0 0 0 16.494141 11.107422 A 0.50005 0.50005 0 0 0 16.494141 11.103516 A 0.50005 0.50005 0 0 0 16.501953 11.056641 A 0.50005 0.50005 0 0 0 16.503906 11.03125 A 0.50005 0.50005 0 0 0 16.503906 10.957031 A 0.50005 0.50005 0 0 0 16.498047 10.908203 A 0.50005 0.50005 0 0 0 16.486328 10.859375 A 0.50005 0.50005 0 0 0 16.470703 10.8125 A 0.50005 0.50005 0 0 0 16.425781 10.722656 A 0.50005 0.50005 0 0 0 16.396484 10.683594 A 0.50005 0.50005 0 0 0 16.298828 10.591797 L 14.353516 8.6464844 A 0.50005 0.50005 0 0 0 14.222656 8.5527344 L 12.222656 7.5527344 A 0.50005 0.50005 0 0 0 12 7.5 L 11 7.5 L 9 7.5 L 8 7.5 z "
     id="path13" />
</svg>
