<?xml version="1.0" encoding="UTF-8" standalone="no"?>
<svg
   xmlns:dc="http://purl.org/dc/elements/1.1/"
   xmlns:cc="http://creativecommons.org/ns#"
   xmlns:rdf="http://www.w3.org/1999/02/22-rdf-syntax-ns#"
   xmlns:svg="http://www.w3.org/2000/svg"
   xmlns="http://www.w3.org/2000/svg"
   xmlns:sodipodi="http://sodipodi.sourceforge.net/DTD/sodipodi-0.dtd"
   xmlns:inkscape="http://www.inkscape.org/namespaces/inkscape"
   data-dec="58"
   width="12"
   height="40"
   version="1.1"
   id="svg4"
   sodipodi:docname="58.svg"
   inkscape:version="0.92.4 (unknown)">
  <metadata
     id="metadata10">
    <rdf:RDF>
      <cc:Work
         rdf:about="">
        <dc:format>image/svg+xml</dc:format>
        <dc:type
           rdf:resource="http://purl.org/dc/dcmitype/StillImage" />
      </cc:Work>
    </rdf:RDF>
  </metadata>
  <defs
     id="defs8" />
  <sodipodi:namedview
     pagecolor="#ffffff"
     bordercolor="#666666"
     borderopacity="1"
     objecttolerance="10"
     gridtolerance="10"
     guidetolerance="10"
     inkscape:pageopacity="0"
     inkscape:pageshadow="2"
     inkscape:window-width="640"
     inkscape:window-height="480"
     id="namedview6"
     showgrid="false"
     inkscape:zoom="5.9"
     inkscape:cx="6"
     inkscape:cy="20"
     inkscape:window-x="0"
     inkscape:window-y="27"
     inkscape:window-maximized="0"
     inkscape:current-layer="svg4" />
  <path
     style="color:#000000;font-style:normal;font-variant:normal;font-weight:normal;font-stretch:normal;font-size:medium;line-height:normal;font-family:sans-serif;font-variant-ligatures:normal;font-variant-position:normal;font-variant-caps:normal;font-variant-numeric:normal;font-variant-alternates:normal;font-feature-settings:normal;text-indent:0;text-align:start;text-decoration:none;text-decoration-line:none;text-decoration-style:solid;text-decoration-color:#000000;letter-spacing:normal;word-spacing:normal;text-transform:none;writing-mode:lr-tb;direction:ltr;text-orientation:mixed;dominant-baseline:auto;baseline-shift:baseline;text-anchor:start;white-space:normal;shape-padding:0;clip-rule:nonzero;display:inline;overflow:visible;visibility:visible;opacity:1;isolation:auto;mix-blend-mode:normal;color-interpolation:sRGB;color-interpolation-filters:linearRGB;solid-color:#000000;solid-opacity:1;vector-effect:none;fill:#013272;fill-opacity:1;fill-rule:nonzero;stroke:none;stroke-width:0.5;stroke-linecap:round;stroke-linejoin:round;stroke-miterlimit:4;stroke-dasharray:none;stroke-dashoffset:0;stroke-opacity:1;color-rendering:auto;image-rendering:auto;shape-rendering:auto;text-rendering:auto;enable-background:accumulate"
     d="m 2.9941406,19.748047 a 0.250025,0.250025 0 0 1 0.1835938,0.429687 L 2.3554688,21 3,21.644531 3.8222656,20.822266 a 0.25135447,0.25135447 0 1 1 0.3554688,0.355468 l -1,1 a 0.250025,0.250025 0 0 1 -0.3554688,0 l -1,-1 a 0.250025,0.250025 0 0 1 0,-0.355468 l 1,-1 a 0.250025,0.250025 0 0 1 0.171875,-0.07422 z M 6,8.3554688 5.3554688,9 6,9.6445312 6.6445312,9 Z M 5.9726562,7.7480469 a 0.250025,0.250025 0 0 1 0.021484,0 0.250025,0.250025 0 0 1 0.00391,0 0.250025,0.250025 0 0 1 0.021484,0 0.250025,0.250025 0 0 1 0.00195,0 0.250025,0.250025 0 0 1 0.023437,0.00391 0.250025,0.250025 0 0 1 0.00195,0 0.250025,0.250025 0 0 1 0.00391,0.00195 0.250025,0.250025 0 0 1 0.064453,0.021484 0.250025,0.250025 0 0 1 0.00195,0.00195 0.250025,0.250025 0 0 1 0.060547,0.044922 0.250025,0.250025 0 0 1 0.015625,0.013672 l 0.00781,0.00977 a 0.250025,0.250025 0 0 1 0.00781,0.00977 l 0.96875,0.9667968 a 0.250025,0.250025 0 0 1 0,0.3554688 l -1,0.9999996 a 0.250025,0.250025 0 0 1 -0.3554688,0 l -1,-0.9999996 a 0.250025,0.250025 0 0 1 0,-0.3554688 L 5.796875,7.8476562 a 0.250025,0.250025 0 0 1 0.025391,-0.025391 0.250025,0.250025 0 0 1 0.076172,-0.052734 0.250025,0.250025 0 0 1 0.00195,-0.00195 0.250025,0.250025 0 0 1 0.072266,-0.019531 z"
     id="path2" />
</svg>
