<?xml version="1.0" encoding="UTF-8" standalone="no"?>
<svg
   xmlns:dc="http://purl.org/dc/elements/1.1/"
   xmlns:cc="http://creativecommons.org/ns#"
   xmlns:rdf="http://www.w3.org/1999/02/22-rdf-syntax-ns#"
   xmlns:svg="http://www.w3.org/2000/svg"
   xmlns="http://www.w3.org/2000/svg"
   xmlns:sodipodi="http://sodipodi.sourceforge.net/DTD/sodipodi-0.dtd"
   xmlns:inkscape="http://www.inkscape.org/namespaces/inkscape"
   data-dec="180"
   width="12"
   height="40"
   version="1.1"
   id="svg4"
   sodipodi:docname="180.svg"
   inkscape:version="0.92.4 (unknown)">
  <metadata
     id="metadata10">
    <rdf:RDF>
      <cc:Work
         rdf:about="">
        <dc:format>image/svg+xml</dc:format>
        <dc:type
           rdf:resource="http://purl.org/dc/dcmitype/StillImage" />
      </cc:Work>
    </rdf:RDF>
  </metadata>
  <defs
     id="defs8" />
  <sodipodi:namedview
     pagecolor="#ffffff"
     bordercolor="#666666"
     borderopacity="1"
     objecttolerance="10"
     gridtolerance="10"
     guidetolerance="10"
     inkscape:pageopacity="0"
     inkscape:pageshadow="2"
     inkscape:window-width="640"
     inkscape:window-height="480"
     id="namedview6"
     showgrid="false"
     inkscape:zoom="5.9"
     inkscape:cx="6"
     inkscape:cy="20"
     inkscape:window-x="0"
     inkscape:window-y="27"
     inkscape:window-maximized="0"
     inkscape:current-layer="svg4" />
  <path
     style="color:#000000;font-style:normal;font-variant:normal;font-weight:normal;font-stretch:normal;font-size:medium;line-height:normal;font-family:sans-serif;font-variant-ligatures:normal;font-variant-position:normal;font-variant-caps:normal;font-variant-numeric:normal;font-variant-alternates:normal;font-feature-settings:normal;text-indent:0;text-align:start;text-decoration:none;text-decoration-line:none;text-decoration-style:solid;text-decoration-color:#000000;letter-spacing:normal;word-spacing:normal;text-transform:none;writing-mode:lr-tb;direction:ltr;text-orientation:mixed;dominant-baseline:auto;baseline-shift:baseline;text-anchor:start;white-space:normal;shape-padding:0;clip-rule:nonzero;display:inline;overflow:visible;visibility:visible;opacity:1;isolation:auto;mix-blend-mode:normal;color-interpolation:sRGB;color-interpolation-filters:linearRGB;solid-color:#000000;solid-opacity:1;vector-effect:none;fill:#000000;fill-opacity:1;fill-rule:nonzero;stroke:none;stroke-width:0.30000001;stroke-linecap:round;stroke-linejoin:round;stroke-miterlimit:4;stroke-dasharray:none;stroke-dashoffset:0;stroke-opacity:1;color-rendering:auto;image-rendering:auto;shape-rendering:auto;text-rendering:auto;enable-background:accumulate"
     d="M 4.9335938,5.6445312 3.4277344,6.8496094 H 3.9296875 Z M 6.7753906,3.4355469 5.015625,5.1953125 5.8945312,4.4921875 Z M 9.0097656,1.2207031 7.0664062,3.5546875 7.90625,2.8828125 a 0.15007322,0.15007322 0 1 1 0.1875,0.234375 L 6.1054688,4.7089844 5.171875,5.828125 9.7792969,1.9902344 Z M 8.0703125,1.1503906 5.2246094,4.5644531 8.6386719,1.1503906 Z M 7.9980469,0.84765625 a 0.15001501,0.15001501 0 0 1 0.015625,0.001953 h 0.96875 0.00195 a 0.15001501,0.15001501 0 0 1 0.013672,-0.001953 0.15001501,0.15001501 0 0 1 0.00977,0.001953 0.15001501,0.15001501 0 0 1 0.00586,0 0.15001501,0.15001501 0 0 1 0.013672,0.001953 0.15001501,0.15001501 0 0 1 0.029297,0.007813 0.15001501,0.15001501 0 0 1 0.039063,0.0234375 0.15001501,0.15001501 0 0 1 0.00781,0.007813 A 0.15001501,0.15001501 0 0 1 9.125,0.9140625 l 0.980469,0.9804687 a 0.15001501,0.15001501 0 0 1 -0.0098,0.2207032 l -5.9941405,4.9941406 -0.00586,0.00586 a 0.15001501,0.15001501 0 0 1 -0.011719,0.00781 0.15001501,0.15001501 0 0 1 -0.011719,0.00781 0.15001501,0.15001501 0 0 1 -0.013672,0.00781 0.15001501,0.15001501 0 0 1 -0.072266,0.011719 h -0.96875 a 0.15001501,0.15001501 0 0 1 -0.013672,0.00195 0.15001501,0.15001501 0 0 1 -0.013672,-0.00195 0.15001501,0.15001501 0 0 1 -0.00195,0 0.15001501,0.15001501 0 0 1 -0.00195,0 0.15001501,0.15001501 0 0 1 -0.013672,-0.00195 0.15001501,0.15001501 0 0 1 -0.013672,-0.00195 0.15001501,0.15001501 0 0 1 -0.00195,0 0.15001501,0.15001501 0 0 1 -0.011719,-0.00586 0.15001501,0.15001501 0 0 1 -0.013672,-0.00586 0.15001501,0.15001501 0 0 1 -0.00195,0 0.15001501,0.15001501 0 0 1 -0.011719,-0.00781 0.15001501,0.15001501 0 0 1 -0.00195,0 0.15001501,0.15001501 0 0 1 -0.00977,-0.00781 0.15001501,0.15001501 0 0 1 -0.00195,0 0.15001501,0.15001501 0 0 1 -0.00977,-0.00977 0.15001501,0.15001501 0 0 1 -0.00195,-0.00195 0.15001501,0.15001501 0 0 1 -0.00781,-0.00977 0.15001501,0.15001501 0 0 1 -0.00977,-0.011719 0.15001501,0.15001501 0 0 1 -0.00781,-0.011719 0.15001501,0.15001501 0 0 1 0,-0.00195 0.15001501,0.15001501 0 0 1 -0.00586,-0.011719 0.15001501,0.15001501 0 0 1 -0.00195,-0.00195 0.15001501,0.15001501 0 0 1 -0.00195,-0.00781 0.15001501,0.15001501 0 0 1 -0.00195,-0.00586 0.15001501,0.15001501 0 0 1 -0.00391,-0.013672 0.15001501,0.15001501 0 0 1 0,-0.00195 0.15001501,0.15001501 0 0 1 -0.00195,-0.013672 0.15001501,0.15001501 0 0 1 0,-0.029297 0.15001501,0.15001501 0 0 1 0,-0.00195 0.15001501,0.15001501 0 0 1 0.00195,-0.011719 0.15001501,0.15001501 0 0 1 0,-0.00195 0.15001501,0.15001501 0 0 1 0.00391,-0.013672 0.15001501,0.15001501 0 0 1 0,-0.00195 0.15001501,0.15001501 0 0 1 0.00195,-0.00391 0.15001501,0.15001501 0 0 1 0.00391,-0.00977 0.15001501,0.15001501 0 0 1 0.00195,-0.00586 0.15001501,0.15001501 0 0 1 0.00391,-0.00586 0.15001501,0.15001501 0 0 1 0,-0.00195 0.15001501,0.15001501 0 0 1 0.00781,-0.011719 0.15001501,0.15001501 0 0 1 0.00977,-0.011719 0.15001501,0.15001501 0 0 1 0.00391,-0.00586 0.15001501,0.15001501 0 0 1 0.00586,-0.00391 v -0.00195 L 7.8652344,0.9296875 a 0.15001501,0.15001501 0 0 1 0.00781,-0.0117188 0.15001501,0.15001501 0 0 1 0.019531,-0.0234375 0.15001501,0.15001501 0 0 1 0.00977,-0.009766 0.15001501,0.15001501 0 0 1 0.033203,-0.0214844 0.15001501,0.15001501 0 0 1 0.019531,-0.007813 0.15001501,0.15001501 0 0 1 0.027344,-0.005859 0.15001501,0.15001501 0 0 1 0.00195,0 0.15001501,0.15001501 0 0 1 0.013672,-0.001953 z"
     id="path2" />
</svg>
