<svg xmlns:dc="http://purl.org/dc/elements/1.1/" xmlns:cc="http://creativecommons.org/ns#" xmlns:rdf="http://www.w3.org/1999/02/22-rdf-syntax-ns#" xmlns:svg="http://www.w3.org/2000/svg" xmlns="http://www.w3.org/2000/svg" xmlns:sodipodi="http://sodipodi.sourceforge.net/DTD/sodipodi-0.dtd" xmlns:inkscape="http://www.inkscape.org/namespaces/inkscape" data-dec="168" id="dec_46" width="15" height="40" version="1.1" sodipodi:docname="168.svg" inkscape:version="0.92.3 (2405546, 2018-03-11)">
  <metadata id="metadata9">
    <rdf:RDF>
      <cc:Work rdf:about="">
        <dc:format>image/svg+xml</dc:format>
        <dc:type rdf:resource="http://purl.org/dc/dcmitype/StillImage"/>
        <dc:title/>
      </cc:Work>
    </rdf:RDF>
  </metadata>
  <defs id="defs7"/>
  <sodipodi:namedview pagecolor="#ffffff" bordercolor="#666666" borderopacity="1" objecttolerance="10" gridtolerance="10" guidetolerance="10" inkscape:pageopacity="0" inkscape:pageshadow="2" inkscape:window-width="1403" inkscape:window-height="872" id="namedview5" showgrid="true" showguides="true" inkscape:zoom="16.7855" inkscape:cx="-9.0580417" inkscape:cy="25.031363" inkscape:window-x="37" inkscape:window-y="0" inkscape:window-maximized="1" inkscape:current-layer="dec_46" inkscape:guide-bbox="true">
    <inkscape:grid type="xygrid" id="grid897"/>
    <sodipodi:guide position="4,35" orientation="1,0" id="guide841" inkscape:locked="false"/>
    <sodipodi:guide position="11,33" orientation="1,0" id="guide843" inkscape:locked="false"/>
  </sodipodi:namedview>
  <path id="path824-5" style="fill:none;fill-rule:evenodd;stroke:#000000;stroke-width:1px;stroke-linecap:round;stroke-linejoin:round;stroke-opacity:1" d="m 10,5 -1,-1 m 2,0 -1,1 m 0,-2 1,1 m -2,0 1,-1 m 0,0 v 2 m -1,-1 h 2 M 5,5 4,4 M 6,4 5,5 M 5,3 6,4 M 4,4 5,3 M 5,3 V 5 M 4,4 h 2              "/>
</svg>