<?xml version="1.0" encoding="UTF-8"?>
<glyph name="uacute" format="1">
  <advance width="607"/>
  <unicode hex="00FA"/>
  <outline>
    <component base="acute" xOffset="212" yOffset="67"/>
    <component base="u"/>
  </outline>
  <lib>
    <dict>
      <key>com.fontlab.hintData</key>
      <dict>
        <key>hhints</key>
        <array>
          <dict>
            <key>position</key>
            <integer>0</integer>
            <key>width</key>
            <integer>29</integer>
          </dict>
          <dict>
            <key>position</key>
            <integer>405</integer>
            <key>width</key>
            <integer>29</integer>
          </dict>
          <dict>
            <key>position</key>
            <integer>492</integer>
            <key>width</key>
            <integer>174</integer>
          </dict>
        </array>
        <key>vhints</key>
        <array>
          <dict>
            <key>position</key>
            <integer>130</integer>
            <key>width</key>
            <integer>30</integer>
          </dict>
          <dict>
            <key>position</key>
            <integer>216</integer>
            <key>width</key>
            <integer>202</integer>
          </dict>
          <dict>
            <key>position</key>
            <integer>449</integer>
            <key>width</key>
            <integer>29</integer>
          </dict>
        </array>
      </dict>
    </dict>
  </lib>
</glyph>
