<?xml version="1.0" encoding="UTF-8" standalone="no"?>
<svg
   xmlns:dc="http://purl.org/dc/elements/1.1/"
   xmlns:cc="http://creativecommons.org/ns#"
   xmlns:rdf="http://www.w3.org/1999/02/22-rdf-syntax-ns#"
   xmlns:svg="http://www.w3.org/2000/svg"
   xmlns="http://www.w3.org/2000/svg"
   xmlns:sodipodi="http://sodipodi.sourceforge.net/DTD/sodipodi-0.dtd"
   xmlns:inkscape="http://www.inkscape.org/namespaces/inkscape"
   data-dec="68"
   width="22"
   height="40"
   version="1.1"
   id="svg4"
   sodipodi:docname="68.svg"
   inkscape:version="0.92.4 (unknown)">
  <metadata
     id="metadata10">
    <rdf:RDF>
      <cc:Work
         rdf:about="">
        <dc:format>image/svg+xml</dc:format>
        <dc:type
           rdf:resource="http://purl.org/dc/dcmitype/StillImage" />
      </cc:Work>
    </rdf:RDF>
  </metadata>
  <defs
     id="defs8" />
  <sodipodi:namedview
     pagecolor="#ffffff"
     bordercolor="#666666"
     borderopacity="1"
     objecttolerance="10"
     gridtolerance="10"
     guidetolerance="10"
     inkscape:pageopacity="0"
     inkscape:pageshadow="2"
     inkscape:window-width="640"
     inkscape:window-height="480"
     id="namedview6"
     showgrid="false"
     inkscape:zoom="5.9"
     inkscape:cx="11"
     inkscape:cy="20"
     inkscape:window-x="0"
     inkscape:window-y="27"
     inkscape:window-maximized="0"
     inkscape:current-layer="svg4" />
  <path
     style="color:#000000;font-style:normal;font-variant:normal;font-weight:normal;font-stretch:normal;font-size:medium;line-height:normal;font-family:sans-serif;font-variant-ligatures:normal;font-variant-position:normal;font-variant-caps:normal;font-variant-numeric:normal;font-variant-alternates:normal;font-feature-settings:normal;text-indent:0;text-align:start;text-decoration:none;text-decoration-line:none;text-decoration-style:solid;text-decoration-color:#000000;letter-spacing:normal;word-spacing:normal;text-transform:none;writing-mode:lr-tb;direction:ltr;text-orientation:mixed;dominant-baseline:auto;baseline-shift:baseline;text-anchor:start;white-space:normal;shape-padding:0;clip-rule:nonzero;display:inline;overflow:visible;visibility:visible;opacity:1;isolation:auto;mix-blend-mode:normal;color-interpolation:sRGB;color-interpolation-filters:linearRGB;solid-color:#000000;solid-opacity:1;vector-effect:none;fill:#013272;fill-opacity:1;fill-rule:nonzero;stroke:none;stroke-width:1;stroke-linecap:round;stroke-linejoin:round;stroke-miterlimit:4;stroke-dasharray:none;stroke-dashoffset:0;stroke-opacity:1;color-rendering:auto;image-rendering:auto;shape-rendering:auto;text-rendering:auto;enable-background:accumulate"
     d="M 6.4980469,21.060547 A 0.50005,0.50005 0 0 1 6.0820312,21.5 H 6.5 v -0.427734 a 0.50005,0.50005 0 0 1 -0.00195,-0.01172 z m -0.9960938,-0.0039 A 0.50005,0.50005 0 0 1 5.5,21.070312 V 21.5 H 5.9140625 A 0.50005,0.50005 0 0 1 5.5019531,21.056641 Z m 10.1738279,-1.667969 -0.458984,0.6875 0.601562,-0.601563 a 0.50005,0.50005 0 0 1 -0.142578,-0.08594 z m -0.458984,-16.4648439 0.458984,0.6875 a 0.50005,0.50005 0 0 1 0.144531,-0.083984 z M 9.1171875,1.5 8.0390625,2.0390625 7.5,3.1171875 V 19.882812 L 8.0390625,20.960938 9.1171875,21.5 H 11.882812 L 13.658203,20.611328 15.535156,17.794922 16.5,13.9375 V 9.0625 L 15.535156,5.2050781 13.658203,2.3886719 11.882812,1.5 Z m -3.03125,0 A 0.50005,0.50005 0 0 1 6.4980469,1.9433594 0.50005,0.50005 0 0 1 6.5,1.9296875 V 1.5 Z M 5.5,1.5 v 0.4277344 a 0.50005,0.50005 0 0 1 0.00195,0.011719 A 0.50005,0.50005 0 0 1 5.9179688,1.5 Z M 4.9921875,0.4921875 A 0.50005,0.50005 0 0 1 5.0800781,0.5 h 1.8378907 a 0.50005,0.50005 0 0 1 0.1621093,0 h 0.8476563 a 0.50005,0.50005 0 0 1 0.1503906,0 h 0.875 a 0.50005,0.50005 0 0 1 0.1113281,0 h 2.8691409 a 0.50005,0.50005 0 0 1 0.224609,0.0253906 0.50005,0.50005 0 0 1 0.01953,0.005859 l 0.0039,0.001953 2.976562,0.99218748 a 0.50005,0.50005 0 0 1 0.195313,0.1210938 l 2,2 a 0.50005,0.50005 0 0 1 0.09375,0.1308594 l 1,2 a 0.50005,0.50005 0 0 1 0.02734,0.064453 l 1,3 A 0.50005,0.50005 0 0 1 19.5,9 v 5 a 0.50005,0.50005 0 0 1 -0.02539,0.158203 l -1,3 a 0.50005,0.50005 0 0 1 -0.02734,0.06445 l -1,2 a 0.50005,0.50005 0 0 1 -0.09375,0.13086 l -2,2 a 0.50005,0.50005 0 0 1 -0.195313,0.121093 l -2.966797,0.988282 a 0.50005,0.50005 0 0 1 -0.01563,0.0059 l -0.01758,0.0059 a 0.50005,0.50005 0 0 1 -0.0098,0.0039 0.50005,0.50005 0 0 1 -0.0039,0.002 A 0.50005,0.50005 0 0 1 11.935547,22.5 H 9.0664062 a 0.50005,0.50005 0 0 1 -0.1152343,0 h -0.875 a 0.50005,0.50005 0 0 1 -0.1464844,0 H 7.0820312 a 0.50005,0.50005 0 0 1 -0.1621093,0 H 5.0820312 a 0.50005,0.50005 0 0 1 -0.1621093,0 H 4.0722656 a 0.50005,0.50005 0 0 1 -0.1503906,0 h -0.875 a 0.50005,0.50005 0 0 1 -0.1113281,0 H 2 a 0.50005,0.50005 0 1 1 0,-1 H 2.8828125 L 3.9609375,20.960938 4.5,19.882812 V 3.1171875 L 3.9609375,2.0390625 2.8828125,1.5 H 2 a 0.50005,0.50005 0 1 1 0,-1 h 0.9335938 a 0.50005,0.50005 0 0 1 0.1152343,0 h 0.875 a 0.50005,0.50005 0 0 1 0.1464844,0 h 0.8476563 a 0.50005,0.50005 0 0 1 0.074219,-0.007813 z"
     id="path2" />
</svg>
