<?xml version="1.0" encoding="UTF-8" standalone="no"?>
<svg
   xmlns:dc="http://purl.org/dc/elements/1.1/"
   xmlns:cc="http://creativecommons.org/ns#"
   xmlns:rdf="http://www.w3.org/1999/02/22-rdf-syntax-ns#"
   xmlns:svg="http://www.w3.org/2000/svg"
   xmlns="http://www.w3.org/2000/svg"
   xmlns:sodipodi="http://sodipodi.sourceforge.net/DTD/sodipodi-0.dtd"
   xmlns:inkscape="http://www.inkscape.org/namespaces/inkscape"
   data-dec="79"
   width="21"
   height="40"
   version="1.1"
   id="svg4"
   sodipodi:docname="79.svg"
   inkscape:version="0.92.4 (unknown)">
  <metadata
     id="metadata10">
    <rdf:RDF>
      <cc:Work
         rdf:about="">
        <dc:format>image/svg+xml</dc:format>
        <dc:type
           rdf:resource="http://purl.org/dc/dcmitype/StillImage" />
      </cc:Work>
    </rdf:RDF>
  </metadata>
  <defs
     id="defs8" />
  <sodipodi:namedview
     pagecolor="#ffffff"
     bordercolor="#666666"
     borderopacity="1"
     objecttolerance="10"
     gridtolerance="10"
     guidetolerance="10"
     inkscape:pageopacity="0"
     inkscape:pageshadow="2"
     inkscape:window-width="640"
     inkscape:window-height="480"
     id="namedview6"
     showgrid="false"
     inkscape:zoom="5.9"
     inkscape:cx="10.5"
     inkscape:cy="20"
     inkscape:window-x="0"
     inkscape:window-y="27"
     inkscape:window-maximized="0"
     inkscape:current-layer="svg4" />
  <path
     style="color:#000000;font-style:normal;font-variant:normal;font-weight:normal;font-stretch:normal;font-size:medium;line-height:normal;font-family:sans-serif;font-variant-ligatures:normal;font-variant-position:normal;font-variant-caps:normal;font-variant-numeric:normal;font-variant-alternates:normal;font-feature-settings:normal;text-indent:0;text-align:start;text-decoration:none;text-decoration-line:none;text-decoration-style:solid;text-decoration-color:#000000;letter-spacing:normal;word-spacing:normal;text-transform:none;writing-mode:lr-tb;direction:ltr;text-orientation:mixed;dominant-baseline:auto;baseline-shift:baseline;text-anchor:start;white-space:normal;shape-padding:0;clip-rule:nonzero;display:inline;overflow:visible;visibility:visible;opacity:1;isolation:auto;mix-blend-mode:normal;color-interpolation:sRGB;color-interpolation-filters:linearRGB;solid-color:#000000;solid-opacity:1;vector-effect:none;fill:#000000;fill-opacity:1;fill-rule:nonzero;stroke:none;stroke-width:2;stroke-linecap:round;stroke-linejoin:round;stroke-miterlimit:4;stroke-dasharray:none;stroke-dashoffset:0;stroke-opacity:1;color-rendering:auto;image-rendering:auto;shape-rendering:auto;text-rendering:auto;enable-background:accumulate"
     d="M 9.2363281,4 7.5917969,4.8222656 5.8222656,6.5917969 4.9257812,8.3828125 4,11.162109 v 2.675782 l 0.9257812,2.779297 0.8964844,1.791015 1.7695313,1.769531 L 9.2363281,21 h 2.5273439 l 1.644531,-0.822266 1.769531,-1.769531 0.896485,-1.791015 L 17,13.837891 V 11.162109 L 16.074219,8.3828125 15.177734,6.5917969 13.408203,4.8222656 11.763672,4 Z M 9.0039062,1.9941406 A 1.0001,1.0001 0 0 1 9.1191406,2 H 12 a 1.0001,1.0001 0 0 1 0.447266,0.1054688 l 2,1 a 1.0001,1.0001 0 0 1 0.259765,0.1875 l 2,2 a 1.0001,1.0001 0 0 1 0.1875,0.2597656 l 1,2 a 1.0001,1.0001 0 0 1 0.05469,0.1308594 l 1,3.0000002 A 1.0001,1.0001 0 0 1 19,11 v 3 a 1.0001,1.0001 0 0 1 -0.05078,0.316406 l -1,3 a 1.0001,1.0001 0 0 1 -0.05469,0.13086 l -1,2 a 1.0001,1.0001 0 0 1 -0.1875,0.259765 l -2,2 a 1.0001,1.0001 0 0 1 -0.259765,0.1875 l -2,1 A 1.0001,1.0001 0 0 1 12,23 H 9 A 1.0001,1.0001 0 0 1 8.5527344,22.894531 l -2,-1 a 1.0001,1.0001 0 0 1 -0.2597656,-0.1875 l -2,-2 a 1.0001,1.0001 0 0 1 -0.1875,-0.259765 l -1,-2 a 1.0001,1.0001 0 0 1 -0.054688,-0.13086 l -1,-3 A 1.0001,1.0001 0 0 1 2,14 v -3 a 1.0001,1.0001 0 0 1 0.050781,-0.316406 l 1,-3.0000002 a 1.0001,1.0001 0 0 1 0.054688,-0.1308594 l 1,-2 a 1.0001,1.0001 0 0 1 0.1875,-0.2597656 l 2,-2 a 1.0001,1.0001 0 0 1 0.2597656,-0.1875 L 8.4335938,2.1660156 a 1.0001,1.0001 0 0 1 0.011719,-0.00586 1.0001,1.0001 0 0 1 0.3339844,-0.1367187 1.0001,1.0001 0 0 1 0.021484,-0.00586 1.0001,1.0001 0 0 1 0.203125,-0.023438 z"
     id="path2" />
</svg>
