<?xml version="1.0" encoding="UTF-8" standalone="no"?>
<svg
   xmlns:dc="http://purl.org/dc/elements/1.1/"
   xmlns:cc="http://creativecommons.org/ns#"
   xmlns:rdf="http://www.w3.org/1999/02/22-rdf-syntax-ns#"
   xmlns:svg="http://www.w3.org/2000/svg"
   xmlns="http://www.w3.org/2000/svg"
   xmlns:sodipodi="http://sodipodi.sourceforge.net/DTD/sodipodi-0.dtd"
   xmlns:inkscape="http://www.inkscape.org/namespaces/inkscape"
   data-dec="119"
   width="27"
   height="40"
   version="1.1"
   id="svg4"
   sodipodi:docname="119.svg"
   inkscape:version="0.92.4 5da689c313, 2019-01-14">
  <metadata
     id="metadata10">
    <rdf:RDF>
      <cc:Work
         rdf:about="">
        <dc:format>image/svg+xml</dc:format>
        <dc:type
           rdf:resource="http://purl.org/dc/dcmitype/StillImage" />
        <dc:title></dc:title>
      </cc:Work>
    </rdf:RDF>
  </metadata>
  <defs
     id="defs8" />
  <sodipodi:namedview
     pagecolor="#ffffff"
     bordercolor="#666666"
     borderopacity="1"
     objecttolerance="10"
     gridtolerance="10"
     guidetolerance="10"
     inkscape:pageopacity="0"
     inkscape:pageshadow="2"
     inkscape:window-width="1920"
     inkscape:window-height="1043"
     id="namedview6"
     showgrid="false"
     inkscape:zoom="5.9"
     inkscape:cx="13.5"
     inkscape:cy="20"
     inkscape:window-x="0"
     inkscape:window-y="37"
     inkscape:window-maximized="0"
     inkscape:current-layer="svg4" />
  <path
     style="color:#000000;font-style:normal;font-variant:normal;font-weight:normal;font-stretch:normal;font-size:medium;line-height:normal;font-family:sans-serif;font-variant-ligatures:normal;font-variant-position:normal;font-variant-caps:normal;font-variant-numeric:normal;font-variant-alternates:normal;font-feature-settings:normal;text-indent:0;text-align:start;text-decoration:none;text-decoration-line:none;text-decoration-style:solid;text-decoration-color:#000000;letter-spacing:normal;word-spacing:normal;text-transform:none;writing-mode:lr-tb;direction:ltr;text-orientation:mixed;dominant-baseline:auto;baseline-shift:baseline;text-anchor:start;white-space:normal;shape-padding:0;clip-rule:nonzero;display:inline;overflow:visible;visibility:visible;opacity:1;isolation:auto;mix-blend-mode:normal;color-interpolation:sRGB;color-interpolation-filters:linearRGB;solid-color:#000000;solid-opacity:1;vector-effect:none;fill:#000000;fill-opacity:1;fill-rule:nonzero;stroke:none;stroke-width:0.5;stroke-linecap:round;stroke-linejoin:round;stroke-miterlimit:4;stroke-dasharray:none;stroke-dashoffset:0;stroke-opacity:1;color-rendering:auto;image-rendering:auto;shape-rendering:auto;text-rendering:auto;enable-background:accumulate"
     d="m 13.492188,10.847656 0.162109,0.375 0.05664,-0.15625 z M 23.177734,8.25 23.056641,8.5878906 23.394531,8.25 Z m -0.572265,0 0.0293,0.029297 0.0098,-0.029297 z m -9.230469,0 0.0059,0.013672 L 13.394531,8.25 Z m -0.996094,0 0.582032,1.3554688 0.75,0.7500002 -0.503907,-1.2070315 -0.0293,0.029297 A 0.25135412,0.25135412 0 1 1 12.822266,8.8222656 L 12.998047,8.6464844 12.833984,8.25 Z m -0.773437,0 0.402343,0.4023438 L 11.833984,8.25 Z M 5.375,8.25 5.3808594,8.2636719 5.3945312,8.25 Z m -0.9960938,0 0.5820313,1.3554688 0.75,0.7500002 -0.5039063,-1.2070315 -0.029297,0.029297 A 0.2513544,0.2513544 0 1 1 4.8222656,8.8222656 L 4.9980469,8.6464844 4.8339844,8.25 Z M 3.6054688,8.25 4.0078125,8.6523438 3.8339844,8.25 Z M 3.9941406,7.7460938 A 0.250025,0.250025 0 0 1 4.0429688,7.75 h 0.9160156 a 0.250025,0.250025 0 0 1 0.074219,0 H 6 7 a 0.250025,0.250025 0 0 1 0,0.5 H 6.1035156 L 5.5898438,8.765625 10.230469,19.904297 A 0.250025,0.250025 0 1 1 9.7695312,20.095703 L 6.0800781,11.240234 a 0.250025,0.250025 0 0 1 -0.2578125,-0.0625 L 5.4921875,10.847656 9.9804688,21.320312 13.404297,11.910156 12.539062,9.8945312 11.822266,9.1777344 10.896484,8.25 H 10 a 0.250025,0.250025 0 0 1 0,-0.5 h 1 0.02148 0.935547 a 0.250025,0.250025 0 0 1 0.08594,0 h 0.916015 a 0.250025,0.250025 0 0 1 0.07422,0 H 14 15 a 0.250025,0.250025 0 0 1 0,0.5 h -0.896484 l -0.513672,0.515625 4.640625,11.138672 a 0.250025,0.250025 0 1 1 -0.460938,0.191406 l -3.636719,-8.728515 -0.191406,0.52539 4.03711,9.421875 L 22.447266,8.8007812 21.896484,8.25 H 21 a 0.250025,0.250025 0 0 1 0,-0.5 h 1.021484 0.9375 a 0.250025,0.250025 0 0 1 0.08203,0 H 24 25 a 0.250025,0.250025 0 0 1 0,0.5 h -0.896484 l -0.902344,0.9042969 -0.978516,1.9570311 a 0.250025,0.250025 0 0 1 -0.107422,0.113281 l -3.871093,10.835938 a 0.250025,0.250025 0 0 1 0,0.0039 0.250025,0.250025 0 0 1 -0.07031,0.117188 0.250025,0.250025 0 0 1 -0.01953,0.01758 0.250025,0.250025 0 0 1 -0.01953,0.01367 0.250025,0.250025 0 0 1 -0.0098,0.0078 0.250025,0.250025 0 0 1 -0.01172,0.0059 0.250025,0.250025 0 0 1 -0.02344,0.0098 0.250025,0.250025 0 0 1 -0.0098,0.0039 0.250025,0.250025 0 0 1 -0.01367,0.0039 0.250025,0.250025 0 0 1 -0.02539,0.0059 0.250025,0.250025 0 0 1 -0.02344,0.002 0.250025,0.250025 0 0 1 -0.01172,0.002 0.250025,0.250025 0 0 1 -0.02539,-0.002 0.250025,0.250025 0 0 1 -0.02148,-0.002 0.250025,0.250025 0 0 1 -0.04102,-0.0098 0.250025,0.250025 0 0 1 -0.0078,-0.0039 0.250025,0.250025 0 0 1 -0.0039,0 0.250025,0.250025 0 0 1 -0.04102,-0.02344 0.250025,0.250025 0 0 1 -0.02148,-0.01563 0.250025,0.250025 0 0 1 -0.01758,-0.01563 0.250025,0.250025 0 0 1 -0.0332,-0.03906 0.250025,0.250025 0 0 1 -0.0332,-0.06836 l -0.0039,-0.01172 -4.064453,-9.482422 -3.445312,9.47461 a 0.250025,0.250025 0 0 1 -0.05664,0.111328 0.250025,0.250025 0 0 1 -0.0059,0.0078 0.250025,0.250025 0 0 1 -0.01172,0.0098 0.250025,0.250025 0 0 1 -0.01758,0.01563 0.250025,0.250025 0 0 1 -0.02149,0.01563 0.250025,0.250025 0 0 1 -0.04492,0.02148 0.250025,0.250025 0 0 1 -0.0078,0.0039 0.250025,0.250025 0 0 1 -0.01563,0.0039 0.250025,0.250025 0 0 1 -0.02344,0.0059 0.250025,0.250025 0 0 1 -0.042969,0.0039 0.250025,0.250025 0 0 1 -0.041016,-0.0039 0.250025,0.250025 0 0 1 -0.015625,-0.0039 0.250025,0.250025 0 0 1 -0.00977,-0.002 0.250025,0.250025 0 0 1 -0.00195,-0.002 0.250025,0.250025 0 0 1 -0.021484,-0.0059 0.250025,0.250025 0 0 1 -0.064453,-0.03906 0.250025,0.250025 0 0 1 -0.017578,-0.01563 0.250025,0.250025 0 0 1 -0.0625,-0.0957 0.250025,0.250025 0 0 1 -0.00195,-0.0078 L 9.7558594,22.0625 4.5390625,9.8945312 3.8222656,9.1777344 2.8964844,8.25 H 2 a 0.250025,0.250025 0 0 1 0,-0.5 h 1.0214844 0.9355468 a 0.250025,0.250025 0 0 1 0.037109,-0.00391 z"
     id="path2" />
</svg>
