<?xml version="1.0" encoding="UTF-8" standalone="no"?>
<svg
   xmlns:dc="http://purl.org/dc/elements/1.1/"
   xmlns:cc="http://creativecommons.org/ns#"
   xmlns:rdf="http://www.w3.org/1999/02/22-rdf-syntax-ns#"
   xmlns:svg="http://www.w3.org/2000/svg"
   xmlns="http://www.w3.org/2000/svg"
   xmlns:sodipodi="http://sodipodi.sourceforge.net/DTD/sodipodi-0.dtd"
   xmlns:inkscape="http://www.inkscape.org/namespaces/inkscape"
   data-dec="113"
   width="18"
   height="40"
   version="1.1"
   id="svg4"
   sodipodi:docname="113.svg"
   inkscape:version="0.92.4 (unknown)">
  <metadata
     id="metadata10">
    <rdf:RDF>
      <cc:Work
         rdf:about="">
        <dc:format>image/svg+xml</dc:format>
        <dc:type
           rdf:resource="http://purl.org/dc/dcmitype/StillImage" />
      </cc:Work>
    </rdf:RDF>
  </metadata>
  <defs
     id="defs8" />
  <sodipodi:namedview
     pagecolor="#ffffff"
     bordercolor="#666666"
     borderopacity="1"
     objecttolerance="10"
     gridtolerance="10"
     guidetolerance="10"
     inkscape:pageopacity="0"
     inkscape:pageshadow="2"
     inkscape:window-width="640"
     inkscape:window-height="480"
     id="namedview6"
     showgrid="false"
     inkscape:zoom="5.9"
     inkscape:cx="9"
     inkscape:cy="20"
     inkscape:window-x="0"
     inkscape:window-y="27"
     inkscape:window-maximized="0"
     inkscape:current-layer="svg4" />
  <path
     style="color:#000000;font-style:normal;font-variant:normal;font-weight:normal;font-stretch:normal;font-size:medium;line-height:normal;font-family:sans-serif;font-variant-ligatures:normal;font-variant-position:normal;font-variant-caps:normal;font-variant-numeric:normal;font-variant-alternates:normal;font-feature-settings:normal;text-indent:0;text-align:start;text-decoration:none;text-decoration-line:none;text-decoration-style:solid;text-decoration-color:#000000;letter-spacing:normal;word-spacing:normal;text-transform:none;writing-mode:lr-tb;direction:ltr;text-orientation:mixed;dominant-baseline:auto;baseline-shift:baseline;text-anchor:start;white-space:normal;shape-padding:0;clip-rule:nonzero;display:inline;overflow:visible;visibility:visible;opacity:1;isolation:auto;mix-blend-mode:normal;color-interpolation:sRGB;color-interpolation-filters:linearRGB;solid-color:#000000;solid-opacity:1;vector-effect:none;fill:#000000;fill-opacity:1;fill-rule:nonzero;stroke:none;stroke-width:1.5;stroke-linecap:round;stroke-linejoin:round;stroke-miterlimit:4;stroke-dasharray:none;stroke-dashoffset:0;stroke-opacity:1;color-rendering:auto;image-rendering:auto;shape-rendering:auto;text-rendering:auto;enable-background:accumulate"
     d="M 7.1777344,8.75 5.4433594,9.6171875 4.6542969,10.40625 3.75,13.121094 v 3.701172 L 4.6171875,18.556641 6.4433594,20.382812 8.1757812,21.25 H 8.8222656 L 10.556641,20.382812 12.25,18.6875 V 11.175781 L 11.441406,9.5585938 9.8222656,8.75 Z M 12.988281,7.2402344 a 0.750075,0.750075 0 0 1 0.361328,0.085937 l 0.002,0.00195 2.884766,0.9609375 A 0.750075,0.750075 0 0 1 16,9.75 H 15.310547 L 14.75,10.3125 v 19.375 L 15.310547,30.25 H 16 a 0.750075,0.750075 0 0 1 0,1.5 h -1 -0.876953 a 0.750075,0.750075 0 0 1 -0.246094,0 h -0.753906 a 0.750075,0.750075 0 0 1 -0.246094,0 H 12 11 a 0.750075,0.750075 0 0 1 0,-1.5 h 0.689453 L 12.25,29.6875 v -8.875 l -0.71875,0.71875 a 0.750075,0.750075 0 0 1 -0.195312,0.138672 l -2.0000005,1 A 0.750075,0.750075 0 0 1 9,22.75 H 8 7 a 0.750075,0.750075 0 0 1 -0.052734,-0.002 0.750075,0.750075 0 0 1 -0.070312,-0.0078 0.750075,0.750075 0 0 1 -0.00391,0 0.750075,0.750075 0 0 1 -0.2890625,-0.111328 L 4.6640625,21.669922 A 0.750075,0.750075 0 0 1 4.46875,21.53125 l -2,-2 A 0.750075,0.750075 0 0 1 2.3300781,19.335938 l -1,-2 A 0.750075,0.750075 0 0 1 1.25,17 v -4 a 0.750075,0.750075 0 0 1 0.080078,-0.335938 l 1,-2 A 0.750075,0.750075 0 0 1 2.46875,10.46875 L 3.4179688,9.5195312 A 0.750075,0.750075 0 0 1 3.5234375,9.4121094 0.750075,0.750075 0 0 1 3.53125,9.40625 l 0.9375,-0.9375 A 0.750075,0.750075 0 0 1 4.6640625,8.3300781 l 2,-1 A 0.750075,0.750075 0 0 1 7,7.25 h 3 a 0.750075,0.750075 0 0 1 0.335938,0.080078 L 12.25,8.2871094 v -0.171875 a 0.750075,0.750075 0 0 1 0.257812,-0.6914063 0.750075,0.750075 0 0 1 0.03711,-0.029297 0.750075,0.750075 0 0 1 0.04492,-0.03125 0.750075,0.750075 0 0 1 0.398437,-0.1230468 z"
     id="path2" />
</svg>
