<?xml version="1.0" encoding="UTF-8" standalone="no"?>
<svg
   xmlns:dc="http://purl.org/dc/elements/1.1/"
   xmlns:cc="http://creativecommons.org/ns#"
   xmlns:rdf="http://www.w3.org/1999/02/22-rdf-syntax-ns#"
   xmlns:svg="http://www.w3.org/2000/svg"
   xmlns="http://www.w3.org/2000/svg"
   xmlns:sodipodi="http://sodipodi.sourceforge.net/DTD/sodipodi-0.dtd"
   xmlns:inkscape="http://www.inkscape.org/namespaces/inkscape"
   data-dec="83"
   width="20"
   height="40"
   version="1.1"
   id="svg4"
   sodipodi:docname="83.svg"
   inkscape:version="0.92.4 (unknown)">
  <metadata
     id="metadata10">
    <rdf:RDF>
      <cc:Work
         rdf:about="">
        <dc:format>image/svg+xml</dc:format>
        <dc:type
           rdf:resource="http://purl.org/dc/dcmitype/StillImage" />
      </cc:Work>
    </rdf:RDF>
  </metadata>
  <defs
     id="defs8" />
  <sodipodi:namedview
     pagecolor="#ffffff"
     bordercolor="#666666"
     borderopacity="1"
     objecttolerance="10"
     gridtolerance="10"
     guidetolerance="10"
     inkscape:pageopacity="0"
     inkscape:pageshadow="2"
     inkscape:window-width="615"
     inkscape:window-height="417"
     id="namedview6"
     showgrid="false"
     inkscape:zoom="5.9"
     inkscape:cx="10"
     inkscape:cy="20"
     inkscape:window-x="0"
     inkscape:window-y="27"
     inkscape:window-maximized="0"
     inkscape:current-layer="svg4" />
  <path
     style="color:#000000;font-style:normal;font-variant:normal;font-weight:normal;font-stretch:normal;font-size:medium;line-height:normal;font-family:sans-serif;font-variant-ligatures:normal;font-variant-position:normal;font-variant-caps:normal;font-variant-numeric:normal;font-variant-alternates:normal;font-feature-settings:normal;text-indent:0;text-align:start;text-decoration:none;text-decoration-line:none;text-decoration-style:solid;text-decoration-color:#000000;letter-spacing:normal;word-spacing:normal;text-transform:none;writing-mode:lr-tb;direction:ltr;text-orientation:mixed;dominant-baseline:auto;baseline-shift:baseline;text-anchor:start;white-space:normal;shape-padding:0;clip-rule:nonzero;display:inline;overflow:visible;visibility:visible;opacity:1;isolation:auto;mix-blend-mode:normal;color-interpolation:sRGB;color-interpolation-filters:linearRGB;solid-color:#000000;solid-opacity:1;vector-effect:none;fill:#013272;fill-opacity:1;fill-rule:nonzero;stroke:none;stroke-width:2;stroke-linecap:round;stroke-linejoin:round;stroke-miterlimit:4;stroke-dasharray:none;stroke-dashoffset:0;stroke-opacity:1;color-rendering:auto;image-rendering:auto;shape-rendering:auto;text-rendering:auto;enable-background:accumulate"
     d="m 8,0 h 3 a 1.0001,1.0001 0 0 1 0.316406,0.05078125 l 3,0.99999995 a 1.0001,1.0001 0 0 1 0.390625,0.2421876 L 15.5625,2.1484375 16.050781,0.68359375 A 1.0001,1.0001 0 0 1 18,1 V 7 A 1.0001,1.0001 0 0 1 16.050781,7.3164062 L 15.125,4.5410156 13.458984,2.875 10.837891,2 H 8.1621094 L 5.7089844,2.8183594 5,4.2363281 v 1.5273438 l 0.7460938,1.4902343 1.6367187,0.8203126 5.9335935,1.9765622 a 1.0001,1.0001 0 0 1 0.238282,0.117188 l 3,2 a 1.0001,1.0001 0 0 1 0.339843,0.384765 l 1,2 A 1.0001,1.0001 0 0 1 18,15 v 3 a 1.0001,1.0001 0 0 1 -0.105469,0.447266 l -1,2 a 1.0001,1.0001 0 0 1 -0.1875,0.259765 l -0.945312,0.945313 a 1.0001,1.0001 0 0 1 -0.576172,0.339844 l -2.869141,0.957031 A 1.0001,1.0001 0 0 1 12,23 H 9 a 1.0001,1.0001 0 0 1 -0.3164062,-0.05078 l -3,-1 A 1.0001,1.0001 0 0 1 5.2929688,21.707031 L 4.4375,20.851562 3.9492188,22.316406 A 1.0001,1.0001 0 0 1 2,22 V 16 A 1.0001,1.0001 0 0 1 3.9492188,15.683594 L 4.875,18.458984 6.5410156,20.125 9.1621094,21 H 11.837891 L 14.291016,20.181641 15,18.763672 V 16.236328 L 14.253906,14.746094 12.617188,13.925781 6.6835938,11.949219 A 1.0001,1.0001 0 0 1 6.4453125,11.832031 l -3,-1.9999998 A 1.0001,1.0001 0 0 1 3.1054688,9.4472656 l -1,-2 A 1.0001,1.0001 0 0 1 2,7 V 4 A 1.0001,1.0001 0 0 1 2.2929688,3.2929688 L 4.2382812,1.3476562 A 1.0001,1.0001 0 0 1 4.8144531,1.0078125 L 7.6835938,0.05078125 A 1.0001,1.0001 0 0 1 8,0 Z"
     id="path2" />
</svg>
