<?xml version="1.0" encoding="UTF-8" standalone="no"?>
<svg
   xmlns:dc="http://purl.org/dc/elements/1.1/"
   xmlns:cc="http://creativecommons.org/ns#"
   xmlns:rdf="http://www.w3.org/1999/02/22-rdf-syntax-ns#"
   xmlns:svg="http://www.w3.org/2000/svg"
   xmlns="http://www.w3.org/2000/svg"
   xmlns:sodipodi="http://sodipodi.sourceforge.net/DTD/sodipodi-0.dtd"
   xmlns:inkscape="http://www.inkscape.org/namespaces/inkscape"
   data-dec="65"
   width="21"
   height="40"
   version="1.1"
   id="svg4"
   sodipodi:docname="65.svg"
   inkscape:version="0.92.4 (unknown)">
  <metadata
     id="metadata10">
    <rdf:RDF>
      <cc:Work
         rdf:about="">
        <dc:format>image/svg+xml</dc:format>
        <dc:type
           rdf:resource="http://purl.org/dc/dcmitype/StillImage" />
      </cc:Work>
    </rdf:RDF>
  </metadata>
  <defs
     id="defs8" />
  <sodipodi:namedview
     pagecolor="#ffffff"
     bordercolor="#666666"
     borderopacity="1"
     objecttolerance="10"
     gridtolerance="10"
     guidetolerance="10"
     inkscape:pageopacity="0"
     inkscape:pageshadow="2"
     inkscape:window-width="640"
     inkscape:window-height="480"
     id="namedview6"
     showgrid="false"
     inkscape:zoom="5.9"
     inkscape:cx="10.5"
     inkscape:cy="20"
     inkscape:window-x="0"
     inkscape:window-y="27"
     inkscape:window-maximized="0"
     inkscape:current-layer="svg4" />
  <path
     style="color:#000000;font-style:normal;font-variant:normal;font-weight:normal;font-stretch:normal;font-size:medium;line-height:normal;font-family:sans-serif;font-variant-ligatures:normal;font-variant-position:normal;font-variant-caps:normal;font-variant-numeric:normal;font-variant-alternates:normal;font-feature-settings:normal;text-indent:0;text-align:start;text-decoration:none;text-decoration-line:none;text-decoration-style:solid;text-decoration-color:#000000;letter-spacing:normal;word-spacing:normal;text-transform:none;writing-mode:lr-tb;direction:ltr;text-orientation:mixed;dominant-baseline:auto;baseline-shift:baseline;text-anchor:start;white-space:normal;shape-padding:0;clip-rule:nonzero;display:inline;overflow:visible;visibility:visible;opacity:1;isolation:auto;mix-blend-mode:normal;color-interpolation:sRGB;color-interpolation-filters:linearRGB;solid-color:#000000;solid-opacity:1;vector-effect:none;fill:#000000;fill-opacity:1;fill-rule:nonzero;stroke:none;stroke-width:2;stroke-linecap:round;stroke-linejoin:round;stroke-miterlimit:4;stroke-dasharray:none;stroke-dashoffset:0;stroke-opacity:1;color-rendering:auto;image-rendering:auto;shape-rendering:auto;text-rendering:auto;enable-background:accumulate"
     d="M 10.619141,6.9238281 8.0117188,14 H 13.117188 Z M 10.015625,-0.01367188 A 1.0001,1.0001 0 0 1 10.148438,0 h 0.697265 a 1.0001,1.0001 0 0 1 1.138672,0.77734375 L 19.876953,21.496094 a 1.0001,1.0001 0 0 1 0.0098,0.990234 1.0001,1.0001 0 0 1 -0.03906,0.06641 1.0001,1.0001 0 0 1 -0.0059,0.0078 1.0001,1.0001 0 0 1 -0.05273,0.07227 1.0001,1.0001 0 0 1 -0.002,0.002 A 1.0001,1.0001 0 0 1 18.851562,23 h -0.683593 a 1.0001,1.0001 0 0 1 -0.316407,0 H 17 A 1.0001,1.0001 0 0 1 16.056641,22.332031 L 14.527344,18 H 6.5390625 L 4.9375,22.345703 A 1.0001,1.0001 0 0 1 4,23 H 3.1542969 A 1.0001,1.0001 0 0 1 2.8359375,23 H 2.1542969 a 1.0001,1.0001 0 0 1 -0.9238281,-0.34375 1.0001,1.0001 0 0 1 -0.060547,-0.08008 1.0001,1.0001 0 0 1 -0.041016,-0.06445 1.0001,1.0001 0 0 1 -0.00781,-1.013672 L 9.0234375,0.75976562 a 1.0001,1.0001 0 0 1 0.9921875,-0.7734375 z"
     id="path2" />
</svg>
