StartFontMetrics 2.0
Comment Generated by FontForge 20170924
Comment Creation Date: Thu Mar 12 12:01:14 2020
FontName Hershey-Noailles-Times-Triplex-Regular
FullName Hershey-Noailles-Times-Triplex-Regular
FamilyName Hershey-Noailles-Times
Weight Regular
Notice (by Luuse (contact@luuse.io), SIL Open Font License)
ItalicAngle 0
IsFixedPitch false
UnderlinePosition 0
UnderlineThickness 26,4
Version 001.000
EncodingScheme ISO10646-1
FontBBox -73 -186 855 817
CapHeight 579
XHeight 395
Ascender 579
Descender -185
StartCharMetrics 159
C 32 ; WX 367 ; N space ; B 0 0 0 0 ;
C 33 ; WX 314 ; N exclam ; B 91 0 198 580 ;
C 34 ; WX 472 ; N quotedbl ; B 91 368 409 580 ;
C 35 ; WX 577 ; N numbersign ; B 66 -186 488 684 ;
C 36 ; WX 525 ; N dollar ; B 66 -107 461 684 ;
C 37 ; WX 630 ; N percent ; B 66 0 567 580 ;
C 38 ; WX 683 ; N ampersand ; B 91 0 620 580 ;
C 39 ; WX 262 ; N quotesingle ; B 65 368 171 580 ;
C 40 ; WX 367 ; N parenleft ; B 66 -186 277 684 ;
C 41 ; WX 367 ; N parenright ; B 91 -186 303 684 ;
C 42 ; WX 420 ; N asterisk ; B 66 236 355 580 ;
C 43 ; WX 683 ; N plus ; B 91 26 567 500 ;
C 44 ; WX 314 ; N comma ; B 91 -107 198 106 ;
C 45 ; WX 235 ; N hyphen ; B 12 210 224 238 ;
C 46 ; WX 314 ; N period ; B 91 0 198 106 ;
C 47 ; WX 630 ; N slash ; B 39 -186 567 684 ;
C 48 ; WX 525 ; N zero ; B 66 0 461 580 ;
C 49 ; WX 525 ; N one ; B 118 0 409 580 ;
C 50 ; WX 525 ; N two ; B 66 0 461 580 ;
C 51 ; WX 525 ; N three ; B 66 0 461 580 ;
C 52 ; WX 525 ; N four ; B 39 0 488 580 ;
C 53 ; WX 525 ; N five ; B 66 0 461 580 ;
C 54 ; WX 525 ; N six ; B 66 0 461 580 ;
C 55 ; WX 525 ; N seven ; B 66 0 461 580 ;
C 56 ; WX 525 ; N eight ; B 66 0 461 580 ;
C 57 ; WX 525 ; N nine ; B 66 0 461 580 ;
C 58 ; WX 314 ; N colon ; B 91 0 198 395 ;
C 59 ; WX 314 ; N semicolon ; B 91 -107 198 395 ;
C 60 ; WX 630 ; N less ; B 91 0 540 500 ;
C 61 ; WX 683 ; N equal ; B 91 130 567 395 ;
C 62 ; WX 630 ; N greater ; B 91 0 540 500 ;
C 63 ; WX 525 ; N question ; B 66 0 434 580 ;
C 64 ; WX 735 ; N at ; B 66 0 646 580 ;
C 65 ; WX 525 ; N A ; B 12 0 513 580 ;
C 66 ; WX 577 ; N B ; B 39 0 513 580 ;
C 67 ; WX 525 ; N C ; B 66 0 488 580 ;
C 68 ; WX 577 ; N D ; B 39 0 513 580 ;
C 69 ; WX 525 ; N E ; B 39 0 488 580 ;
C 70 ; WX 472 ; N F ; B 39 0 488 580 ;
C 71 ; WX 630 ; N G ; B 66 0 567 580 ;
C 72 ; WX 630 ; N H ; B 39 0 592 580 ;
C 73 ; WX 314 ; N I ; B 39 0 277 580 ;
C 74 ; WX 420 ; N J ; B 39 0 382 580 ;
C 75 ; WX 525 ; N K ; B 39 0 567 580 ;
C 76 ; WX 472 ; N L ; B 39 0 461 580 ;
C 77 ; WX 683 ; N M ; B 39 0 646 580 ;
C 78 ; WX 630 ; N N ; B 39 0 592 580 ;
C 79 ; WX 577 ; N O ; B 66 0 513 580 ;
C 80 ; WX 577 ; N P ; B 39 0 513 580 ;
C 81 ; WX 577 ; N Q ; B 66 -132 513 580 ;
C 82 ; WX 577 ; N R ; B 39 0 540 580 ;
C 83 ; WX 525 ; N S ; B 66 0 461 580 ;
C 84 ; WX 525 ; N T ; B 39 0 488 580 ;
C 85 ; WX 630 ; N U ; B 39 0 592 580 ;
C 86 ; WX 525 ; N V ; B 12 0 513 580 ;
C 87 ; WX 630 ; N W ; B 12 0 620 580 ;
C 88 ; WX 525 ; N X ; B 12 0 513 580 ;
C 89 ; WX 577 ; N Y ; B 12 0 567 580 ;
C 90 ; WX 525 ; N Z ; B 66 0 461 580 ;
C 91 ; WX 367 ; N bracketleft ; B 91 -186 303 684 ;
C 92 ; WX 367 ; N backslash ; B -13 -80 382 580 ;
C 93 ; WX 367 ; N bracketright ; B 66 -186 277 684 ;
C 94 ; WX 577 ; N asciicircum ; B 66 183 513 342 ;
C 95 ; WX 525 ; N underscore ; B -13 -159 540 -131 ;
C 96 ; WX 314 ; N grave ; B 66 393 250 580 ;
C 97 ; WX 525 ; N a ; B 66 0 488 395 ;
C 98 ; WX 525 ; N b ; B 39 0 488 580 ;
C 99 ; WX 472 ; N c ; B 66 0 434 395 ;
C 100 ; WX 577 ; N d ; B 66 0 513 580 ;
C 101 ; WX 446 ; N e ; B 39 0 409 395 ;
C 102 ; WX 367 ; N f ; B 39 0 355 580 ;
C 103 ; WX 525 ; N g ; B 39 -186 461 395 ;
C 104 ; WX 630 ; N h ; B 39 0 567 580 ;
C 105 ; WX 314 ; N i ; B 39 0 277 580 ;
C 106 ; WX 314 ; N j ; B 12 -186 250 580 ;
C 107 ; WX 577 ; N k ; B 39 0 540 580 ;
C 108 ; WX 314 ; N l ; B 39 0 277 580 ;
C 109 ; WX 893 ; N m ; B 39 0 855 395 ;
C 110 ; WX 604 ; N n ; B 39 0 567 395 ;
C 111 ; WX 525 ; N o ; B 66 0 461 395 ;
C 112 ; WX 525 ; N p ; B 39 -186 488 395 ;
C 113 ; WX 525 ; N q ; B 66 -186 513 395 ;
C 114 ; WX 420 ; N r ; B 39 0 409 395 ;
C 115 ; WX 472 ; N s ; B 66 0 382 394 ;
C 116 ; WX 420 ; N t ; B 39 0 382 580 ;
C 117 ; WX 630 ; N u ; B 39 0 567 395 ;
C 118 ; WX 472 ; N v ; B 12 0 461 395 ;
C 119 ; WX 630 ; N w ; B 12 0 620 395 ;
C 120 ; WX 525 ; N x ; B 39 0 488 395 ;
C 121 ; WX 472 ; N y ; B 12 -184 488 395 ;
C 122 ; WX 472 ; N z ; B 66 0 409 395 ;
C 123 ; WX 367 ; N braceleft ; B 91 -186 250 684 ;
C 124 ; WX 210 ; N bar ; B 91 -186 119 684 ;
C 125 ; WX 367 ; N braceright ; B 118 -186 277 684 ;
C 126 ; WX 630 ; N asciitilde ; B 66 157 567 342 ;
C 127 ; WX 420 ; N uni007F ; B -13 0 434 580 ;
C 168 ; WX 393 ; N dieresis ; B 66 447 330 552 ;
C 169 ; WX 630 ; N copyright ; B 12 -80 619 552 ;
C 171 ; WX 367 ; N guillemotleft ; B 12 51 355 395 ;
C 180 ; WX 314 ; N acute ; B 66 393 250 580 ;
C 184 ; WX 472 ; N cedilla ; B 223 -107 303 27 ;
C 187 ; WX 367 ; N guillemotright ; B 12 51 355 395 ;
C 192 ; WX 525 ; N Agrave ; B 12 0 513 817 ;
C 193 ; WX 525 ; N Aacute ; B 12 0 513 817 ;
C 194 ; WX 525 ; N Acircumflex ; B 12 0 513 790 ;
C 195 ; WX 525 ; N Atilde ; B 12 0 514 817 ;
C 196 ; WX 525 ; N Adieresis ; B 12 0 513 737 ;
C 199 ; WX 525 ; N Ccedilla ; B 66 -129 488 580 ;
C 200 ; WX 525 ; N Egrave ; B 39 0 488 817 ;
C 201 ; WX 525 ; N Eacute ; B 39 0 488 817 ;
C 202 ; WX 525 ; N Ecircumflex ; B 33 0 443 766 ;
C 203 ; WX 525 ; N Edieresis ; B 35 0 443 694 ;
C 204 ; WX 314 ; N Igrave ; B 35 0 251 772 ;
C 205 ; WX 314 ; N Iacute ; B 35 0 251 772 ;
C 206 ; WX 314 ; N Icircumflex ; B -73 0 335 766 ;
C 207 ; WX 314 ; N Idieresis ; B 20 0 260 694 ;
C 210 ; WX 577 ; N Ograve ; B 60 0 467 772 ;
C 211 ; WX 577 ; N Oacute ; B 60 0 467 772 ;
C 212 ; WX 577 ; N Ocircumflex ; B 59 0 467 766 ;
C 213 ; WX 577 ; N Otilde ; B 32 0 488 793 ;
C 214 ; WX 577 ; N Odieresis ; B 60 0 467 694 ;
C 217 ; WX 630 ; N Ugrave ; B 39 0 592 817 ;
C 218 ; WX 630 ; N Uacute ; B 35 0 539 772 ;
C 219 ; WX 630 ; N Ucircumflex ; B 35 0 539 766 ;
C 220 ; WX 630 ; N Udieresis ; B 35 0 539 694 ;
C 224 ; WX 525 ; N agrave ; B 60 0 443 588 ;
C 225 ; WX 525 ; N aacute ; B 60 0 443 588 ;
C 226 ; WX 525 ; N acircumflex ; B 29 0 443 582 ;
C 227 ; WX 525 ; N atilde ; B 32 0 488 609 ;
C 231 ; WX 472 ; N ccedilla ; B 60 -118 395 360 ;
C 232 ; WX 446 ; N egrave ; B 35 0 371 588 ;
C 233 ; WX 446 ; N eacute ; B 35 0 371 588 ;
C 234 ; WX 446 ; N ecircumflex ; B 7 0 414 582 ;
C 235 ; WX 446 ; N edieresis ; B 35 0 371 510 ;
C 236 ; WX 314 ; N igrave ; B 32 0 277 632 ;
C 237 ; WX 314 ; N iacute ; B 39 0 277 632 ;
C 238 ; WX 314 ; N icircumflex ; B -73 0 335 627 ;
C 239 ; WX 314 ; N idieresis ; B 17 0 277 555 ;
C 242 ; WX 525 ; N ograve ; B 60 0 420 588 ;
C 243 ; WX 525 ; N oacute ; B 60 0 420 588 ;
C 244 ; WX 525 ; N ocircumflex ; B 32 0 440 582 ;
C 249 ; WX 630 ; N ugrave ; B 35 0 515 588 ;
C 250 ; WX 630 ; N uacute ; B 35 0 515 588 ;
C 251 ; WX 630 ; N ucircumflex ; B 20 0 515 582 ;
C 252 ; WX 630 ; N udieresis ; B 35 0 515 510 ;
C -1 ; WX 867 ; N glyph21 ; B 66 0 803 580 ;
C -1 ; WX 762 ; N glyph10 ; B 39 0 724 395 ;
C -1 ; WX 525 ; N glyph154 ; B 66 -129 461 580 ;
C -1 ; WX 472 ; N glyph155 ; B 66 -129 382 394 ;
C -1 ; WX 104 ; N glyph157 ; B 0 0 0 0 ;
C -1 ; WX 683 ; N glyph39 ; B 91 210 592 238 ;
C -1 ; WX 367 ; N glyph107 ; B 39 210 330 238 ;
C -1 ; WX 525 ; N glyph54 ; B -13 210 540 238 ;
C -1 ; WX 183 ; N glyph97 ; B 39 368 146 580 ;
C -1 ; WX 183 ; N glyph24 ; B 39 368 146 580 ;
C -1 ; WX 393 ; N glyph23 ; B 66 368 330 580 ;
C -1 ; WX 393 ; N glyph38 ; B 65 368 330 580 ;
C -1 ; WX 393 ; N glyph72 ; B 12 26 382 131 ;
C -1 ; WX 500 ; N .notdef ; B 50 0 450 491 ;
EndCharMetrics
EndFontMetrics
