<?xml version="1.0" encoding="UTF-8" standalone="no"?>
<svg
   xmlns:dc="http://purl.org/dc/elements/1.1/"
   xmlns:cc="http://creativecommons.org/ns#"
   xmlns:rdf="http://www.w3.org/1999/02/22-rdf-syntax-ns#"
   xmlns:svg="http://www.w3.org/2000/svg"
   xmlns="http://www.w3.org/2000/svg"
   xmlns:sodipodi="http://sodipodi.sourceforge.net/DTD/sodipodi-0.dtd"
   xmlns:inkscape="http://www.inkscape.org/namespaces/inkscape"
   data-dec="105"
   width="12"
   height="40"
   version="1.1"
   id="svg4"
   sodipodi:docname="105.svg"
   inkscape:version="0.92.4 (unknown)">
  <metadata
     id="metadata10">
    <rdf:RDF>
      <cc:Work
         rdf:about="">
        <dc:format>image/svg+xml</dc:format>
        <dc:type
           rdf:resource="http://purl.org/dc/dcmitype/StillImage" />
      </cc:Work>
    </rdf:RDF>
  </metadata>
  <defs
     id="defs8" />
  <sodipodi:namedview
     pagecolor="#ffffff"
     bordercolor="#666666"
     borderopacity="1"
     objecttolerance="10"
     gridtolerance="10"
     guidetolerance="10"
     inkscape:pageopacity="0"
     inkscape:pageshadow="2"
     inkscape:window-width="640"
     inkscape:window-height="480"
     id="namedview6"
     showgrid="false"
     inkscape:zoom="5.9"
     inkscape:cx="6"
     inkscape:cy="20"
     inkscape:window-x="0"
     inkscape:window-y="27"
     inkscape:window-maximized="0"
     inkscape:current-layer="svg4" />
  <path
     style="color:#000000;font-style:normal;font-variant:normal;font-weight:normal;font-stretch:normal;font-size:medium;line-height:normal;font-family:sans-serif;font-variant-ligatures:normal;font-variant-position:normal;font-variant-caps:normal;font-variant-numeric:normal;font-variant-alternates:normal;font-feature-settings:normal;text-indent:0;text-align:start;text-decoration:none;text-decoration-line:none;text-decoration-style:solid;text-decoration-color:#000000;letter-spacing:normal;word-spacing:normal;text-transform:none;writing-mode:lr-tb;direction:ltr;text-orientation:mixed;dominant-baseline:auto;baseline-shift:baseline;text-anchor:start;white-space:normal;shape-padding:0;clip-rule:nonzero;display:inline;overflow:visible;visibility:visible;opacity:1;isolation:auto;mix-blend-mode:normal;color-interpolation:sRGB;color-interpolation-filters:linearRGB;solid-color:#000000;solid-opacity:1;vector-effect:none;fill:#013272;fill-opacity:1;fill-rule:nonzero;stroke:none;stroke-width:1.5;stroke-linecap:round;stroke-linejoin:round;stroke-miterlimit:4;stroke-dasharray:none;stroke-dashoffset:0;stroke-opacity:1;color-rendering:auto;image-rendering:auto;shape-rendering:auto;text-rendering:auto;enable-background:accumulate"
     d="M 4.9882812,7.2402344 A 0.750075,0.750075 0 0 1 5.1230469,7.25 h 0.7539062 a 0.750075,0.750075 0 0 1 0.6445313,0.2011719 0.750075,0.750075 0 0 1 0.00391,0.00391 0.750075,0.750075 0 0 1 0.00195,0.00195 0.750075,0.750075 0 0 1 0.048828,0.050781 0.750075,0.750075 0 0 1 0.00391,0.00586 A 0.750075,0.750075 0 0 1 6.75,8.1230469 V 21.25 H 9 a 0.750075,0.750075 0 1 1 0,1.5 H 6.1230469 a 0.750075,0.750075 0 0 1 -0.2460938,0 H 5.1230469 a 0.750075,0.750075 0 0 1 -0.2460938,0 H 2 a 0.750075,0.750075 0 1 1 0,-1.5 H 4.25 V 8.75 H 2 a 0.750075,0.750075 0 1 1 0,-1.5 h 2.8769531 a 0.750075,0.750075 0 0 1 0.1113281,-0.00977 z M 4.984375,0.2421875 a 0.750075,0.750075 0 0 1 0.015625,0 0.750075,0.750075 0 0 1 0.6113281,0.30664062 L 6.53125,1.46875 a 0.750075,0.750075 0 0 1 0,1.0625 l -1,1 a 0.750075,0.750075 0 0 1 -1.0625,0 l -1,-1 a 0.750075,0.750075 0 0 1 0,-1.0625 L 4.390625,0.546875 A 0.750075,0.750075 0 0 1 4.9101562,0.24804688 0.750075,0.750075 0 0 1 4.96875,0.24414062 0.750075,0.750075 0 0 1 4.984375,0.2421875 Z"
     id="path2" />
</svg>
