<?xml version="1.0" encoding="UTF-8" standalone="no"?>
<svg
   xmlns:dc="http://purl.org/dc/elements/1.1/"
   xmlns:cc="http://creativecommons.org/ns#"
   xmlns:rdf="http://www.w3.org/1999/02/22-rdf-syntax-ns#"
   xmlns:svg="http://www.w3.org/2000/svg"
   xmlns="http://www.w3.org/2000/svg"
   xmlns:sodipodi="http://sodipodi.sourceforge.net/DTD/sodipodi-0.dtd"
   xmlns:inkscape="http://www.inkscape.org/namespaces/inkscape"
   data-dec="63"
   width="20"
   height="40"
   version="1.1"
   id="svg4"
   sodipodi:docname="63.svg"
   inkscape:version="0.92.4 5da689c313, 2019-01-14">
  <metadata
     id="metadata10">
    <rdf:RDF>
      <cc:Work
         rdf:about="">
        <dc:format>image/svg+xml</dc:format>
        <dc:type
           rdf:resource="http://purl.org/dc/dcmitype/StillImage" />
        <dc:title></dc:title>
      </cc:Work>
    </rdf:RDF>
  </metadata>
  <defs
     id="defs8" />
  <sodipodi:namedview
     pagecolor="#ffffff"
     bordercolor="#666666"
     borderopacity="1"
     objecttolerance="10"
     gridtolerance="10"
     guidetolerance="10"
     inkscape:pageopacity="0"
     inkscape:pageshadow="2"
     inkscape:window-width="1920"
     inkscape:window-height="1043"
     id="namedview6"
     showgrid="false"
     inkscape:zoom="5.9"
     inkscape:cx="10"
     inkscape:cy="20"
     inkscape:window-x="0"
     inkscape:window-y="37"
     inkscape:window-maximized="0"
     inkscape:current-layer="svg4" />
  <path
     style="color:#000000;font-style:normal;font-variant:normal;font-weight:normal;font-stretch:normal;font-size:medium;line-height:normal;font-family:sans-serif;font-variant-ligatures:normal;font-variant-position:normal;font-variant-caps:normal;font-variant-numeric:normal;font-variant-alternates:normal;font-feature-settings:normal;text-indent:0;text-align:start;text-decoration:none;text-decoration-line:none;text-decoration-style:solid;text-decoration-color:#000000;letter-spacing:normal;word-spacing:normal;text-transform:none;writing-mode:lr-tb;direction:ltr;text-orientation:mixed;dominant-baseline:auto;baseline-shift:baseline;text-anchor:start;white-space:normal;shape-padding:0;clip-rule:nonzero;display:inline;overflow:visible;visibility:visible;opacity:1;isolation:auto;mix-blend-mode:normal;color-interpolation:sRGB;color-interpolation-filters:linearRGB;solid-color:#000000;solid-opacity:1;vector-effect:none;fill:#000000;fill-opacity:1;fill-rule:nonzero;stroke:none;stroke-width:0.5;stroke-linecap:round;stroke-linejoin:round;stroke-miterlimit:4;stroke-dasharray:none;stroke-dashoffset:0;stroke-opacity:1;color-rendering:auto;image-rendering:auto;shape-rendering:auto;text-rendering:auto;enable-background:accumulate"
     d="m 9.25,20.25 v 0.5 h 0.5 v -0.5 z M 8.9960938,19.746094 A 0.250025,0.250025 0 0 1 9.046875,19.75 H 10 A 0.250025,0.250025 0 0 1 10.25,20 v 1 A 0.250025,0.250025 0 0 1 10,21.25 H 9 A 0.250025,0.250025 0 0 1 8.75,21 v -0.958984 a 0.250025,0.250025 0 0 1 0.052734,-0.197266 0.250025,0.250025 0 0 1 0,-0.002 0.250025,0.250025 0 0 1 0.00781,-0.0078 0.250025,0.250025 0 0 1 0.027344,-0.02734 0.250025,0.250025 0 0 1 0.017578,-0.01367 0.250025,0.250025 0 0 1 0.00195,-0.002 0.250025,0.250025 0 0 1 0.00781,-0.0039 0.250025,0.250025 0 0 1 0.013672,-0.0078 0.250025,0.250025 0 0 1 0.1171876,-0.0332 z M 9.1054688,19.25 8.25,20.103516 v 0.792968 L 9.1035156,21.75 H 9.8964844 L 10.75,20.896484 V 20.103516 L 9.8964844,19.25 Z M 8.9941406,18.748047 A 0.250025,0.250025 0 0 1 9.03125,18.75 H 10 a 0.250025,0.250025 0 0 1 0.177734,0.07227 l 1,1 A 0.250025,0.250025 0 0 1 11.25,20 v 1 a 0.250025,0.250025 0 0 1 -0.07227,0.177734 l -1,1 A 0.250025,0.250025 0 0 1 10,22.25 H 9 a 0.250025,0.250025 0 0 1 -0.1777344,-0.07227 l -1,-1 A 0.250025,0.250025 0 0 1 7.75,21 v -1 a 0.250025,0.250025 0 0 1 0.072266,-0.177734 l 0.9804688,-0.980469 a 0.250025,0.250025 0 0 1 0.019531,-0.01953 0.250025,0.250025 0 0 1 0.013672,-0.01172 0.250025,0.250025 0 0 1 0.041016,-0.0293 0.250025,0.250025 0 0 1 0.00195,-0.002 0.250025,0.250025 0 0 1 0.019531,-0.0098 0.250025,0.250025 0 0 1 0.00391,-0.002 0.250025,0.250025 0 0 1 0.019531,-0.0059 0.250025,0.250025 0 0 1 0.00391,-0.002 0.250025,0.250025 0 0 1 0.00586,-0.002 0.250025,0.250025 0 0 1 0.019531,-0.0039 0.250025,0.250025 0 0 1 0.023437,-0.0039 0.250025,0.250025 0 0 1 0.019531,-0.002 z M 9.75,12.011719 9.25,12.179688 V 14.75 h 0.5 z m 0,-1 -0.5,0.167969 v 0.474609 l 0.5,-0.167969 z m 1.470703,-0.490235 -1.011719,0.337891 A 0.250025,0.250025 0 0 1 10.25,11 v 0.320312 l 0.539062,-0.179687 a 0.250025,0.250025 0 0 1 0.06055,-0.339844 z m 3.882813,-2.287109 -0.707032,0.53125 -0.173828,0.3457031 A 0.250025,0.250025 0 0 1 14.111328,9.2226562 L 13.134766,9.7109375 11.582031,10.875 l 0.322266,-0.107422 1.947265,-0.9726561 0.94336,-0.9433594 z m 0.144531,-4.1796875 a 0.250025,0.250025 0 0 1 -0.357422,0.1699219 l 0.332031,0.6640625 A 0.250025,0.250025 0 0 1 15.25,5 v 2 a 0.250025,0.250025 0 0 1 -0.02734,0.1113281 l -0.332031,0.6621094 a 0.250025,0.250025 0 0 1 0.357422,0.1738281 L 15.75,6.9414062 V 5.0585938 Z m -11.4960939,0 L 3.25,5.0585938 V 5.75 h 0.5 V 5 A 0.250025,0.250025 0 0 1 3.7773438,4.8886719 L 4.109375,4.2246094 A 0.250025,0.250025 0 0 1 3.7519531,4.0546875 Z M 8.0410156,1.25 5.1347656,2.21875 4.2050781,3.1484375 3.8945312,3.7695312 4.5585938,3.3261719 l 0.21875,-0.4375 a 0.250025,0.250025 0 0 1 0.1445312,-0.125 L 5.8828125,2.4433594 6.8613281,1.7910156 A 0.250025,0.250025 0 0 1 7.2539062,1.9863281 L 7.921875,1.7636719 A 0.250025,0.250025 0 0 1 8,1.75 h 3 a 0.250025,0.250025 0 0 1 0.07813,0.013672 l 0.669922,0.2226562 a 0.250025,0.250025 0 0 1 0.390625,-0.1953125 l 0.978516,0.6523438 0.960937,0.3203125 a 0.250025,0.250025 0 0 1 0.144531,0.125 l 0.21875,0.4375 0.664063,0.4433593 L 14.794922,3.1484375 13.865234,2.21875 10.958984,1.25 Z M 8,0.75 h 3 a 0.250025,0.250025 0 0 1 0.07813,0.0136719 l 3,1.00000002 a 0.250025,0.250025 0 0 1 0.09961,0.058594 l 1,1 a 0.250025,0.250025 0 0 1 0.04492,0.066406 l 1,2 A 0.250025,0.250025 0 0 1 16.25,5 v 2 a 0.250025,0.250025 0 0 1 -0.02734,0.1113281 l -1,2 a 0.250025,0.250025 0 0 1 -0.04492,0.066406 l -1,0.9999996 a 0.250025,0.250025 0 0 1 -0.06641,0.04492 l -2,1 a 0.250025,0.250025 0 0 1 -0.0332,0.01367 L 10.25,11.845703 V 15 A 0.250025,0.250025 0 0 1 10,15.25 H 9 A 0.250025,0.250025 0 0 1 8.75,15 v -2.957031 a 0.250025,0.250025 0 0 1 0,-0.08203 v -0.917969 a 0.250025,0.250025 0 0 1 0.00781,-0.109375 0.250025,0.250025 0 0 1 0.00586,-0.02149 0.250025,0.250025 0 0 1 0.00195,-0.002 0.250025,0.250025 0 0 1 0.00781,-0.02148 0.250025,0.250025 0 0 1 0.00195,-0.002 0.250025,0.250025 0 0 1 0.00977,-0.01953 0.250025,0.250025 0 0 1 0.00195,-0.002 0.250025,0.250025 0 0 1 0.011719,-0.01758 0.250025,0.250025 0 0 1 0.00391,-0.0039 0.250025,0.250025 0 0 1 0.013672,-0.01563 0.250025,0.250025 0 0 1 0.00195,-0.0039 0.250025,0.250025 0 0 1 0.015625,-0.01367 0.250025,0.250025 0 0 1 0.00195,-0.002 0.250025,0.250025 0 0 1 0.017578,-0.01367 0.250025,0.250025 0 0 1 0.00195,-0.002 0.250025,0.250025 0 0 1 0.1113281,-0.04492 h 0.00391 L 11.904297,9.7675781 12.869141,9.2871094 14.003906,8.4355469 14.75,6.9414062 V 5.0585938 L 14.056641,3.671875 12.888672,2.8925781 10.958984,2.25 H 8.0410156 L 6.1113281,2.8925781 4.9433594,3.671875 4.25,5.0585938 V 6 A 0.250025,0.250025 0 0 1 4,6.25 H 3.0410156 A 0.250025,0.250025 0 0 1 2.84375,6.1972656 a 0.250025,0.250025 0 0 1 -0.00195,0 0.250025,0.250025 0 0 1 -0.00781,-0.00781 0.250025,0.250025 0 0 1 -0.00977,-0.00977 0.250025,0.250025 0 0 1 -0.015625,-0.015625 0.250025,0.250025 0 0 1 -0.00195,-0.00195 0.250025,0.250025 0 0 1 -0.013672,-0.017578 0.250025,0.250025 0 0 1 -0.00195,-0.00195 0.250025,0.250025 0 0 1 -0.00391,-0.00781 0.250025,0.250025 0 0 1 -0.00781,-0.013672 A 0.250025,0.250025 0 0 1 2.75,5.953125 V 5 a 0.250025,0.250025 0 0 1 0.027344,-0.1113281 l 1,-2 a 0.250025,0.250025 0 0 1 0.044922,-0.066406 l 1,-1 a 0.250025,0.250025 0 0 1 0.099609,-0.058594 l 3,-1.00000002 A 0.250025,0.250025 0 0 1 8,0.75 Z"
     id="path2" />
</svg>
