<?xml version="1.0" encoding="UTF-8" standalone="no"?>
<svg
   xmlns:dc="http://purl.org/dc/elements/1.1/"
   xmlns:cc="http://creativecommons.org/ns#"
   xmlns:rdf="http://www.w3.org/1999/02/22-rdf-syntax-ns#"
   xmlns:svg="http://www.w3.org/2000/svg"
   xmlns="http://www.w3.org/2000/svg"
   xmlns:sodipodi="http://sodipodi.sourceforge.net/DTD/sodipodi-0.dtd"
   xmlns:inkscape="http://www.inkscape.org/namespaces/inkscape"
   data-dec="56"
   width="20"
   height="40"
   version="1.1"
   id="svg4"
   sodipodi:docname="56.svg"
   inkscape:version="0.92.4 5da689c313, 2019-01-14">
  <metadata
     id="metadata10">
    <rdf:RDF>
      <cc:Work
         rdf:about="">
        <dc:format>image/svg+xml</dc:format>
        <dc:type
           rdf:resource="http://purl.org/dc/dcmitype/StillImage" />
        <dc:title></dc:title>
      </cc:Work>
    </rdf:RDF>
  </metadata>
  <defs
     id="defs8" />
  <sodipodi:namedview
     pagecolor="#ffffff"
     bordercolor="#666666"
     borderopacity="1"
     objecttolerance="10"
     gridtolerance="10"
     guidetolerance="10"
     inkscape:pageopacity="0"
     inkscape:pageshadow="2"
     inkscape:window-width="1920"
     inkscape:window-height="1043"
     id="namedview6"
     showgrid="false"
     inkscape:zoom="5.9"
     inkscape:cx="10"
     inkscape:cy="20"
     inkscape:window-x="0"
     inkscape:window-y="37"
     inkscape:window-maximized="0"
     inkscape:current-layer="svg4" />
  <path
     style="color:#000000;font-style:normal;font-variant:normal;font-weight:normal;font-stretch:normal;font-size:medium;line-height:normal;font-family:sans-serif;font-variant-ligatures:normal;font-variant-position:normal;font-variant-caps:normal;font-variant-numeric:normal;font-variant-alternates:normal;font-feature-settings:normal;text-indent:0;text-align:start;text-decoration:none;text-decoration-line:none;text-decoration-style:solid;text-decoration-color:#000000;letter-spacing:normal;word-spacing:normal;text-transform:none;writing-mode:lr-tb;direction:ltr;text-orientation:mixed;dominant-baseline:auto;baseline-shift:baseline;text-anchor:start;white-space:normal;shape-padding:0;clip-rule:nonzero;display:inline;overflow:visible;visibility:visible;opacity:1;isolation:auto;mix-blend-mode:normal;color-interpolation:sRGB;color-interpolation-filters:linearRGB;solid-color:#000000;solid-opacity:1;vector-effect:none;fill:#000000;fill-opacity:1;fill-rule:nonzero;stroke:none;stroke-width:1;stroke-linecap:round;stroke-linejoin:round;stroke-miterlimit:4;stroke-dasharray:none;stroke-dashoffset:0;stroke-opacity:1;color-rendering:auto;image-rendering:auto;shape-rendering:auto;text-rendering:auto;enable-background:accumulate"
     d="M 10,10.265625 9.140625,10.480469 6.2695312,11.4375 4.4101562,13.296875 3.5,15.117188 v 2.765624 l 0.9101562,1.820313 0.859375,0.859375 2.8125,0.9375 h 3.8359378 l 2.8125,-0.9375 0.859375,-0.859375 L 16.5,17.882812 V 15.117188 L 15.589844,13.296875 13.730469,11.4375 10.859375,10.480469 Z M 8.0820312,1.5 5.3554688,2.4082031 4.5,4.1171875 v 1.765625 L 5.3730469,7.6269531 7.1738281,8.5273438 10,9.234375 12.826172,8.5273438 14.626953,7.6269531 15.5,5.8828125 V 4.1171875 L 14.644531,2.4082031 11.917969,1.5 Z M 7.9746094,0.49804688 A 0.50005,0.50005 0 0 1 8.0488281,0.5 H 12 a 0.50005,0.50005 0 0 1 0.158203,0.0253906 l 3,0.99999998 a 0.50005,0.50005 0 0 1 0.289063,0.2519532 l 1,2 A 0.50005,0.50005 0 0 1 16.5,4 v 2 a 0.50005,0.50005 0 0 1 -0.05273,0.2226562 l -1,2 a 0.50005,0.50005 0 0 1 -0.22461,0.2246094 l -2,1 a 0.50005,0.50005 0 0 1 -0.101562,0.037109 l -1.191406,0.2988281 2.228515,0.7421879 a 0.50005,0.50005 0 0 1 0.195313,0.121093 l 2,2 a 0.50005,0.50005 0 0 1 0.09375,0.13086 l 1,2 A 0.50005,0.50005 0 0 1 17.5,15 v 3 a 0.50005,0.50005 0 0 1 -0.05273,0.222656 l -1,2 a 0.50005,0.50005 0 0 1 -0.09375,0.13086 l -1,1 a 0.50005,0.50005 0 0 1 -0.195313,0.121093 l -3,1 A 0.50005,0.50005 0 0 1 12,22.5 H 8 a 0.50005,0.50005 0 0 1 -0.1582031,-0.02539 l -3,-1 A 0.50005,0.50005 0 0 1 4.6464844,21.353516 l -1,-1 a 0.50005,0.50005 0 0 1 -0.09375,-0.13086 l -1,-2 A 0.50005,0.50005 0 0 1 2.5,18 v -3 a 0.50005,0.50005 0 0 1 0.052734,-0.222656 l 1,-2 a 0.50005,0.50005 0 0 1 0.09375,-0.13086 l 2,-2 A 0.50005,0.50005 0 0 1 5.8417969,10.525391 L 8.0703125,9.7832031 6.8789062,9.484375 A 0.50005,0.50005 0 0 1 6.7773438,9.4472656 l -2,-1 A 0.50005,0.50005 0 0 1 4.5527344,8.2226562 l -1,-2 A 0.50005,0.50005 0 0 1 3.5,6 V 4 a 0.50005,0.50005 0 0 1 0.052734,-0.2226562 l 1,-2 A 0.50005,0.50005 0 0 1 4.8417969,1.5253906 L 7.8007812,0.5390625 a 0.50005,0.50005 0 0 1 0.00391,-0.001953 0.50005,0.50005 0 0 1 0.109375,-0.03125 0.50005,0.50005 0 0 1 0.035156,-0.003906 0.50005,0.50005 0 0 1 0.025391,-0.003906 z"
     id="path2" />
</svg>
