<?xml version="1.0" encoding="UTF-8" standalone="no"?>
<svg
   xmlns:dc="http://purl.org/dc/elements/1.1/"
   xmlns:cc="http://creativecommons.org/ns#"
   xmlns:rdf="http://www.w3.org/1999/02/22-rdf-syntax-ns#"
   xmlns:svg="http://www.w3.org/2000/svg"
   xmlns="http://www.w3.org/2000/svg"
   xmlns:sodipodi="http://sodipodi.sourceforge.net/DTD/sodipodi-0.dtd"
   xmlns:inkscape="http://www.inkscape.org/namespaces/inkscape"
   data-dec="115"
   width="18"
   height="40"
   version="1.1"
   id="svg4"
   sodipodi:docname="115.svg"
   inkscape:version="0.92.4 (unknown)">
  <metadata
     id="metadata10">
    <rdf:RDF>
      <cc:Work
         rdf:about="">
        <dc:format>image/svg+xml</dc:format>
        <dc:type
           rdf:resource="http://purl.org/dc/dcmitype/StillImage" />
      </cc:Work>
    </rdf:RDF>
  </metadata>
  <defs
     id="defs8" />
  <sodipodi:namedview
     pagecolor="#ffffff"
     bordercolor="#666666"
     borderopacity="1"
     objecttolerance="10"
     gridtolerance="10"
     guidetolerance="10"
     inkscape:pageopacity="0"
     inkscape:pageshadow="2"
     inkscape:window-width="640"
     inkscape:window-height="480"
     id="namedview6"
     showgrid="false"
     inkscape:zoom="5.9"
     inkscape:cx="9"
     inkscape:cy="20"
     inkscape:window-x="0"
     inkscape:window-y="27"
     inkscape:window-maximized="0"
     inkscape:current-layer="svg4" />
  <path
     style="color:#000000;font-style:normal;font-variant:normal;font-weight:normal;font-stretch:normal;font-size:medium;line-height:normal;font-family:sans-serif;font-variant-ligatures:normal;font-variant-position:normal;font-variant-caps:normal;font-variant-numeric:normal;font-variant-alternates:normal;font-feature-settings:normal;text-indent:0;text-align:start;text-decoration:none;text-decoration-line:none;text-decoration-style:solid;text-decoration-color:#000000;letter-spacing:normal;word-spacing:normal;text-transform:none;writing-mode:lr-tb;direction:ltr;text-orientation:mixed;dominant-baseline:auto;baseline-shift:baseline;text-anchor:start;white-space:normal;shape-padding:0;clip-rule:nonzero;display:inline;overflow:visible;visibility:visible;opacity:1;isolation:auto;mix-blend-mode:normal;color-interpolation:sRGB;color-interpolation-filters:linearRGB;solid-color:#000000;solid-opacity:1;vector-effect:none;fill:#013272;fill-opacity:1;fill-rule:nonzero;stroke:none;stroke-width:1;stroke-linecap:round;stroke-linejoin:round;stroke-miterlimit:4;stroke-dasharray:none;stroke-dashoffset:0;stroke-opacity:1;color-rendering:auto;image-rendering:auto;shape-rendering:auto;text-rendering:auto;enable-background:accumulate"
     d="m 13.177734,16.472656 a 0.50005,0.50005 0 0 1 -0.07422,0.01953 l 0.111328,0.05664 z m -9.3925778,-4.021484 0.037109,0.07617 a 0.50005,0.50005 0 0 1 0.074219,-0.01953 z M 6,7.5 h 4 a 0.50005,0.50005 0 0 1 0.222656,0.052734 l 2,1 a 0.50005,0.50005 0 0 1 0.13086,0.09375 L 12.863281,9.15625 13.552734,7.7773438 A 0.50005,0.50005 0 0 1 14.5,8 v 4 a 0.50005,0.50005 0 0 1 -0.947266,0.222656 L 12.589844,10.296875 11.703125,9.4101562 9.8828125,8.5 h -3.765625 l -1.7070313,0.8535156 -0.4707031,1.4082034 0.4335938,0.865234 1.7910156,0.896485 4.9335935,0.986328 a 0.50005,0.50005 0 0 1 0.125,0.04297 l 2,1 a 0.50005,0.50005 0 0 1 0.22461,0.22461 l 0.96875,1.9375 a 0.50005,0.50005 0 0 1 0.08203,0.234375 A 0.50005,0.50005 0 0 1 14.5,17 a 0.50005,0.50005 0 0 1 0,0.02344 v 2.933593 a 0.50005,0.50005 0 0 1 -0.201172,0.451172 l -0.908203,0.908203 a 0.50005,0.50005 0 0 1 -0.232422,0.164063 l -1.935547,0.966797 A 0.50005,0.50005 0 0 1 11,22.5 H 7 a 0.50005,0.50005 0 0 1 -0.2226562,-0.05273 l -2,-1 A 0.50005,0.50005 0 0 1 4.6464844,21.353516 L 4.1367188,20.84375 3.4472656,22.222656 A 0.50005,0.50005 0 0 1 2.5,22 V 18 A 0.50005,0.50005 0 0 1 3.4472656,17.777344 L 4.4101562,19.703125 5.296875,20.589844 7.1171875,21.5 h 3.7656245 l 1.689454,-0.84375 0.478515,-1.919922 -0.458984,-1.380859 -1.755859,-0.878907 -4.9335942,-0.986328 a 0.50005,0.50005 0 0 1 -0.125,-0.04297 l -2,-1 A 0.50005,0.50005 0 0 1 3.5527344,14.222656 L 2.5878906,12.291016 A 0.50005,0.50005 0 0 1 2.5,11.964844 V 10.046875 A 0.50005,0.50005 0 0 1 2.7070312,9.5859375 l 0.90625,-0.90625 a 0.50005,0.50005 0 0 1 0.2363282,-0.1640625 0.50005,0.50005 0 0 1 0.00781,-0.00195 L 5.7773438,7.5527344 A 0.50005,0.50005 0 0 1 6,7.5 Z"
     id="path2" />
</svg>
