<?xml version="1.0" encoding="UTF-8" standalone="no"?>
<svg
   xmlns:dc="http://purl.org/dc/elements/1.1/"
   xmlns:cc="http://creativecommons.org/ns#"
   xmlns:rdf="http://www.w3.org/1999/02/22-rdf-syntax-ns#"
   xmlns:svg="http://www.w3.org/2000/svg"
   xmlns="http://www.w3.org/2000/svg"
   xmlns:sodipodi="http://sodipodi.sourceforge.net/DTD/sodipodi-0.dtd"
   xmlns:inkscape="http://www.inkscape.org/namespaces/inkscape"
   data-dec="71"
   width="22"
   height="40"
   version="1.1"
   id="svg4"
   sodipodi:docname="71.svg"
   inkscape:version="0.92.4 (unknown)">
  <metadata
     id="metadata10">
    <rdf:RDF>
      <cc:Work
         rdf:about="">
        <dc:format>image/svg+xml</dc:format>
        <dc:type
           rdf:resource="http://purl.org/dc/dcmitype/StillImage" />
      </cc:Work>
    </rdf:RDF>
  </metadata>
  <defs
     id="defs8" />
  <sodipodi:namedview
     pagecolor="#ffffff"
     bordercolor="#666666"
     borderopacity="1"
     objecttolerance="10"
     gridtolerance="10"
     guidetolerance="10"
     inkscape:pageopacity="0"
     inkscape:pageshadow="2"
     inkscape:window-width="640"
     inkscape:window-height="480"
     id="namedview6"
     showgrid="false"
     inkscape:zoom="5.9"
     inkscape:cx="11"
     inkscape:cy="20"
     inkscape:window-x="0"
     inkscape:window-y="27"
     inkscape:window-maximized="0"
     inkscape:current-layer="svg4" />
  <path
     style="color:#000000;font-style:normal;font-variant:normal;font-weight:normal;font-stretch:normal;font-size:medium;line-height:normal;font-family:sans-serif;font-variant-ligatures:normal;font-variant-position:normal;font-variant-caps:normal;font-variant-numeric:normal;font-variant-alternates:normal;font-feature-settings:normal;text-indent:0;text-align:start;text-decoration:none;text-decoration-line:none;text-decoration-style:solid;text-decoration-color:#000000;letter-spacing:normal;word-spacing:normal;text-transform:none;writing-mode:lr-tb;direction:ltr;text-orientation:mixed;dominant-baseline:auto;baseline-shift:baseline;text-anchor:start;white-space:normal;shape-padding:0;clip-rule:nonzero;display:inline;overflow:visible;visibility:visible;opacity:1;isolation:auto;mix-blend-mode:normal;color-interpolation:sRGB;color-interpolation-filters:linearRGB;solid-color:#000000;solid-opacity:1;vector-effect:none;fill:#000000;fill-opacity:1;fill-rule:nonzero;stroke:none;stroke-width:3;stroke-linecap:round;stroke-linejoin:round;stroke-miterlimit:4;stroke-dasharray:none;stroke-dashoffset:0;stroke-opacity:1;color-rendering:auto;image-rendering:auto;shape-rendering:auto;text-rendering:auto;enable-background:accumulate"
     d="m 9,1.5 h 4 a 1.50015,1.50015 0 0 1 0.669922,0.1582031 l 2,1 a 1.50015,1.50015 0 0 1 0.390625,0.28125 l 2,2 a 1.50015,1.50015 0 0 1 0.28125,0.390625 l 1,2 a 1.50015,1.50015 0 1 1 -2.683594,1.3398438 l -0.890625,-1.78125 -1.65625,-1.65625 L 12.646484,4.5 H 9.3535156 l -1.4648437,0.7324219 -1.65625,1.65625 -0.84375,1.6875 L 4.5,11.244141 v 2.511718 l 0.8886719,2.667969 0.84375,1.6875 1.65625,1.65625 L 9.3535156,20.5 h 3.2929684 l 1.464844,-0.732422 1.65625,-1.65625 L 16.5,16.646484 V 15.5 H 13 a 1.50015,1.50015 0 1 1 0,-3 h 4.759766 a 1.50015,1.50015 0 0 1 1.277343,0.396484 1.50015,1.50015 0 0 1 0.01367,0.01172 1.50015,1.50015 0 0 1 0.0098,0.0098 1.50015,1.50015 0 0 1 0.0039,0.0059 A 1.50015,1.50015 0 0 1 19.5,14.246094 V 17 a 1.50015,1.50015 0 0 1 -0.158203,0.669922 l -1,2 a 1.50015,1.50015 0 0 1 -0.28125,0.390625 l -2,2 a 1.50015,1.50015 0 0 1 -0.390625,0.28125 l -2,1 A 1.50015,1.50015 0 0 1 13,23.5 H 9 A 1.50015,1.50015 0 0 1 8.3300781,23.341797 l -2,-1 a 1.50015,1.50015 0 0 1 -0.390625,-0.28125 l -2,-2 a 1.50015,1.50015 0 0 1 -0.28125,-0.390625 l -1,-2 a 1.50015,1.50015 0 0 1 -0.082031,-0.195313 l -1,-3 A 1.50015,1.50015 0 0 1 1.5,14 v -3 a 1.50015,1.50015 0 0 1 0.076172,-0.474609 l 1,-3.0000004 a 1.50015,1.50015 0 0 1 0.082031,-0.1953125 l 1,-2 a 1.50015,1.50015 0 0 1 0.28125,-0.390625 l 2,-2 a 1.50015,1.50015 0 0 1 0.390625,-0.28125 l 2,-1 A 1.50015,1.50015 0 0 1 9,1.5 Z"
     id="path2" />
</svg>
