<?xml version="1.0" encoding="UTF-8"?>
<glyph name="z" format="1">
  <advance width="520"/>
  <unicode hex="007A"/>
  <outline>
    <contour>
      <point x="87" y="449" type="curve" smooth="yes"/>
      <point x="90" y="449" type="line"/>
      <point x="431" y="449" type="line"/>
      <point x="434" y="449" type="line" smooth="yes"/>
      <point x="440" y="449"/>
      <point x="448" y="445"/>
      <point x="451" y="441" type="curve" smooth="yes"/>
      <point x="452" y="440"/>
      <point x="452" y="439"/>
      <point x="453" y="438" type="curve" smooth="yes"/>
      <point x="454" y="437" type="line"/>
      <point x="455" y="435"/>
      <point x="455" y="434" type="curve" smooth="yes"/>
      <point x="456" y="432"/>
      <point x="456" y="429"/>
      <point x="456" y="427" type="curve" smooth="yes"/>
      <point x="456" y="421"/>
      <point x="453" y="414"/>
      <point x="450" y="411" type="curve" smooth="yes"/>
      <point x="189" y="73" type="line"/>
      <point x="434" y="73" type="line" smooth="yes"/>
      <point x="446" y="73"/>
      <point x="455" y="63"/>
      <point x="455" y="51" type="curve" smooth="yes"/>
      <point x="455" y="25" type="line" smooth="yes"/>
      <point x="455" y="24"/>
      <point x="456" y="23"/>
      <point x="456" y="22" type="curve" smooth="yes"/>
      <point x="456" y="18"/>
      <point x="453" y="10"/>
      <point x="450" y="7" type="curve" smooth="yes"/>
      <point x="449" y="6" type="line" smooth="yes"/>
      <point x="446" y="3"/>
      <point x="438" y="0"/>
      <point x="434" y="0" type="curve" smooth="yes"/>
      <point x="430" y="0" type="line"/>
      <point x="90" y="0" type="line"/>
      <point x="87" y="0" type="line" smooth="yes"/>
      <point x="81" y="0"/>
      <point x="73" y="4"/>
      <point x="70" y="8" type="curve" smooth="yes"/>
      <point x="69" y="9"/>
      <point x="69" y="10"/>
      <point x="68" y="11" type="curve" smooth="yes"/>
      <point x="67" y="12" type="line"/>
      <point x="66" y="13"/>
      <point x="66" y="14" type="curve" smooth="yes"/>
      <point x="65" y="16"/>
      <point x="65" y="20"/>
      <point x="65" y="22" type="curve" smooth="yes"/>
      <point x="65" y="28"/>
      <point x="69" y="34"/>
      <point x="72" y="37" type="curve" smooth="yes"/>
      <point x="332" y="376" type="line"/>
      <point x="87" y="376" type="line" smooth="yes"/>
      <point x="75" y="376"/>
      <point x="65" y="386"/>
      <point x="65" y="398" type="curve" smooth="yes"/>
      <point x="65" y="424" type="line"/>
      <point x="65" y="427" type="line" smooth="yes"/>
      <point x="65" y="431"/>
      <point x="69" y="439"/>
      <point x="72" y="442" type="curve" smooth="yes"/>
      <point x="73" y="444" type="line" smooth="yes"/>
      <point x="76" y="447"/>
      <point x="83" y="449"/>
    </contour>
  </outline>
  <lib>
    <dict>
      <key>com.fontlab.hintData</key>
      <dict>
        <key>hhints</key>
        <array>
          <dict>
            <key>position</key>
            <integer>0</integer>
            <key>width</key>
            <integer>73</integer>
          </dict>
          <dict>
            <key>position</key>
            <integer>376</integer>
            <key>width</key>
            <integer>73</integer>
          </dict>
        </array>
      </dict>
    </dict>
  </lib>
</glyph>
