<?xml version="1.0" encoding="UTF-8" standalone="no"?>
<svg
   xmlns:dc="http://purl.org/dc/elements/1.1/"
   xmlns:cc="http://creativecommons.org/ns#"
   xmlns:rdf="http://www.w3.org/1999/02/22-rdf-syntax-ns#"
   xmlns:svg="http://www.w3.org/2000/svg"
   xmlns="http://www.w3.org/2000/svg"
   xmlns:sodipodi="http://sodipodi.sourceforge.net/DTD/sodipodi-0.dtd"
   xmlns:inkscape="http://www.inkscape.org/namespaces/inkscape"
   data-dec="64261"
   width="21"
   height="40"
   version="1.1"
   id="svg4"
   sodipodi:docname="64261.svg"
   inkscape:version="0.92.4 5da689c313, 2019-01-14">
  <metadata
     id="metadata10">
    <rdf:RDF>
      <cc:Work
         rdf:about="">
        <dc:format>image/svg+xml</dc:format>
        <dc:type
           rdf:resource="http://purl.org/dc/dcmitype/StillImage" />
        <dc:title></dc:title>
      </cc:Work>
    </rdf:RDF>
  </metadata>
  <defs
     id="defs8" />
  <sodipodi:namedview
     pagecolor="#ffffff"
     bordercolor="#666666"
     borderopacity="1"
     objecttolerance="10"
     gridtolerance="10"
     guidetolerance="10"
     inkscape:pageopacity="0"
     inkscape:pageshadow="2"
     inkscape:window-width="1920"
     inkscape:window-height="1043"
     id="namedview6"
     showgrid="false"
     inkscape:zoom="5.9"
     inkscape:cx="10.5"
     inkscape:cy="20"
     inkscape:window-x="0"
     inkscape:window-y="37"
     inkscape:window-maximized="0"
     inkscape:current-layer="svg4" />
  <path
     style="color:#000000;font-style:normal;font-variant:normal;font-weight:normal;font-stretch:normal;font-size:medium;line-height:normal;font-family:sans-serif;font-variant-ligatures:normal;font-variant-position:normal;font-variant-caps:normal;font-variant-numeric:normal;font-variant-alternates:normal;font-feature-settings:normal;text-indent:0;text-align:start;text-decoration:none;text-decoration-line:none;text-decoration-style:solid;text-decoration-color:#000000;letter-spacing:normal;word-spacing:normal;text-transform:none;writing-mode:lr-tb;direction:ltr;text-orientation:mixed;dominant-baseline:auto;baseline-shift:baseline;text-anchor:start;white-space:normal;shape-padding:0;clip-rule:nonzero;display:inline;overflow:visible;visibility:visible;opacity:1;isolation:auto;mix-blend-mode:normal;color-interpolation:sRGB;color-interpolation-filters:linearRGB;solid-color:#000000;solid-opacity:1;vector-effect:none;fill:#000000;fill-opacity:1;fill-rule:nonzero;stroke:none;stroke-width:1.5;stroke-linecap:round;stroke-linejoin:round;stroke-miterlimit:4;stroke-dasharray:none;stroke-dashoffset:0;stroke-opacity:1;color-rendering:auto;image-rendering:auto;shape-rendering:auto;text-rendering:auto;enable-background:accumulate"
     d="m 8,0.25 h 1 2 a 0.750075,0.750075 0 0 1 0.04687,0.001953 0.750075,0.750075 0 0 1 0.05078,0.005859 0.750075,0.750075 0 0 1 0.04102,0.005859 0.750075,0.750075 0 0 1 0.07227,0.0175781 0.750075,0.750075 0 0 1 0.05664,0.0175781 0.750075,0.750075 0 0 1 0.01367,0.005859 0.750075,0.750075 0 0 1 0.05469,0.0253906 0.750075,0.750075 0 0 1 0.01367,0.005859 l 0.0098,0.005859 1.976563,0.98828122 a 0.750075,0.750075 0 0 1 0.333984,0.3339844 l 1,2 A 0.750075,0.750075 0 0 1 14.75,4 V 7 7.25 H 15 17 a 0.750075,0.750075 0 0 1 0,1.5 H 15.310547 L 14.75,9.3125 v 9.509766 L 15.617188,20.556641 16.3125,21.25 h 1.376953 l 0.779297,-0.78125 a 0.75130096,0.75130096 0 1 1 1.0625,1.0625 l -1,1 A 0.750075,0.750075 0 0 1 18,22.75 h -1.892578 a 0.750075,0.750075 0 0 1 -0.496094,-0.105469 l -1.947266,-0.974609 a 0.750075,0.750075 0 0 1 -0.333984,-0.333984 l -1,-2 A 0.750075,0.750075 0 0 1 12.25,19 V 9.3125 L 11.689453,8.75 H 11.072266 A 0.750075,0.750075 0 0 1 10.664062,7.3300781 L 12.25,6.5371094 V 4.1777344 L 11.382812,2.4433594 10.689453,1.75 H 9 8.3105469 L 6.65625,3.4042969 5.75,6.1191406 v 1.7578125 a 0.750075,0.750075 0 0 1 0,0.2460938 V 9 20.6875 L 6.3105469,21.25 H 7 a 0.750075,0.750075 0 0 1 0,1.5 H 6 5.1230469 a 0.750075,0.750075 0 0 1 -0.2460938,0 H 4.1230469 a 0.750075,0.750075 0 0 1 -0.2460938,0 H 3.0996094 a 0.750075,0.750075 0 0 1 -0.2050782,0 H 2 a 0.750075,0.750075 0 1 1 0,-1.5 H 2.6875 L 3.25,20.6875 V 9.3125 L 2.6875,8.75 H 2 a 0.750075,0.750075 0 1 1 0,-1.5 h 0.8925781 a 0.750075,0.750075 0 0 1 0.1992188,0 H 3.25 V 6.078125 a 0.750075,0.750075 0 0 1 0.00977,-0.1972656 0.750075,0.750075 0 0 1 0.00781,-0.046875 A 0.750075,0.750075 0 0 1 3.3144531,5.6875 L 4.2890625,2.7636719 A 0.750075,0.750075 0 0 1 4.46875,2.46875 l 1,-1 A 0.750075,0.750075 0 0 1 5.6640625,1.3300781 L 7.640625,0.34179688 a 0.750075,0.750075 0 0 1 0.023437,-0.0117188 0.750075,0.750075 0 0 1 0.042969,-0.0214844 0.750075,0.750075 0 0 1 0.21875,-0.0546875 A 0.750075,0.750075 0 0 1 8,0.25 Z"
     id="path2" />
</svg>
