<?xml version="1.0" encoding="UTF-8" standalone="no"?>
<svg
   xmlns:dc="http://purl.org/dc/elements/1.1/"
   xmlns:cc="http://creativecommons.org/ns#"
   xmlns:rdf="http://www.w3.org/1999/02/22-rdf-syntax-ns#"
   xmlns:svg="http://www.w3.org/2000/svg"
   xmlns="http://www.w3.org/2000/svg"
   xmlns:sodipodi="http://sodipodi.sourceforge.net/DTD/sodipodi-0.dtd"
   xmlns:inkscape="http://www.inkscape.org/namespaces/inkscape"
   data-dec="112"
   width="20"
   height="40"
   version="1.1"
   id="svg4"
   sodipodi:docname="112.svg"
   inkscape:version="0.92.4 (unknown)">
  <metadata
     id="metadata10">
    <rdf:RDF>
      <cc:Work
         rdf:about="">
        <dc:format>image/svg+xml</dc:format>
        <dc:type
           rdf:resource="http://purl.org/dc/dcmitype/StillImage" />
      </cc:Work>
    </rdf:RDF>
  </metadata>
  <defs
     id="defs8" />
  <sodipodi:namedview
     pagecolor="#ffffff"
     bordercolor="#666666"
     borderopacity="1"
     objecttolerance="10"
     gridtolerance="10"
     guidetolerance="10"
     inkscape:pageopacity="0"
     inkscape:pageshadow="2"
     inkscape:window-width="640"
     inkscape:window-height="480"
     id="namedview6"
     showgrid="false"
     inkscape:zoom="5.9"
     inkscape:cx="10"
     inkscape:cy="20"
     inkscape:window-x="0"
     inkscape:window-y="27"
     inkscape:window-maximized="0"
     inkscape:current-layer="svg4" />
  <path
     style="color:#000000;font-style:normal;font-variant:normal;font-weight:normal;font-stretch:normal;font-size:medium;line-height:normal;font-family:sans-serif;font-variant-ligatures:normal;font-variant-position:normal;font-variant-caps:normal;font-variant-numeric:normal;font-variant-alternates:normal;font-feature-settings:normal;text-indent:0;text-align:start;text-decoration:none;text-decoration-line:none;text-decoration-style:solid;text-decoration-color:#000000;letter-spacing:normal;word-spacing:normal;text-transform:none;writing-mode:lr-tb;direction:ltr;text-orientation:mixed;dominant-baseline:auto;baseline-shift:baseline;text-anchor:start;white-space:normal;shape-padding:0;clip-rule:nonzero;display:inline;overflow:visible;visibility:visible;opacity:1;isolation:auto;mix-blend-mode:normal;color-interpolation:sRGB;color-interpolation-filters:linearRGB;solid-color:#000000;solid-opacity:1;vector-effect:none;fill:#013272;fill-opacity:1;fill-rule:nonzero;stroke:none;stroke-width:2.5;stroke-linecap:round;stroke-linejoin:round;stroke-miterlimit:4;stroke-dasharray:none;stroke-dashoffset:0;stroke-opacity:1;color-rendering:auto;image-rendering:auto;shape-rendering:auto;text-rendering:auto;enable-background:accumulate"
     d="M 10.294922,9.25 8.7402344,10.027344 7.25,11.519531 v 6.960938 L 8.7402344,19.972656 10.294922,20.75 h 1.412109 L 13.259766,19.972656 14.908203,18.324219 15.75,15.796875 v -1.59375 L 14.908203,11.675781 13.259766,10.027344 11.707031,9.25 Z M 4.9804688,6.7324219 A 1.250125,1.250125 0 0 1 5.203125,6.75 h 0.5976562 a 1.250125,1.250125 0 0 1 1.0664063,0.3320312 1.250125,1.250125 0 0 1 0.00781,0.00781 1.250125,1.250125 0 0 1 0.00586,0.00586 1.250125,1.250125 0 0 1 0.00781,0.00781 1.250125,1.250125 0 0 1 0.3789062,0.8867188 1.250125,1.250125 0 0 1 0.1738281,-0.1074219 l 2,-1 A 1.250125,1.250125 0 0 1 10,6.75 h 1.857422 a 1.250125,1.250125 0 0 1 0.58789,0.080078 l 0.0098,0.00391 2.939453,0.9804687 a 1.250125,1.250125 0 0 1 0.490235,0.3007813 l 2,1.9999996 a 1.250125,1.250125 0 0 1 0.300781,0.490235 l 1,3 A 1.250125,1.250125 0 0 1 19.25,14 v 2 a 1.250125,1.250125 0 0 1 -0.06445,0.394531 l -1,3 a 1.250125,1.250125 0 0 1 -0.300781,0.490235 l -2,2 a 1.250125,1.250125 0 0 1 -0.490235,0.300781 l -2.914062,0.970703 a 1.250125,1.250125 0 0 1 -0.01953,0.0078 A 1.250125,1.250125 0 0 1 11.855469,23.25 H 10 A 1.250125,1.250125 0 0 1 9.4414062,23.117188 l -2,-1 A 1.250125,1.250125 0 0 1 7.25,21.998047 V 27.75 H 9 a 1.250125,1.250125 0 1 1 0,2.5 H 6.1992188 a 1.250125,1.250125 0 0 1 -0.4023438,0 H 5.1992188 a 1.250125,1.250125 0 0 1 -0.4023438,0 H 2 a 1.250125,1.250125 0 1 1 0,-2.5 H 3.75 V 9.25 H 2 a 1.250125,1.250125 0 1 1 0,-2.5 h 2.8007812 a 1.250125,1.250125 0 0 1 0.1796876,-0.017578 z"
     id="path2" />
</svg>
