<?xml version="1.0" encoding="UTF-8" standalone="no"?>
<svg
   xmlns:dc="http://purl.org/dc/elements/1.1/"
   xmlns:cc="http://creativecommons.org/ns#"
   xmlns:rdf="http://www.w3.org/1999/02/22-rdf-syntax-ns#"
   xmlns:svg="http://www.w3.org/2000/svg"
   xmlns="http://www.w3.org/2000/svg"
   xmlns:sodipodi="http://sodipodi.sourceforge.net/DTD/sodipodi-0.dtd"
   xmlns:inkscape="http://www.inkscape.org/namespaces/inkscape"
   data-dec="68"
   width="22"
   height="40"
   version="1.1"
   id="svg4"
   sodipodi:docname="68.svg"
   inkscape:version="0.92.4 (unknown)">
  <metadata
     id="metadata10">
    <rdf:RDF>
      <cc:Work
         rdf:about="">
        <dc:format>image/svg+xml</dc:format>
        <dc:type
           rdf:resource="http://purl.org/dc/dcmitype/StillImage" />
      </cc:Work>
    </rdf:RDF>
  </metadata>
  <defs
     id="defs8" />
  <sodipodi:namedview
     pagecolor="#ffffff"
     bordercolor="#666666"
     borderopacity="1"
     objecttolerance="10"
     gridtolerance="10"
     guidetolerance="10"
     inkscape:pageopacity="0"
     inkscape:pageshadow="2"
     inkscape:window-width="640"
     inkscape:window-height="480"
     id="namedview6"
     showgrid="false"
     inkscape:zoom="5.9"
     inkscape:cx="11"
     inkscape:cy="20"
     inkscape:window-x="0"
     inkscape:window-y="27"
     inkscape:window-maximized="0"
     inkscape:current-layer="svg4" />
  <path
     style="color:#000000;font-style:normal;font-variant:normal;font-weight:normal;font-stretch:normal;font-size:medium;line-height:normal;font-family:sans-serif;font-variant-ligatures:normal;font-variant-position:normal;font-variant-caps:normal;font-variant-numeric:normal;font-variant-alternates:normal;font-feature-settings:normal;text-indent:0;text-align:start;text-decoration:none;text-decoration-line:none;text-decoration-style:solid;text-decoration-color:#000000;letter-spacing:normal;word-spacing:normal;text-transform:none;writing-mode:lr-tb;direction:ltr;text-orientation:mixed;dominant-baseline:auto;baseline-shift:baseline;text-anchor:start;white-space:normal;shape-padding:0;clip-rule:nonzero;display:inline;overflow:visible;visibility:visible;opacity:1;isolation:auto;mix-blend-mode:normal;color-interpolation:sRGB;color-interpolation-filters:linearRGB;solid-color:#000000;solid-opacity:1;vector-effect:none;fill:#013272;fill-opacity:1;fill-rule:nonzero;stroke:none;stroke-width:2;stroke-linecap:round;stroke-linejoin:round;stroke-miterlimit:4;stroke-dasharray:none;stroke-dashoffset:0;stroke-opacity:1;color-rendering:auto;image-rendering:auto;shape-rendering:auto;text-rendering:auto;enable-background:accumulate"
     d="M 9.2363281,2 8.4121094,2.4121094 8,3.2363281 V 19.763672 L 8.4121094,20.587891 9.2363281,21 H 11.763672 L 13.314453,20.224609 15.072266,17.589844 16,13.876953 V 9.1230469 L 15.072266,5.4101562 13.314453,2.7753906 11.763672,2 Z M 4.984375,-0.01367188 A 1.0001,1.0001 0 0 1 5.1679688,0 h 1.6738281 a 1.0001,1.0001 0 0 1 0.3261719,0 h 0.6777343 a 1.0001,1.0001 0 0 1 0.3183594,0 h 0.7402344 a 1.0001,1.0001 0 0 1 0.2148437,0 h 2.7714844 a 1.0001,1.0001 0 0 1 0.425781,0.05078125 l 0.0078,0.0019531 a 1.0001,1.0001 0 0 1 0.03125,0.01171875 l 2.960937,0.98632808 a 1.0001,1.0001 0 0 1 0.390625,0.2421876 l 2,2 a 1.0001,1.0001 0 0 1 0.1875,0.2597656 l 1,2 a 1.0001,1.0001 0 0 1 0.05469,0.1308594 l 1,3 A 1.0001,1.0001 0 0 1 20,9 v 5 a 1.0001,1.0001 0 0 1 -0.05078,0.316406 l -1,3 a 1.0001,1.0001 0 0 1 -0.05469,0.13086 l -1,2 a 1.0001,1.0001 0 0 1 -0.1875,0.259765 l -2,2 a 1.0001,1.0001 0 0 1 -0.390625,0.242188 l -2.99414,0.998047 -0.0059,0.002 A 1.0001,1.0001 0 0 1 11.880859,23 H 9.109375 A 1.0001,1.0001 0 0 1 8.90625,23 h -0.75 A 1.0001,1.0001 0 0 1 7.8515625,23 H 7.1582031 A 1.0001,1.0001 0 0 1 6.8320312,23 H 5.1582031 A 1.0001,1.0001 0 0 1 4.8320312,23 H 4.1542969 A 1.0001,1.0001 0 0 1 3.8359375,23 H 3.0957031 A 1.0001,1.0001 0 0 1 2.8808594,23 H 2 A 1.0001,1.0001 0 1 1 2,21 H 2.7636719 L 3.5878906,20.587891 4,19.763672 V 3.2363281 L 3.5878906,2.4121094 2.7636719,2 H 2 A 1.0001,1.0001 0 1 1 2,0 H 2.890625 A 1.0001,1.0001 0 0 1 3.09375,0 h 0.75 A 1.0001,1.0001 0 0 1 4.1484375,0 H 4.8417969 A 1.0001,1.0001 0 0 1 4.984375,-0.01367188 Z"
     id="path2" />
</svg>
