<?xml version="1.0" encoding="UTF-8" standalone="no"?>
<svg
   xmlns:dc="http://purl.org/dc/elements/1.1/"
   xmlns:cc="http://creativecommons.org/ns#"
   xmlns:rdf="http://www.w3.org/1999/02/22-rdf-syntax-ns#"
   xmlns:svg="http://www.w3.org/2000/svg"
   xmlns="http://www.w3.org/2000/svg"
   xmlns:sodipodi="http://sodipodi.sourceforge.net/DTD/sodipodi-0.dtd"
   xmlns:inkscape="http://www.inkscape.org/namespaces/inkscape"
   data-dec="99"
   width="18"
   height="40"
   version="1.1"
   id="svg4"
   sodipodi:docname="99.svg"
   inkscape:version="0.92.4 (unknown)">
  <metadata
     id="metadata10">
    <rdf:RDF>
      <cc:Work
         rdf:about="">
        <dc:format>image/svg+xml</dc:format>
        <dc:type
           rdf:resource="http://purl.org/dc/dcmitype/StillImage" />
      </cc:Work>
    </rdf:RDF>
  </metadata>
  <defs
     id="defs8" />
  <sodipodi:namedview
     pagecolor="#ffffff"
     bordercolor="#666666"
     borderopacity="1"
     objecttolerance="10"
     gridtolerance="10"
     guidetolerance="10"
     inkscape:pageopacity="0"
     inkscape:pageshadow="2"
     inkscape:window-width="640"
     inkscape:window-height="480"
     id="namedview6"
     showgrid="false"
     inkscape:zoom="5.9"
     inkscape:cx="9"
     inkscape:cy="20"
     inkscape:window-x="0"
     inkscape:window-y="27"
     inkscape:window-maximized="0"
     inkscape:current-layer="svg4" />
  <path
     style="color:#000000;font-style:normal;font-variant:normal;font-weight:normal;font-stretch:normal;font-size:medium;line-height:normal;font-family:sans-serif;font-variant-ligatures:normal;font-variant-position:normal;font-variant-caps:normal;font-variant-numeric:normal;font-variant-alternates:normal;font-feature-settings:normal;text-indent:0;text-align:start;text-decoration:none;text-decoration-line:none;text-decoration-style:solid;text-decoration-color:#000000;letter-spacing:normal;word-spacing:normal;text-transform:none;writing-mode:lr-tb;direction:ltr;text-orientation:mixed;dominant-baseline:auto;baseline-shift:baseline;text-anchor:start;white-space:normal;shape-padding:0;clip-rule:nonzero;display:inline;overflow:visible;visibility:visible;opacity:1;isolation:auto;mix-blend-mode:normal;color-interpolation:sRGB;color-interpolation-filters:linearRGB;solid-color:#000000;solid-opacity:1;vector-effect:none;fill:#013272;fill-opacity:1;fill-rule:nonzero;stroke:none;stroke-width:0.30000001;stroke-linecap:round;stroke-linejoin:round;stroke-miterlimit:4;stroke-dasharray:none;stroke-dashoffset:0;stroke-opacity:1;color-rendering:auto;image-rendering:auto;shape-rendering:auto;text-rendering:auto;enable-background:accumulate"
     d="m 4.9941406,10.847656 a 0.15001501,0.15001501 0 0 1 0.140625,0.21875 l -0.984375,1.96875 v 3.929688 l 0.984375,1.96875 a 0.15023822,0.15023822 0 0 1 -0.2695312,0.132812 l -1,-2 A 0.15001501,0.15001501 0 0 1 3.8496094,17 v -4 a 0.15001501,0.15001501 0 0 1 0.015625,-0.06641 l 1,-2 a 0.15001501,0.15001501 0 0 1 0.1289062,-0.08594 z M 7.0449219,8.8085938 6.0800781,9.1308594 4.1308594,11.080078 3.1503906,14.023438 v 1.953124 l 0.9804688,2.94336 1.9492187,1.949219 0.9648438,0.322265 -0.1113281,-0.05664 a 0.15001501,0.15001501 0 0 1 -0.039063,-0.0293 l -1,-1 a 0.15001501,0.15001501 0 0 1 -0.037109,-0.05859 l -1,-3 A 0.15001501,0.15001501 0 0 1 4.8496094,17 v -4 a 0.15001501,0.15001501 0 0 1 0.00781,-0.04687 l 1,-3 a 0.15001501,0.15001501 0 0 1 0.037109,-0.058594 l 1,-1 a 0.15001501,0.15001501 0 0 1 0.039063,-0.029297 z M 8.9863281,7.8496094 a 0.15001501,0.15001501 0 0 1 0.013672,0 H 9.015625 12 a 0.15001501,0.15001501 0 0 1 0.06641,0.015625 l 2,1 a 0.15001501,0.15001501 0 0 1 0.03906,0.029297 l 2,1.9999998 A 0.15001501,0.15001501 0 0 1 16.150391,11 v 2 A 0.15001501,0.15001501 0 0 1 16,13.150391 H 14 A 0.15001501,0.15001501 0 0 1 13.849609,13 V 11 A 0.15001501,0.15001501 0 0 1 14,10.849609 h 1 A 0.15001501,0.15001501 0 0 1 15.150391,11 v 1 a 0.150391,0.150391 0 1 1 -0.300782,0 v -0.849609 h -0.699218 v 1.699218 h 1.699218 V 11.0625 L 13.912109,9.1230469 11.964844,8.1503906 H 9.0351562 L 7.0878906,9.1230469 6.1308594,10.080078 5.1503906,13.023438 v 3.953124 l 0.9804688,2.94336 0.9570312,0.957031 1.9472656,0.972656 h 1.9414058 l 2.94336,-0.980468 1.974609,-1.97461 a 0.15001501,0.15001501 0 1 1 0.210938,0.210938 l -2,2 a 0.15001501,0.15001501 0 0 1 -0.05859,0.03711 l -3,1 A 0.15001501,0.15001501 0 0 1 11,22.150391 H 9.0195312 9.0058594 a 0.15001501,0.15001501 0 0 1 -0.00977,0 0.15001501,0.15001501 0 0 1 -0.00586,0 0.15001501,0.15001501 0 0 1 -0.00781,-0.002 0.15001501,0.15001501 0 0 1 -0.00781,0 0.15001501,0.15001501 0 0 1 -0.00781,-0.002 0.15001501,0.15001501 0 0 1 -0.00586,-0.002 0.15001501,0.15001501 0 0 1 -0.00781,-0.002 l -0.00586,-0.002 a 0.15001501,0.15001501 0 0 1 -0.013672,-0.0059 L 5.953125,21.142578 a 0.15001501,0.15001501 0 0 1 -0.058594,-0.03711 l -2,-2 a 0.15001501,0.15001501 0 0 1 -0.037109,-0.05859 l -1,-3 A 0.15001501,0.15001501 0 0 1 2.8496094,16 v -2 a 0.15001501,0.15001501 0 0 1 0.00781,-0.04687 l 1,-3 a 0.15001501,0.15001501 0 0 1 0.037109,-0.05859 l 2,-1.9999998 A 0.15001501,0.15001501 0 0 1 5.953125,8.8574219 L 8.9335938,7.8652344 a 0.15001501,0.15001501 0 0 1 0.019531,-0.00781 0.15001501,0.15001501 0 0 1 0.033203,-0.00781 z"
     id="path2" />
</svg>
