<?xml version="1.0" encoding="UTF-8" standalone="no"?>
<svg
   xmlns:dc="http://purl.org/dc/elements/1.1/"
   xmlns:cc="http://creativecommons.org/ns#"
   xmlns:rdf="http://www.w3.org/1999/02/22-rdf-syntax-ns#"
   xmlns:svg="http://www.w3.org/2000/svg"
   xmlns="http://www.w3.org/2000/svg"
   xmlns:sodipodi="http://sodipodi.sourceforge.net/DTD/sodipodi-0.dtd"
   xmlns:inkscape="http://www.inkscape.org/namespaces/inkscape"
   data-dec="77"
   width="26"
   height="40"
   version="1.1"
   id="svg4"
   sodipodi:docname="77.svg"
   inkscape:version="0.92.4 (unknown)">
  <metadata
     id="metadata10">
    <rdf:RDF>
      <cc:Work
         rdf:about="">
        <dc:format>image/svg+xml</dc:format>
        <dc:type
           rdf:resource="http://purl.org/dc/dcmitype/StillImage" />
      </cc:Work>
    </rdf:RDF>
  </metadata>
  <defs
     id="defs8" />
  <sodipodi:namedview
     pagecolor="#ffffff"
     bordercolor="#666666"
     borderopacity="1"
     objecttolerance="10"
     gridtolerance="10"
     guidetolerance="10"
     inkscape:pageopacity="0"
     inkscape:pageshadow="2"
     inkscape:window-width="640"
     inkscape:window-height="480"
     id="namedview6"
     showgrid="false"
     inkscape:zoom="5.9"
     inkscape:cx="13"
     inkscape:cy="20"
     inkscape:window-x="0"
     inkscape:window-y="27"
     inkscape:window-maximized="0"
     inkscape:current-layer="svg4" />
  <path
     style="color:#000000;font-style:normal;font-variant:normal;font-weight:normal;font-stretch:normal;font-size:medium;line-height:normal;font-family:sans-serif;font-variant-ligatures:normal;font-variant-position:normal;font-variant-caps:normal;font-variant-numeric:normal;font-variant-alternates:normal;font-feature-settings:normal;text-indent:0;text-align:start;text-decoration:none;text-decoration-line:none;text-decoration-style:solid;text-decoration-color:#000000;letter-spacing:normal;word-spacing:normal;text-transform:none;writing-mode:lr-tb;direction:ltr;text-orientation:mixed;dominant-baseline:auto;baseline-shift:baseline;text-anchor:start;white-space:normal;shape-padding:0;clip-rule:nonzero;display:inline;overflow:visible;visibility:visible;opacity:1;isolation:auto;mix-blend-mode:normal;color-interpolation:sRGB;color-interpolation-filters:linearRGB;solid-color:#000000;solid-opacity:1;vector-effect:none;fill:#013272;fill-opacity:1;fill-rule:nonzero;stroke:none;stroke-width:1.5;stroke-linecap:round;stroke-linejoin:round;stroke-miterlimit:4;stroke-dasharray:none;stroke-dashoffset:0;stroke-opacity:1;color-rendering:auto;image-rendering:auto;shape-rendering:auto;text-rendering:auto;enable-background:accumulate"
     d="m 4.96875,0.24023438 a 0.750075,0.750075 0 0 1 0.076172,0.001953 0.750075,0.750075 0 0 1 0.074219,0.007813 0.750075,0.750075 0 0 1 0.00391,0 H 5.875 a 0.750075,0.750075 0 0 1 0.53125,0.11328125 0.750075,0.750075 0 0 1 0.052734,0.0351563 0.750075,0.750075 0 0 1 0.056641,0.0488281 0.750075,0.750075 0 0 1 0.2363281,0.4375 L 12.5,18.130859 18.248047,0.88476562 a 0.750075,0.750075 0 0 1 0.203125,-0.40625 0.750075,0.750075 0 0 1 0.0059,-0.005859 0.750075,0.750075 0 0 1 0.0059,-0.005859 0.750075,0.750075 0 0 1 0.0059,-0.003906 0.750075,0.750075 0 0 1 0.03906,-0.0390625 0.750075,0.750075 0 0 1 0.0059,-0.003906 0.750075,0.750075 0 0 1 0.0059,-0.005859 0.750075,0.750075 0 0 1 0.0039,-0.001953 0.750075,0.750075 0 0 1 0.06055,-0.0449219 0.750075,0.750075 0 0 1 0.275391,-0.11328125 0.750075,0.750075 0 0 1 0.128906,-0.0136719 0.750075,0.750075 0 0 1 0.07617,0.001953 0.750075,0.750075 0 0 1 0.01953,0.001953 0.750075,0.750075 0 0 1 0.02344,0.003906 0.750075,0.750075 0 0 1 0.01367,0.001953 0.750075,0.750075 0 0 1 0.002,0 h 0.753906 a 0.750075,0.750075 0 0 1 0.246094,0 H 23 a 0.750075,0.750075 0 1 1 0,1.5 h -2.25 v 19.5 H 23 a 0.750075,0.750075 0 1 1 0,1.5 h -2.876953 a 0.750075,0.750075 0 0 1 -0.246094,0 h -0.753906 a 0.750075,0.750075 0 0 1 -0.246094,0 H 16 a 0.750075,0.750075 0 1 1 0,-1.5 h 2.25 V 5.6191406 L 12.736328,22.158203 a 0.750075,0.750075 0 0 1 -0.523437,0.570313 0.750075,0.750075 0 0 1 -0.07227,0.01758 0.750075,0.750075 0 0 1 -0.06445,0.0098 0.750075,0.750075 0 0 1 -0.02539,0.002 0.750075,0.750075 0 0 1 -0.03906,0.002 0.750075,0.750075 0 0 1 -0.05664,-0.002 0.750075,0.750075 0 0 1 -0.07422,-0.0078 0.750075,0.750075 0 0 1 -0.07226,-0.01563 0.750075,0.750075 0 0 1 -0.548828,-0.587891 l -0.0039,-0.01367 L 5.75,5.6191406 V 21.25 H 8 a 0.750075,0.750075 0 1 1 0,1.5 H 5.1230469 a 0.750075,0.750075 0 0 1 -0.2460938,0 H 2 a 0.750075,0.750075 0 1 1 0,-1.5 H 4.25 V 1.75 H 2 a 0.750075,0.750075 0 1 1 0,-1.5 h 2.8730469 a 0.750075,0.750075 0 0 1 0.00391,0 0.750075,0.750075 0 0 1 0.091797,-0.009766 z"
     id="path2" />
</svg>
