<?xml version="1.0" encoding="UTF-8" standalone="no"?>
<svg
   xmlns:dc="http://purl.org/dc/elements/1.1/"
   xmlns:cc="http://creativecommons.org/ns#"
   xmlns:rdf="http://www.w3.org/1999/02/22-rdf-syntax-ns#"
   xmlns:svg="http://www.w3.org/2000/svg"
   xmlns="http://www.w3.org/2000/svg"
   xmlns:sodipodi="http://sodipodi.sourceforge.net/DTD/sodipodi-0.dtd"
   xmlns:inkscape="http://www.inkscape.org/namespaces/inkscape"
   data-dec="115"
   width="18"
   height="40"
   version="1.1"
   id="svg4"
   sodipodi:docname="115.svg"
   inkscape:version="0.92.4 (unknown)">
  <metadata
     id="metadata10">
    <rdf:RDF>
      <cc:Work
         rdf:about="">
        <dc:format>image/svg+xml</dc:format>
        <dc:type
           rdf:resource="http://purl.org/dc/dcmitype/StillImage" />
      </cc:Work>
    </rdf:RDF>
  </metadata>
  <defs
     id="defs8" />
  <sodipodi:namedview
     pagecolor="#ffffff"
     bordercolor="#666666"
     borderopacity="1"
     objecttolerance="10"
     gridtolerance="10"
     guidetolerance="10"
     inkscape:pageopacity="0"
     inkscape:pageshadow="2"
     inkscape:window-width="640"
     inkscape:window-height="480"
     id="namedview6"
     showgrid="false"
     inkscape:zoom="5.9"
     inkscape:cx="9"
     inkscape:cy="20"
     inkscape:window-x="0"
     inkscape:window-y="27"
     inkscape:window-maximized="0"
     inkscape:current-layer="svg4" />
  <path
     style="color:#000000;font-style:normal;font-variant:normal;font-weight:normal;font-stretch:normal;font-size:medium;line-height:normal;font-family:sans-serif;font-variant-ligatures:normal;font-variant-position:normal;font-variant-caps:normal;font-variant-numeric:normal;font-variant-alternates:normal;font-feature-settings:normal;text-indent:0;text-align:start;text-decoration:none;text-decoration-line:none;text-decoration-style:solid;text-decoration-color:#000000;letter-spacing:normal;word-spacing:normal;text-transform:none;writing-mode:lr-tb;direction:ltr;text-orientation:mixed;dominant-baseline:auto;baseline-shift:baseline;text-anchor:start;white-space:normal;shape-padding:0;clip-rule:nonzero;display:inline;overflow:visible;visibility:visible;opacity:1;isolation:auto;mix-blend-mode:normal;color-interpolation:sRGB;color-interpolation-filters:linearRGB;solid-color:#000000;solid-opacity:1;vector-effect:none;fill:#000000;fill-opacity:1;fill-rule:nonzero;stroke:none;stroke-width:0.30000001;stroke-linecap:round;stroke-linejoin:round;stroke-miterlimit:4;stroke-dasharray:none;stroke-dashoffset:0;stroke-opacity:1;color-rendering:auto;image-rendering:auto;shape-rendering:auto;text-rendering:auto;enable-background:accumulate"
     d="m 4.9882812,20.488281 0.1308594,0.392578 2.9042969,0.96875 H 9.0742188 L 6.9667969,21.146484 a 0.15001501,0.15001501 0 0 1 -0.013672,-0.0039 0.15001501,0.15001501 0 0 1 -0.00977,-0.0039 l -0.8300782,-0.275391 0.029297,0.08984 a 0.15008591,0.15008591 0 1 1 -0.2851562,0.09375 L 5.7558594,20.744141 Z m 8.1601568,-0.11914 -0.759766,0.189453 -0.253906,0.507812 a 0.15023858,0.15023858 0 1 1 -0.269532,-0.132812 l 0.138672,-0.279297 -1.966797,0.492187 a 0.15001501,0.15001501 0 0 1 -0.074218,0 L 8.6582031,20.820312 7.5820312,21.035156 10,21.841797 12.892578,20.876953 h 0.002 z m -7.304688,-0.314453 0.1503906,0.451171 1.015625,0.339844 0.9726563,-0.195312 -2.0195313,-0.503907 a 0.15001501,0.15001501 0 0 1 -0.068359,-0.04102 z m 6.609375,-0.296876 -0.347656,0.347657 a 0.15001501,0.15001501 0 0 1 -0.07617,0.04102 L 9.3476562,20.683594 10,20.845703 12.181641,20.298828 Z M 3.1503906,18.361328 v 0.603516 l 0.9550782,1.912109 2.9179687,0.972656 h 0.050781 L 4.9726562,21.148438 H 4.96875 a 0.15001501,0.15001501 0 0 1 -0.046875,-0.01953 0.15001501,0.15001501 0 0 1 -0.00781,-0.0059 0.15001501,0.15001501 0 0 1 -0.00391,-0.0039 0.15001501,0.15001501 0 0 1 -0.011719,-0.0098 0.15001501,0.15001501 0 0 1 -0.00781,-0.0059 0.15001501,0.15001501 0 0 1 -0.00195,-0.002 0.15001501,0.15001501 0 0 1 -0.00391,-0.0059 0.15001501,0.15001501 0 0 1 -0.00586,-0.0078 0.15001501,0.15001501 0 0 1 -0.00586,-0.0078 0.15001501,0.15001501 0 0 1 -0.00195,-0.002 0.15001501,0.15001501 0 0 1 -0.00391,-0.0078 0.15001501,0.15001501 0 0 1 -0.00195,-0.0039 l -0.00195,-0.0059 L 4.4941406,20.322266 3.953125,20.142578 a 0.15008581,0.15008581 0 0 1 0.09375,-0.285156 l 0.2578125,0.08594 -0.4277344,-0.855468 z m 1.0585938,-0.210937 0.6601562,1.980468 0.7695313,0.257813 -0.2695313,-0.808594 -0.4746094,-0.474609 a 0.15001501,0.15001501 0 1 1 0.2109376,-0.210938 l 0.052734,0.05273 -0.265625,-0.796875 z m -0.8476563,0 0.7441407,0.74414 a 0.15001501,0.15001501 0 0 1 0.029297,0.03906 l 0.054687,0.109375 -0.296875,-0.892578 z m 8.9746099,-1.816407 0.109374,0.220704 0.621094,0.310546 a 0.15023858,0.15023858 0 1 1 -0.132812,0.269532 l -0.263672,-0.132813 0.464844,0.931641 A 0.15001501,0.15001501 0 0 1 13.150391,18 v 0.984375 a 0.15001501,0.15001501 0 0 1 0,0.02539 0.15001501,0.15001501 0 0 1 0,0.0039 0.15001501,0.15001501 0 0 1 -0.002,0.01172 0.15001501,0.15001501 0 0 1 0,0.002 0.15001501,0.15001501 0 0 1 -0.0039,0.01172 0.15001501,0.15001501 0 0 1 0,0.0039 0.15001501,0.15001501 0 0 1 -0.0039,0.0098 0.15001501,0.15001501 0 0 1 -0.0059,0.01367 0.15001501,0.15001501 0 0 1 -0.0098,0.01758 l -0.558594,1.119141 0.759766,-0.189453 0.523437,-1.048828 v -0.929688 l -0.626953,-1.255859 -0.002,-0.002 z m -6.3339849,-3.664062 0.1074219,0.21289 4.947266,1.978516 a 0.15001501,0.15001501 0 0 1 0.0098,0.0039 l 1.980469,0.990235 a 0.15001501,0.15001501 0 0 1 0.01367,0.0059 l 0.0059,0.0039 a 0.15001501,0.15001501 0 0 1 0.01953,0.01172 0.15001501,0.15001501 0 0 1 0.01172,0.0098 0.15001501,0.15001501 0 0 1 0.0098,0.0098 0.15001501,0.15001501 0 0 1 0.01953,0.02344 0.15001501,0.15001501 0 0 1 0.0078,0.01367 l 0.310546,0.621094 0.621094,0.310546 a 0.15023858,0.15023858 0 1 1 -0.132812,0.269532 l -0.263672,-0.132813 0.464844,0.931641 a 0.15001501,0.15001501 0 0 1 0.01172,0.03711 0.15001501,0.15001501 0 0 1 0.002,0.01367 0.15001501,0.15001501 0 0 1 0.002,0.01563 v 1 a 0.15001501,0.15001501 0 0 1 -0.0059,0.03906 0.15001501,0.15001501 0 0 1 -0.0039,0.01367 0.15001501,0.15001501 0 0 1 -0.0059,0.01367 l -0.425782,0.84961 0.253907,-0.0625 a 0.1511116,0.1511116 0 1 1 0.07422,0.292968 l -0.505859,0.126954 -0.396484,0.792968 a 0.15001501,0.15001501 0 0 1 -0.0059,0.0098 0.15001501,0.15001501 0 0 1 0,0.002 0.15001501,0.15001501 0 0 1 -0.0039,0.0039 0.15001501,0.15001501 0 0 1 -0.01563,0.01953 0.15001501,0.15001501 0 0 1 -0.0098,0.01172 0.15001501,0.15001501 0 0 1 -0.002,0.002 0.15001501,0.15001501 0 0 1 -0.0098,0.0059 0.15001501,0.15001501 0 0 1 -0.0098,0.0078 0.15001501,0.15001501 0 0 1 -0.0039,0.002 0.15001501,0.15001501 0 0 1 -0.02734,0.01172 l -0.01758,0.0059 a 0.15001501,0.15001501 0 0 1 -0.0078,0.002 l -2.095703,0.699218 h 0.05078 l 2.917969,-0.972656 0.955078,-1.912109 V 18.035156 L 13.888672,16.111328 11.939453,15.136719 6.9433594,13.138672 a 0.15001501,0.15001501 0 0 1 -0.00977,-0.0039 z m -1,0 0.109375,0.21875 h 0.00195 l 1.9472657,0.974609 4.9707031,1.988281 h 0.002 a 0.15001501,0.15001501 0 0 1 0.0332,0.01367 0.15001501,0.15001501 0 0 1 0.01367,0.0059 l 0.917969,0.458984 -0.109375,-0.21875 h -0.002 L 10.939453,15.136719 5.96875,13.148438 a 0.15001501,0.15001501 0 0 1 -0.00195,0 0.15001501,0.15001501 0 0 1 -0.033203,-0.01367 0.15001501,0.15001501 0 0 1 -0.013672,-0.0059 z m 8.1484379,-1.308594 v 0.488281 h 0.488281 z m -8.1523441,-0.693359 -0.796875,0.398437 0.5761719,1.154297 0.00195,0.002 0.8847656,0.44336 -0.109375,-0.220704 -0.6210937,-0.310546 a 0.15023867,0.15023867 0 1 1 0.1328124,-0.269532 l 0.2636719,0.132813 -0.4648437,-0.931641 a 0.15001501,0.15001501 0 0 1 0,-0.132812 z m 7.7441411,-0.517578 0.107421,0.214843 v -0.214843 z m 0.408203,-0.5156254 v 0.2148438 h 0.107421 z M 9.9941406,9.15625 9.6210938,9.25 12.017578,9.8496094 h 0.05664 z m -1.9882812,0 -2.2988282,0.765625 -0.037109,0.076172 0.2636719,-0.1328125 a 0.15001501,0.15001501 0 0 1 0.029297,-0.011719 L 8.3789062,9.25 Z m 1.9902344,-1 L 6.1035156,9.1308594 5.8964844,9.5429688 7.953125,8.8574219 a 0.15001501,0.15001501 0 0 1 0.083984,-0.00391 L 9,9.09375 9.9628906,8.8535156 a 0.15001501,0.15001501 0 0 1 0.083984,0.00391 l 2.056641,0.6855469 -0.238282,-0.4765626 a 0.15023867,0.15023867 0 1 1 0.269532,-0.1328124 l 0.371093,0.7441406 0.34375,0.1132812 V 9.1074219 Z m 0.9296872,-0.00586 2.087891,0.6972656 0.01367,0.00195 a 0.15001501,0.15001501 0 0 1 0.0293,0.00977 0.15001501,0.15001501 0 0 1 0.002,0.00195 0.15001501,0.15001501 0 0 1 0.04687,0.03125 0.15001501,0.15001501 0 0 1 0.002,0.00391 0.15001501,0.15001501 0 0 1 0.01953,0.023437 0.15001501,0.15001501 0 0 1 0.0059,0.00781 0.15001501,0.15001501 0 0 1 0.002,0.00586 0.15001501,0.15001501 0 0 1 0.0098,0.021484 L 13.59375,9.8496094 H 14 a 0.1503908,0.1503908 0 0 1 0,0.3007816 h -0.257812 l 0.392578,0.783203 a 0.15023858,0.15023858 0 0 1 -0.269532,0.132812 l -0.457031,-0.916015 h -0.257812 v 0.789062 l 0.910156,0.910156 h 0.789062 V 11.035156 L 13.894531,9.1230469 10.976562,8.1503906 Z m -2.9023435,0 -2.9160156,0.9726563 -0.7714844,1.5410151 0.8847656,-0.443359 0.082031,-0.164062 -0.2558594,0.08594 A 0.15008586,0.15008586 0 1 1 4.953125,9.8574219 L 5.4941406,9.6777344 5.8574219,8.9511719 a 0.15001501,0.15001501 0 0 1 0.00195,-0.00391 0.15001501,0.15001501 0 0 1 0.029297,-0.048828 0.15001501,0.15001501 0 0 1 0.033203,-0.027344 0.15001501,0.15001501 0 0 1 0.013672,-0.00781 0.15001501,0.15001501 0 0 1 0.027344,-0.00977 l 0.015625,-0.00391 2.796875,-0.6992188 z m -1,0 L 4.1054688,9.1230469 3.1679688,11 l 0.9433593,1.888672 1.9492188,0.974609 4.9960941,1.998047 a 0.15001501,0.15001501 0 0 1 0.0098,0.0039 l 0.931641,0.464844 -0.107422,-0.21289 -4.9472656,-1.978516 a 0.15001501,0.15001501 0 0 1 -0.00977,-0.0039 L 4.953125,13.144531 a 0.15001501,0.15001501 0 0 1 -0.019531,-0.0098 0.15001501,0.15001501 0 0 1 -0.019531,-0.01172 0.15001501,0.15001501 0 0 1 -0.011719,-0.0098 0.15001501,0.15001501 0 0 1 -0.00977,-0.0098 0.15001501,0.15001501 0 0 1 -0.019531,-0.02344 0.15001501,0.15001501 0 0 1 -0.00781,-0.01367 L 4.5546875,12.445312 3.9335938,12.134766 a 0.15023867,0.15023867 0 0 1 0.1328124,-0.269532 l 0.2636719,0.132813 -0.4492187,-0.902344 a 0.15001501,0.15001501 0 0 1 -0.00781,-0.01367 0.15001501,0.15001501 0 0 1 -0.00977,-0.01953 0.15001501,0.15001501 0 0 1 -0.013672,-0.07227 0.15001501,0.15001501 0 0 1 0,-0.0078 0.15001501,0.15001501 0 0 1 0.00195,-0.0078 0.15001501,0.15001501 0 0 1 0.00781,-0.02734 0.15001501,0.15001501 0 0 1 0.00195,-0.0078 0.15001501,0.15001501 0 0 1 0.00391,-0.0059 0.15001501,0.15001501 0 0 1 0.00586,-0.01367 L 4.8652344,8.9335938 a 0.15001501,0.15001501 0 0 1 0.00586,-0.00977 0.15001501,0.15001501 0 0 1 0,-0.00195 0.15001501,0.15001501 0 0 1 0.00391,-0.00391 0.15001501,0.15001501 0 0 1 0.015625,-0.019531 0.15001501,0.15001501 0 0 1 0.00781,-0.00977 0.15001501,0.15001501 0 0 1 0.00391,-0.00391 0.15001501,0.15001501 0 0 1 0.023437,-0.015625 0.15001501,0.15001501 0 0 1 0.027344,-0.011719 0.15001501,0.15001501 0 0 1 0.017578,-0.00586 l 0.00781,-0.00195 2.0957032,-0.6992188 z M 6.984375,7.8496094 a 0.15001501,0.15001501 0 0 1 0.015625,0 H 8 9.9882812 10 h 0.0039 0.01563 H 11 a 0.15001501,0.15001501 0 0 1 0.04687,0.00781 l 3,1 a 0.15001501,0.15001501 0 0 1 0.08789,0.076172 l 1,2.0000002 A 0.15001501,0.15001501 0 0 1 15.150391,11 v 1 A 0.15001501,0.15001501 0 0 1 15,12.150391 h -0.984375 a 0.15001501,0.15001501 0 0 1 -0.0293,0 H 13 A 0.15001501,0.15001501 0 0 1 12.849609,12 V 11.035156 L 12.40625,10.150391 H 12 a 0.15001501,0.15001501 0 0 1 -0.03711,-0.0039 L 8.9980469,9.4042969 6.0527344,10.140625 5.4453125,10.445312 5.1679688,11 l 0.6113281,1.222656 1.28125,0.640625 4.9960941,1.998047 a 0.15001501,0.15001501 0 0 1 0.0098,0.0039 l 2,1 a 0.15001501,0.15001501 0 0 1 0.06836,0.06836 l 1,2 A 0.15001501,0.15001501 0 0 1 15.150391,18 v 1 a 0.15001501,0.15001501 0 0 1 -0.01563,0.06641 l -1,2 a 0.15001501,0.15001501 0 0 1 -0.08789,0.07617 l -3,1 A 0.15001501,0.15001501 0 0 1 11,22.150391 H 10.011719 10 h -0.00391 -2 H 7 a 0.15001501,0.15001501 0 0 1 -0.046875,-0.0078 l -3,-1 a 0.15001501,0.15001501 0 0 1 -0.087891,-0.07617 l -1,-2 A 0.15001501,0.15001501 0 0 1 2.8496094,19 v -0.982422 a 0.15001501,0.15001501 0 0 1 0.023437,-0.09766 0.15001501,0.15001501 0 0 1 0,-0.002 0.15001501,0.15001501 0 0 1 0.017578,-0.02148 0.15001501,0.15001501 0 0 1 0.00195,-0.002 0.15001501,0.15001501 0 0 1 0.00977,-0.0078 0.15001501,0.15001501 0 0 1 0.023437,-0.01758 0.15001501,0.15001501 0 0 1 0.00195,-0.002 0.15001501,0.15001501 0 0 1 0.011719,-0.0039 0.15001501,0.15001501 0 0 1 0.00195,-0.002 0.15001501,0.15001501 0 0 1 0.011719,-0.0039 0.15001501,0.15001501 0 0 1 0.013672,-0.0039 0.15001501,0.15001501 0 0 1 0.00391,0 0.15001501,0.15001501 0 0 1 0.00195,0 0.15001501,0.15001501 0 0 1 0.025391,-0.0039 0.15001501,0.15001501 0 0 1 0.00195,0 0.15001501,0.15001501 0 0 1 0.013672,0 h 0.9648437 a 0.15001501,0.15001501 0 0 1 0.044922,0 H 5 a 0.15001501,0.15001501 0 0 1 0.1425781,0.103516 l 0.4902344,1.46875 0.4433594,0.443359 2.59375,0.648438 3.2558591,-0.652344 0.923828,-0.921875 v -0.904297 l -0.628906,-1.257812 -1.28125,-0.640625 -4.9960936,-1.998047 a 0.15001501,0.15001501 0 0 1 -0.00977,-0.0039 l -2,-1 a 0.15001501,0.15001501 0 0 1 -0.068359,-0.06836 l -1,-2 a 0.15001501,0.15001501 0 0 1 0,-0.132812 l 1,-2.0000002 a 0.15001501,0.15001501 0 0 1 0.087891,-0.076172 l 3,-1 a 0.15001501,0.15001501 0 0 1 0.03125,-0.00781 z"
     id="path2" />
</svg>
