<?xml version="1.0" encoding="UTF-8"?>
<glyph name="Ocircumflex" format="1">
  <advance width="694"/>
  <unicode hex="00D4"/>
  <outline>
    <component base="asciicircum" xOffset="29" yOffset="283"/>
    <component base="O"/>
  </outline>
  <lib>
    <dict>
      <key>com.fontlab.hintData</key>
      <dict>
        <key>hhints</key>
        <array>
          <dict>
            <key>position</key>
            <integer>0</integer>
            <key>width</key>
            <integer>44</integer>
          </dict>
          <dict>
            <key>position</key>
            <integer>608</integer>
            <key>width</key>
            <integer>43</integer>
          </dict>
          <dict>
            <key>position</key>
            <integer>710</integer>
            <key>width</key>
            <integer>217</integer>
          </dict>
        </array>
        <key>vhints</key>
        <array>
          <dict>
            <key>position</key>
            <integer>36</integer>
            <key>width</key>
            <integer>73</integer>
          </dict>
          <dict>
            <key>position</key>
            <integer>586</integer>
            <key>width</key>
            <integer>73</integer>
          </dict>
        </array>
      </dict>
    </dict>
  </lib>
</glyph>
