<?xml version="1.0" encoding="UTF-8" standalone="no"?>
<svg
   xmlns:dc="http://purl.org/dc/elements/1.1/"
   xmlns:cc="http://creativecommons.org/ns#"
   xmlns:rdf="http://www.w3.org/1999/02/22-rdf-syntax-ns#"
   xmlns:svg="http://www.w3.org/2000/svg"
   xmlns="http://www.w3.org/2000/svg"
   xmlns:sodipodi="http://sodipodi.sourceforge.net/DTD/sodipodi-0.dtd"
   xmlns:inkscape="http://www.inkscape.org/namespaces/inkscape"
   data-dec="120"
   width="20"
   height="40"
   version="1.1"
   id="svg4"
   sodipodi:docname="120.svg"
   inkscape:version="0.92.4 (unknown)">
  <metadata
     id="metadata10">
    <rdf:RDF>
      <cc:Work
         rdf:about="">
        <dc:format>image/svg+xml</dc:format>
        <dc:type
           rdf:resource="http://purl.org/dc/dcmitype/StillImage" />
      </cc:Work>
    </rdf:RDF>
  </metadata>
  <defs
     id="defs8" />
  <sodipodi:namedview
     pagecolor="#ffffff"
     bordercolor="#666666"
     borderopacity="1"
     objecttolerance="10"
     gridtolerance="10"
     guidetolerance="10"
     inkscape:pageopacity="0"
     inkscape:pageshadow="2"
     inkscape:window-width="615"
     inkscape:window-height="417"
     id="namedview6"
     showgrid="false"
     inkscape:zoom="5.9"
     inkscape:cx="10"
     inkscape:cy="20"
     inkscape:window-x="0"
     inkscape:window-y="27"
     inkscape:window-maximized="0"
     inkscape:current-layer="svg4" />
  <path
     style="color:#000000;font-style:normal;font-variant:normal;font-weight:normal;font-stretch:normal;font-size:medium;line-height:normal;font-family:sans-serif;font-variant-ligatures:normal;font-variant-position:normal;font-variant-caps:normal;font-variant-numeric:normal;font-variant-alternates:normal;font-feature-settings:normal;text-indent:0;text-align:start;text-decoration:none;text-decoration-line:none;text-decoration-style:solid;text-decoration-color:#000000;letter-spacing:normal;word-spacing:normal;text-transform:none;writing-mode:lr-tb;direction:ltr;text-orientation:mixed;dominant-baseline:auto;baseline-shift:baseline;text-anchor:start;white-space:normal;shape-padding:0;clip-rule:nonzero;display:inline;overflow:visible;visibility:visible;opacity:1;isolation:auto;mix-blend-mode:normal;color-interpolation:sRGB;color-interpolation-filters:linearRGB;solid-color:#000000;solid-opacity:1;vector-effect:none;fill:#013272;fill-opacity:1;fill-rule:nonzero;stroke:none;stroke-width:0.5;stroke-linecap:round;stroke-linejoin:round;stroke-miterlimit:4;stroke-dasharray:none;stroke-dashoffset:0;stroke-opacity:1;color-rendering:auto;image-rendering:auto;shape-rendering:auto;text-rendering:auto;enable-background:accumulate"
     d="M 10.251953,15.089844 10.0625,15.310547 15.121094,21.75 h 0.363281 z M 4.515625,8.25 9.7480469,14.910156 9.9375,14.689453 4.8789062,8.25 Z M 3.9785156,7.7480469 A 0.250025,0.250025 0 0 1 4.0351562,7.75 h 0.9296876 a 0.250025,0.250025 0 0 1 0.070312,0 H 8 a 0.250025,0.250025 0 1 1 0,0.5 H 5.515625 L 10.269531,14.302734 15.457031,8.25 H 12 a 0.250025,0.250025 0 1 1 0,-0.5 h 3.964844 a 0.250025,0.250025 0 0 1 0.07422,0 H 18 a 0.250025,0.250025 0 1 1 0,0.5 H 16.113281 L 10.583984,14.701172 16.121094,21.75 H 18 a 0.250025,0.250025 0 1 1 0,0.5 h -1.964844 a 0.250025,0.250025 0 0 1 -0.07031,0 h -0.929688 a 0.250025,0.250025 0 0 1 -0.07031,0 H 12 a 0.250025,0.250025 0 1 1 0,-0.5 h 2.484375 L 9.7304688,15.697266 4.5429688,21.75 H 8 a 0.250025,0.250025 0 1 1 0,0.5 H 4.0351562 a 0.250025,0.250025 0 0 1 -0.074219,0 H 2 a 0.250025,0.250025 0 1 1 0,-0.5 H 3.8867188 L 9.4160156,15.298828 3.8789062,8.25 H 2 a 0.250025,0.250025 0 1 1 0,-0.5 h 1.9648438 a 0.250025,0.250025 0 0 1 0.013672,-0.00195 z"
     id="path2" />
</svg>
