<?xml version="1.0" encoding="UTF-8" standalone="no"?>
<svg
   xmlns:dc="http://purl.org/dc/elements/1.1/"
   xmlns:cc="http://creativecommons.org/ns#"
   xmlns:rdf="http://www.w3.org/1999/02/22-rdf-syntax-ns#"
   xmlns:svg="http://www.w3.org/2000/svg"
   xmlns="http://www.w3.org/2000/svg"
   xmlns:sodipodi="http://sodipodi.sourceforge.net/DTD/sodipodi-0.dtd"
   xmlns:inkscape="http://www.inkscape.org/namespaces/inkscape"
   data-dec="187"
   width="14"
   height="40"
   version="1.1"
   id="svg4"
   sodipodi:docname="187.svg"
   inkscape:version="0.92.4 (unknown)">
  <metadata
     id="metadata10">
    <rdf:RDF>
      <cc:Work
         rdf:about="">
        <dc:format>image/svg+xml</dc:format>
        <dc:type
           rdf:resource="http://purl.org/dc/dcmitype/StillImage" />
      </cc:Work>
    </rdf:RDF>
  </metadata>
  <defs
     id="defs8" />
  <sodipodi:namedview
     pagecolor="#ffffff"
     bordercolor="#666666"
     borderopacity="1"
     objecttolerance="10"
     gridtolerance="10"
     guidetolerance="10"
     inkscape:pageopacity="0"
     inkscape:pageshadow="2"
     inkscape:window-width="640"
     inkscape:window-height="480"
     id="namedview6"
     showgrid="false"
     inkscape:zoom="5.9"
     inkscape:cx="7"
     inkscape:cy="20"
     inkscape:window-x="0"
     inkscape:window-y="27"
     inkscape:window-maximized="0"
     inkscape:current-layer="svg4" />
  <path
     style="color:#000000;font-style:normal;font-variant:normal;font-weight:normal;font-stretch:normal;font-size:medium;line-height:normal;font-family:sans-serif;font-variant-ligatures:normal;font-variant-position:normal;font-variant-caps:normal;font-variant-numeric:normal;font-variant-alternates:normal;font-feature-settings:normal;text-indent:0;text-align:start;text-decoration:none;text-decoration-line:none;text-decoration-style:solid;text-decoration-color:#000000;letter-spacing:normal;word-spacing:normal;text-transform:none;writing-mode:lr-tb;direction:ltr;text-orientation:mixed;dominant-baseline:auto;baseline-shift:baseline;text-anchor:start;white-space:normal;shape-padding:0;clip-rule:nonzero;display:inline;overflow:visible;visibility:visible;opacity:1;isolation:auto;mix-blend-mode:normal;color-interpolation:sRGB;color-interpolation-filters:linearRGB;solid-color:#000000;solid-opacity:1;vector-effect:none;fill:#013272;fill-opacity:1;fill-rule:nonzero;stroke:none;stroke-width:2.5;stroke-linecap:round;stroke-linejoin:round;stroke-miterlimit:4;stroke-dasharray:none;stroke-dashoffset:0;stroke-opacity:1;color-rendering:auto;image-rendering:auto;shape-rendering:auto;text-rendering:auto;enable-background:accumulate"
     d="m 6.9765625,6.7363281 a 1.250125,1.250125 0 0 1 0.1347656,0.00781 1.250125,1.250125 0 0 1 0.1132813,0.015625 1.250125,1.250125 0 0 1 0.00977,0.00195 1.250125,1.250125 0 0 1 0.025391,0.00586 1.250125,1.250125 0 0 1 0.095703,0.025391 1.250125,1.250125 0 0 1 0.1191406,0.042969 1.250125,1.250125 0 0 1 0.21875,0.1191406 1.250125,1.250125 0 0 1 0.1835937,0.1523438 1.250125,1.250125 0 0 1 0.00781,0.00781 l 6.0000004,5.9999996 a 1.250125,1.250125 0 0 1 0,1.769532 l -5.9824222,5.980468 -0.017578,0.01953 a 1.250125,1.250125 0 0 1 -0.060547,0.05664 1.250125,1.250125 0 0 1 -0.00391,0.0039 1.250125,1.250125 0 0 1 -0.00781,0.0078 1.250125,1.250125 0 0 1 -0.087891,0.07031 1.250125,1.250125 0 0 1 -0.00977,0.0078 1.250125,1.250125 0 0 1 -0.095703,0.06055 1.250125,1.250125 0 0 1 -0.00977,0.0059 1.250125,1.250125 0 0 1 -0.1015625,0.05078 1.250125,1.250125 0 0 1 -0.1152344,0.04687 1.250125,1.250125 0 0 1 -0.00977,0.0039 1.250125,1.250125 0 0 1 -0.1113281,0.03125 1.250125,1.250125 0 0 1 -0.1230469,0.02148 1.250125,1.250125 0 0 1 -0.1230469,0.0098 1.250125,1.250125 0 0 1 -0.125,-0.002 1.250125,1.250125 0 0 1 -0.2460937,-0.04297 1.250125,1.250125 0 0 1 -0.00977,-0.002 1.250125,1.250125 0 0 1 -0.076172,-0.02539 1.250125,1.250125 0 0 1 -0.039063,-0.01367 1.250125,1.250125 0 0 1 -0.1074219,-0.04883 1.250125,1.250125 0 0 1 -0.068359,-0.03906 1.250125,1.250125 0 0 1 -0.048828,-0.0293 1.250125,1.250125 0 0 1 -0.09375,-0.06641 1.250125,1.250125 0 0 1 -0.00195,-0.002 1.250125,1.250125 0 0 1 -0.052734,-0.04492 1.250125,1.250125 0 0 1 -0.042969,-0.04102 1.250125,1.250125 0 0 1 -0.025391,-0.02539 1.250125,1.250125 0 0 1 -0.0625,-0.06836 1.250125,1.250125 0 0 1 -0.074219,-0.09961 A 1.250125,1.250125 0 0 1 5.8867188,20.603516 1.250125,1.250125 0 0 1 5.8359375,20.5 a 1.250125,1.250125 0 0 1 -0.00195,-0.0078 1.250125,1.250125 0 0 1 -0.00977,-0.02148 1.250125,1.250125 0 0 1 -0.033203,-0.09766 1.250125,1.250125 0 0 1 -0.046875,-0.246094 1.250125,1.250125 0 0 1 -0.00586,-0.113281 1.250125,1.250125 0 0 1 0,-0.0059 1.250125,1.250125 0 0 1 0.00195,-0.04102 1.250125,1.250125 0 0 1 0.00586,-0.08984 1.250125,1.250125 0 0 1 0.019531,-0.123047 1.250125,1.250125 0 0 1 0.027344,-0.109375 1.250125,1.250125 0 0 1 0.00391,-0.0078 1.250125,1.250125 0 0 1 0.00586,-0.01758 1.250125,1.250125 0 0 1 0.039063,-0.103516 1.250125,1.250125 0 0 1 0.048828,-0.101563 1.250125,1.250125 0 0 1 0.00586,-0.0098 1.250125,1.250125 0 0 1 0.1425781,-0.205078 l 0.00586,-0.0078 L 10.373047,14 6.0605469,8.8261719 A 1.250125,1.250125 0 0 1 6.0390625,8.8007812 1.250125,1.250125 0 0 1 5.984375,8.7324219 1.250125,1.250125 0 0 1 5.9160156,8.6289062 1.250125,1.250125 0 0 1 5.8574219,8.5175781 1.250125,1.250125 0 0 1 5.7734375,8.2832031 1.250125,1.250125 0 0 1 5.7519531,8.1660156 1.250125,1.250125 0 0 1 5.75,8.1601562 a 1.250125,1.250125 0 0 1 -0.00195,-0.011719 1.250125,1.250125 0 0 1 -0.00781,-0.2382813 1.250125,1.250125 0 0 1 0,-0.00977 1.250125,1.250125 0 0 1 0.00781,-0.068359 1.250125,1.250125 0 0 1 0.00781,-0.054687 1.250125,1.250125 0 0 1 0.025391,-0.1132813 1.250125,1.250125 0 0 1 0.00195,-0.00977 1.250125,1.250125 0 0 1 0.021484,-0.066406 1.250125,1.250125 0 0 1 0.015625,-0.048828 1.250125,1.250125 0 0 1 0.025391,-0.056641 1.250125,1.250125 0 0 1 0.025391,-0.056641 1.250125,1.250125 0 0 1 0.039062,-0.068359 1.250125,1.250125 0 0 1 0.021484,-0.037109 1.250125,1.250125 0 0 1 0.054687,-0.080078 1.250125,1.250125 0 0 1 0.017578,-0.023437 1.250125,1.250125 0 0 1 0.080078,-0.091797 1.250125,1.250125 0 0 1 0.089844,-0.085937 1.250125,1.250125 0 0 1 0.00781,-0.00781 1.250125,1.250125 0 0 1 0.085937,-0.066406 1.250125,1.250125 0 0 1 0.00586,-0.00391 1.250125,1.250125 0 0 1 0.00781,-0.00586 1.250125,1.250125 0 0 1 0.1054688,-0.064453 1.250125,1.250125 0 0 1 0.00781,-0.00391 1.250125,1.250125 0 0 1 0.1152344,-0.054688 1.250125,1.250125 0 0 1 0.1074219,-0.039062 1.250125,1.250125 0 0 1 0.1113281,-0.029297 1.250125,1.250125 0 0 1 0.035156,-0.00586 1.250125,1.250125 0 0 1 0.097656,-0.013672 1.250125,1.250125 0 0 1 0.1152344,-0.00781 z m -6,0 a 1.250125,1.250125 0 0 1 0.1347656,0.00781 1.250125,1.250125 0 0 1 0.1132813,0.015625 1.250125,1.250125 0 0 1 0.00977,0.00195 1.250125,1.250125 0 0 1 0.025391,0.00586 1.250125,1.250125 0 0 1 0.095703,0.025391 1.250125,1.250125 0 0 1 0.1191406,0.042969 1.250125,1.250125 0 0 1 0.21875,0.1191406 1.250125,1.250125 0 0 1 0.1835937,0.1523438 1.250125,1.250125 0 0 1 0.00781,0.00781 l 6,5.9999996 a 1.250125,1.250125 0 0 1 0,1.769532 l -5.9824218,5.980468 -0.017578,0.01953 a 1.250125,1.250125 0 0 1 -0.060547,0.05664 1.250125,1.250125 0 0 1 -0.00391,0.0039 1.250125,1.250125 0 0 1 -0.00781,0.0078 1.250125,1.250125 0 0 1 -0.087891,0.07031 1.250125,1.250125 0 0 1 -0.00977,0.0078 1.250125,1.250125 0 0 1 -0.095703,0.06055 1.250125,1.250125 0 0 1 -0.00977,0.0059 1.250125,1.250125 0 0 1 -0.1015625,0.05078 1.250125,1.250125 0 0 1 -0.1152344,0.04687 1.250125,1.250125 0 0 1 -0.00977,0.0039 1.250125,1.250125 0 0 1 -0.1113281,0.03125 1.250125,1.250125 0 0 1 -0.1230469,0.02148 1.250125,1.250125 0 0 1 -0.1230469,0.0098 1.250125,1.250125 0 0 1 -0.12499998,-0.002 1.250125,1.250125 0 0 1 -0.24609374,-0.04297 1.250125,1.250125 0 0 1 -0.009766,-0.002 1.250125,1.250125 0 0 1 -0.0761719,-0.02539 1.250125,1.250125 0 0 1 -0.0390625,-0.01367 1.250125,1.250125 0 0 1 -0.10742188,-0.04883 1.250125,1.250125 0 0 1 -0.0683594,-0.03906 1.250125,1.250125 0 0 1 -0.0488281,-0.0293 1.250125,1.250125 0 0 1 -0.09375,-0.06641 1.250125,1.250125 0 0 1 -0.001953,-0.002 A 1.250125,1.250125 0 0 1 0.15625,20.945312 1.250125,1.250125 0 0 1 0.11328125,20.904297 1.250125,1.250125 0 0 1 0.08789062,20.878906 1.250125,1.250125 0 0 1 0.02539063,20.810547 1.250125,1.250125 0 0 1 -0.04882812,20.710938 1.250125,1.250125 0 0 1 -0.11328125,20.603516 1.250125,1.250125 0 0 1 -0.1640625,20.5 a 1.250125,1.250125 0 0 1 -0.001953,-0.0078 1.250125,1.250125 0 0 1 -0.009766,-0.02148 1.250125,1.250125 0 0 1 -0.0332031,-0.09766 1.250125,1.250125 0 0 1 -0.046875,-0.246094 1.250125,1.250125 0 0 1 -0.005859,-0.113281 1.250125,1.250125 0 0 1 0,-0.0059 1.250125,1.250125 0 0 1 0.001953,-0.04102 1.250125,1.250125 0 0 1 0.005859,-0.08984 1.250125,1.250125 0 0 1 0.0195313,-0.123047 1.250125,1.250125 0 0 1 0.0273438,-0.109375 1.250125,1.250125 0 0 1 0.003906,-0.0078 1.250125,1.250125 0 0 1 0.005859,-0.01758 1.250125,1.250125 0 0 1 0.0390625,-0.103516 1.250125,1.250125 0 0 1 0.0488281,-0.101563 1.250125,1.250125 0 0 1 0.005859,-0.0098 1.250125,1.250125 0 0 1 0.14257812,-0.205078 l 0.0058594,-0.0078 L 4.3730469,14 0.06054687,8.8261719 A 1.250125,1.250125 0 0 1 0.0390625,8.8007812 1.250125,1.250125 0 0 1 -0.015625,8.7324219 1.250125,1.250125 0 0 1 -0.08398437,8.6289062 1.250125,1.250125 0 0 1 -0.14257812,8.5175781 1.250125,1.250125 0 0 1 -0.2265625,8.2832031 1.250125,1.250125 0 0 1 -0.24804688,8.1660156 1.250125,1.250125 0 0 1 -0.25,8.1601562 a 1.250125,1.250125 0 0 1 -0.001953,-0.011719 1.250125,1.250125 0 0 1 -0.007813,-0.2382813 1.250125,1.250125 0 0 1 0,-0.00977 1.250125,1.250125 0 0 1 0.007813,-0.068359 1.250125,1.250125 0 0 1 0.007812,-0.054687 1.250125,1.250125 0 0 1 0.0253906,-0.1132813 1.250125,1.250125 0 0 1 0.001953,-0.00977 1.250125,1.250125 0 0 1 0.0214844,-0.066406 1.250125,1.250125 0 0 1 0.015625,-0.048828 1.250125,1.250125 0 0 1 0.0253906,-0.056641 1.250125,1.250125 0 0 1 0.0253906,-0.056641 1.250125,1.250125 0 0 1 0.0390625,-0.068359 1.250125,1.250125 0 0 1 0.02148438,-0.037109 1.250125,1.250125 0 0 1 0.05468749,-0.080078 1.250125,1.250125 0 0 1 0.01757813,-0.023437 1.250125,1.250125 0 0 1 0.08007812,-0.091797 1.250125,1.250125 0 0 1 0.08984375,-0.085937 1.250125,1.250125 0 0 1 0.007813,-0.00781 1.250125,1.250125 0 0 1 0.0859375,-0.066406 1.250125,1.250125 0 0 1 0.005859,-0.00391 1.250125,1.250125 0 0 1 0.0585938,-0.037109 1.250125,1.250125 0 0 1 0.0546875,-0.033203 1.250125,1.250125 0 0 1 0.007813,-0.00391 A 1.250125,1.250125 0 0 1 0.5,6.8359375 a 1.250125,1.250125 0 0 1 0.009766,-0.00391 1.250125,1.250125 0 0 1 0.10742188,-0.039062 1.250125,1.250125 0 0 1 0.12109375,-0.03125 1.250125,1.250125 0 0 1 0.0253906,-0.00391 1.250125,1.250125 0 0 1 0.0976562,-0.013672 1.250125,1.250125 0 0 1 0.11523438,-0.00781 z"
     id="path2" />
</svg>
