<?xml version="1.0" encoding="UTF-8" standalone="no"?>
<svg
   xmlns:dc="http://purl.org/dc/elements/1.1/"
   xmlns:cc="http://creativecommons.org/ns#"
   xmlns:rdf="http://www.w3.org/1999/02/22-rdf-syntax-ns#"
   xmlns:svg="http://www.w3.org/2000/svg"
   xmlns="http://www.w3.org/2000/svg"
   xmlns:sodipodi="http://sodipodi.sourceforge.net/DTD/sodipodi-0.dtd"
   xmlns:inkscape="http://www.inkscape.org/namespaces/inkscape"
   data-dec="67"
   width="20"
   height="40"
   version="1.1"
   id="svg4"
   sodipodi:docname="67.svg"
   inkscape:version="0.92.4 (unknown)">
  <metadata
     id="metadata10">
    <rdf:RDF>
      <cc:Work
         rdf:about="">
        <dc:format>image/svg+xml</dc:format>
        <dc:type
           rdf:resource="http://purl.org/dc/dcmitype/StillImage" />
      </cc:Work>
    </rdf:RDF>
  </metadata>
  <defs
     id="defs8" />
  <sodipodi:namedview
     pagecolor="#ffffff"
     bordercolor="#666666"
     borderopacity="1"
     objecttolerance="10"
     gridtolerance="10"
     guidetolerance="10"
     inkscape:pageopacity="0"
     inkscape:pageshadow="2"
     inkscape:window-width="640"
     inkscape:window-height="480"
     id="namedview6"
     showgrid="false"
     inkscape:zoom="5.9"
     inkscape:cx="10"
     inkscape:cy="20"
     inkscape:window-x="0"
     inkscape:window-y="27"
     inkscape:window-maximized="0"
     inkscape:current-layer="svg4" />
  <path
     style="color:#000000;font-style:normal;font-variant:normal;font-weight:normal;font-stretch:normal;font-size:medium;line-height:normal;font-family:sans-serif;font-variant-ligatures:normal;font-variant-position:normal;font-variant-caps:normal;font-variant-numeric:normal;font-variant-alternates:normal;font-feature-settings:normal;text-indent:0;text-align:start;text-decoration:none;text-decoration-line:none;text-decoration-style:solid;text-decoration-color:#000000;letter-spacing:normal;word-spacing:normal;text-transform:none;writing-mode:lr-tb;direction:ltr;text-orientation:mixed;dominant-baseline:auto;baseline-shift:baseline;text-anchor:start;white-space:normal;shape-padding:0;clip-rule:nonzero;display:inline;overflow:visible;visibility:visible;opacity:1;isolation:auto;mix-blend-mode:normal;color-interpolation:sRGB;color-interpolation-filters:linearRGB;solid-color:#000000;solid-opacity:1;vector-effect:none;fill:#013272;fill-opacity:1;fill-rule:nonzero;stroke:none;stroke-width:3;stroke-linecap:round;stroke-linejoin:round;stroke-miterlimit:4;stroke-dasharray:none;stroke-dashoffset:0;stroke-opacity:1;color-rendering:auto;image-rendering:auto;shape-rendering:auto;text-rendering:auto;enable-background:accumulate"
     d="M 17.976562,-0.52148438 A 1.50015,1.50015 0 0 1 19.5,1 v 6 a 1.50015,1.50015 0 0 1 -2.923828,0.4746094 l -0.886719,-2.6640625 -1.5,-1.5 L 11.755859,2.5 h -1.511718 l -2.4335941,0.8105469 -1.578125,1.578125 -0.84375,1.6875 L 4.5,9.2441406 v 4.5117184 l 0.8886719,2.667969 0.84375,1.6875 1.578125,1.578125 L 10.244141,20.5 h 1.511718 l 2.433594,-0.810547 1.578125,-1.578125 0.890625,-1.78125 a 1.50015,1.50015 0 1 1 2.683594,1.339844 l -1,2 a 1.50015,1.50015 0 0 1 -0.28125,0.390625 l -2,2 a 1.50015,1.50015 0 0 1 -0.585938,0.363281 l -3,1 A 1.50015,1.50015 0 0 1 12,23.5 h -2 a 1.50015,1.50015 0 0 1 -0.4746094,-0.07617 l -3,-1 A 1.50015,1.50015 0 0 1 5.9394531,22.060547 l -2,-2 a 1.50015,1.50015 0 0 1 -0.28125,-0.390625 l -1,-2 a 1.50015,1.50015 0 0 1 -0.082031,-0.195313 l -1,-3 A 1.50015,1.50015 0 0 1 1.5,14 V 9 a 1.50015,1.50015 0 0 1 0.076172,-0.4746094 l 1,-3 a 1.50015,1.50015 0 0 1 0.082031,-0.1953125 l 1,-2 a 1.50015,1.50015 0 0 1 0.28125,-0.390625 l 2,-1.99999998 A 1.50015,1.50015 0 0 1 6.5253906,0.57617188 l 3,-1 A 1.50015,1.50015 0 0 1 10,-0.5 h 2 a 1.50015,1.50015 0 0 1 0.474609,0.0761719 l 3,1 a 1.50015,1.50015 0 0 1 0.585938,0.36328124 L 16.5,1.3789062 V 1 a 1.50015,1.50015 0 0 1 1.476562,-1.52148438 z"
     id="path2" />
</svg>
