<?xml version="1.0" encoding="UTF-8" standalone="no"?>
<svg
   xmlns:dc="http://purl.org/dc/elements/1.1/"
   xmlns:cc="http://creativecommons.org/ns#"
   xmlns:rdf="http://www.w3.org/1999/02/22-rdf-syntax-ns#"
   xmlns:svg="http://www.w3.org/2000/svg"
   xmlns="http://www.w3.org/2000/svg"
   xmlns:sodipodi="http://sodipodi.sourceforge.net/DTD/sodipodi-0.dtd"
   xmlns:inkscape="http://www.inkscape.org/namespaces/inkscape"
   data-dec="8221"
   width="14"
   height="40"
   version="1.1"
   id="svg4"
   sodipodi:docname="8221.svg"
   inkscape:version="0.92.4 (unknown)">
  <metadata
     id="metadata10">
    <rdf:RDF>
      <cc:Work
         rdf:about="">
        <dc:format>image/svg+xml</dc:format>
        <dc:type
           rdf:resource="http://purl.org/dc/dcmitype/StillImage" />
      </cc:Work>
    </rdf:RDF>
  </metadata>
  <defs
     id="defs8" />
  <sodipodi:namedview
     pagecolor="#ffffff"
     bordercolor="#666666"
     borderopacity="1"
     objecttolerance="10"
     gridtolerance="10"
     guidetolerance="10"
     inkscape:pageopacity="0"
     inkscape:pageshadow="2"
     inkscape:window-width="640"
     inkscape:window-height="480"
     id="namedview6"
     showgrid="false"
     inkscape:zoom="5.9"
     inkscape:cx="7"
     inkscape:cy="20"
     inkscape:window-x="0"
     inkscape:window-y="27"
     inkscape:window-maximized="0"
     inkscape:current-layer="svg4" />
  <path
     style="color:#000000;font-style:normal;font-variant:normal;font-weight:normal;font-stretch:normal;font-size:medium;line-height:normal;font-family:sans-serif;font-variant-ligatures:normal;font-variant-position:normal;font-variant-caps:normal;font-variant-numeric:normal;font-variant-alternates:normal;font-feature-settings:normal;text-indent:0;text-align:start;text-decoration:none;text-decoration-line:none;text-decoration-style:solid;text-decoration-color:#000000;letter-spacing:normal;word-spacing:normal;text-transform:none;writing-mode:lr-tb;direction:ltr;text-orientation:mixed;dominant-baseline:auto;baseline-shift:baseline;text-anchor:start;white-space:normal;shape-padding:0;clip-rule:nonzero;display:inline;overflow:visible;visibility:visible;opacity:1;isolation:auto;mix-blend-mode:normal;color-interpolation:sRGB;color-interpolation-filters:linearRGB;solid-color:#000000;solid-opacity:1;vector-effect:none;fill:#013272;fill-opacity:1;fill-rule:nonzero;stroke:none;stroke-width:0.5;stroke-linecap:round;stroke-linejoin:round;stroke-miterlimit:4;stroke-dasharray:none;stroke-dashoffset:0;stroke-opacity:1;color-rendering:auto;image-rendering:auto;shape-rendering:auto;text-rendering:auto;enable-background:accumulate"
     d="M 10,3.3554688 9.3554688,4 10,4.6445312 10.644531,4 Z m -6,0 L 3.3554688,4 4,4.6445312 4.6445312,4 Z M 9.9960938,2.75 a 0.250025,0.250025 0 0 1 0.1816402,0.072266 l 0.97461,0.9746094 a 0.250025,0.250025 0 0 1 0.02344,0.021484 l 0.002,0.00391 A 0.250025,0.250025 0 0 1 11.25,4.0351562 V 6 a 0.250025,0.250025 0 0 1 -0.07227,0.1777344 l -1.9999996,2 A 0.2513544,0.2513544 0 1 1 8.8222656,7.8222656 L 10.75,5.8964844 V 4.6054688 l -0.572266,0.5722656 a 0.250025,0.250025 0 0 1 -0.3554684,0 l -1,-1 a 0.250025,0.250025 0 0 1 0,-0.3554688 l 1,-1 A 0.250025,0.250025 0 0 1 9.9960938,2.75 Z m -6,0 a 0.250025,0.250025 0 0 1 0.1816406,0.072266 L 5.1523438,3.796875 a 0.250025,0.250025 0 0 1 0.023437,0.021484 l 0.00195,0.00391 A 0.250025,0.250025 0 0 1 5.25,4.0351562 V 6 a 0.250025,0.250025 0 0 1 -0.072266,0.1777344 l -2,2 A 0.2513544,0.2513544 0 1 1 2.8222656,7.8222656 L 4.75,5.8964844 V 4.6054688 L 4.1777344,5.1777344 a 0.250025,0.250025 0 0 1 -0.3554688,0 l -1,-1 a 0.250025,0.250025 0 0 1 0,-0.3554688 l 1,-1 A 0.250025,0.250025 0 0 1 3.9960938,2.75 Z"
     id="path2" />
</svg>
