<?xml version="1.0" encoding="UTF-8" standalone="no"?>
<svg
   xmlns:dc="http://purl.org/dc/elements/1.1/"
   xmlns:cc="http://creativecommons.org/ns#"
   xmlns:rdf="http://www.w3.org/1999/02/22-rdf-syntax-ns#"
   xmlns:svg="http://www.w3.org/2000/svg"
   xmlns="http://www.w3.org/2000/svg"
   xmlns:sodipodi="http://sodipodi.sourceforge.net/DTD/sodipodi-0.dtd"
   xmlns:inkscape="http://www.inkscape.org/namespaces/inkscape"
   data-dec="41"
   width="14"
   height="40"
   version="1.1"
   id="svg4"
   sodipodi:docname="41.svg"
   inkscape:version="0.92.4 (unknown)">
  <metadata
     id="metadata10">
    <rdf:RDF>
      <cc:Work
         rdf:about="">
        <dc:format>image/svg+xml</dc:format>
        <dc:type
           rdf:resource="http://purl.org/dc/dcmitype/StillImage" />
      </cc:Work>
    </rdf:RDF>
  </metadata>
  <defs
     id="defs8" />
  <sodipodi:namedview
     pagecolor="#ffffff"
     bordercolor="#666666"
     borderopacity="1"
     objecttolerance="10"
     gridtolerance="10"
     guidetolerance="10"
     inkscape:pageopacity="0"
     inkscape:pageshadow="2"
     inkscape:window-width="615"
     inkscape:window-height="417"
     id="namedview6"
     showgrid="false"
     inkscape:zoom="5.9"
     inkscape:cx="7"
     inkscape:cy="20"
     inkscape:window-x="0"
     inkscape:window-y="27"
     inkscape:window-maximized="0"
     inkscape:current-layer="svg4" />
  <path
     style="color:#000000;font-style:normal;font-variant:normal;font-weight:normal;font-stretch:normal;font-size:medium;line-height:normal;font-family:sans-serif;font-variant-ligatures:normal;font-variant-position:normal;font-variant-caps:normal;font-variant-numeric:normal;font-variant-alternates:normal;font-feature-settings:normal;text-indent:0;text-align:start;text-decoration:none;text-decoration-line:none;text-decoration-style:solid;text-decoration-color:#000000;letter-spacing:normal;word-spacing:normal;text-transform:none;writing-mode:lr-tb;direction:ltr;text-orientation:mixed;dominant-baseline:auto;baseline-shift:baseline;text-anchor:start;white-space:normal;shape-padding:0;clip-rule:nonzero;display:inline;overflow:visible;visibility:visible;opacity:1;isolation:auto;mix-blend-mode:normal;color-interpolation:sRGB;color-interpolation-filters:linearRGB;solid-color:#000000;solid-opacity:1;vector-effect:none;fill:#013272;fill-opacity:1;fill-rule:nonzero;stroke:none;stroke-width:2.5;stroke-linecap:round;stroke-linejoin:round;stroke-miterlimit:4;stroke-dasharray:none;stroke-dashoffset:0;stroke-opacity:1;color-rendering:auto;image-rendering:auto;shape-rendering:auto;text-rendering:auto;enable-background:accumulate"
     d="m 8.9492188,-4.265625 a 1.250125,1.250125 0 0 1 0.046875,0 1.250125,1.250125 0 0 1 0.041016,0.00195 1.250125,1.250125 0 0 1 0.1054687,0.00781 1.250125,1.250125 0 0 1 0.1132813,0.017578 1.250125,1.250125 0 0 1 0.00977,0.00195 1.250125,1.250125 0 0 1 0.00586,0.00195 1.250125,1.250125 0 0 1 0.2324218,0.078125 1.250125,1.250125 0 0 1 0.1113282,0.056641 1.250125,1.250125 0 0 1 0.097656,0.060547 1.250125,1.250125 0 0 1 0.00781,0.00586 1.250125,1.250125 0 0 1 0.00781,0.00586 1.250125,1.250125 0 0 1 0.089844,0.072266 1.250125,1.250125 0 0 1 0.2402346,0.2871093 1.250125,1.250125 0 0 1 0.08984,0.171875 l 0.96875,1.9375 a 1.250125,1.250125 0 0 1 0.06836,0.1640626 l 1,3 a 1.250125,1.250125 0 0 1 0.04101,0.1484374 l 1,5 A 1.250125,1.250125 0 0 1 13.25,7 v 4 a 1.250125,1.250125 0 0 1 -0.02344,0.246094 l -1,5 a 1.250125,1.250125 0 0 1 -0.109374,0.3125 l -2,4 a 1.250125,1.250125 0 0 1 -0.07617,0.134765 l -2.0000004,3 a 1.250125,1.250125 0 0 1 -0.15625,0.191407 l -3,3 a 1.250125,1.250125 0 0 1 -0.00195,0.002 1.250125,1.250125 0 0 1 -0.234375,0.189453 L 0.75,30 a 1.250125,1.250125 0 1 1 -1.5,-2 L 3.1074219,25.107422 5.9316406,21.339844 7.8417969,17.519531 8.7890625,14.677734 9.75,9.8769531 V 5.1230469 L 8.7890625,0.32226562 7.84375,-2.5195312 a 1.250125,1.250125 0 0 1 -0.00781,-0.019531 1.250125,1.250125 0 0 1 -0.074219,-0.2714844 1.250125,1.250125 0 0 1 -0.013672,-0.1132812 1.250125,1.250125 0 0 1 -0.00195,-0.023437 1.250125,1.250125 0 0 1 -0.00195,-0.1035156 1.250125,1.250125 0 0 1 0.00195,-0.019531 1.250125,1.250125 0 0 1 0.00977,-0.1132813 1.250125,1.250125 0 0 1 0.023437,-0.1230468 1.250125,1.250125 0 0 1 0.033203,-0.1191406 1.250125,1.250125 0 0 1 0.046875,-0.1152344 1.250125,1.250125 0 0 1 0.00195,-0.00391 1.250125,1.250125 0 0 1 0.056641,-0.1054687 1.250125,1.250125 0 0 1 0.00195,-0.00586 1.250125,1.250125 0 0 1 0.054687,-0.082031 1.250125,1.250125 0 0 1 0.023437,-0.035156 1.250125,1.250125 0 0 1 0.068359,-0.080078 1.250125,1.250125 0 0 1 0.080078,-0.082031 1.250125,1.250125 0 0 1 0.023437,-0.021484 1.250125,1.250125 0 0 1 0.076172,-0.060547 1.250125,1.250125 0 0 1 0.013672,-0.00977 1.250125,1.250125 0 0 1 0.074219,-0.050781 1.250125,1.250125 0 0 1 0.064453,-0.037109 1.250125,1.250125 0 0 1 0.029297,-0.015625 1.250125,1.250125 0 0 1 0.078125,-0.035156 1.250125,1.250125 0 0 1 0.044922,-0.019531 1.250125,1.250125 0 0 1 0.097656,-0.03125 1.250125,1.250125 0 0 1 0.109375,-0.025391 1.250125,1.250125 0 0 1 0.021484,-0.00586 1.250125,1.250125 0 0 1 0.1074219,-0.013672 1.250125,1.250125 0 0 1 0.015625,0 1.250125,1.250125 0 0 1 0.046875,-0.00391 z"
     id="path2" />
</svg>
