<?xml version="1.0" encoding="UTF-8" standalone="no"?>
<svg
   xmlns:dc="http://purl.org/dc/elements/1.1/"
   xmlns:cc="http://creativecommons.org/ns#"
   xmlns:rdf="http://www.w3.org/1999/02/22-rdf-syntax-ns#"
   xmlns:svg="http://www.w3.org/2000/svg"
   xmlns="http://www.w3.org/2000/svg"
   xmlns:sodipodi="http://sodipodi.sourceforge.net/DTD/sodipodi-0.dtd"
   xmlns:inkscape="http://www.inkscape.org/namespaces/inkscape"
   data-dec="71"
   width="22"
   height="40"
   version="1.1"
   id="svg4"
   sodipodi:docname="71.svg"
   inkscape:version="0.92.4 5da689c313, 2019-01-14">
  <metadata
     id="metadata10">
    <rdf:RDF>
      <cc:Work
         rdf:about="">
        <dc:format>image/svg+xml</dc:format>
        <dc:type
           rdf:resource="http://purl.org/dc/dcmitype/StillImage" />
        <dc:title></dc:title>
      </cc:Work>
    </rdf:RDF>
  </metadata>
  <defs
     id="defs8" />
  <sodipodi:namedview
     pagecolor="#ffffff"
     bordercolor="#666666"
     borderopacity="1"
     objecttolerance="10"
     gridtolerance="10"
     guidetolerance="10"
     inkscape:pageopacity="0"
     inkscape:pageshadow="2"
     inkscape:window-width="1920"
     inkscape:window-height="1043"
     id="namedview6"
     showgrid="false"
     inkscape:zoom="5.9"
     inkscape:cx="11"
     inkscape:cy="20"
     inkscape:window-x="0"
     inkscape:window-y="37"
     inkscape:window-maximized="0"
     inkscape:current-layer="svg4" />
  <path
     style="color:#000000;font-style:normal;font-variant:normal;font-weight:normal;font-stretch:normal;font-size:medium;line-height:normal;font-family:sans-serif;font-variant-ligatures:normal;font-variant-position:normal;font-variant-caps:normal;font-variant-numeric:normal;font-variant-alternates:normal;font-feature-settings:normal;text-indent:0;text-align:start;text-decoration:none;text-decoration-line:none;text-decoration-style:solid;text-decoration-color:#000000;letter-spacing:normal;word-spacing:normal;text-transform:none;writing-mode:lr-tb;direction:ltr;text-orientation:mixed;dominant-baseline:auto;baseline-shift:baseline;text-anchor:start;white-space:normal;shape-padding:0;clip-rule:nonzero;display:inline;overflow:visible;visibility:visible;opacity:1;isolation:auto;mix-blend-mode:normal;color-interpolation:sRGB;color-interpolation-filters:linearRGB;solid-color:#000000;solid-opacity:1;vector-effect:none;fill:#000000;fill-opacity:1;fill-rule:nonzero;stroke:none;stroke-width:2.5;stroke-linecap:round;stroke-linejoin:round;stroke-miterlimit:4;stroke-dasharray:none;stroke-dashoffset:0;stroke-opacity:1;color-rendering:auto;image-rendering:auto;shape-rendering:auto;text-rendering:auto;enable-background:accumulate"
     d="m 9,-0.25 h 4 a 1.250125,1.250125 0 0 1 0.558594,0.1328125 l 2,1 a 1.250125,1.250125 0 0 1 0.326172,0.2324219 l 2,2 a 1.250125,1.250125 0 0 1 0.232422,0.3261718 l 0.914062,1.828125 a 1.250125,1.250125 0 0 1 0.132812,1.2246094 1.250125,1.250125 0 0 1 -0.04102,0.087891 1.250125,1.250125 0 0 1 -0.01367,0.025391 1.250125,1.250125 0 0 1 -0.04883,0.082031 1.250125,1.250125 0 0 1 -0.01563,0.023437 1.250125,1.250125 0 0 1 -0.05859,0.078125 A 1.250125,1.250125 0 0 1 17.820312,7.25 H 17 A 1.250125,1.250125 0 0 1 15.882812,6.5585938 L 14.972656,4.7402344 14.259766,4.0273438 12.705078,3.25 H 9.2949219 L 7.7402344,4.0273438 7.0273438,4.7402344 6.1582031,6.4804688 5.25,9.203125 v 4.59375 l 0.9082031,2.722656 0.8691407,1.740235 0.7128906,0.71289 L 9.2949219,19.75 h 3.4101561 l 1.554688,-0.777344 0.71289,-0.71289 L 15.75,16.705078 V 15.25 H 13 A 1.250125,1.250125 0 0 1 11.75,14 v -0.800781 a 1.250125,1.250125 0 0 1 0.332031,-1.066407 1.250125,1.250125 0 0 1 0.01367,-0.01367 1.250125,1.250125 0 0 1 0.0078,-0.0078 A 1.250125,1.250125 0 0 1 13.203125,11.75 H 18 A 1.250125,1.250125 0 0 1 19.25,13 v 4 a 1.250125,1.250125 0 0 1 -0.132812,0.558594 l -1,2 a 1.250125,1.250125 0 0 1 -0.232422,0.326172 l -2,2 a 1.250125,1.250125 0 0 1 -0.326172,0.232422 l -2,1 A 1.250125,1.250125 0 0 1 13,23.25 H 9 A 1.250125,1.250125 0 0 1 8.4414062,23.117188 l -2,-1 A 1.250125,1.250125 0 0 1 6.1152344,21.884766 l -2,-2 A 1.250125,1.250125 0 0 1 3.8828125,19.558594 l -1,-2 a 1.250125,1.250125 0 0 1 -0.068359,-0.164063 l -1,-3 A 1.250125,1.250125 0 0 1 1.75,14 V 9 a 1.250125,1.250125 0 0 1 0.064453,-0.3945312 l 1,-3 a 1.250125,1.250125 0 0 1 0.068359,-0.1640626 l 1,-2 A 1.250125,1.250125 0 0 1 4.1152344,3.1152344 l 2,-2 A 1.250125,1.250125 0 0 1 6.4414062,0.8828125 l 2,-1 A 1.250125,1.250125 0 0 1 9,-0.25 Z"
     id="path2" />
</svg>
