<?xml version="1.0" encoding="UTF-8" standalone="no"?>
<svg
   xmlns:dc="http://purl.org/dc/elements/1.1/"
   xmlns:cc="http://creativecommons.org/ns#"
   xmlns:rdf="http://www.w3.org/1999/02/22-rdf-syntax-ns#"
   xmlns:svg="http://www.w3.org/2000/svg"
   xmlns="http://www.w3.org/2000/svg"
   xmlns:sodipodi="http://sodipodi.sourceforge.net/DTD/sodipodi-0.dtd"
   xmlns:inkscape="http://www.inkscape.org/namespaces/inkscape"
   data-dec="8221"
   id="dec_39"
   width="15"
   height="40"
   version="1.1"
   sodipodi:docname="8221.svg"
   inkscape:version="0.92.4 5da689c313, 2019-01-14">
  <metadata
     id="metadata9">
    <rdf:RDF>
      <cc:Work
         rdf:about="">
        <dc:format>image/svg+xml</dc:format>
        <dc:type
           rdf:resource="http://purl.org/dc/dcmitype/StillImage" />
        <dc:title></dc:title>
      </cc:Work>
    </rdf:RDF>
  </metadata>
  <defs
     id="defs7" />
  <sodipodi:namedview
     pagecolor="#ffffff"
     bordercolor="#666666"
     borderopacity="1"
     objecttolerance="10"
     gridtolerance="10"
     guidetolerance="10"
     inkscape:pageopacity="0"
     inkscape:pageshadow="2"
     inkscape:window-width="1920"
     inkscape:window-height="1043"
     id="namedview5"
     showgrid="true"
     showguides="true"
     inkscape:zoom="22.893359"
     inkscape:cx="-7.1430137"
     inkscape:cy="31.444654"
     inkscape:window-x="0"
     inkscape:window-y="37"
     inkscape:window-maximized="0"
     inkscape:current-layer="dec_39">
    <inkscape:grid
       type="xygrid"
       id="grid836" />
  </sodipodi:namedview>
  <path
     inkscape:connector-curvature="0"
     d="M 6,3 5,4 H 4 L 3,3 V 2 L 4,1 H 5 L 6,2 V 5 L 5,7 3,8 M 4,2 V 3 H 5 V 2 H 4 M 5,4 6,5 M 6,3 5,7 M 12,3 11,4 H 10 L 9,3 V 2 l 1,-1 h 1 l 1,1 V 5 L 11,7 9,8 m 1,-6 v 1 h 1 V 2 h -1 m 1,2 1,1 m 0,-2 -1,4"
     style="fill:none;stroke:#000000;stroke-width:1;stroke-linecap:round;stroke-linejoin:round;stroke-miterlimit:4;stroke-dasharray:none"
     id="path2-7"
     sodipodi:nodetypes="cccccccccccccccccccccccccccccccccccccccc" />
</svg>
