<?xml version="1.0" encoding="UTF-8" standalone="no"?>
<svg
   xmlns:dc="http://purl.org/dc/elements/1.1/"
   xmlns:cc="http://creativecommons.org/ns#"
   xmlns:rdf="http://www.w3.org/1999/02/22-rdf-syntax-ns#"
   xmlns:svg="http://www.w3.org/2000/svg"
   xmlns="http://www.w3.org/2000/svg"
   xmlns:sodipodi="http://sodipodi.sourceforge.net/DTD/sodipodi-0.dtd"
   xmlns:inkscape="http://www.inkscape.org/namespaces/inkscape"
   data-dec="86"
   width="20"
   height="40"
   version="1.1"
   id="svg4"
   sodipodi:docname="86.svg"
   inkscape:version="0.92.4 (unknown)">
  <metadata
     id="metadata10">
    <rdf:RDF>
      <cc:Work
         rdf:about="">
        <dc:format>image/svg+xml</dc:format>
        <dc:type
           rdf:resource="http://purl.org/dc/dcmitype/StillImage" />
      </cc:Work>
    </rdf:RDF>
  </metadata>
  <defs
     id="defs8" />
  <sodipodi:namedview
     pagecolor="#ffffff"
     bordercolor="#666666"
     borderopacity="1"
     objecttolerance="10"
     gridtolerance="10"
     guidetolerance="10"
     inkscape:pageopacity="0"
     inkscape:pageshadow="2"
     inkscape:window-width="615"
     inkscape:window-height="417"
     id="namedview6"
     showgrid="false"
     inkscape:zoom="5.9"
     inkscape:cx="10"
     inkscape:cy="20"
     inkscape:window-x="0"
     inkscape:window-y="27"
     inkscape:window-maximized="0"
     inkscape:current-layer="svg4" />
  <path
     style="color:#000000;font-style:normal;font-variant:normal;font-weight:normal;font-stretch:normal;font-size:medium;line-height:normal;font-family:sans-serif;font-variant-ligatures:normal;font-variant-position:normal;font-variant-caps:normal;font-variant-numeric:normal;font-variant-alternates:normal;font-feature-settings:normal;text-indent:0;text-align:start;text-decoration:none;text-decoration-line:none;text-decoration-style:solid;text-decoration-color:#000000;letter-spacing:normal;word-spacing:normal;text-transform:none;writing-mode:lr-tb;direction:ltr;text-orientation:mixed;dominant-baseline:auto;baseline-shift:baseline;text-anchor:start;white-space:normal;shape-padding:0;clip-rule:nonzero;display:inline;overflow:visible;visibility:visible;opacity:1;isolation:auto;mix-blend-mode:normal;color-interpolation:sRGB;color-interpolation-filters:linearRGB;solid-color:#000000;solid-opacity:1;vector-effect:none;fill:#013272;fill-opacity:1;fill-rule:nonzero;stroke:none;stroke-width:1;stroke-linecap:round;stroke-linejoin:round;stroke-miterlimit:4;stroke-dasharray:none;stroke-dashoffset:0;stroke-opacity:1;color-rendering:auto;image-rendering:auto;shape-rendering:auto;text-rendering:auto;enable-background:accumulate"
     d="M 7.5761719,3.2773438 8.4765625,18.566406 8.6191406,18.328125 A 0.50005,0.50005 0 0 1 8.5,18.029297 L 7.6367188,3.3515625 a 0.50005,0.50005 0 0 1 -0.060547,-0.074219 z m 0,-0.9414063 -0.052734,0.017578 0.025391,0.4335938 a 0.50005,0.50005 0 0 1 0.00391,-0.00977 L 7.5976562,2.6875 Z M 6.5,2.0800781 V 2.953125 a 0.50005,0.50005 0 0 1 0.00195,0.078125 L 7.5,19.970703 A 0.50005,0.50005 0 0 1 7.5,20 v 0.193359 L 7.9160156,19.5 A 0.50005,0.50005 0 0 1 7.5,19.029297 L 6.5039062,2.1015625 A 0.50005,0.50005 0 0 1 6.5,2.0800781 Z M 6.5,1.5 V 1.921875 A 0.50005,0.50005 0 0 1 6.5605469,1.7539062 0.50005,0.50005 0 0 1 6.578125,1.7226562 0.50005,0.50005 0 0 1 6.9140625,1.5 Z M 5.9921875,0.4921875 A 0.50005,0.50005 0 0 1 6.0800781,0.5 h 1.8339844 a 0.50005,0.50005 0 0 1 0.1679687,0 h 0.8457032 a 0.50005,0.50005 0 0 1 0.1503906,0 h 0.8789062 a 0.50005,0.50005 0 0 1 0.091797,0 H 11 a 0.50005,0.50005 0 1 1 0,1 H 10.082031 L 9.1542969,1.8085938 8.6132812,2.890625 9.4414062,16.958984 18.292969,2.2050781 16.882812,1.5 H 16 a 0.50005,0.50005 0 1 1 0,-1 h 0.933594 a 0.50005,0.50005 0 0 1 0.115234,0 h 3.904297 a 0.50005,0.50005 0 0 1 0.111328,0 H 22 a 0.50005,0.50005 0 1 1 0,1 H 21.117188 L 19.355469,2.3808594 7.4511719,22.222656 a 0.50005,0.50005 0 0 1 -0.00195,0.0039 0.50005,0.50005 0 0 1 -0.2246094,0.22461 0.50005,0.50005 0 0 1 -0.091797,0.03711 0.50005,0.50005 0 0 1 -0.1992187,0.01367 0.50005,0.50005 0 0 1 -0.027344,-0.0039 0.50005,0.50005 0 0 1 -0.046875,-0.01172 0.50005,0.50005 0 0 1 -0.046875,-0.01563 0.50005,0.50005 0 0 1 -0.023437,-0.0098 0.50005,0.50005 0 0 1 -0.021484,-0.01172 0.50005,0.50005 0 0 1 -0.1210937,-0.08789 0.50005,0.50005 0 0 1 -0.033203,-0.03711 A 0.50005,0.50005 0 0 1 6.5,21.945312 V 20.015625 L 5.5058594,3.1289062 4.6914062,1.5 H 4 a 0.50005,0.50005 0 1 1 0,-1 h 0.9238281 a 0.50005,0.50005 0 0 1 0.1464844,0 h 0.8476563 a 0.50005,0.50005 0 0 1 0.074219,-0.007813 z"
     id="path2" />
</svg>
