<?xml version="1.0" encoding="UTF-8" standalone="no"?>
<svg
   xmlns:dc="http://purl.org/dc/elements/1.1/"
   xmlns:cc="http://creativecommons.org/ns#"
   xmlns:rdf="http://www.w3.org/1999/02/22-rdf-syntax-ns#"
   xmlns:svg="http://www.w3.org/2000/svg"
   xmlns="http://www.w3.org/2000/svg"
   xmlns:sodipodi="http://sodipodi.sourceforge.net/DTD/sodipodi-0.dtd"
   xmlns:inkscape="http://www.inkscape.org/namespaces/inkscape"
   data-dec="39"
   width="10"
   height="40"
   version="1.1"
   id="svg4"
   sodipodi:docname="39.svg"
   inkscape:version="0.92.4 5da689c313, 2019-01-14">
  <metadata
     id="metadata10">
    <rdf:RDF>
      <cc:Work
         rdf:about="">
        <dc:format>image/svg+xml</dc:format>
        <dc:type
           rdf:resource="http://purl.org/dc/dcmitype/StillImage" />
        <dc:title></dc:title>
      </cc:Work>
    </rdf:RDF>
  </metadata>
  <defs
     id="defs8" />
  <sodipodi:namedview
     pagecolor="#ffffff"
     bordercolor="#666666"
     borderopacity="1"
     objecttolerance="10"
     gridtolerance="10"
     guidetolerance="10"
     inkscape:pageopacity="0"
     inkscape:pageshadow="2"
     inkscape:window-width="1920"
     inkscape:window-height="1043"
     id="namedview6"
     showgrid="false"
     inkscape:zoom="5.9"
     inkscape:cx="5"
     inkscape:cy="20"
     inkscape:window-x="0"
     inkscape:window-y="37"
     inkscape:window-maximized="0"
     inkscape:current-layer="svg4" />
  <path
     style="color:#000000;font-style:normal;font-variant:normal;font-weight:normal;font-stretch:normal;font-size:medium;line-height:normal;font-family:sans-serif;font-variant-ligatures:normal;font-variant-position:normal;font-variant-caps:normal;font-variant-numeric:normal;font-variant-alternates:normal;font-feature-settings:normal;text-indent:0;text-align:start;text-decoration:none;text-decoration-line:none;text-decoration-style:solid;text-decoration-color:#000000;letter-spacing:normal;word-spacing:normal;text-transform:none;writing-mode:lr-tb;direction:ltr;text-orientation:mixed;dominant-baseline:auto;baseline-shift:baseline;text-anchor:start;white-space:normal;shape-padding:0;clip-rule:nonzero;display:inline;overflow:visible;visibility:visible;opacity:1;isolation:auto;mix-blend-mode:normal;color-interpolation:sRGB;color-interpolation-filters:linearRGB;solid-color:#000000;solid-opacity:1;vector-effect:none;fill:#000000;fill-opacity:1;fill-rule:nonzero;stroke:none;stroke-width:0.5;stroke-linecap:round;stroke-linejoin:round;stroke-miterlimit:4;stroke-dasharray:none;stroke-dashoffset:0;stroke-opacity:1;color-rendering:auto;image-rendering:auto;shape-rendering:auto;text-rendering:auto;enable-background:accumulate"
     d="m 4.75,2.6054688 -0.5,0.5 V 3.3945312 L 4.75,2.8964844 Z M 4.25,2.25 V 2.3945312 L 4.3945312,2.25 Z M 3.6054688,2.25 3.75,2.3945312 V 2.25 Z M 4.25,1.6054688 V 1.75 h 0.1445312 z m -0.5,0 L 3.6054688,1.75 H 3.75 Z M 3.9960938,0.74609375 a 0.250025,0.250025 0 0 1 0.023437,0.001953 0.250025,0.250025 0 0 1 0.00195,0 0.250025,0.250025 0 0 1 0.046875,0.007813 0.250025,0.250025 0 0 1 0.00195,0 0.250025,0.250025 0 0 1 0.00586,0.001953 0.250025,0.250025 0 0 1 0.033203,0.0136719 0.250025,0.250025 0 0 1 0.00586,0.003906 0.250025,0.250025 0 0 1 0.00195,0 0.250025,0.250025 0 0 1 0.019531,0.0117188 0.250025,0.250025 0 0 1 0.00195,0 0.250025,0.250025 0 0 1 0.00781,0.005859 0.250025,0.250025 0 0 1 0.011719,0.009766 0.250025,0.250025 0 0 1 0.017578,0.015625 0.250025,0.250025 0 0 1 0,0.001953 0.250025,0.250025 0 0 1 0.00195,0.001953 0.250025,0.250025 0 0 1 0.015625,0.0136719 0.250025,0.250025 0 0 1 0,0.001953 l 0.00781,0.007813 a 0.250025,0.250025 0 0 1 0.00781,0.009766 l 0.9375,0.93750005 a 0.250025,0.250025 0 0 1 0.00586,0.00391 0.250025,0.250025 0 0 1 0.00586,0.00391 v 0.00195 a 0.250025,0.250025 0 0 1 0.00781,0.00781 0.250025,0.250025 0 0 1 0.00977,0.00781 0.250025,0.250025 0 0 1 0.00195,0.00391 0.250025,0.250025 0 0 1 0.013672,0.013672 0.250025,0.250025 0 0 1 0.00195,0.00195 0.250025,0.250025 0 0 1 0.015625,0.017578 0.250025,0.250025 0 0 1 0,0.00195 0.250025,0.250025 0 0 1 0.019531,0.035156 0.250025,0.250025 0 0 1 0.00391,0.00586 0.250025,0.250025 0 0 1 0,0.00195 0.250025,0.250025 0 0 1 0.00977,0.021484 0.250025,0.250025 0 0 1 0,0.00195 0.250025,0.250025 0 0 1 0.00586,0.023437 0.250025,0.250025 0 0 1 0.00391,0.025391 0.250025,0.250025 0 0 1 0,0.046875 0.250025,0.250025 0 0 1 0,0.00195 A 0.250025,0.250025 0 0 1 5.25,2.0351562 V 2.046875 3 a 0.250025,0.250025 0 0 1 -0.072266,0.1777344 l -1,1 -1,1 A 0.2513544,0.2513544 0 1 1 2.8222656,4.8222656 L 3.75,3.8945312 V 3.1054688 L 2.8476562,2.203125 a 0.250025,0.250025 0 0 1 -0.00586,-0.00391 0.250025,0.250025 0 0 1 -0.00781,-0.00977 0.250025,0.250025 0 0 1 -0.011719,-0.011719 0.250025,0.250025 0 0 1 -0.013672,-0.013672 0.250025,0.250025 0 0 1 -0.037109,-0.056641 0.250025,0.250025 0 0 1 -0.00391,-0.00586 0.250025,0.250025 0 0 1 0,-0.00195 0.250025,0.250025 0 0 1 -0.00977,-0.021484 0.250025,0.250025 0 0 1 0,-0.00195 0.250025,0.250025 0 0 1 -0.00586,-0.023437 0.250025,0.250025 0 0 1 -0.00391,-0.025391 0.250025,0.250025 0 0 1 0,-0.046875 0.250025,0.250025 0 0 1 0,-0.00195 0.250025,0.250025 0 0 1 0.00781,-0.046875 0.250025,0.250025 0 0 1 0,-0.00195 0.250025,0.250025 0 0 1 0.00195,-0.00586 0.250025,0.250025 0 0 1 0.013672,-0.033203 0.250025,0.250025 0 0 1 0.00391,-0.00586 0.250025,0.250025 0 0 1 0,-0.00195 0.250025,0.250025 0 0 1 0.011719,-0.019531 0.250025,0.250025 0 0 1 0,-0.00195 0.250025,0.250025 0 0 1 0.00586,-0.00781 0.250025,0.250025 0 0 1 0.00977,-0.011719 0.250025,0.250025 0 0 1 0.017578,-0.017578 0.250025,0.250025 0 0 1 0.00195,-0.00195 l 0.013672,-0.015625 a 0.250025,0.250025 0 0 1 0.00977,-0.00781 l 0.00977,-0.00781 0.9414062,-0.94335935 a 0.250025,0.250025 0 0 1 0.00391,-0.005859 0.250025,0.250025 0 0 1 0.00977,-0.007813 0.250025,0.250025 0 0 1 0.00781,-0.009766 0.250025,0.250025 0 0 1 0.00391,-0.001953 0.250025,0.250025 0 0 1 0.013672,-0.0136719 0.250025,0.250025 0 0 1 0.056641,-0.0371094 0.250025,0.250025 0 0 1 0.00586,-0.003906 0.250025,0.250025 0 0 1 0.00195,0 0.250025,0.250025 0 0 1 0.072266,-0.0195312 0.250025,0.250025 0 0 1 0.023438,-0.001953 z"
     id="path2" />
</svg>
