<?xml version="1.0" encoding="UTF-8"?>
<glyph name="Aacute" format="1">
  <advance width="578"/>
  <unicode hex="00C1"/>
  <outline>
    <component base="acute" xOffset="105" yOffset="298"/>
    <component base="A"/>
  </outline>
  <lib>
    <dict>
      <key>com.fontlab.hintData</key>
      <dict>
        <key>hhints</key>
        <array>
          <dict>
            <key>position</key>
            <integer>0</integer>
            <key>width</key>
            <integer>57</integer>
          </dict>
          <dict>
            <key>position</key>
            <integer>173</integer>
            <key>width</key>
            <integer>58</integer>
          </dict>
          <dict>
            <key>position</key>
            <integer>644</integer>
            <key>width</key>
            <integer>22</integer>
          </dict>
          <dict>
            <key>position</key>
            <integer>724</integer>
            <key>width</key>
            <integer>232</integer>
          </dict>
        </array>
        <key>vhints</key>
        <array>
          <dict>
            <key>position</key>
            <integer>349</integer>
            <key>width</key>
            <integer>230</integer>
          </dict>
        </array>
      </dict>
    </dict>
  </lib>
</glyph>
