<?xml version="1.0" encoding="UTF-8" standalone="no"?>
<svg
   xmlns:dc="http://purl.org/dc/elements/1.1/"
   xmlns:cc="http://creativecommons.org/ns#"
   xmlns:rdf="http://www.w3.org/1999/02/22-rdf-syntax-ns#"
   xmlns:svg="http://www.w3.org/2000/svg"
   xmlns="http://www.w3.org/2000/svg"
   xmlns:sodipodi="http://sodipodi.sourceforge.net/DTD/sodipodi-0.dtd"
   xmlns:inkscape="http://www.inkscape.org/namespaces/inkscape"
   data-dec="74"
   width="18"
   height="40"
   version="1.1"
   id="svg4"
   sodipodi:docname="74.svg"
   inkscape:version="0.92.4 (unknown)">
  <metadata
     id="metadata10">
    <rdf:RDF>
      <cc:Work
         rdf:about="">
        <dc:format>image/svg+xml</dc:format>
        <dc:type
           rdf:resource="http://purl.org/dc/dcmitype/StillImage" />
      </cc:Work>
    </rdf:RDF>
  </metadata>
  <defs
     id="defs8" />
  <sodipodi:namedview
     pagecolor="#ffffff"
     bordercolor="#666666"
     borderopacity="1"
     objecttolerance="10"
     gridtolerance="10"
     guidetolerance="10"
     inkscape:pageopacity="0"
     inkscape:pageshadow="2"
     inkscape:window-width="640"
     inkscape:window-height="480"
     id="namedview6"
     showgrid="false"
     inkscape:zoom="5.9"
     inkscape:cx="9"
     inkscape:cy="20"
     inkscape:window-x="0"
     inkscape:window-y="27"
     inkscape:window-maximized="0"
     inkscape:current-layer="svg4" />
  <path
     style="color:#000000;font-style:normal;font-variant:normal;font-weight:normal;font-stretch:normal;font-size:medium;line-height:normal;font-family:sans-serif;font-variant-ligatures:normal;font-variant-position:normal;font-variant-caps:normal;font-variant-numeric:normal;font-variant-alternates:normal;font-feature-settings:normal;text-indent:0;text-align:start;text-decoration:none;text-decoration-line:none;text-decoration-style:solid;text-decoration-color:#000000;letter-spacing:normal;word-spacing:normal;text-transform:none;writing-mode:lr-tb;direction:ltr;text-orientation:mixed;dominant-baseline:auto;baseline-shift:baseline;text-anchor:start;white-space:normal;shape-padding:0;clip-rule:nonzero;display:inline;overflow:visible;visibility:visible;opacity:1;isolation:auto;mix-blend-mode:normal;color-interpolation:sRGB;color-interpolation-filters:linearRGB;solid-color:#000000;solid-opacity:1;vector-effect:none;fill:#013272;fill-opacity:1;fill-rule:nonzero;stroke:none;stroke-width:0.5;stroke-linecap:round;stroke-linejoin:round;stroke-miterlimit:4;stroke-dasharray:none;stroke-dashoffset:0;stroke-opacity:1;color-rendering:auto;image-rendering:auto;shape-rendering:auto;text-rendering:auto;enable-background:accumulate"
     d="M 14.1875,1.25 9.2402344,18.070312 a 0.250025,0.250025 0 0 1 -0.017578,0.04102 l -1,2 a 0.250025,0.250025 0 0 1 -0.044922,0.06641 L 7.2695312,21.085938 7.8515625,20.794922 8.7949219,19.851562 9.765625,17.908203 14.666016,1.25 Z M 13.994141,0.74609375 A 0.250025,0.250025 0 0 1 14.042969,0.75 h 0.917969 a 0.250025,0.250025 0 0 1 0.08203,0 H 18 a 0.250025,0.250025 0 1 1 0,0.5 h -2.8125 l -4.947266,16.820312 a 0.250025,0.250025 0 0 1 -0.01758,0.04102 l -0.9999998,2 a 0.250025,0.250025 0 0 1 -0.044922,0.06641 l -1,1 a 0.250025,0.250025 0 0 1 -0.066406,0.04492 l -1.9667969,0.982422 a 0.250025,0.250025 0 0 1 -0.00781,0.0039 0.250025,0.250025 0 0 1 -0.039063,0.02148 0.250025,0.250025 0 0 1 -0.023437,0.0078 A 0.250025,0.250025 0 0 1 5.96875,22.25 H 4 a 0.250025,0.250025 0 0 1 -0.1113281,-0.02734 l -2,-1 A 0.250025,0.250025 0 0 1 1.7773438,21.111328 l -1.00000005,-2 A 0.250025,0.250025 0 0 1 0.75,19 v -2 a 0.250025,0.250025 0 0 1 0.0722656,-0.177734 l 0.99999998,-1 a 0.250025,0.250025 0 0 1 0.3554688,0 l 1,1 a 0.250025,0.250025 0 0 1 0,0.355468 l -1,1 A 0.25135412,0.25135412 0 1 1 1.8222656,17.822266 L 2.6445312,17 2,16.355469 1.25,17.103516 v 1.83789 L 2.1855469,20.814453 4.0585938,21.75 H 5.8945312 L 7.7949219,19.851562 8.765625,17.908203 13.666016,1.25 H 11 a 0.250025,0.250025 0 1 1 0,-0.5 h 2.960938 a 0.250025,0.250025 0 0 1 0.0332,-0.003906 z"
     id="path2" />
</svg>
