<?xml version="1.0" encoding="UTF-8" standalone="no"?>
<svg
   xmlns:dc="http://purl.org/dc/elements/1.1/"
   xmlns:cc="http://creativecommons.org/ns#"
   xmlns:rdf="http://www.w3.org/1999/02/22-rdf-syntax-ns#"
   xmlns:svg="http://www.w3.org/2000/svg"
   xmlns="http://www.w3.org/2000/svg"
   xmlns:sodipodi="http://sodipodi.sourceforge.net/DTD/sodipodi-0.dtd"
   xmlns:inkscape="http://www.inkscape.org/namespaces/inkscape"
   data-dec="125"
   width="14"
   height="40"
   version="1.1"
   id="svg4"
   sodipodi:docname="125.svg"
   inkscape:version="0.92.4 5da689c313, 2019-01-14">
  <metadata
     id="metadata10">
    <rdf:RDF>
      <cc:Work
         rdf:about="">
        <dc:format>image/svg+xml</dc:format>
        <dc:type
           rdf:resource="http://purl.org/dc/dcmitype/StillImage" />
        <dc:title></dc:title>
      </cc:Work>
    </rdf:RDF>
  </metadata>
  <defs
     id="defs8" />
  <sodipodi:namedview
     pagecolor="#ffffff"
     bordercolor="#666666"
     borderopacity="1"
     objecttolerance="10"
     gridtolerance="10"
     guidetolerance="10"
     inkscape:pageopacity="0"
     inkscape:pageshadow="2"
     inkscape:window-width="1920"
     inkscape:window-height="1043"
     id="namedview6"
     showgrid="false"
     inkscape:zoom="5.9"
     inkscape:cx="7"
     inkscape:cy="20"
     inkscape:window-x="0"
     inkscape:window-y="37"
     inkscape:window-maximized="0"
     inkscape:current-layer="svg4" />
  <path
     style="color:#000000;font-style:normal;font-variant:normal;font-weight:normal;font-stretch:normal;font-size:medium;line-height:normal;font-family:sans-serif;font-variant-ligatures:normal;font-variant-position:normal;font-variant-caps:normal;font-variant-numeric:normal;font-variant-alternates:normal;font-feature-settings:normal;text-indent:0;text-align:start;text-decoration:none;text-decoration-line:none;text-decoration-style:solid;text-decoration-color:#000000;letter-spacing:normal;word-spacing:normal;text-transform:none;writing-mode:lr-tb;direction:ltr;text-orientation:mixed;dominant-baseline:auto;baseline-shift:baseline;text-anchor:start;white-space:normal;shape-padding:0;clip-rule:nonzero;display:inline;overflow:visible;visibility:visible;opacity:1;isolation:auto;mix-blend-mode:normal;color-interpolation:sRGB;color-interpolation-filters:linearRGB;solid-color:#000000;solid-opacity:1;vector-effect:none;fill:#000000;fill-opacity:1;fill-rule:nonzero;stroke:none;stroke-width:1;stroke-linecap:round;stroke-linejoin:round;stroke-miterlimit:4;stroke-dasharray:none;stroke-dashoffset:0;stroke-opacity:1;color-rendering:auto;image-rendering:auto;shape-rendering:auto;text-rendering:auto;enable-background:accumulate"
     d="m 4.9824219,-3.5039062 a 0.50005,0.50005 0 0 1 0.2402343,0.056641 l 2,1 a 0.50005,0.50005 0 0 1 0.1308594,0.09375 l 1,1 a 0.50005,0.50005 0 0 1 0.09375,0.1308594 l 1,1.99999995 A 0.50005,0.50005 0 0 1 9.5,1 v 2 a 0.50005,0.50005 0 0 1 -0.052734,0.2226562 l -1,2 a 0.50005,0.50005 0 0 1 -0.09375,0.1308594 L 7.4101562,6.296875 6.5,8.1171875 v 1.6757813 l 1.796875,1.7968752 1.925781,0.96289 a 0.50005,0.50005 0 0 1 0,0.894532 L 8.296875,14.410156 6.5,16.207031 v 1.675781 l 0.9101562,1.820313 0.9433594,0.943359 a 0.50005,0.50005 0 0 1 0.09375,0.13086 l 1,2 A 0.50005,0.50005 0 0 1 9.5,23 v 2 a 0.50005,0.50005 0 0 1 -0.052734,0.222656 l -1,2 a 0.50005,0.50005 0 0 1 -0.09375,0.13086 l -1,1 a 0.50005,0.50005 0 0 1 -0.1308594,0.09375 l -2,1 A 0.50005,0.50005 0 1 1 4.7773438,28.552734 L 6.703125,27.589844 7.5898438,26.703125 8.5,24.882812 V 23.117188 L 7.5898438,21.296875 6.6464844,20.353516 a 0.50005,0.50005 0 0 1 -0.09375,-0.13086 l -1,-2 A 0.50005,0.50005 0 0 1 5.5,18 v -2 a 0.50005,0.50005 0 0 1 0.1464844,-0.353516 l 1.9648437,-1.964843 a 0.50005,0.50005 0 0 1 0.00586,-0.0078 0.50005,0.50005 0 0 1 0.09375,-0.08203 0.50005,0.50005 0 0 1 0.023437,-0.01563 0.50005,0.50005 0 0 1 0.085937,-0.04492 L 8.8828125,13 7.8183594,12.46875 a 0.50005,0.50005 0 0 1 -0.00781,-0.0039 0.50005,0.50005 0 0 1 -0.064453,-0.0332 0.50005,0.50005 0 0 1 -0.023438,-0.01367 0.50005,0.50005 0 0 1 -0.00781,-0.0059 0.50005,0.50005 0 0 1 -0.068359,-0.05859 l -0.017578,-0.01563 a 0.50005,0.50005 0 0 1 -0.015625,-0.01758 L 7.5957031,12.300781 5.6464844,10.353516 A 0.50005,0.50005 0 0 1 5.5,10 V 8 a 0.50005,0.50005 0 0 1 0.052734,-0.2226562 l 1,-2 a 0.50005,0.50005 0 0 1 0.09375,-0.1308594 L 7.5898438,4.703125 8.5,2.8828125 V 1.1171875 L 7.5898438,-0.703125 6.703125,-1.5898438 4.7773438,-2.5527344 a 0.50005,0.50005 0 0 1 0.2050781,-0.9511718 z"
     id="path2" />
</svg>
