<?xml version="1.0" encoding="UTF-8" standalone="no"?>
<svg
   xmlns:dc="http://purl.org/dc/elements/1.1/"
   xmlns:cc="http://creativecommons.org/ns#"
   xmlns:rdf="http://www.w3.org/1999/02/22-rdf-syntax-ns#"
   xmlns:svg="http://www.w3.org/2000/svg"
   xmlns="http://www.w3.org/2000/svg"
   xmlns:sodipodi="http://sodipodi.sourceforge.net/DTD/sodipodi-0.dtd"
   xmlns:inkscape="http://www.inkscape.org/namespaces/inkscape"
   data-dec="109"
   width="29"
   height="40"
   version="1.1"
   id="svg4"
   sodipodi:docname="109.svg"
   inkscape:version="0.92.4 (unknown)">
  <metadata
     id="metadata10">
    <rdf:RDF>
      <cc:Work
         rdf:about="">
        <dc:format>image/svg+xml</dc:format>
        <dc:type
           rdf:resource="http://purl.org/dc/dcmitype/StillImage" />
      </cc:Work>
    </rdf:RDF>
  </metadata>
  <defs
     id="defs8" />
  <sodipodi:namedview
     pagecolor="#ffffff"
     bordercolor="#666666"
     borderopacity="1"
     objecttolerance="10"
     gridtolerance="10"
     guidetolerance="10"
     inkscape:pageopacity="0"
     inkscape:pageshadow="2"
     inkscape:window-width="640"
     inkscape:window-height="480"
     id="namedview6"
     showgrid="false"
     inkscape:zoom="5.9"
     inkscape:cx="14.5"
     inkscape:cy="20"
     inkscape:window-x="0"
     inkscape:window-y="27"
     inkscape:window-maximized="0"
     inkscape:current-layer="svg4" />
  <path
     style="color:#000000;font-style:normal;font-variant:normal;font-weight:normal;font-stretch:normal;font-size:medium;line-height:normal;font-family:sans-serif;font-variant-ligatures:normal;font-variant-position:normal;font-variant-caps:normal;font-variant-numeric:normal;font-variant-alternates:normal;font-feature-settings:normal;text-indent:0;text-align:start;text-decoration:none;text-decoration-line:none;text-decoration-style:solid;text-decoration-color:#000000;letter-spacing:normal;word-spacing:normal;text-transform:none;writing-mode:lr-tb;direction:ltr;text-orientation:mixed;dominant-baseline:auto;baseline-shift:baseline;text-anchor:start;white-space:normal;shape-padding:0;clip-rule:nonzero;display:inline;overflow:visible;visibility:visible;opacity:1;isolation:auto;mix-blend-mode:normal;color-interpolation:sRGB;color-interpolation-filters:linearRGB;solid-color:#000000;solid-opacity:1;vector-effect:none;fill:#000000;fill-opacity:1;fill-rule:nonzero;stroke:none;stroke-width:3;stroke-linecap:round;stroke-linejoin:round;stroke-miterlimit:4;stroke-dasharray:none;stroke-dashoffset:0;stroke-opacity:1;color-rendering:auto;image-rendering:auto;shape-rendering:auto;text-rendering:auto;enable-background:accumulate"
     d="M 3.9765625,6.4785156 A 1.50015,1.50015 0 0 1 5.5,8 V 8.3789062 L 5.9394531,7.9394531 a 1.50015,1.50015 0 0 1 0.390625,-0.28125 l 2,-1 A 1.50015,1.50015 0 0 1 9,6.5 h 2 a 1.50015,1.50015 0 0 1 0.669922,0.1582031 l 2,1 a 1.50015,1.50015 0 0 1 0.390625,0.28125 l 1,1 a 1.50015,1.50015 0 0 1 0.363281,0.5859375 l 0.0293,0.089844 0.298828,-0.4472656 a 1.50015,1.50015 0 0 1 0.1875,-0.2285157 l 1,-1 a 1.50015,1.50015 0 0 1 0.390625,-0.28125 l 2,-1 A 1.50015,1.50015 0 0 1 20,6.5 h 2 a 1.50015,1.50015 0 0 1 0.669922,0.1582031 l 2,1 a 1.50015,1.50015 0 0 1 0.390625,0.28125 l 1,1 a 1.50015,1.50015 0 0 1 0.363281,0.5859375 l 1,3.0000004 A 1.50015,1.50015 0 0 1 27.5,13 v 9 a 1.50015,1.50015 0 1 1 -3,0 V 13.244141 L 23.689453,10.810547 23.111328,10.232422 21.646484,9.5 H 20.353516 L 18.888672,10.232422 18.166016,10.955078 16.5,13.453125 V 22 a 1.50015,1.50015 0 1 1 -3,0 V 13.244141 L 12.689453,10.810547 12.111328,10.232422 10.646484,9.5 H 9.3535156 L 7.8886719,10.232422 7.1660156,10.955078 5.5,13.453125 V 22 a 1.50015,1.50015 0 1 1 -3,0 v -8.808594 a 1.50015,1.50015 0 0 1 0,-0.351562 V 8 A 1.50015,1.50015 0 0 1 3.9765625,6.4785156 Z"
     id="path2" />
</svg>
