<?xml version="1.0" encoding="UTF-8" standalone="no"?>
<svg
   xmlns:dc="http://purl.org/dc/elements/1.1/"
   xmlns:cc="http://creativecommons.org/ns#"
   xmlns:rdf="http://www.w3.org/1999/02/22-rdf-syntax-ns#"
   xmlns:svg="http://www.w3.org/2000/svg"
   xmlns="http://www.w3.org/2000/svg"
   xmlns:sodipodi="http://sodipodi.sourceforge.net/DTD/sodipodi-0.dtd"
   xmlns:inkscape="http://www.inkscape.org/namespaces/inkscape"
   data-dec="64"
   width="28"
   height="40"
   version="1.1"
   id="svg4"
   sodipodi:docname="64.svg"
   inkscape:version="0.92.4 (unknown)">
  <metadata
     id="metadata10">
    <rdf:RDF>
      <cc:Work
         rdf:about="">
        <dc:format>image/svg+xml</dc:format>
        <dc:type
           rdf:resource="http://purl.org/dc/dcmitype/StillImage" />
      </cc:Work>
    </rdf:RDF>
  </metadata>
  <defs
     id="defs8" />
  <sodipodi:namedview
     pagecolor="#ffffff"
     bordercolor="#666666"
     borderopacity="1"
     objecttolerance="10"
     gridtolerance="10"
     guidetolerance="10"
     inkscape:pageopacity="0"
     inkscape:pageshadow="2"
     inkscape:window-width="615"
     inkscape:window-height="417"
     id="namedview6"
     showgrid="false"
     inkscape:zoom="5.9"
     inkscape:cx="14"
     inkscape:cy="20"
     inkscape:window-x="0"
     inkscape:window-y="27"
     inkscape:window-maximized="0"
     inkscape:current-layer="svg4" />
  <path
     style="color:#000000;font-style:normal;font-variant:normal;font-weight:normal;font-stretch:normal;font-size:medium;line-height:normal;font-family:sans-serif;font-variant-ligatures:normal;font-variant-position:normal;font-variant-caps:normal;font-variant-numeric:normal;font-variant-alternates:normal;font-feature-settings:normal;text-indent:0;text-align:start;text-decoration:none;text-decoration-line:none;text-decoration-style:solid;text-decoration-color:#000000;letter-spacing:normal;word-spacing:normal;text-transform:none;writing-mode:lr-tb;direction:ltr;text-orientation:mixed;dominant-baseline:auto;baseline-shift:baseline;text-anchor:start;white-space:normal;shape-padding:0;clip-rule:nonzero;display:inline;overflow:visible;visibility:visible;opacity:1;isolation:auto;mix-blend-mode:normal;color-interpolation:sRGB;color-interpolation-filters:linearRGB;solid-color:#000000;solid-opacity:1;vector-effect:none;fill:#013272;fill-opacity:1;fill-rule:nonzero;stroke:none;stroke-width:1.5;stroke-linecap:round;stroke-linejoin:round;stroke-miterlimit:4;stroke-dasharray:none;stroke-dashoffset:0;stroke-opacity:1;color-rendering:auto;image-rendering:auto;shape-rendering:auto;text-rendering:auto;enable-background:accumulate"
     d="M 12.3125,6.75 10.65625,8.4042969 9.75,11.121094 v 2.701172 L 10.617188,15.556641 11.3125,16.25 h 2.509766 l 1.61914,-0.808594 0.830078,-1.660156 0.65625,-5.25 L 16.441406,7.5585938 14.822266,6.75 Z M 12,0.25 h 3 a 0.750075,0.750075 0 0 1 0.236328,0.0390625 l 3,1 a 0.750075,0.750075 0 0 1 0.09961,0.041016 l 2,1 A 0.750075,0.750075 0 0 1 20.53125,2.46875 l 2,2 a 0.750075,0.750075 0 0 1 0.138672,0.1953125 l 1,2 a 0.750075,0.750075 0 0 1 0.04102,0.099609 l 1,3 A 0.750075,0.750075 0 0 1 24.75,10 v 2 a 0.750075,0.750075 0 0 1 -0.03906,0.236328 l -1,3 A 0.750075,0.750075 0 0 1 23.53125,15.53125 l -2,2 A 0.750075,0.750075 0 0 1 21,17.75 H 19.107422 A 0.750075,0.750075 0 0 1 18.611328,17.644531 L 16.664062,16.669922 A 0.750075,0.750075 0 0 1 16.5,16.558594 0.750075,0.750075 0 0 1 16.335938,16.669922 l -2,1 A 0.750075,0.750075 0 0 1 14,17.75 H 11.107422 A 0.750075,0.750075 0 0 1 10.611328,17.644531 L 8.6640625,16.669922 A 0.750075,0.750075 0 0 1 8.3300781,16.335938 l -1,-2 A 0.750075,0.750075 0 0 1 7.25,14 v -3 a 0.750075,0.750075 0 0 1 0.039063,-0.236328 l 1,-3.0000001 A 0.750075,0.750075 0 0 1 8.46875,7.46875 l 1,-1 A 0.750075,0.750075 0 0 1 9.6640625,6.3300781 L 11.617188,5.3535156 A 0.750075,0.750075 0 0 1 12.105469,5.25 H 15 a 0.750075,0.750075 0 0 1 0.335938,0.080078 l 1.875,0.9375 0.04492,-0.3613281 A 0.750075,0.750075 0 0 1 18.501953,5.4316406 0.750075,0.750075 0 0 1 19.744141,6.09375 L 18.75,14.046875 v 1.642578 L 19.3125,16.25 h 1.376953 L 22.34375,14.595703 23.25,11.878906 V 10.121094 L 22.304688,7.2871094 21.382812,5.4433594 19.556641,3.6171875 17.712891,2.6953125 14.878906,1.75 H 12.121094 L 9.2871094,2.6953125 7.4433594,3.6171875 5.6171875,5.4433594 4.6953125,7.2871094 3.75,10.121094 v 2.757812 l 0.9453125,2.833985 0.921875,1.84375 1.8261719,1.826171 1.84375,0.921876 L 12.121094,21.25 h 2.757812 l 2.833985,-0.945312 1.84375,-0.921876 0.912109,-0.914062 a 0.75130096,0.75130096 0 1 1 1.0625,1.0625 l -1,1 a 0.750075,0.750075 0 0 1 -0.195312,0.138672 l -2,1 a 0.750075,0.750075 0 0 1 -0.09961,0.04102 l -3,1 A 0.750075,0.750075 0 0 1 15,22.75 h -3 a 0.750075,0.750075 0 0 1 -0.236328,-0.03906 l -3.0000001,-1 a 0.750075,0.750075 0 0 1 -0.099609,-0.04102 l -2,-1 A 0.750075,0.750075 0 0 1 6.46875,20.53125 l -2,-2 A 0.750075,0.750075 0 0 1 4.3300781,18.335938 l -1,-2 a 0.750075,0.750075 0 0 1 -0.041016,-0.09961 l -1,-3 A 0.750075,0.750075 0 0 1 2.25,13 v -3 a 0.750075,0.750075 0 0 1 0.039063,-0.2363281 l 1,-3 a 0.750075,0.750075 0 0 1 0.041016,-0.099609 l 1,-2 A 0.750075,0.750075 0 0 1 4.46875,4.46875 l 2,-2 A 0.750075,0.750075 0 0 1 6.6640625,2.3300781 l 2,-1 a 0.750075,0.750075 0 0 1 0.099609,-0.041016 l 3.0000001,-1 A 0.750075,0.750075 0 0 1 12,0.25 Z"
     id="path2" />
</svg>
