<?xml version="1.0" encoding="UTF-8" standalone="no"?>
<svg
   xmlns:dc="http://purl.org/dc/elements/1.1/"
   xmlns:cc="http://creativecommons.org/ns#"
   xmlns:rdf="http://www.w3.org/1999/02/22-rdf-syntax-ns#"
   xmlns:svg="http://www.w3.org/2000/svg"
   xmlns="http://www.w3.org/2000/svg"
   xmlns:sodipodi="http://sodipodi.sourceforge.net/DTD/sodipodi-0.dtd"
   xmlns:inkscape="http://www.inkscape.org/namespaces/inkscape"
   data-dec="90"
   width="22"
   height="40"
   version="1.1"
   id="svg4"
   sodipodi:docname="90.svg"
   inkscape:version="0.92.4 (unknown)">
  <metadata
     id="metadata10">
    <rdf:RDF>
      <cc:Work
         rdf:about="">
        <dc:format>image/svg+xml</dc:format>
        <dc:type
           rdf:resource="http://purl.org/dc/dcmitype/StillImage" />
      </cc:Work>
    </rdf:RDF>
  </metadata>
  <defs
     id="defs8" />
  <sodipodi:namedview
     pagecolor="#ffffff"
     bordercolor="#666666"
     borderopacity="1"
     objecttolerance="10"
     gridtolerance="10"
     guidetolerance="10"
     inkscape:pageopacity="0"
     inkscape:pageshadow="2"
     inkscape:window-width="640"
     inkscape:window-height="480"
     id="namedview6"
     showgrid="false"
     inkscape:zoom="5.9"
     inkscape:cx="11"
     inkscape:cy="20"
     inkscape:window-x="0"
     inkscape:window-y="27"
     inkscape:window-maximized="0"
     inkscape:current-layer="svg4" />
  <path
     style="color:#000000;font-style:normal;font-variant:normal;font-weight:normal;font-stretch:normal;font-size:medium;line-height:normal;font-family:sans-serif;font-variant-ligatures:normal;font-variant-position:normal;font-variant-caps:normal;font-variant-numeric:normal;font-variant-alternates:normal;font-feature-settings:normal;text-indent:0;text-align:start;text-decoration:none;text-decoration-line:none;text-decoration-style:solid;text-decoration-color:#000000;letter-spacing:normal;word-spacing:normal;text-transform:none;writing-mode:lr-tb;direction:ltr;text-orientation:mixed;dominant-baseline:auto;baseline-shift:baseline;text-anchor:start;white-space:normal;shape-padding:0;clip-rule:nonzero;display:inline;overflow:visible;visibility:visible;opacity:1;isolation:auto;mix-blend-mode:normal;color-interpolation:sRGB;color-interpolation-filters:linearRGB;solid-color:#000000;solid-opacity:1;vector-effect:none;fill:#000000;fill-opacity:1;fill-rule:nonzero;stroke:none;stroke-width:1.5;stroke-linecap:round;stroke-linejoin:round;stroke-miterlimit:4;stroke-dasharray:none;stroke-dashoffset:0;stroke-opacity:1;color-rendering:auto;image-rendering:auto;shape-rendering:auto;text-rendering:auto;enable-background:accumulate"
     d="M 17.988281,0.24023438 A 0.750075,0.750075 0 0 1 18.123047,0.25 h 0.753906 a 0.750075,0.750075 0 0 1 0.246094,0 h 0.773437 a 0.750075,0.750075 0 0 1 0.726563,0.31445312 0.750075,0.750075 0 0 1 0.02539,0.0410156 0.750075,0.750075 0 0 1 0.01367,0.0234375 0.750075,0.750075 0 0 1 0.002,0.001953 0.750075,0.750075 0 0 1 0.03125,0.0644531 0.750075,0.750075 0 0 1 0.002,0.001953 0.750075,0.750075 0 0 1 0.02539,0.0683594 0.750075,0.750075 0 0 1 -0.201172,0.78125 L 4.9023438,20.841797 5.3105469,21.25 H 16.6875 l 0.78125,-0.78125 a 0.750075,0.750075 0 0 1 0.195312,-0.138672 l 2,-1 a 0.750075,0.750075 0 0 1 1.00586,1.00586 l -1,2 A 0.750075,0.750075 0 0 1 18.875,22.75 h -1.775391 a 0.750075,0.750075 0 0 1 -0.205078,0 H 5 4.1230469 a 0.750075,0.750075 0 0 1 -0.2460938,0 H 3.1230469 a 0.750075,0.750075 0 0 1 -0.2460938,0 H 2.1035156 a 0.750075,0.750075 0 0 1 -0.7265625,-0.314453 0.750075,0.750075 0 0 1 0,-0.002 0.750075,0.750075 0 0 1 -0.039063,-0.0625 0.750075,0.750075 0 0 1 -0.00195,-0.002 0.750075,0.750075 0 0 1 -0.03125,-0.06445 0.750075,0.750075 0 0 1 -0.00195,-0.002 0.750075,0.750075 0 0 1 -0.025391,-0.06836 0.750075,0.750075 0 0 1 0.2011718,-0.78125 L 17.097656,2.1601562 16.6875,1.75 H 5.3125 L 4.5722656,2.4902344 4.53125,2.53125 a 0.750075,0.750075 0 0 1 -0.039063,0.035156 0.750075,0.750075 0 0 1 -0.046875,0.037109 0.750075,0.750075 0 0 1 -0.011719,0.00977 0.750075,0.750075 0 0 1 -0.033203,0.021484 0.750075,0.750075 0 0 1 -0.1308594,0.068359 L 2.3359375,3.6699219 A 0.750075,0.750075 0 0 1 1.3300781,2.6640625 L 2.2753906,0.77539062 A 0.750075,0.750075 0 0 1 2.6015625,0.35742188 0.750075,0.750075 0 0 1 2.6230469,0.34570312 0.750075,0.750075 0 0 1 2.6542969,0.328125 0.750075,0.750075 0 0 1 2.7070312,0.3046875 0.750075,0.750075 0 0 1 3.125,0.25 h 1.7753906 a 0.750075,0.750075 0 0 1 0.2050782,0 H 16.892578 a 0.750075,0.750075 0 0 1 0.199219,0 h 0.785156 a 0.750075,0.750075 0 0 1 0.111328,-0.009766 z"
     id="path2" />
</svg>
