<?xml version="1.0" encoding="UTF-8"?>
<glyph name="Udieresis" format="1">
  <advance width="635"/>
  <unicode hex="00DC"/>
  <outline>
    <component base="dieresis" xOffset="101" yOffset="211"/>
    <component base="U"/>
  </outline>
  <lib>
    <dict>
      <key>com.fontlab.hintData</key>
      <dict>
        <key>hhints</key>
        <array>
          <dict>
            <key>position</key>
            <integer>0</integer>
            <key>width</key>
            <integer>29</integer>
          </dict>
          <dict>
            <key>position</key>
            <integer>615</integer>
            <key>width</key>
            <integer>22</integer>
          </dict>
          <dict>
            <key>position</key>
            <integer>694</integer>
            <key>width</key>
            <integer>87</integer>
          </dict>
        </array>
        <key>vhints</key>
        <array>
          <dict>
            <key>position</key>
            <integer>-29</integer>
            <key>width</key>
            <integer>87</integer>
          </dict>
          <dict>
            <key>position</key>
            <integer>101</integer>
            <key>width</key>
            <integer>29</integer>
          </dict>
          <dict>
            <key>position</key>
            <integer>174</integer>
            <key>width</key>
            <integer>87</integer>
          </dict>
          <dict>
            <key>position</key>
            <integer>507</integer>
            <key>width</key>
            <integer>29</integer>
          </dict>
        </array>
      </dict>
    </dict>
  </lib>
</glyph>
