<?xml version="1.0" encoding="UTF-8" standalone="no"?>
<svg
   xmlns:dc="http://purl.org/dc/elements/1.1/"
   xmlns:cc="http://creativecommons.org/ns#"
   xmlns:rdf="http://www.w3.org/1999/02/22-rdf-syntax-ns#"
   xmlns:svg="http://www.w3.org/2000/svg"
   xmlns="http://www.w3.org/2000/svg"
   xmlns:sodipodi="http://sodipodi.sourceforge.net/DTD/sodipodi-0.dtd"
   xmlns:inkscape="http://www.inkscape.org/namespaces/inkscape"
   data-dec="46"
   width="12"
   height="40"
   version="1.1"
   id="svg4"
   sodipodi:docname="46.svg"
   inkscape:version="0.92.4 5da689c313, 2019-01-14">
  <metadata
     id="metadata10">
    <rdf:RDF>
      <cc:Work
         rdf:about="">
        <dc:format>image/svg+xml</dc:format>
        <dc:type
           rdf:resource="http://purl.org/dc/dcmitype/StillImage" />
        <dc:title></dc:title>
      </cc:Work>
    </rdf:RDF>
  </metadata>
  <defs
     id="defs8" />
  <sodipodi:namedview
     pagecolor="#ffffff"
     bordercolor="#666666"
     borderopacity="1"
     objecttolerance="10"
     gridtolerance="10"
     guidetolerance="10"
     inkscape:pageopacity="0"
     inkscape:pageshadow="2"
     inkscape:window-width="1920"
     inkscape:window-height="1043"
     id="namedview6"
     showgrid="false"
     inkscape:zoom="5.9"
     inkscape:cx="6"
     inkscape:cy="20"
     inkscape:window-x="0"
     inkscape:window-y="37"
     inkscape:window-maximized="0"
     inkscape:current-layer="svg4" />
  <path
     style="color:#000000;font-style:normal;font-variant:normal;font-weight:normal;font-stretch:normal;font-size:medium;line-height:normal;font-family:sans-serif;font-variant-ligatures:normal;font-variant-position:normal;font-variant-caps:normal;font-variant-numeric:normal;font-variant-alternates:normal;font-feature-settings:normal;text-indent:0;text-align:start;text-decoration:none;text-decoration-line:none;text-decoration-style:solid;text-decoration-color:#000000;letter-spacing:normal;word-spacing:normal;text-transform:none;writing-mode:lr-tb;direction:ltr;text-orientation:mixed;dominant-baseline:auto;baseline-shift:baseline;text-anchor:start;white-space:normal;shape-padding:0;clip-rule:nonzero;display:inline;overflow:visible;visibility:visible;opacity:1;isolation:auto;mix-blend-mode:normal;color-interpolation:sRGB;color-interpolation-filters:linearRGB;solid-color:#000000;solid-opacity:1;vector-effect:none;fill:#000000;fill-opacity:1;fill-rule:nonzero;stroke:none;stroke-width:0.5;stroke-linecap:round;stroke-linejoin:round;stroke-miterlimit:4;stroke-dasharray:none;stroke-dashoffset:0;stroke-opacity:1;color-rendering:auto;image-rendering:auto;shape-rendering:auto;text-rendering:auto;enable-background:accumulate"
     d="m 5.25,20.25 v 0.5 h 0.5 v -0.5 z M 4.9960938,19.746094 A 0.250025,0.250025 0 0 1 5.046875,19.75 H 6 A 0.250025,0.250025 0 0 1 6.25,20 v 1 A 0.250025,0.250025 0 0 1 6,21.25 H 5 A 0.250025,0.250025 0 0 1 4.75,21 v -0.958984 a 0.250025,0.250025 0 0 1 0.052734,-0.197266 0.250025,0.250025 0 0 1 0,-0.002 0.250025,0.250025 0 0 1 0.00781,-0.0078 0.250025,0.250025 0 0 1 0.027344,-0.02734 0.250025,0.250025 0 0 1 0.017578,-0.01367 0.250025,0.250025 0 0 1 0.00195,-0.002 0.250025,0.250025 0 0 1 0.00781,-0.0039 0.250025,0.250025 0 0 1 0.013672,-0.0078 0.250025,0.250025 0 0 1 0.1171876,-0.0332 z M 5.1054688,19.25 4.25,20.103516 v 0.792968 L 5.1035156,21.75 H 5.8964844 L 6.75,20.896484 V 20.103516 L 5.8964844,19.25 Z M 4.9941406,18.748047 A 0.250025,0.250025 0 0 1 5.03125,18.75 H 6 a 0.250025,0.250025 0 0 1 0.1777344,0.07227 l 1,1 A 0.250025,0.250025 0 0 1 7.25,20 v 1 a 0.250025,0.250025 0 0 1 -0.072266,0.177734 l -1,1 A 0.250025,0.250025 0 0 1 6,22.25 H 5 a 0.250025,0.250025 0 0 1 -0.1777344,-0.07227 l -1,-1 A 0.250025,0.250025 0 0 1 3.75,21 v -1 a 0.250025,0.250025 0 0 1 0.072266,-0.177734 l 0.9804688,-0.980469 a 0.250025,0.250025 0 0 1 0.019531,-0.01953 0.250025,0.250025 0 0 1 0.013672,-0.01172 0.250025,0.250025 0 0 1 0.041016,-0.0293 0.250025,0.250025 0 0 1 0.00195,-0.002 0.250025,0.250025 0 0 1 0.019531,-0.0098 0.250025,0.250025 0 0 1 0.00391,-0.002 0.250025,0.250025 0 0 1 0.019531,-0.0059 0.250025,0.250025 0 0 1 0.00391,-0.002 0.250025,0.250025 0 0 1 0.00586,-0.002 0.250025,0.250025 0 0 1 0.019531,-0.0039 0.250025,0.250025 0 0 1 0.023437,-0.0039 0.250025,0.250025 0 0 1 0.019531,-0.002 z"
     id="path2" />
</svg>
