<?xml version="1.0" encoding="UTF-8" standalone="no"?>
<svg
   xmlns:dc="http://purl.org/dc/elements/1.1/"
   xmlns:cc="http://creativecommons.org/ns#"
   xmlns:rdf="http://www.w3.org/1999/02/22-rdf-syntax-ns#"
   xmlns:svg="http://www.w3.org/2000/svg"
   xmlns="http://www.w3.org/2000/svg"
   xmlns:sodipodi="http://sodipodi.sourceforge.net/DTD/sodipodi-0.dtd"
   xmlns:inkscape="http://www.inkscape.org/namespaces/inkscape"
   data-dec="102"
   width="14"
   height="40"
   version="1.1"
   id="svg4"
   sodipodi:docname="102.svg"
   inkscape:version="0.92.4 (unknown)">
  <metadata
     id="metadata10">
    <rdf:RDF>
      <cc:Work
         rdf:about="">
        <dc:format>image/svg+xml</dc:format>
        <dc:type
           rdf:resource="http://purl.org/dc/dcmitype/StillImage" />
      </cc:Work>
    </rdf:RDF>
  </metadata>
  <defs
     id="defs8" />
  <sodipodi:namedview
     pagecolor="#ffffff"
     bordercolor="#666666"
     borderopacity="1"
     objecttolerance="10"
     gridtolerance="10"
     guidetolerance="10"
     inkscape:pageopacity="0"
     inkscape:pageshadow="2"
     inkscape:window-width="640"
     inkscape:window-height="480"
     id="namedview6"
     showgrid="false"
     inkscape:zoom="5.9"
     inkscape:cx="7"
     inkscape:cy="20"
     inkscape:window-x="0"
     inkscape:window-y="27"
     inkscape:window-maximized="0"
     inkscape:current-layer="svg4" />
  <path
     style="color:#000000;font-style:normal;font-variant:normal;font-weight:normal;font-stretch:normal;font-size:medium;line-height:normal;font-family:sans-serif;font-variant-ligatures:normal;font-variant-position:normal;font-variant-caps:normal;font-variant-numeric:normal;font-variant-alternates:normal;font-feature-settings:normal;text-indent:0;text-align:start;text-decoration:none;text-decoration-line:none;text-decoration-style:solid;text-decoration-color:#000000;letter-spacing:normal;word-spacing:normal;text-transform:none;writing-mode:lr-tb;direction:ltr;text-orientation:mixed;dominant-baseline:auto;baseline-shift:baseline;text-anchor:start;white-space:normal;shape-padding:0;clip-rule:nonzero;display:inline;overflow:visible;visibility:visible;opacity:1;isolation:auto;mix-blend-mode:normal;color-interpolation:sRGB;color-interpolation-filters:linearRGB;solid-color:#000000;solid-opacity:1;vector-effect:none;fill:#013272;fill-opacity:1;fill-rule:nonzero;stroke:none;stroke-width:0.30000001;stroke-linecap:round;stroke-linejoin:round;stroke-miterlimit:4;stroke-dasharray:none;stroke-dashoffset:0;stroke-opacity:1;color-rendering:auto;image-rendering:auto;shape-rendering:auto;text-rendering:auto;enable-background:accumulate"
     d="m 8.0019531,21.669922 0.091797,0.179687 h 0.2695312 z m -4.0039062,0 -0.3613281,0.179687 H 3.90625 Z m 3.1523437,-0.427734 v 0.607421 h 0.6074219 l -0.203125,-0.404297 z m -2.3007812,0 -0.4042969,0.203124 -0.203125,0.404297 h 0.6074219 z m 2.3007812,-0.605469 v 0.269531 l 0.1796875,0.0918 z m -2.3007812,0 -0.1796875,0.361328 0.1796875,-0.0918 z M 5.1503906,8.1503906 V 19.980469 a 0.15001501,0.15001501 0 0 1 0,0.0293 v 0.96289 a 0.15001501,0.15001501 0 0 1 0,0.04492 v 0.832031 h 1.6992188 v -0.828125 a 0.15001501,0.15001501 0 0 1 0,-0.04492 v -0.96289 a 0.15001501,0.15001501 0 0 1 0,-0.0293 V 8.1503906 H 6.1503906 V 21 A 0.1503906,0.1503906 0 0 1 5.8496094,21 V 8.1503906 Z M 8.2421875,1.546875 7.0878906,2.1230469 6.1308594,3.0800781 5.1503906,6.0234375 V 7.8496094 H 5.8496094 V 6 a 0.15001501,0.15001501 0 0 1 0.00781,-0.046875 l 1,-3 a 0.15008591,0.15008591 0 1 1 0.2851562,0.09375 L 6.1503906,6.0234375 V 7.8496094 H 6.8496094 V 4 a 0.15001501,0.15001501 0 0 1 0.015625,-0.066406 l 1,-2 a 0.15001501,0.15001501 0 0 1 0.029297,-0.039063 z M 8.9960938,0.84765625 a 0.15001501,0.15001501 0 0 1 0.015625,0.001953 H 12 a 0.15001501,0.15001501 0 0 1 0.105469,0.0449219 l 1,0.99999995 A 0.15001501,0.15001501 0 0 1 13.150391,2 V 4 A 0.15001501,0.15001501 0 0 1 13,4.1503906 H 11 A 0.15001501,0.15001501 0 0 1 10.849609,4 V 2 A 0.15001501,0.15001501 0 0 1 11,1.8496094 h 1 A 0.15001501,0.15001501 0 0 1 12.150391,2 V 3 A 0.150391,0.150391 0 1 1 11.849609,3 V 2.1503906 h -0.699218 v 1.6992188 h 1.699218 V 2.0625 L 11.9375,1.1503906 H 9.0605469 l -0.9375,0.9375 -0.9726563,1.9472656 V 7.8496094 H 11 a 0.1503906,0.1503906 0 1 1 0,0.3007812 H 7.1503906 V 19.964844 l 0.6289063,1.255859 1.2558593,0.628906 H 10 a 0.150391,0.150391 0 1 1 0,0.300782 H 9.0195312 8.9902344 8.0273438 a 0.15001501,0.15001501 0 0 1 -0.044922,0 H 7.0175781 a 0.15001501,0.15001501 0 0 1 -0.044922,0 H 5.0175781 a 0.15001501,0.15001501 0 0 1 -0.044922,0 H 4.0214844 a 0.15001501,0.15001501 0 0 1 -0.044922,0 H 3.0136719 2.984375 2 A 0.150391,0.150391 0 0 1 2,21.849609 H 2.9648438 L 4.2207031,21.220703 4.8496094,19.964844 V 8.1503906 H 2 A 0.1503906,0.1503906 0 1 1 2,7.8496094 H 4.8496094 V 6 a 0.15001501,0.15001501 0 0 1 0.00781,-0.046875 l 1,-3 a 0.15001501,0.15001501 0 0 1 0.037109,-0.058594 l 1,-1 a 0.15001501,0.15001501 0 0 1 0.039063,-0.029297 L 8.9257812,0.86914062 a 0.15001501,0.15001501 0 0 1 0.00781,-0.003906 0.15001501,0.15001501 0 0 1 0.00586,-0.003906 0.15001501,0.15001501 0 0 1 0.015625,-0.003906 0.15001501,0.15001501 0 0 1 0.041016,-0.009766 z"
     id="path2" />
</svg>
