<?xml version="1.0" encoding="UTF-8" standalone="no"?>
<svg
   xmlns:dc="http://purl.org/dc/elements/1.1/"
   xmlns:cc="http://creativecommons.org/ns#"
   xmlns:rdf="http://www.w3.org/1999/02/22-rdf-syntax-ns#"
   xmlns:svg="http://www.w3.org/2000/svg"
   xmlns="http://www.w3.org/2000/svg"
   xmlns:sodipodi="http://sodipodi.sourceforge.net/DTD/sodipodi-0.dtd"
   xmlns:inkscape="http://www.inkscape.org/namespaces/inkscape"
   data-dec="66"
   width="19"
   height="40"
   version="1.1"
   id="svg4"
   sodipodi:docname="66.svg"
   inkscape:version="0.92.4 (unknown)">
  <metadata
     id="metadata10">
    <rdf:RDF>
      <cc:Work
         rdf:about="">
        <dc:format>image/svg+xml</dc:format>
        <dc:type
           rdf:resource="http://purl.org/dc/dcmitype/StillImage" />
      </cc:Work>
    </rdf:RDF>
  </metadata>
  <defs
     id="defs8" />
  <sodipodi:namedview
     pagecolor="#ffffff"
     bordercolor="#666666"
     borderopacity="1"
     objecttolerance="10"
     gridtolerance="10"
     guidetolerance="10"
     inkscape:pageopacity="0"
     inkscape:pageshadow="2"
     inkscape:window-width="640"
     inkscape:window-height="480"
     id="namedview6"
     showgrid="false"
     inkscape:zoom="5.9"
     inkscape:cx="9.5"
     inkscape:cy="20"
     inkscape:window-x="0"
     inkscape:window-y="27"
     inkscape:window-maximized="0"
     inkscape:current-layer="svg4" />
  <path
     style="color:#000000;font-style:normal;font-variant:normal;font-weight:normal;font-stretch:normal;font-size:medium;line-height:normal;font-family:sans-serif;font-variant-ligatures:normal;font-variant-position:normal;font-variant-caps:normal;font-variant-numeric:normal;font-variant-alternates:normal;font-feature-settings:normal;text-indent:0;text-align:start;text-decoration:none;text-decoration-line:none;text-decoration-style:solid;text-decoration-color:#000000;letter-spacing:normal;word-spacing:normal;text-transform:none;writing-mode:lr-tb;direction:ltr;text-orientation:mixed;dominant-baseline:auto;baseline-shift:baseline;text-anchor:start;white-space:normal;shape-padding:0;clip-rule:nonzero;display:inline;overflow:visible;visibility:visible;opacity:1;isolation:auto;mix-blend-mode:normal;color-interpolation:sRGB;color-interpolation-filters:linearRGB;solid-color:#000000;solid-opacity:1;vector-effect:none;fill:#000000;fill-opacity:1;fill-rule:nonzero;stroke:none;stroke-width:3;stroke-linecap:round;stroke-linejoin:round;stroke-miterlimit:4;stroke-dasharray:none;stroke-dashoffset:0;stroke-opacity:1;color-rendering:auto;image-rendering:auto;shape-rendering:auto;text-rendering:auto;enable-background:accumulate"
     d="m 5.5,13.5 v 7 h 6.255859 L 14.189453,19.689453 14.767578,19.111328 15.5,17.646484 V 16.353516 L 14.767578,14.888672 14.189453,14.310547 11.755859,13.5 Z m 0,-9 v 6 h 6.253906 L 13.935547,9.7734375 14.5,8.6464844 V 7.3535156 L 13.767578,5.8886719 13.189453,5.3105469 10.755859,4.5 Z M 3.9765625,1.4785156 A 1.50015,1.50015 0 0 1 4.2460938,1.5 H 11 a 1.50015,1.50015 0 0 1 0.474609,0.076172 l 3,1 a 1.50015,1.50015 0 0 1 0.585938,0.3632812 l 1,1 a 1.50015,1.50015 0 0 1 0.28125,0.390625 l 1,2 A 1.50015,1.50015 0 0 1 17.5,7 v 2 a 1.50015,1.50015 0 0 1 -0.158203,0.6699219 l -1,2.0000001 a 1.50015,1.50015 0 0 1 -0.222656,0.328125 l 0.941406,0.941406 a 1.50015,1.50015 0 0 1 0.28125,0.390625 l 1,2 A 1.50015,1.50015 0 0 1 18.5,16 v 2 a 1.50015,1.50015 0 0 1 -0.158203,0.669922 l -1,2 a 1.50015,1.50015 0 0 1 -0.28125,0.390625 l -1,1 a 1.50015,1.50015 0 0 1 -0.585938,0.363281 l -3,1 A 1.50015,1.50015 0 0 1 12,23.5 H 4.2402344 a 1.50015,1.50015 0 0 1 -1.2773438,-0.396484 1.50015,1.50015 0 0 1 -0.019531,-0.01953 1.50015,1.50015 0 0 1 -0.00781,-0.0078 A 1.50015,1.50015 0 0 1 2.5,21.753906 v -9.513672 a 1.50015,1.50015 0 0 1 0,-0.486328 V 3.2402344 a 1.50015,1.50015 0 0 1 0.3964844,-1.2773438 1.50015,1.50015 0 0 1 0.019531,-0.019531 1.50015,1.50015 0 0 1 0.00781,-0.00781 1.50015,1.50015 0 0 1 1.0527344,-0.4570313 z"
     id="path2" />
</svg>
