<?xml version="1.0" encoding="UTF-8" standalone="no"?>
<svg
   xmlns:dc="http://purl.org/dc/elements/1.1/"
   xmlns:cc="http://creativecommons.org/ns#"
   xmlns:rdf="http://www.w3.org/1999/02/22-rdf-syntax-ns#"
   xmlns:svg="http://www.w3.org/2000/svg"
   xmlns="http://www.w3.org/2000/svg"
   xmlns:sodipodi="http://sodipodi.sourceforge.net/DTD/sodipodi-0.dtd"
   xmlns:inkscape="http://www.inkscape.org/namespaces/inkscape"
   data-dec="77"
   width="25"
   height="40"
   version="1.1"
   id="svg4"
   sodipodi:docname="77.svg"
   inkscape:version="0.92.4 5da689c313, 2019-01-14">
  <metadata
     id="metadata10">
    <rdf:RDF>
      <cc:Work
         rdf:about="">
        <dc:format>image/svg+xml</dc:format>
        <dc:type
           rdf:resource="http://purl.org/dc/dcmitype/StillImage" />
        <dc:title></dc:title>
      </cc:Work>
    </rdf:RDF>
  </metadata>
  <defs
     id="defs8" />
  <sodipodi:namedview
     pagecolor="#ffffff"
     bordercolor="#666666"
     borderopacity="1"
     objecttolerance="10"
     gridtolerance="10"
     guidetolerance="10"
     inkscape:pageopacity="0"
     inkscape:pageshadow="2"
     inkscape:window-width="1920"
     inkscape:window-height="1043"
     id="namedview6"
     showgrid="false"
     inkscape:zoom="5.9"
     inkscape:cx="12.5"
     inkscape:cy="20"
     inkscape:window-x="0"
     inkscape:window-y="37"
     inkscape:window-maximized="0"
     inkscape:current-layer="svg4" />
  <path
     style="color:#000000;font-style:normal;font-variant:normal;font-weight:normal;font-stretch:normal;font-size:medium;line-height:normal;font-family:sans-serif;font-variant-ligatures:normal;font-variant-position:normal;font-variant-caps:normal;font-variant-numeric:normal;font-variant-alternates:normal;font-feature-settings:normal;text-indent:0;text-align:start;text-decoration:none;text-decoration-line:none;text-decoration-style:solid;text-decoration-color:#000000;letter-spacing:normal;word-spacing:normal;text-transform:none;writing-mode:lr-tb;direction:ltr;text-orientation:mixed;dominant-baseline:auto;baseline-shift:baseline;text-anchor:start;white-space:normal;shape-padding:0;clip-rule:nonzero;display:inline;overflow:visible;visibility:visible;opacity:1;isolation:auto;mix-blend-mode:normal;color-interpolation:sRGB;color-interpolation-filters:linearRGB;solid-color:#000000;solid-opacity:1;vector-effect:none;fill:#000000;fill-opacity:1;fill-rule:nonzero;stroke:none;stroke-width:0.5;stroke-linecap:round;stroke-linejoin:round;stroke-miterlimit:4;stroke-dasharray:none;stroke-dashoffset:0;stroke-opacity:1;color-rendering:auto;image-rendering:auto;shape-rendering:auto;text-rendering:auto;enable-background:accumulate"
     d="M 19.714844,21.640625 19.605469,21.75 h 0.121093 z m -15.4296878,0 L 4.2734375,21.75 H 4.3945312 Z M 21.208984,21.564453 21.226562,21.75 h 0.167969 z m -17.4179684,0 L 3.6054688,21.75 H 3.7734375 Z M 19.273438,1.25 19.285156,1.359375 19.394531,1.25 Z m -1,0 1.861328,19.535156 a 0.250025,0.250025 0 0 1 0.04297,0.392578 l -0.0059,0.0059 0.05469,0.566406 h 0.5 L 18.865234,2.2148438 a 0.250025,0.250025 0 0 1 -0.04297,-0.3925782 l 0.0059,-0.00586 L 18.773438,1.25 Z M 5.6054688,1.25 5.7148438,1.359375 5.7265625,1.25 Z m 0.390625,-0.50390625 a 0.250025,0.250025 0 0 1 0.023437,0.001953 0.250025,0.250025 0 0 1 0.00586,0 0.250025,0.250025 0 0 1 0.00586,0 0.250025,0.250025 0 0 1 0.00781,0.001953 0.250025,0.250025 0 0 1 0.00586,0 H 6.953125 a 0.250025,0.250025 0 0 1 0.1132812,0.007813 0.250025,0.250025 0 0 1 0.00977,0.001953 0.250025,0.250025 0 0 1 0.013672,0.005859 0.250025,0.250025 0 0 1 0.023437,0.009766 0.250025,0.250025 0 0 1 0.00781,0.003906 0.250025,0.250025 0 0 1 0.013672,0.007813 0.250025,0.250025 0 0 1 0.027344,0.0214844 0.250025,0.250025 0 0 1 0.013672,0.009766 0.250025,0.250025 0 0 1 0.00586,0.005859 0.250025,0.250025 0 0 1 0.00977,0.0117188 0.250025,0.250025 0 0 1 0.00586,0.007813 0.250025,0.250025 0 0 1 0.054687,0.13476562 L 12.240234,18.933594 a 0.250025,0.250025 0 1 1 -0.480468,0.132812 L 6.8105469,1.25 H 6.3320312 L 12,21.089844 17.748047,0.97070312 a 0.250025,0.250025 0 0 1 0.01758,-0.0625 0.250025,0.250025 0 0 1 0,-0.001953 0.250025,0.250025 0 0 1 0.0078,-0.015625 0.250025,0.250025 0 0 1 0.002,-0.005859 0.250025,0.250025 0 0 1 0,-0.001953 0.250025,0.250025 0 0 1 0.01172,-0.0195313 0.250025,0.250025 0 0 1 0,-0.001953 0.250025,0.250025 0 0 1 0.0078,-0.009766 0.250025,0.250025 0 0 1 0.0078,-0.007813 0.250025,0.250025 0 0 1 0.0039,-0.003906 0.250025,0.250025 0 0 1 0.0078,-0.009766 0.250025,0.250025 0 0 1 0.0039,-0.005859 0.250025,0.250025 0 0 1 0.01367,-0.0136719 0.250025,0.250025 0 0 1 0.0039,-0.003906 0.250025,0.250025 0 0 1 0.01562,-0.0117187 0.250025,0.250025 0 0 1 0.0039,-0.003906 0.250025,0.250025 0 0 1 0.0039,-0.001953 0.250025,0.250025 0 0 1 0.01367,-0.007813 0.250025,0.250025 0 0 1 0.01758,-0.009766 0.250025,0.250025 0 0 1 0.0098,-0.003906 0.250025,0.250025 0 0 1 0.002,0 0.250025,0.250025 0 0 1 0.01563,-0.007813 0.250025,0.250025 0 0 1 0.0039,0 0.250025,0.250025 0 0 1 0.002,-0.001953 0.250025,0.250025 0 0 1 0.02344,-0.005859 0.250025,0.250025 0 0 1 0.01953,-0.003906 0.250025,0.250025 0 0 1 0.05078,0 0.250025,0.250025 0 0 1 0.0039,0 0.250025,0.250025 0 0 1 0.01953,0.001953 h 0.0059 0.914063 a 0.250025,0.250025 0 0 1 0.08594,0 H 20 21 a 0.250025,0.250025 0 0 1 0,0.5 h -0.896484 l -0.757813,0.7578125 1.789063,18.7812495 a 0.250025,0.250025 0 0 1 0.04297,0.0332 L 22.103516,21.75 H 23 a 0.250025,0.250025 0 0 1 0,0.5 h -1.021484 -0.939454 a 0.250025,0.250025 0 0 1 -0.08594,0 h -0.914063 a 0.250025,0.250025 0 0 1 -0.08594,0 H 19 18 a 0.250025,0.250025 0 0 1 0,-0.5 h 0.896484 L 19.654297,20.992188 17.876953,2.3398438 12.248047,22.039062 a 0.250025,0.250025 0 0 1 -0.01563,0.05664 0.250025,0.250025 0 0 1 -0.0059,0.01367 0.250025,0.250025 0 0 1 -0.0039,0.0098 0.250025,0.250025 0 0 1 -0.0078,0.01172 0.250025,0.250025 0 0 1 -0.01367,0.02148 0.250025,0.250025 0 0 1 -0.0059,0.0078 0.250025,0.250025 0 0 1 -0.02539,0.02734 0.250025,0.250025 0 0 1 -0.002,0.002 0.250025,0.250025 0 0 1 -0.0078,0.0059 0.250025,0.250025 0 0 1 -0.01172,0.0098 0.250025,0.250025 0 0 1 -0.0078,0.0059 0.250025,0.250025 0 0 1 -0.03516,0.01953 0.250025,0.250025 0 0 1 -0.01563,0.0059 0.250025,0.250025 0 0 1 -0.04102,0.01172 0.250025,0.250025 0 0 1 -0.02539,0.0039 0.250025,0.250025 0 0 1 -0.01563,0.002 0.250025,0.250025 0 0 1 -0.0332,-0.002 0.250025,0.250025 0 0 1 -0.02148,-0.0039 0.250025,0.250025 0 0 1 -0.0039,0 0.250025,0.250025 0 0 1 -0.03125,-0.0098 0.250025,0.250025 0 0 1 -0.01563,-0.0059 0.250025,0.250025 0 0 1 -0.01563,-0.0059 0.250025,0.250025 0 0 1 -0.0059,-0.002 0.250025,0.250025 0 0 1 -0.0039,-0.0039 0.250025,0.250025 0 0 1 -0.03906,-0.02734 0.250025,0.250025 0 0 1 -0.01172,-0.0098 0.250025,0.250025 0 0 1 -0.0059,-0.0078 0.250025,0.250025 0 0 1 -0.03125,-0.03906 0.250025,0.250025 0 0 1 -0.0078,-0.01172 0.250025,0.250025 0 0 1 -0.0039,-0.0098 0.250025,0.250025 0 0 1 -0.02539,-0.07617 L 6.1230469,2.3398438 4.3457031,20.992188 5.1035156,21.75 H 6 a 0.250025,0.250025 0 0 1 0,0.5 H 4.9785156 4.0429688 a 0.250025,0.250025 0 0 1 -0.087891,0 H 3 2 a 0.250025,0.250025 0 0 1 0,-0.5 H 2.8964844 L 3.796875,20.847656 a 0.250025,0.250025 0 0 1 0.025391,-0.02539 0.250025,0.250025 0 0 1 0.042969,-0.03711 L 5.6542969,2.0078125 4.8964844,1.25 H 4 a 0.250025,0.250025 0 0 1 0,-0.5 h 1 0.021484 0.9355468 a 0.250025,0.250025 0 0 1 0.00781,0 0.250025,0.250025 0 0 1 0.03125,-0.003906 z"
     id="path2" />
</svg>
