<?xml version="1.0" encoding="UTF-8" standalone="no"?>
<svg
   xmlns:dc="http://purl.org/dc/elements/1.1/"
   xmlns:cc="http://creativecommons.org/ns#"
   xmlns:rdf="http://www.w3.org/1999/02/22-rdf-syntax-ns#"
   xmlns:svg="http://www.w3.org/2000/svg"
   xmlns="http://www.w3.org/2000/svg"
   xmlns:sodipodi="http://sodipodi.sourceforge.net/DTD/sodipodi-0.dtd"
   xmlns:inkscape="http://www.inkscape.org/namespaces/inkscape"
   data-dec="56"
   width="17"
   height="40"
   version="1.1"
   id="svg4"
   sodipodi:docname="56.svg"
   inkscape:version="0.92.4 (unknown)">
  <metadata
     id="metadata10">
    <rdf:RDF>
      <cc:Work
         rdf:about="">
        <dc:format>image/svg+xml</dc:format>
        <dc:type
           rdf:resource="http://purl.org/dc/dcmitype/StillImage" />
      </cc:Work>
    </rdf:RDF>
  </metadata>
  <defs
     id="defs8" />
  <sodipodi:namedview
     pagecolor="#ffffff"
     bordercolor="#666666"
     borderopacity="1"
     objecttolerance="10"
     gridtolerance="10"
     guidetolerance="10"
     inkscape:pageopacity="0"
     inkscape:pageshadow="2"
     inkscape:window-width="640"
     inkscape:window-height="480"
     id="namedview6"
     showgrid="false"
     inkscape:zoom="5.9"
     inkscape:cx="8.5"
     inkscape:cy="20"
     inkscape:window-x="0"
     inkscape:window-y="27"
     inkscape:window-maximized="0"
     inkscape:current-layer="svg4" />
  <path
     style="color:#000000;font-style:normal;font-variant:normal;font-weight:normal;font-stretch:normal;font-size:medium;line-height:normal;font-family:sans-serif;font-variant-ligatures:normal;font-variant-position:normal;font-variant-caps:normal;font-variant-numeric:normal;font-variant-alternates:normal;font-feature-settings:normal;text-indent:0;text-align:start;text-decoration:none;text-decoration-line:none;text-decoration-style:solid;text-decoration-color:#000000;letter-spacing:normal;word-spacing:normal;text-transform:none;writing-mode:lr-tb;direction:ltr;text-orientation:mixed;dominant-baseline:auto;baseline-shift:baseline;text-anchor:start;white-space:normal;shape-padding:0;clip-rule:nonzero;display:inline;overflow:visible;visibility:visible;opacity:1;isolation:auto;mix-blend-mode:normal;color-interpolation:sRGB;color-interpolation-filters:linearRGB;solid-color:#000000;solid-opacity:1;vector-effect:none;fill:#013272;fill-opacity:1;fill-rule:nonzero;stroke:none;stroke-width:2;stroke-linecap:round;stroke-linejoin:round;stroke-miterlimit:4;stroke-dasharray:none;stroke-dashoffset:0;stroke-opacity:1;color-rendering:auto;image-rendering:auto;shape-rendering:auto;text-rendering:auto;enable-background:accumulate"
     d="M 7.1640625,11 4.5410156,11.875 3.8222656,12.591797 3,14.236328 v 3.527344 L 3.8222656,19.408203 4.5410156,20.125 7.1621094,21 H 9.8378906 L 12.458984,20.125 13.177734,19.408203 14,17.763672 V 14.236328 L 13.177734,12.591797 12.458984,11.875 9.8359375,11 Z m 0,-9 L 4.7089844,2.8183594 4,4.2363281 V 6.7636719 L 4.7089844,8.1816406 7.1621094,9 H 9.8378906 L 12.291016,8.1816406 13,6.7636719 V 4.2363281 L 12.291016,2.8183594 9.8378906,2 Z M 7.046875,-0.00390625 A 1.0001,1.0001 0 0 1 7.0976562,0 H 10 a 1.0001,1.0001 0 0 1 0.316406,0.05078125 l 3,0.99999995 a 1.0001,1.0001 0 0 1 0.578125,0.5019532 l 1,2 A 1.0001,1.0001 0 0 1 15,4 v 3 a 1.0001,1.0001 0 0 1 -0.105469,0.4472656 l -1,2 A 1.0001,1.0001 0 0 1 13.316406,9.9492188 L 13.164062,10 l 0.152344,0.05078 a 1.0001,1.0001 0 0 1 0.390625,0.242188 l 1,1 a 1.0001,1.0001 0 0 1 0.1875,0.259765 l 1,2 A 1.0001,1.0001 0 0 1 16,14 v 4 a 1.0001,1.0001 0 0 1 -0.105469,0.447266 l -1,2 a 1.0001,1.0001 0 0 1 -0.1875,0.259765 l -1,1 a 1.0001,1.0001 0 0 1 -0.390625,0.242188 l -3,1 A 1.0001,1.0001 0 0 1 10,23 H 7 a 1.0001,1.0001 0 0 1 -0.3164062,-0.05078 l -3,-1 a 1.0001,1.0001 0 0 1 -0.390625,-0.242188 l -1,-1 a 1.0001,1.0001 0 0 1 -0.1875,-0.259765 l -1,-2 A 1.0001,1.0001 0 0 1 1,18 v -4 a 1.0001,1.0001 0 0 1 0.1054688,-0.447266 l 1,-2 a 1.0001,1.0001 0 0 1 0.1875,-0.259765 l 1,-1 a 1.0001,1.0001 0 0 1 0.390625,-0.242188 L 3.8359375,10 3.6835938,9.9492188 A 1.0001,1.0001 0 0 1 3.1054688,9.4472656 l -1,-2 A 1.0001,1.0001 0 0 1 2,7 V 4 A 1.0001,1.0001 0 0 1 2.1054688,3.5527344 l 1,-2 A 1.0001,1.0001 0 0 1 3.6835938,1.0507812 L 6.5996094,0.078125 a 1.0001,1.0001 0 0 1 0.00977,-0.0039063 1.0001,1.0001 0 0 1 0.2207031,-0.06054687 1.0001,1.0001 0 0 1 0.070312,-0.00976563 1.0001,1.0001 0 0 1 0.1464844,-0.0078125 z"
     id="path2" />
</svg>
