<?xml version="1.0" encoding="UTF-8"?>
<glyph name="P" format="1">
  <advance width="578"/>
  <unicode hex="0050"/>
  <outline>
    <contour>
      <point x="160" y="42" type="line" smooth="yes"/>
      <point x="160" y="35"/>
      <point x="154" y="30"/>
      <point x="147" y="29" type="curve" smooth="yes"/>
      <point x="160" y="29" type="line"/>
    </contour>
    <contour>
      <point x="130" y="43" type="curve" smooth="yes"/>
      <point x="130" y="29" type="line"/>
      <point x="142" y="29" type="line" smooth="yes"/>
      <point x="135" y="30"/>
      <point x="130" y="36"/>
    </contour>
    <contour>
      <point x="188" y="550" type="line"/>
      <point x="188" y="376" type="line"/>
      <point x="402" y="376" type="line"/>
      <point x="449" y="399" type="line"/>
      <point x="449" y="526" type="line"/>
      <point x="402" y="550" type="line"/>
    </contour>
    <contour>
      <point x="160" y="579" type="line"/>
      <point x="160" y="566" type="line" smooth="yes"/>
      <point x="160" y="568"/>
      <point x="161" y="572"/>
      <point x="162" y="573" type="curve" smooth="yes"/>
      <point x="163" y="573" type="line"/>
      <point x="163" y="574" type="line"/>
      <point x="164" y="575" type="line" smooth="yes"/>
      <point x="166" y="576"/>
      <point x="170" y="579"/>
      <point x="172" y="579" type="curve" smooth="yes"/>
    </contour>
    <contour>
      <point x="130" y="607" type="line"/>
      <point x="130" y="595" type="line" smooth="yes"/>
      <point x="130" y="597"/>
      <point x="132" y="601"/>
      <point x="133" y="602" type="curve" smooth="yes"/>
      <point x="133" y="603" type="line"/>
      <point x="134" y="603" type="line"/>
      <point x="134" y="604" type="line"/>
      <point x="135" y="604" type="line" smooth="yes"/>
      <point x="137" y="605"/>
      <point x="140" y="607"/>
      <point x="142" y="607" type="curve" smooth="yes"/>
    </contour>
    <contour>
      <point x="116" y="637" type="curve" smooth="yes"/>
      <point x="118" y="637" type="line"/>
      <point x="375" y="637" type="line"/>
      <point x="376" y="637" type="line"/>
      <point x="377" y="637" type="line"/>
      <point x="378" y="637" type="line"/>
      <point x="380" y="636" type="line"/>
      <point x="382" y="636" type="line"/>
      <point x="468" y="607" type="line" smooth="yes"/>
      <point x="470" y="606"/>
      <point x="472" y="605"/>
      <point x="473" y="604" type="curve" smooth="yes"/>
      <point x="503" y="574" type="line" smooth="yes"/>
      <point x="504" y="573"/>
      <point x="504" y="572"/>
      <point x="505" y="571" type="curve" smooth="yes"/>
      <point x="534" y="513" type="line" smooth="yes"/>
      <point x="535" y="511"/>
      <point x="536" y="508"/>
      <point x="536" y="506" type="curve" smooth="yes"/>
      <point x="536" y="419" type="line" smooth="yes"/>
      <point x="536" y="417"/>
      <point x="535" y="414"/>
      <point x="534" y="412" type="curve" smooth="yes"/>
      <point x="505" y="355" type="line" smooth="yes"/>
      <point x="504" y="354"/>
      <point x="504" y="352"/>
      <point x="503" y="351" type="curve" smooth="yes"/>
      <point x="473" y="322" type="line" smooth="yes"/>
      <point x="472" y="321"/>
      <point x="471" y="321"/>
      <point x="470" y="320" type="curve" smooth="yes"/>
      <point x="414" y="292" type="line" smooth="yes"/>
      <point x="413" y="291"/>
      <point x="409" y="289"/>
      <point x="407" y="289" type="curve" smooth="yes"/>
      <point x="406" y="289" type="line"/>
      <point x="405" y="289" type="line"/>
      <point x="188" y="289" type="line"/>
      <point x="188" y="14" type="line" smooth="yes"/>
      <point x="188" y="6"/>
      <point x="182" y="0"/>
      <point x="174" y="0" type="curve" smooth="yes"/>
      <point x="118" y="0" type="line"/>
      <point x="116" y="0" type="line" smooth="yes"/>
      <point x="113" y="0"/>
      <point x="109" y="0"/>
      <point x="107" y="2" type="curve" smooth="yes"/>
      <point x="107" y="3" type="line"/>
      <point x="106" y="3" type="line"/>
      <point x="104" y="4" type="line" smooth="yes"/>
      <point x="102" y="6"/>
      <point x="101" y="11"/>
      <point x="101" y="14" type="curve" smooth="yes"/>
      <point x="101" y="16" type="line"/>
      <point x="101" y="619" type="line"/>
      <point x="101" y="623" type="line" smooth="yes"/>
      <point x="101" y="626"/>
      <point x="102" y="629"/>
      <point x="104" y="631" type="curve" smooth="yes"/>
      <point x="106" y="632" type="line"/>
      <point x="107" y="634" type="line" smooth="yes"/>
      <point x="109" y="636"/>
      <point x="113" y="637"/>
    </contour>
  </outline>
  <lib>
    <dict>
      <key>com.fontlab.hintData</key>
      <dict>
        <key>hhints</key>
        <array>
          <dict>
            <key>position</key>
            <integer>0</integer>
            <key>width</key>
            <integer>29</integer>
          </dict>
          <dict>
            <key>position</key>
            <integer>289</integer>
            <key>width</key>
            <integer>87</integer>
          </dict>
          <dict>
            <key>position</key>
            <integer>550</integer>
            <key>width</key>
            <integer>87</integer>
          </dict>
          <dict>
            <key>position</key>
            <integer>607</integer>
            <key>width</key>
            <integer>30</integer>
          </dict>
        </array>
        <key>vhints</key>
        <array>
          <dict>
            <key>position</key>
            <integer>101</integer>
            <key>width</key>
            <integer>29</integer>
          </dict>
          <dict>
            <key>position</key>
            <integer>130</integer>
            <key>width</key>
            <integer>30</integer>
          </dict>
          <dict>
            <key>position</key>
            <integer>160</integer>
            <key>width</key>
            <integer>29</integer>
          </dict>
          <dict>
            <key>position</key>
            <integer>449</integer>
            <key>width</key>
            <integer>87</integer>
          </dict>
        </array>
      </dict>
    </dict>
  </lib>
</glyph>
