<?xml version="1.0" encoding="UTF-8"?>
<glyph name="ecircumflex" format="1">
  <advance width="520"/>
  <unicode hex="00EA"/>
  <outline>
    <component base="asciicircum" xOffset="-43" yOffset="96"/>
    <component base="e"/>
  </outline>
  <lib>
    <dict>
      <key>com.fontlab.hintData</key>
      <dict>
        <key>hhints</key>
        <array>
          <dict>
            <key>position</key>
            <integer>0</integer>
            <key>width</key>
            <integer>23</integer>
          </dict>
          <dict>
            <key>position</key>
            <integer>173</integer>
            <key>width</key>
            <integer>117</integer>
          </dict>
          <dict>
            <key>position</key>
            <integer>441</integer>
            <key>width</key>
            <integer>22</integer>
          </dict>
          <dict>
            <key>position</key>
            <integer>524</integer>
            <key>width</key>
            <integer>200</integer>
          </dict>
        </array>
      </dict>
    </dict>
  </lib>
</glyph>
