<?xml version="1.0" encoding="UTF-8" standalone="no"?>
<svg
   xmlns:dc="http://purl.org/dc/elements/1.1/"
   xmlns:cc="http://creativecommons.org/ns#"
   xmlns:rdf="http://www.w3.org/1999/02/22-rdf-syntax-ns#"
   xmlns:svg="http://www.w3.org/2000/svg"
   xmlns="http://www.w3.org/2000/svg"
   xmlns:sodipodi="http://sodipodi.sourceforge.net/DTD/sodipodi-0.dtd"
   xmlns:inkscape="http://www.inkscape.org/namespaces/inkscape"
   data-dec="113"
   width="20"
   height="40"
   version="1.1"
   id="svg4"
   sodipodi:docname="113.svg"
   inkscape:version="0.92.4 5da689c313, 2019-01-14">
  <metadata
     id="metadata10">
    <rdf:RDF>
      <cc:Work
         rdf:about="">
        <dc:format>image/svg+xml</dc:format>
        <dc:type
           rdf:resource="http://purl.org/dc/dcmitype/StillImage" />
        <dc:title></dc:title>
      </cc:Work>
    </rdf:RDF>
  </metadata>
  <defs
     id="defs8" />
  <sodipodi:namedview
     pagecolor="#ffffff"
     bordercolor="#666666"
     borderopacity="1"
     objecttolerance="10"
     gridtolerance="10"
     guidetolerance="10"
     inkscape:pageopacity="0"
     inkscape:pageshadow="2"
     inkscape:window-width="1920"
     inkscape:window-height="1043"
     id="namedview6"
     showgrid="false"
     inkscape:zoom="5.9"
     inkscape:cx="10"
     inkscape:cy="20"
     inkscape:window-x="0"
     inkscape:window-y="37"
     inkscape:window-maximized="0"
     inkscape:current-layer="svg4" />
  <path
     style="color:#000000;font-style:normal;font-variant:normal;font-weight:normal;font-stretch:normal;font-size:medium;line-height:normal;font-family:sans-serif;font-variant-ligatures:normal;font-variant-position:normal;font-variant-caps:normal;font-variant-numeric:normal;font-variant-alternates:normal;font-feature-settings:normal;text-indent:0;text-align:start;text-decoration:none;text-decoration-line:none;text-decoration-style:solid;text-decoration-color:#000000;letter-spacing:normal;word-spacing:normal;text-transform:none;writing-mode:lr-tb;direction:ltr;text-orientation:mixed;dominant-baseline:auto;baseline-shift:baseline;text-anchor:start;white-space:normal;shape-padding:0;clip-rule:nonzero;display:inline;overflow:visible;visibility:visible;opacity:1;isolation:auto;mix-blend-mode:normal;color-interpolation:sRGB;color-interpolation-filters:linearRGB;solid-color:#000000;solid-opacity:1;vector-effect:none;fill:#000000;fill-opacity:1;fill-rule:nonzero;stroke:none;stroke-width:2.5;stroke-linecap:round;stroke-linejoin:round;stroke-miterlimit:4;stroke-dasharray:none;stroke-dashoffset:0;stroke-opacity:1;color-rendering:auto;image-rendering:auto;shape-rendering:auto;text-rendering:auto;enable-background:accumulate"
     d="M 8.2949219,10.25 6.7402344,11.027344 6.0917969,11.675781 5.25,14.203125 v 1.59375 L 6.0917969,18.324219 6.7402344,18.972656 8.2949219,19.75 H 10.705078 L 13.75,18.228516 V 11.771484 L 10.705078,10.25 Z M 14.980469,6.7324219 A 1.250125,1.250125 0 0 1 15.203125,6.75 H 16 A 1.250125,1.250125 0 0 1 17.25,8 v 20.800781 a 1.250125,1.250125 0 0 1 -0.332031,1.066407 1.250125,1.250125 0 0 1 -0.0078,0.0078 1.250125,1.250125 0 0 1 -0.0078,0.0078 1.250125,1.250125 0 0 1 -0.0059,0.0059 A 1.250125,1.250125 0 0 1 15.796875,30.25 H 15 A 1.250125,1.250125 0 0 1 13.75,29 v -7.001953 a 1.250125,1.250125 0 0 1 -0.191406,0.119141 l -2,1 A 1.250125,1.250125 0 0 1 11,23.25 H 8 A 1.250125,1.250125 0 0 1 7.4414062,23.117188 l -2,-1 A 1.250125,1.250125 0 0 1 5.1152344,21.884766 l -2,-2 A 1.250125,1.250125 0 0 1 2.8144531,19.394531 l -1,-3 A 1.250125,1.250125 0 0 1 1.75,16 v -2 a 1.250125,1.250125 0 0 1 0.064453,-0.394531 l 1,-3 a 1.250125,1.250125 0 0 1 0.3007813,-0.490235 l 2,-1.9999996 A 1.250125,1.250125 0 0 1 5.4414062,7.8828125 l 2,-1 A 1.250125,1.250125 0 0 1 8,6.75 h 3 a 1.250125,1.250125 0 0 1 0.558594,0.1328125 l 2,1 a 1.250125,1.250125 0 0 1 0.173828,0.1074219 1.250125,1.250125 0 0 1 0.349609,-0.8574219 1.250125,1.250125 0 0 1 0.01367,-0.013672 1.250125,1.250125 0 0 1 0.0078,-0.00781 1.250125,1.250125 0 0 1 0.876953,-0.3789062 z"
     id="path2" />
</svg>
