<?xml version="1.0" encoding="UTF-8" standalone="no"?>
<svg
   xmlns:dc="http://purl.org/dc/elements/1.1/"
   xmlns:cc="http://creativecommons.org/ns#"
   xmlns:rdf="http://www.w3.org/1999/02/22-rdf-syntax-ns#"
   xmlns:svg="http://www.w3.org/2000/svg"
   xmlns="http://www.w3.org/2000/svg"
   xmlns:sodipodi="http://sodipodi.sourceforge.net/DTD/sodipodi-0.dtd"
   xmlns:inkscape="http://www.inkscape.org/namespaces/inkscape"
   data-dec="86"
   width="20"
   height="40"
   version="1.1"
   id="svg4"
   sodipodi:docname="86.svg"
   inkscape:version="0.92.4 (unknown)">
  <metadata
     id="metadata10">
    <rdf:RDF>
      <cc:Work
         rdf:about="">
        <dc:format>image/svg+xml</dc:format>
        <dc:type
           rdf:resource="http://purl.org/dc/dcmitype/StillImage" />
      </cc:Work>
    </rdf:RDF>
  </metadata>
  <defs
     id="defs8" />
  <sodipodi:namedview
     pagecolor="#ffffff"
     bordercolor="#666666"
     borderopacity="1"
     objecttolerance="10"
     gridtolerance="10"
     guidetolerance="10"
     inkscape:pageopacity="0"
     inkscape:pageshadow="2"
     inkscape:window-width="640"
     inkscape:window-height="480"
     id="namedview6"
     showgrid="false"
     inkscape:zoom="5.9"
     inkscape:cx="10"
     inkscape:cy="20"
     inkscape:window-x="0"
     inkscape:window-y="27"
     inkscape:window-maximized="0"
     inkscape:current-layer="svg4" />
  <path
     style="color:#000000;font-style:normal;font-variant:normal;font-weight:normal;font-stretch:normal;font-size:medium;line-height:normal;font-family:sans-serif;font-variant-ligatures:normal;font-variant-position:normal;font-variant-caps:normal;font-variant-numeric:normal;font-variant-alternates:normal;font-feature-settings:normal;text-indent:0;text-align:start;text-decoration:none;text-decoration-line:none;text-decoration-style:solid;text-decoration-color:#000000;letter-spacing:normal;word-spacing:normal;text-transform:none;writing-mode:lr-tb;direction:ltr;text-orientation:mixed;dominant-baseline:auto;baseline-shift:baseline;text-anchor:start;white-space:normal;shape-padding:0;clip-rule:nonzero;display:inline;overflow:visible;visibility:visible;opacity:1;isolation:auto;mix-blend-mode:normal;color-interpolation:sRGB;color-interpolation-filters:linearRGB;solid-color:#000000;solid-opacity:1;vector-effect:none;fill:#013272;fill-opacity:1;fill-rule:nonzero;stroke:none;stroke-width:1;stroke-linecap:round;stroke-linejoin:round;stroke-miterlimit:4;stroke-dasharray:none;stroke-dashoffset:0;stroke-opacity:1;color-rendering:auto;image-rendering:auto;shape-rendering:auto;text-rendering:auto;enable-background:accumulate"
     d="M 1.9941406,0.49414062 A 0.50005,0.50005 0 0 1 2.0605469,0.5 h 0.859375 a 0.50005,0.50005 0 0 1 0.1582031,0 h 0.8417969 a 0.50005,0.50005 0 0 1 0.1582031,0 h 0.8417969 a 0.50005,0.50005 0 0 1 0.1582031,0 h 0.8496094 a 0.50005,0.50005 0 0 1 0.1503906,0 h 0.875 a 0.50005,0.50005 0 0 1 0.1113281,0 H 8 a 0.50005,0.50005 0 1 1 0,1 H 7.1171875 L 6.0390625,2.0390625 5.9394531,2.2382812 11.035156,17.525391 16.382812,2.25 l -1.5,-0.75 H 13 a 0.50005,0.50005 0 1 1 0,-1 h 1.933594 a 0.50005,0.50005 0 0 1 0.115234,0 h 2.890625 a 0.50005,0.50005 0 0 1 0.134766,0 H 19 a 0.50005,0.50005 0 1 1 0,1 H 18.207031 L 17.435547,2.2714844 10.488281,22.119141 a 0.50005,0.50005 0 0 1 0,0.0039 l -0.0039,0.0098 a 0.50005,0.50005 0 0 1 -0.01563,0.04883 0.50005,0.50005 0 0 1 -0.01953,0.04492 0.50005,0.50005 0 0 1 -0.04492,0.07617 0.50005,0.50005 0 0 1 -0.0078,0.0098 0.50005,0.50005 0 0 1 -0.0332,0.03711 0.50005,0.50005 0 0 1 -0.01367,0.01367 0.50005,0.50005 0 0 1 -0.01172,0.01367 0.50005,0.50005 0 0 1 -0.0098,0.0078 0.50005,0.50005 0 0 1 -0.0293,0.02344 0.50005,0.50005 0 0 1 -0.0098,0.0078 0.50005,0.50005 0 0 1 -0.01758,0.0098 0.50005,0.50005 0 0 1 -0.01367,0.0098 0.50005,0.50005 0 0 1 -0.01172,0.0059 0.50005,0.50005 0 0 1 -0.0098,0.0039 0.50005,0.50005 0 0 1 -0.0078,0.0059 0.50005,0.50005 0 0 1 -0.01563,0.0078 0.50005,0.50005 0 0 1 -0.01172,0.0059 0.50005,0.50005 0 0 1 -0.01367,0.0039 0.50005,0.50005 0 0 1 -0.01953,0.0098 0.50005,0.50005 0 0 1 -0.01367,0.0039 0.50005,0.50005 0 0 1 -0.01367,0.0039 0.50005,0.50005 0 0 1 -0.0059,0.002 0.50005,0.50005 0 0 1 -0.002,0 0.50005,0.50005 0 0 1 -0.0039,0.002 0.50005,0.50005 0 0 1 -0.0098,0.002 0.50005,0.50005 0 0 1 -0.04492,0.0098 0.50005,0.50005 0 0 1 -0.0039,0 0.50005,0.50005 0 0 1 -0.002,0 0.50005,0.50005 0 0 1 -0.01563,0.002 0.50005,0.50005 0 0 1 -0.01563,0.002 0.50005,0.50005 0 0 1 -0.0059,0 0.50005,0.50005 0 0 1 -0.0098,0 0.50005,0.50005 0 0 1 -0.050781,0 0.50005,0.50005 0 0 1 -0.00781,0 0.50005,0.50005 0 0 1 -0.015625,-0.002 0.50005,0.50005 0 0 1 -0.025391,-0.0039 0.50005,0.50005 0 0 1 -0.013672,-0.002 0.50005,0.50005 0 0 1 -0.019531,-0.0039 0.50005,0.50005 0 0 1 -0.015625,-0.0039 0.50005,0.50005 0 0 1 -0.011719,-0.0039 0.50005,0.50005 0 0 1 -0.00195,0 0.50005,0.50005 0 0 1 -0.00781,-0.002 0.50005,0.50005 0 0 1 -0.027344,-0.0098 0.50005,0.50005 0 0 1 -0.011719,-0.0039 0.50005,0.50005 0 0 1 -0.00391,-0.002 0.50005,0.50005 0 0 1 -0.041016,-0.01953 0.50005,0.50005 0 0 1 -0.033203,-0.01953 0.50005,0.50005 0 0 1 -0.00977,-0.0059 0.50005,0.50005 0 0 1 -0.041016,-0.0293 0.50005,0.50005 0 0 1 -0.037109,-0.0332 0.50005,0.50005 0 0 1 -0.033203,-0.03711 0.50005,0.50005 0 0 1 -0.09375,-0.175781 0.50005,0.50005 0 0 1 -0.00977,-0.03516 L 3.0625,2.7695312 1.7929688,1.5 H 1 a 0.50005,0.50005 0 1 1 0,-1 h 0.9335938 a 0.50005,0.50005 0 0 1 0.060547,-0.005859 z"
     id="path2" />
</svg>
