<?xml version="1.0" encoding="UTF-8" standalone="no"?>
<svg
   xmlns:dc="http://purl.org/dc/elements/1.1/"
   xmlns:cc="http://creativecommons.org/ns#"
   xmlns:rdf="http://www.w3.org/1999/02/22-rdf-syntax-ns#"
   xmlns:svg="http://www.w3.org/2000/svg"
   xmlns="http://www.w3.org/2000/svg"
   xmlns:sodipodi="http://sodipodi.sourceforge.net/DTD/sodipodi-0.dtd"
   xmlns:inkscape="http://www.inkscape.org/namespaces/inkscape"
   data-dec="115"
   width="14"
   height="40"
   version="1.1"
   id="svg4"
   sodipodi:docname="115.svg"
   inkscape:version="0.92.4 5da689c313, 2019-01-14">
  <metadata
     id="metadata10">
    <rdf:RDF>
      <cc:Work
         rdf:about="">
        <dc:format>image/svg+xml</dc:format>
        <dc:type
           rdf:resource="http://purl.org/dc/dcmitype/StillImage" />
        <dc:title></dc:title>
      </cc:Work>
    </rdf:RDF>
  </metadata>
  <defs
     id="defs8" />
  <sodipodi:namedview
     pagecolor="#ffffff"
     bordercolor="#666666"
     borderopacity="1"
     objecttolerance="10"
     gridtolerance="10"
     guidetolerance="10"
     inkscape:pageopacity="0"
     inkscape:pageshadow="2"
     inkscape:window-width="1920"
     inkscape:window-height="1043"
     id="namedview6"
     showgrid="false"
     inkscape:zoom="5.9"
     inkscape:cx="7"
     inkscape:cy="20"
     inkscape:window-x="0"
     inkscape:window-y="37"
     inkscape:window-maximized="0"
     inkscape:current-layer="svg4" />
  <path
     style="color:#000000;font-style:normal;font-variant:normal;font-weight:normal;font-stretch:normal;font-size:medium;line-height:normal;font-family:sans-serif;font-variant-ligatures:normal;font-variant-position:normal;font-variant-caps:normal;font-variant-numeric:normal;font-variant-alternates:normal;font-feature-settings:normal;text-indent:0;text-align:start;text-decoration:none;text-decoration-line:none;text-decoration-style:solid;text-decoration-color:#000000;letter-spacing:normal;word-spacing:normal;text-transform:none;writing-mode:lr-tb;direction:ltr;text-orientation:mixed;dominant-baseline:auto;baseline-shift:baseline;text-anchor:start;white-space:normal;shape-padding:0;clip-rule:nonzero;display:inline;overflow:visible;visibility:visible;opacity:1;isolation:auto;mix-blend-mode:normal;color-interpolation:sRGB;color-interpolation-filters:linearRGB;solid-color:#000000;solid-opacity:1;vector-effect:none;fill:#000000;fill-opacity:1;fill-rule:nonzero;stroke:none;stroke-width:1.5;stroke-linecap:round;stroke-linejoin:round;stroke-miterlimit:4;stroke-dasharray:none;stroke-dashoffset:0;stroke-opacity:1;color-rendering:auto;image-rendering:auto;shape-rendering:auto;text-rendering:auto;enable-background:accumulate"
     d="m 5,7.25 h 3 a 0.750075,0.750075 0 0 1 0.015625,0 0.750075,0.750075 0 0 1 0.03125,0.00195 0.750075,0.750075 0 0 1 0.044922,0.00391 0.750075,0.750075 0 0 1 0.011719,0.00195 0.750075,0.750075 0 0 1 0.041016,0.00586 0.750075,0.750075 0 0 1 0.019531,0.00391 0.750075,0.750075 0 0 1 0.013672,0.00391 0.750075,0.750075 0 0 1 0.058594,0.017578 0.750075,0.750075 0 0 1 0.03125,0.00977 l 0.00586,0.00195 2.9628905,0.9882813 A 0.750075,0.750075 0 0 1 11.75,9 v 1 a 0.750075,0.750075 0 0 1 -1.28125,0.53125 L 9.5566406,9.6171875 7.8222656,8.75 H 5.1777344 L 3.5585938,9.5585938 2.8378906,11 l 0.7207032,1.441406 1.703125,0.851563 3.9199218,0.978515 a 0.750075,0.750075 0 0 1 0.1542969,0.05859 l 2.0000005,1 a 0.750075,0.750075 0 0 1 0.333984,0.333984 l 1,2 A 0.750075,0.750075 0 0 1 12.75,18 v 0.927734 a 0.750075,0.750075 0 0 1 -0.132812,0.511719 l -0.947266,1.896485 a 0.750075,0.750075 0 0 1 -0.333984,0.333984 l -2.0000005,1 A 0.750075,0.750075 0 0 1 9,22.75 H 5 A 0.750075,0.750075 0 0 1 4.6640625,22.669922 L 2.7675781,21.720703 a 0.750075,0.750075 0 0 1 -0.00977,-0.0039 A 0.750075,0.750075 0 0 1 2.46875,21.53125 l -0.013672,-0.01172 a 0.750075,0.750075 0 0 1 -0.00977,-0.01172 L 1.46875,20.53125 A 0.750075,0.750075 0 0 1 1.25,20 V 19 A 0.750075,0.750075 0 0 1 2.6699219,18.664062 L 3.5585938,20.439453 5.1777344,21.25 H 8.8222656 L 10.441406,20.441406 11.162109,19 10.441406,17.558594 8.7382812,16.707031 4.8183594,15.728516 a 0.750075,0.750075 0 0 1 -0.1542969,-0.05859 l -2,-1 A 0.750075,0.750075 0 0 1 2.3300781,14.335938 l -1,-2 A 0.750075,0.750075 0 0 1 1.25,12 V 11.072266 A 0.750075,0.750075 0 0 1 1.3828125,10.560547 L 2.3300781,8.6640625 A 0.750075,0.750075 0 0 1 2.6640625,8.3300781 L 4.5742188,7.375 A 0.750075,0.750075 0 0 1 5,7.25 Z"
     id="path2" />
</svg>
