<?xml version="1.0" encoding="UTF-8" standalone="no"?>
<svg
   xmlns:dc="http://purl.org/dc/elements/1.1/"
   xmlns:cc="http://creativecommons.org/ns#"
   xmlns:rdf="http://www.w3.org/1999/02/22-rdf-syntax-ns#"
   xmlns:svg="http://www.w3.org/2000/svg"
   xmlns="http://www.w3.org/2000/svg"
   xmlns:sodipodi="http://sodipodi.sourceforge.net/DTD/sodipodi-0.dtd"
   xmlns:inkscape="http://www.inkscape.org/namespaces/inkscape"
   data-dec="71"
   width="24"
   height="40"
   version="1.1"
   id="svg4"
   sodipodi:docname="71.svg"
   inkscape:version="0.92.4 (unknown)">
  <metadata
     id="metadata10">
    <rdf:RDF>
      <cc:Work
         rdf:about="">
        <dc:format>image/svg+xml</dc:format>
        <dc:type
           rdf:resource="http://purl.org/dc/dcmitype/StillImage" />
      </cc:Work>
    </rdf:RDF>
  </metadata>
  <defs
     id="defs8" />
  <sodipodi:namedview
     pagecolor="#ffffff"
     bordercolor="#666666"
     borderopacity="1"
     objecttolerance="10"
     gridtolerance="10"
     guidetolerance="10"
     inkscape:pageopacity="0"
     inkscape:pageshadow="2"
     inkscape:window-width="615"
     inkscape:window-height="417"
     id="namedview6"
     showgrid="false"
     inkscape:zoom="5.9"
     inkscape:cx="12"
     inkscape:cy="20"
     inkscape:window-x="0"
     inkscape:window-y="27"
     inkscape:window-maximized="0"
     inkscape:current-layer="svg4" />
  <path
     style="color:#000000;font-style:normal;font-variant:normal;font-weight:normal;font-stretch:normal;font-size:medium;line-height:normal;font-family:sans-serif;font-variant-ligatures:normal;font-variant-position:normal;font-variant-caps:normal;font-variant-numeric:normal;font-variant-alternates:normal;font-feature-settings:normal;text-indent:0;text-align:start;text-decoration:none;text-decoration-line:none;text-decoration-style:solid;text-decoration-color:#000000;letter-spacing:normal;word-spacing:normal;text-transform:none;writing-mode:lr-tb;direction:ltr;text-orientation:mixed;dominant-baseline:auto;baseline-shift:baseline;text-anchor:start;white-space:normal;shape-padding:0;clip-rule:nonzero;display:inline;overflow:visible;visibility:visible;opacity:1;isolation:auto;mix-blend-mode:normal;color-interpolation:sRGB;color-interpolation-filters:linearRGB;solid-color:#000000;solid-opacity:1;vector-effect:none;fill:#013272;fill-opacity:1;fill-rule:nonzero;stroke:none;stroke-width:1;stroke-linecap:round;stroke-linejoin:round;stroke-miterlimit:4;stroke-dasharray:none;stroke-dashoffset:0;stroke-opacity:1;color-rendering:auto;image-rendering:auto;shape-rendering:auto;text-rendering:auto;enable-background:accumulate"
     d="m 13.675781,19.388672 -0.458984,0.6875 0.603515,-0.603516 a 0.50005,0.50005 0 0 1 -0.144531,-0.08398 z M 19.076172,3.4941406 A 0.50005,0.50005 0 0 1 19,3.5 h -0.191406 l 0.199218,0.4003906 z M 12.001953,0.49609375 A 0.50005,0.50005 0 0 1 12.064453,0.5 H 15 a 0.50005,0.50005 0 0 1 0.222656,0.0527344 l 2,1.00000002 a 0.50005,0.50005 0 0 1 0.13086,0.09375 L 18.207031,2.5 h 0.484375 l 0.861328,-1.72265625 a 0.50005,0.50005 0 0 1 0.941407,0.30468745 l -1,6 A 0.50005,0.50005 0 0 1 18.5,7 V 5.1171875 L 17.589844,3.296875 17.583984,3.2890625 16.703125,2.4101562 14.882812,1.5 H 12.117188 L 10.341797,2.3886719 8.4335938,5.2519531 7.4628906,7.1914062 6.4804688,10.140625 5.5,14.0625 v 4.820312 L 6.3730469,20.626953 8.1171875,21.5 h 1.765625 L 11.658203,20.611328 13.546875,17.779297 13.972656,16.5 13.791016,15.953125 12.882812,15.5 H 12 a 0.50005,0.50005 0 1 1 0,-1 h 0.933594 a 0.50005,0.50005 0 0 1 0.115234,0 h 0.871094 a 0.50005,0.50005 0 0 1 0.158203,0 h 0.84375 a 0.50005,0.50005 0 0 1 0.158203,0 h 0.841797 a 0.50005,0.50005 0 0 1 0.158203,0 h 0.847656 a 0.50005,0.50005 0 0 1 0.150391,0 h 0.861328 a 0.50005,0.50005 0 0 1 0.134766,0 h 0.882812 a 0.50005,0.50005 0 0 1 0.0918,0 H 20 a 0.50005,0.50005 0 1 1 0,1 h -0.917969 l -1.3125,0.4375 -1.359375,1.359375 -0.96289,1.925781 a 0.50005,0.50005 0 0 1 -0.09375,0.13086 l -2,2 a 0.50005,0.50005 0 0 1 -0.195313,0.121093 l -2.966797,0.988282 a 0.50005,0.50005 0 0 1 -0.01563,0.0059 l -0.01758,0.0059 a 0.50005,0.50005 0 0 1 -0.0098,0.0039 0.50005,0.50005 0 0 1 -0.0039,0.002 A 0.50005,0.50005 0 0 1 9.9355469,22.5 H 8.0664062 a 0.50005,0.50005 0 0 1 -0.2246093,-0.02539 l -0.019531,-0.0059 a 0.50005,0.50005 0 0 1 -0.00391,-0.002 L 4.8417969,21.474609 A 0.50005,0.50005 0 0 1 4.6464844,21.353516 l -1,-1 A 0.50005,0.50005 0 0 1 3.5253906,20.158203 l -1,-3 A 0.50005,0.50005 0 0 1 2.5,17 v -3 a 0.50005,0.50005 0 0 1 0.015625,-0.121094 l 1,-3.9999998 a 0.50005,0.50005 0 0 1 0.00977,-0.037109 l 1,-3 a 0.50005,0.50005 0 0 1 0.058594,-0.1191407 l 2,-3 a 0.50005,0.50005 0 0 1 0.0625,-0.076172 l 2,-2 A 0.50005,0.50005 0 0 1 8.8417969,1.5253906 L 11.808594,0.53710938 a 0.50005,0.50005 0 0 1 0.0332,-0.0117188 0.50005,0.50005 0 0 1 0.01367,-0.005859 0.50005,0.50005 0 0 1 0.146484,-0.0234375 z"
     id="path2" />
</svg>
