<?xml version="1.0" encoding="UTF-8" standalone="no"?>
<svg
   xmlns:dc="http://purl.org/dc/elements/1.1/"
   xmlns:cc="http://creativecommons.org/ns#"
   xmlns:rdf="http://www.w3.org/1999/02/22-rdf-syntax-ns#"
   xmlns:svg="http://www.w3.org/2000/svg"
   xmlns="http://www.w3.org/2000/svg"
   xmlns:sodipodi="http://sodipodi.sourceforge.net/DTD/sodipodi-0.dtd"
   xmlns:inkscape="http://www.inkscape.org/namespaces/inkscape"
   data-dec="68"
   width="20"
   height="40"
   version="1.1"
   id="svg4"
   sodipodi:docname="68.svg"
   inkscape:version="0.92.4 5da689c313, 2019-01-14">
  <metadata
     id="metadata10">
    <rdf:RDF>
      <cc:Work
         rdf:about="">
        <dc:format>image/svg+xml</dc:format>
        <dc:type
           rdf:resource="http://purl.org/dc/dcmitype/StillImage" />
        <dc:title></dc:title>
      </cc:Work>
    </rdf:RDF>
  </metadata>
  <defs
     id="defs8" />
  <sodipodi:namedview
     pagecolor="#ffffff"
     bordercolor="#666666"
     borderopacity="1"
     objecttolerance="10"
     gridtolerance="10"
     guidetolerance="10"
     inkscape:pageopacity="0"
     inkscape:pageshadow="2"
     inkscape:window-width="1920"
     inkscape:window-height="1043"
     id="namedview6"
     showgrid="false"
     inkscape:zoom="5.9"
     inkscape:cx="10"
     inkscape:cy="20"
     inkscape:window-x="0"
     inkscape:window-y="37"
     inkscape:window-maximized="0"
     inkscape:current-layer="svg4" />
  <path
     style="color:#000000;font-style:normal;font-variant:normal;font-weight:normal;font-stretch:normal;font-size:medium;line-height:normal;font-family:sans-serif;font-variant-ligatures:normal;font-variant-position:normal;font-variant-caps:normal;font-variant-numeric:normal;font-variant-alternates:normal;font-feature-settings:normal;text-indent:0;text-align:start;text-decoration:none;text-decoration-line:none;text-decoration-style:solid;text-decoration-color:#000000;letter-spacing:normal;word-spacing:normal;text-transform:none;writing-mode:lr-tb;direction:ltr;text-orientation:mixed;dominant-baseline:auto;baseline-shift:baseline;text-anchor:start;white-space:normal;shape-padding:0;clip-rule:nonzero;display:inline;overflow:visible;visibility:visible;opacity:1;isolation:auto;mix-blend-mode:normal;color-interpolation:sRGB;color-interpolation-filters:linearRGB;solid-color:#000000;solid-opacity:1;vector-effect:none;fill:#000000;fill-opacity:1;fill-rule:nonzero;stroke:none;stroke-width:1;stroke-linecap:round;stroke-linejoin:round;stroke-miterlimit:4;stroke-dasharray:none;stroke-dashoffset:0;stroke-opacity:1;color-rendering:auto;image-rendering:auto;shape-rendering:auto;text-rendering:auto;enable-background:accumulate"
     d="m 4.5,1.5 v 20 h 6.417969 l 2.8125,-0.9375 1.859375,-1.859375 0.947265,-1.894531 L 17.5,13.917969 V 9.0820312 L 16.537109,6.1914062 15.589844,4.296875 13.730469,2.4375 10.917969,1.5 Z M 3.9921875,0.4921875 A 0.50005,0.50005 0 0 1 4.0800781,0.5 H 11 a 0.50005,0.50005 0 0 1 0.158203,0.0253906 l 3,0.99999998 a 0.50005,0.50005 0 0 1 0.195313,0.1210938 l 2,2 a 0.50005,0.50005 0 0 1 0.09375,0.1308594 l 1,2 a 0.50005,0.50005 0 0 1 0.02734,0.064453 l 1,3 A 0.50005,0.50005 0 0 1 18.5,9 v 5 a 0.50005,0.50005 0 0 1 -0.02539,0.158203 l -1,3 a 0.50005,0.50005 0 0 1 -0.02734,0.06445 l -1,2 a 0.50005,0.50005 0 0 1 -0.09375,0.13086 l -2,2 a 0.50005,0.50005 0 0 1 -0.195313,0.121093 l -3,1 A 0.50005,0.50005 0 0 1 11,22.5 H 4.0820312 A 0.50005,0.50005 0 0 1 3.6875,22.396484 a 0.50005,0.50005 0 0 1 -0.00391,-0.002 0.50005,0.50005 0 0 1 -0.033203,-0.03125 0.50005,0.50005 0 0 1 -0.00391,-0.002 0.50005,0.50005 0 0 1 -0.017578,-0.01758 0.50005,0.50005 0 0 1 -0.015625,-0.01953 A 0.50005,0.50005 0 0 1 3.5,21.919922 V 1.0820312 A 0.50005,0.50005 0 0 1 3.6035156,0.6875 a 0.50005,0.50005 0 0 1 0.00195,-0.003906 0.50005,0.50005 0 0 1 0.03125,-0.0332031 0.50005,0.50005 0 0 1 0.00195,-0.003906 0.50005,0.50005 0 0 1 0.017578,-0.0175781 0.50005,0.50005 0 0 1 0.019531,-0.015625 0.50005,0.50005 0 0 1 0.3164063,-0.12109375 z"
     id="path2" />
</svg>
