<svg xmlns:dc="http://purl.org/dc/elements/1.1/" xmlns:cc="http://creativecommons.org/ns#" xmlns:rdf="http://www.w3.org/1999/02/22-rdf-syntax-ns#" xmlns:svg="http://www.w3.org/2000/svg" xmlns="http://www.w3.org/2000/svg" xmlns:sodipodi="http://sodipodi.sourceforge.net/DTD/sodipodi-0.dtd" xmlns:inkscape="http://www.inkscape.org/namespaces/inkscape" data-dec="97" id="dec_97" width="17" height="40" version="1.1" sodipodi:docname="97.svg" inkscape:version="0.92.3 (2405546, 2018-03-11)">
  <metadata id="metadata9">
    <rdf:RDF>
      <cc:Work rdf:about="">
        <dc:format>image/svg+xml</dc:format>
        <dc:type rdf:resource="http://purl.org/dc/dcmitype/StillImage"/>
        <dc:title/>
      </cc:Work>
    </rdf:RDF>
  </metadata>
  <defs id="defs7"/>
  <sodipodi:namedview pagecolor="#ffffff" bordercolor="#666666" borderopacity="1" objecttolerance="10" gridtolerance="10" guidetolerance="10" inkscape:pageopacity="0" inkscape:pageshadow="2" inkscape:window-width="1360" inkscape:window-height="730" id="namedview5" showgrid="true" inkscape:zoom="8.6415301" inkscape:cx="-23.773842" inkscape:cy="18.858356" inkscape:window-x="37" inkscape:window-y="18" inkscape:window-maximized="0" inkscape:current-layer="dec_97" showguides="true">
    <inkscape:grid type="xygrid" id="grid897"/>
  </sodipodi:namedview>
  <g inkscape:groupmode="layer" id="layer1" inkscape:label="Layer 1"/>
  <path id="path2" style="fill:none;stroke:#000000;stroke-width:1;stroke-linecap:round;stroke-linejoin:round;stroke-opacity:0.98809521" d="M 7,8 5,9 4,12 H 3 V 11 L 5,9 7,8 h 3 l 1,1 1,1 v 2 7 2 l 1,1 m -2,-9 v 0 l -5,1 -3,2 -1,2 v 2 l 2,2 h 3 l 2,-1 2,-2 M 6,14 4,16 3,18 v 2 l 1,2 m 11,-1 -2,1 -2,-1 V 20 19 10 L 10,8              "/>
</svg>