<?xml version="1.0" encoding="UTF-8"?>
<glyph name="A" format="1">
  <advance width="520"/>
  <unicode hex="0041"/>
  <outline>
    <contour>
      <point x="261" y="582" type="line"/>
      <point x="128" y="231" type="line"/>
      <point x="394" y="231" type="line"/>
    </contour>
    <contour>
      <point x="260" y="637" type="curve" smooth="yes"/>
      <point x="261" y="637" type="line"/>
      <point x="262" y="637" type="line" smooth="yes"/>
      <point x="264" y="637"/>
      <point x="267" y="635"/>
      <point x="268" y="634" type="curve" smooth="yes"/>
      <point x="270" y="632"/>
      <point x="274" y="629"/>
      <point x="275" y="626" type="curve" smooth="yes"/>
      <point x="506" y="20" type="line" smooth="yes"/>
      <point x="507" y="19"/>
      <point x="507" y="15"/>
      <point x="507" y="13" type="curve" smooth="yes"/>
      <point x="507" y="5"/>
      <point x="501" y="-1"/>
      <point x="493" y="-1" type="curve" smooth="yes"/>
      <point x="487" y="-1"/>
      <point x="480" y="3"/>
      <point x="478" y="9" type="curve" smooth="yes"/>
      <point x="405" y="202" type="line"/>
      <point x="117" y="202" type="line"/>
      <point x="43" y="9" type="line" smooth="yes"/>
      <point x="41" y="3"/>
      <point x="35" y="-1"/>
      <point x="29" y="-1" type="curve" smooth="yes"/>
      <point x="21" y="-1"/>
      <point x="14" y="5"/>
      <point x="14" y="13" type="curve" smooth="yes"/>
      <point x="14" y="15"/>
      <point x="14" y="19"/>
      <point x="15" y="20" type="curve" smooth="yes"/>
      <point x="246" y="626" type="line" smooth="yes"/>
      <point x="247" y="629"/>
      <point x="250" y="633"/>
      <point x="253" y="635" type="curve" smooth="yes"/>
      <point x="254" y="635"/>
      <point x="254" y="636"/>
      <point x="255" y="636" type="curve" smooth="yes"/>
      <point x="256" y="636"/>
      <point x="259" y="637"/>
    </contour>
  </outline>
  <lib>
    <dict>
      <key>com.fontlab.hintData</key>
      <dict>
        <key>hhints</key>
        <array>
          <dict>
            <key>position</key>
            <integer>-1</integer>
            <key>width</key>
            <integer>23</integer>
          </dict>
          <dict>
            <key>position</key>
            <integer>202</integer>
            <key>width</key>
            <integer>29</integer>
          </dict>
          <dict>
            <key>position</key>
            <integer>615</integer>
            <key>width</key>
            <integer>22</integer>
          </dict>
        </array>
        <key>vhints</key>
        <array>
          <dict>
            <key>position</key>
            <integer>14</integer>
            <key>width</key>
            <integer>29</integer>
          </dict>
          <dict>
            <key>position</key>
            <integer>479</integer>
            <key>width</key>
            <integer>29</integer>
          </dict>
        </array>
      </dict>
    </dict>
  </lib>
</glyph>
