<?xml version="1.0" encoding="UTF-8" standalone="no"?>
<svg
   xmlns:dc="http://purl.org/dc/elements/1.1/"
   xmlns:cc="http://creativecommons.org/ns#"
   xmlns:rdf="http://www.w3.org/1999/02/22-rdf-syntax-ns#"
   xmlns:svg="http://www.w3.org/2000/svg"
   xmlns="http://www.w3.org/2000/svg"
   xmlns:sodipodi="http://sodipodi.sourceforge.net/DTD/sodipodi-0.dtd"
   xmlns:inkscape="http://www.inkscape.org/namespaces/inkscape"
   data-dec="119"
   width="24"
   height="40"
   version="1.1"
   id="svg4"
   sodipodi:docname="119.svg"
   inkscape:version="0.92.4 (unknown)">
  <metadata
     id="metadata10">
    <rdf:RDF>
      <cc:Work
         rdf:about="">
        <dc:format>image/svg+xml</dc:format>
        <dc:type
           rdf:resource="http://purl.org/dc/dcmitype/StillImage" />
      </cc:Work>
    </rdf:RDF>
  </metadata>
  <defs
     id="defs8" />
  <sodipodi:namedview
     pagecolor="#ffffff"
     bordercolor="#666666"
     borderopacity="1"
     objecttolerance="10"
     gridtolerance="10"
     guidetolerance="10"
     inkscape:pageopacity="0"
     inkscape:pageshadow="2"
     inkscape:window-width="640"
     inkscape:window-height="480"
     id="namedview6"
     showgrid="false"
     inkscape:zoom="5.9"
     inkscape:cx="12"
     inkscape:cy="20"
     inkscape:window-x="0"
     inkscape:window-y="27"
     inkscape:window-maximized="0"
     inkscape:current-layer="svg4" />
  <path
     style="color:#000000;font-style:normal;font-variant:normal;font-weight:normal;font-stretch:normal;font-size:medium;line-height:normal;font-family:sans-serif;font-variant-ligatures:normal;font-variant-position:normal;font-variant-caps:normal;font-variant-numeric:normal;font-variant-alternates:normal;font-feature-settings:normal;text-indent:0;text-align:start;text-decoration:none;text-decoration-line:none;text-decoration-style:solid;text-decoration-color:#000000;letter-spacing:normal;word-spacing:normal;text-transform:none;writing-mode:lr-tb;direction:ltr;text-orientation:mixed;dominant-baseline:auto;baseline-shift:baseline;text-anchor:start;white-space:normal;shape-padding:0;clip-rule:nonzero;display:inline;overflow:visible;visibility:visible;opacity:1;isolation:auto;mix-blend-mode:normal;color-interpolation:sRGB;color-interpolation-filters:linearRGB;solid-color:#000000;solid-opacity:1;vector-effect:none;fill:#013272;fill-opacity:1;fill-rule:nonzero;stroke:none;stroke-width:0.5;stroke-linecap:round;stroke-linejoin:round;stroke-miterlimit:4;stroke-dasharray:none;stroke-dashoffset:0;stroke-opacity:1;color-rendering:auto;image-rendering:auto;shape-rendering:auto;text-rendering:auto;enable-background:accumulate"
     d="m 12.978516,7.7460938 a 0.250025,0.250025 0 0 1 0.02539,0 0.250025,0.250025 0 0 1 0.236328,0.1875 l 3,11.0000002 a 0.250025,0.250025 0 1 1 -0.480468,0.132812 l -3,-10.9999998 a 0.250025,0.250025 0 0 1 0.21875,-0.3203124 z M 4,7.7460938 A 0.250025,0.250025 0 0 1 4.0390625,7.75 H 4.953125 a 0.250025,0.250025 0 0 1 0.087891,0 H 8 a 0.250025,0.250025 0 1 1 0,0.5 H 5.3261719 L 8.2402344,18.933594 A 0.250025,0.250025 0 1 1 7.7597656,19.066406 L 4.8105469,8.25 H 4.3320312 L 8,21.089844 11.751953,7.9609375 a 0.250025,0.250025 0 0 1 0.01563,-0.056641 0.250025,0.250025 0 0 1 0.0059,-0.013672 0.250025,0.250025 0 0 1 0.0039,-0.00977 0.250025,0.250025 0 0 1 0.0078,-0.011719 0.250025,0.250025 0 0 1 0.01367,-0.021484 0.250025,0.250025 0 0 1 0.0059,-0.00781 0.250025,0.250025 0 0 1 0.02539,-0.027344 0.250025,0.250025 0 0 1 0.0098,-0.00781 0.250025,0.250025 0 0 1 0.01172,-0.00977 0.250025,0.250025 0 0 1 0.002,-0.00195 0.250025,0.250025 0 0 1 0.01563,-0.00977 0.250025,0.250025 0 0 1 0.01172,-0.00586 0.250025,0.250025 0 0 1 0.01367,-0.00781 0.250025,0.250025 0 0 1 0.0078,-0.00391 0.250025,0.250025 0 0 1 0.0078,-0.00195 0.250025,0.250025 0 0 1 0.04102,-0.011719 0.250025,0.250025 0 0 1 0.02539,-0.00391 0.250025,0.250025 0 0 1 0.04102,0 0.250025,0.250025 0 0 1 0.0078,0 0.250025,0.250025 0 0 1 0.01563,0.00195 0.250025,0.250025 0 0 1 0.0098,0.00195 0.250025,0.250025 0 0 1 0.03125,0.00977 0.250025,0.250025 0 0 1 0.01563,0.00586 0.250025,0.250025 0 0 1 0.02539,0.011719 0.250025,0.250025 0 0 1 0.03906,0.027344 0.250025,0.250025 0 0 1 0.01172,0.00977 0.250025,0.250025 0 0 1 0.0059,0.00781 0.250025,0.250025 0 0 1 0.03125,0.039062 0.250025,0.250025 0 0 1 0.0078,0.011719 0.250025,0.250025 0 0 1 0.0039,0.00977 0.250025,0.250025 0 0 1 0.02539,0.076172 L 16,21.089844 19.667969,8.25 H 17 a 0.250025,0.250025 0 1 1 0,-0.5 h 2.958984 a 0.250025,0.250025 0 0 1 0.08203,0 H 23 a 0.250025,0.250025 0 1 1 0,0.5 h -2.8125 l -3.939453,13.789062 a 0.250025,0.250025 0 0 1 -0.01563,0.05664 0.250025,0.250025 0 0 1 -0.0059,0.01367 0.250025,0.250025 0 0 1 -0.0039,0.0098 0.250025,0.250025 0 0 1 -0.0078,0.01172 0.250025,0.250025 0 0 1 -0.01367,0.02148 0.250025,0.250025 0 0 1 -0.0059,0.0078 0.250025,0.250025 0 0 1 -0.02539,0.02734 0.250025,0.250025 0 0 1 -0.002,0.002 0.250025,0.250025 0 0 1 -0.0078,0.0059 0.250025,0.250025 0 0 1 -0.01172,0.0098 0.250025,0.250025 0 0 1 -0.0078,0.0059 0.250025,0.250025 0 0 1 -0.03711,0.02148 0.250025,0.250025 0 0 1 -0.01367,0.0039 0.250025,0.250025 0 0 1 -0.04102,0.01172 0.250025,0.250025 0 0 1 -0.02539,0.0039 0.250025,0.250025 0 0 1 -0.01563,0.002 0.250025,0.250025 0 0 1 -0.0332,-0.002 0.250025,0.250025 0 0 1 -0.01563,-0.002 0.250025,0.250025 0 0 1 -0.04883,-0.01367 0.250025,0.250025 0 0 1 -0.0078,-0.0039 0.250025,0.250025 0 0 1 -0.02149,-0.0078 0.250025,0.250025 0 0 1 -0.002,-0.002 0.250025,0.250025 0 0 1 -0.002,-0.002 0.250025,0.250025 0 0 1 -0.03906,-0.02734 0.250025,0.250025 0 0 1 -0.01172,-0.0098 0.250025,0.250025 0 0 1 -0.0059,-0.0078 0.250025,0.250025 0 0 1 -0.03125,-0.03906 0.250025,0.250025 0 0 1 -0.0078,-0.01172 0.250025,0.250025 0 0 1 -0.0039,-0.0098 0.250025,0.250025 0 0 1 -0.02539,-0.07617 L 12,8.9101562 8.2480469,22.039062 a 0.250025,0.250025 0 0 1 -0.015625,0.05664 0.250025,0.250025 0 0 1 -0.00586,0.01367 0.250025,0.250025 0 0 1 -0.00391,0.0098 0.250025,0.250025 0 0 1 -0.00781,0.01172 0.250025,0.250025 0 0 1 -0.013672,0.02148 0.250025,0.250025 0 0 1 -0.00586,0.0078 0.250025,0.250025 0 0 1 -0.025391,0.02734 0.250025,0.250025 0 0 1 -0.00195,0.002 0.250025,0.250025 0 0 1 -0.00781,0.0059 0.250025,0.250025 0 0 1 -0.011719,0.0098 0.250025,0.250025 0 0 1 -0.00781,0.0059 0.250025,0.250025 0 0 1 -0.035156,0.01953 0.250025,0.250025 0 0 1 -0.015625,0.0059 0.250025,0.250025 0 0 1 -0.041016,0.01172 0.250025,0.250025 0 0 1 -0.025391,0.0039 0.250025,0.250025 0 0 1 -0.015625,0.002 0.250025,0.250025 0 0 1 -0.033203,-0.002 0.250025,0.250025 0 0 1 -0.015625,-0.002 0.250025,0.250025 0 0 1 -0.00977,-0.002 0.250025,0.250025 0 0 1 -0.015625,-0.0039 0.250025,0.250025 0 0 1 -0.00781,-0.002 0.250025,0.250025 0 0 1 -0.00781,-0.0039 0.250025,0.250025 0 0 1 -0.015625,-0.0059 0.250025,0.250025 0 0 1 -0.015625,-0.0059 0.250025,0.250025 0 0 1 -0.00586,-0.002 0.250025,0.250025 0 0 1 -0.00391,-0.0039 0.250025,0.250025 0 0 1 -0.039063,-0.02734 0.250025,0.250025 0 0 1 -0.011719,-0.0098 0.250025,0.250025 0 0 1 -0.00586,-0.0078 0.250025,0.250025 0 0 1 -0.03125,-0.03906 0.250025,0.250025 0 0 1 -0.00781,-0.01172 0.250025,0.250025 0 0 1 -0.00391,-0.0098 0.250025,0.250025 0 0 1 -0.025391,-0.07617 L 3.8125,8.25 H 1 A 0.250025,0.250025 0 1 1 1,7.75 H 3.9648438 A 0.250025,0.250025 0 0 1 4,7.7460938 Z"
     id="path2" />
</svg>
