<?xml version="1.0" encoding="UTF-8" standalone="no"?>
<svg
   xmlns:dc="http://purl.org/dc/elements/1.1/"
   xmlns:cc="http://creativecommons.org/ns#"
   xmlns:rdf="http://www.w3.org/1999/02/22-rdf-syntax-ns#"
   xmlns:svg="http://www.w3.org/2000/svg"
   xmlns="http://www.w3.org/2000/svg"
   xmlns:sodipodi="http://sodipodi.sourceforge.net/DTD/sodipodi-0.dtd"
   xmlns:inkscape="http://www.inkscape.org/namespaces/inkscape"
   data-dec="97"
   width="17"
   height="40"
   version="1.1"
   id="svg4"
   sodipodi:docname="97.svg"
   inkscape:version="0.92.4 5da689c313, 2019-01-14">
  <metadata
     id="metadata10">
    <rdf:RDF>
      <cc:Work
         rdf:about="">
        <dc:format>image/svg+xml</dc:format>
        <dc:type
           rdf:resource="http://purl.org/dc/dcmitype/StillImage" />
        <dc:title></dc:title>
      </cc:Work>
    </rdf:RDF>
  </metadata>
  <defs
     id="defs8" />
  <sodipodi:namedview
     pagecolor="#ffffff"
     bordercolor="#666666"
     borderopacity="1"
     objecttolerance="10"
     gridtolerance="10"
     guidetolerance="10"
     inkscape:pageopacity="0"
     inkscape:pageshadow="2"
     inkscape:window-width="1920"
     inkscape:window-height="1043"
     id="namedview6"
     showgrid="false"
     inkscape:zoom="5.9"
     inkscape:cx="8.5"
     inkscape:cy="20"
     inkscape:window-x="0"
     inkscape:window-y="37"
     inkscape:window-maximized="0"
     inkscape:current-layer="svg4" />
  <path
     style="color:#000000;font-style:normal;font-variant:normal;font-weight:normal;font-stretch:normal;font-size:medium;line-height:normal;font-family:sans-serif;font-variant-ligatures:normal;font-variant-position:normal;font-variant-caps:normal;font-variant-numeric:normal;font-variant-alternates:normal;font-feature-settings:normal;text-indent:0;text-align:start;text-decoration:none;text-decoration-line:none;text-decoration-style:solid;text-decoration-color:#000000;letter-spacing:normal;word-spacing:normal;text-transform:none;writing-mode:lr-tb;direction:ltr;text-orientation:mixed;dominant-baseline:auto;baseline-shift:baseline;text-anchor:start;white-space:normal;shape-padding:0;clip-rule:nonzero;display:inline;overflow:visible;visibility:visible;opacity:1;isolation:auto;mix-blend-mode:normal;color-interpolation:sRGB;color-interpolation-filters:linearRGB;solid-color:#000000;solid-opacity:1;vector-effect:none;fill:#000000;fill-opacity:1;fill-rule:nonzero;stroke:none;stroke-width:0.5;stroke-linecap:round;stroke-linejoin:round;stroke-miterlimit:4;stroke-dasharray:none;stroke-dashoffset:0;stroke-opacity:1;color-rendering:auto;image-rendering:auto;shape-rendering:auto;text-rendering:auto;enable-background:accumulate"
     d="M 4.03125,15.613281 3.1933594,16.171875 2.25,18.058594 v 1.83789 l 0.8398438,0.839844 -0.3125,-0.625 A 0.250025,0.250025 0 0 1 2.75,20 v -2 a 0.250025,0.250025 0 0 1 0.027344,-0.111328 l 1,-2 a 0.250025,0.250025 0 0 1 0.044922,-0.06641 z M 10.75,13.306641 6.125,14.230469 4.2050781,16.148438 3.25,18.058594 v 1.882812 L 4.1542969,21.75 H 6.9414062 L 8.8515625,20.794922 10.75,18.894531 Z M 4.4296875,9.9238281 3.25,11.103516 V 11.75 h 0.5703125 z m 6.4824215,-0.65625 0.310547,0.6210938 A 0.250025,0.250025 0 0 1 11.25,10 v 2.958984 a 0.250025,0.250025 0 0 1 0,0.08789 v 5.914063 a 0.250025,0.250025 0 0 1 0,0.07422 V 20 20.845703 l 0.525391,0.263672 A 0.250025,0.250025 0 0 1 11.75,21 V 19 12 10.103516 Z M 9.9785156,7.7460938 a 0.250025,0.250025 0 0 1 0.02539,0 0.250025,0.250025 0 0 1 0.08984,0.021484 0.250025,0.250025 0 0 1 0.08398,0.054687 0.250025,0.250025 0 0 1 0.0039,0.00391 l 0.996093,0.9960937 1,1 A 0.250025,0.250025 0 0 1 12.25,10 v 2 7 1.896484 l 0.800781,0.798828 1.837891,-0.917968 a 0.250025,0.250025 0 1 1 0.222656,0.445312 l -1.957031,0.978516 a 0.250025,0.250025 0 0 1 -0.244141,0.0332 0.250025,0.250025 0 0 1 -0.0059,-0.002 0.250025,0.250025 0 0 1 -0.04297,-0.02344 L 10.888672,21.222656 A 0.250025,0.250025 0 0 1 10.75,21 v -1 -0.394531 l -1.5722656,1.572265 a 0.250025,0.250025 0 0 1 -0.066406,0.04492 l -2,1 A 0.250025,0.250025 0 0 1 7,22.25 H 4.046875 a 0.250025,0.250025 0 0 1 -0.140625,-0.01758 0.250025,0.250025 0 0 1 -0.083984,-0.05469 l -0.00391,-0.0039 -1.9960938,-1.996094 A 0.250025,0.250025 0 0 1 1.75,20 v -2 a 0.250025,0.250025 0 0 1 0.027344,-0.111328 l 1,-2 a 0.250025,0.250025 0 0 1 0.083984,-0.09766 l 2.9941407,-1.996094 a 0.250025,0.250025 0 0 1 0.00781,-0.0039 0.250025,0.250025 0 0 1 0.039063,-0.02149 0.250025,0.250025 0 0 1 0.023437,-0.0078 0.250025,0.250025 0 0 1 0.025391,-0.0078 0.250025,0.250025 0 0 1 0.019531,-0.0039 L 10.75,12.794922 V 10.058594 L 9.8457031,8.25 H 7.0585938 L 5.2050781,9.1777344 4.2363281,12.078125 A 0.250025,0.250025 0 0 1 4,12.25 H 3 A 0.250025,0.250025 0 0 1 2.75,12 v -1 a 0.250025,0.250025 0 0 1 0.072266,-0.177734 l 2,-2.0000004 a 0.250025,0.250025 0 0 1 0.00391,-0.00195 0.250025,0.250025 0 0 1 0.019531,-0.017578 0.250025,0.250025 0 0 1 0.021484,-0.013672 0.250025,0.250025 0 0 1 0.021484,-0.011719 l 2,-1 A 0.250025,0.250025 0 0 1 6.9121094,7.765625 0.250025,0.250025 0 0 1 6.9257812,7.7617188 0.250025,0.250025 0 0 1 7.0253906,7.75 H 9.953125 a 0.250025,0.250025 0 0 1 0.025391,-0.00391 z"
     id="path2" />
</svg>
