<?xml version="1.0" encoding="UTF-8" standalone="no"?>
<svg
   xmlns:dc="http://purl.org/dc/elements/1.1/"
   xmlns:cc="http://creativecommons.org/ns#"
   xmlns:rdf="http://www.w3.org/1999/02/22-rdf-syntax-ns#"
   xmlns:svg="http://www.w3.org/2000/svg"
   xmlns="http://www.w3.org/2000/svg"
   xmlns:sodipodi="http://sodipodi.sourceforge.net/DTD/sodipodi-0.dtd"
   xmlns:inkscape="http://www.inkscape.org/namespaces/inkscape"
   data-dec="118"
   width="16"
   height="40"
   version="1.1"
   id="svg4"
   sodipodi:docname="118.svg"
   inkscape:version="0.92.4 (unknown)">
  <metadata
     id="metadata10">
    <rdf:RDF>
      <cc:Work
         rdf:about="">
        <dc:format>image/svg+xml</dc:format>
        <dc:type
           rdf:resource="http://purl.org/dc/dcmitype/StillImage" />
      </cc:Work>
    </rdf:RDF>
  </metadata>
  <defs
     id="defs8" />
  <sodipodi:namedview
     pagecolor="#ffffff"
     bordercolor="#666666"
     borderopacity="1"
     objecttolerance="10"
     gridtolerance="10"
     guidetolerance="10"
     inkscape:pageopacity="0"
     inkscape:pageshadow="2"
     inkscape:window-width="640"
     inkscape:window-height="480"
     id="namedview6"
     showgrid="false"
     inkscape:zoom="5.9"
     inkscape:cx="8"
     inkscape:cy="20"
     inkscape:window-x="0"
     inkscape:window-y="27"
     inkscape:window-maximized="0"
     inkscape:current-layer="svg4" />
  <path
     style="color:#000000;font-style:normal;font-variant:normal;font-weight:normal;font-stretch:normal;font-size:medium;line-height:normal;font-family:sans-serif;font-variant-ligatures:normal;font-variant-position:normal;font-variant-caps:normal;font-variant-numeric:normal;font-variant-alternates:normal;font-feature-settings:normal;text-indent:0;text-align:start;text-decoration:none;text-decoration-line:none;text-decoration-style:solid;text-decoration-color:#000000;letter-spacing:normal;word-spacing:normal;text-transform:none;writing-mode:lr-tb;direction:ltr;text-orientation:mixed;dominant-baseline:auto;baseline-shift:baseline;text-anchor:start;white-space:normal;shape-padding:0;clip-rule:nonzero;display:inline;overflow:visible;visibility:visible;opacity:1;isolation:auto;mix-blend-mode:normal;color-interpolation:sRGB;color-interpolation-filters:linearRGB;solid-color:#000000;solid-opacity:1;vector-effect:none;fill:#000000;fill-opacity:1;fill-rule:nonzero;stroke:none;stroke-width:1;stroke-linecap:round;stroke-linejoin:round;stroke-miterlimit:4;stroke-dasharray:none;stroke-dashoffset:0;stroke-opacity:1;color-rendering:auto;image-rendering:auto;shape-rendering:auto;text-rendering:auto;enable-background:accumulate"
     d="M 1.9863281,7.4941406 A 0.50005,0.50005 0 0 1 2.0742188,7.5 h 0.84375 a 0.50005,0.50005 0 0 1 0.15625,0 H 4 A 0.50005,0.50005 0 0 1 4.4609375,7.8085938 L 8.3925781,17.242188 11.525391,7.8417969 A 0.50005,0.50005 0 0 1 12,7.5 h 0.916016 a 0.50005,0.50005 0 0 1 0.162109,0 H 14 a 0.50005,0.50005 0 0 1 0.355469,0.1582031 0.50005,0.50005 0 0 1 0.0332,0.037109 0.50005,0.50005 0 0 1 0.0039,0.00391 0.50005,0.50005 0 0 1 0.02539,0.037109 0.50005,0.50005 0 0 1 0.0039,0.00586 0.50005,0.50005 0 0 1 0.02148,0.037109 0.50005,0.50005 0 0 1 0.002,0.00586 0.50005,0.50005 0 0 1 0.02539,0.3828126 L 9.4707031,22.167969 a 0.50005,0.50005 0 0 1 -0.015625,0.03711 0.50005,0.50005 0 0 1 -0.00195,0.0059 0.50005,0.50005 0 0 1 -0.00781,0.01562 0.50005,0.50005 0 0 1 -0.00195,0.0059 0.50005,0.50005 0 0 1 -0.023437,0.03711 0.50005,0.50005 0 0 1 -0.017578,0.02734 0.50005,0.50005 0 0 1 -0.00977,0.01367 0.50005,0.50005 0 0 1 -0.021484,0.02539 0.50005,0.50005 0 0 1 -0.011719,0.01172 0.50005,0.50005 0 0 1 -0.023437,0.02344 0.50005,0.50005 0 0 1 -0.013672,0.01172 0.50005,0.50005 0 0 1 -0.025391,0.01953 0.50005,0.50005 0 0 1 -0.013672,0.0098 0.50005,0.50005 0 0 1 -0.029297,0.01758 0.50005,0.50005 0 0 1 -0.042969,0.02344 0.50005,0.50005 0 0 1 -0.015625,0.0078 0.50005,0.50005 0 0 1 -0.03125,0.01172 0.50005,0.50005 0 0 1 -0.048828,0.01367 0.50005,0.50005 0 0 1 -0.015625,0.0039 0.50005,0.50005 0 0 1 -0.033203,0.0059 0.50005,0.50005 0 0 1 -0.00781,0 0.50005,0.50005 0 0 1 -0.025391,0.002 A 0.50005,0.50005 0 0 1 9.0175781,22.5 0.50005,0.50005 0 0 1 9,22.5 H 8.0839844 a 0.50005,0.50005 0 0 1 -0.00391,0 0.50005,0.50005 0 0 1 -0.037109,0.0039 0.50005,0.50005 0 0 1 -0.058594,0.002 0.50005,0.50005 0 0 1 -0.041016,-0.0039 0.50005,0.50005 0 0 1 -0.00977,0 0.50005,0.50005 0 0 1 -0.019531,-0.0039 0.50005,0.50005 0 0 1 -0.097656,-0.02734 0.50005,0.50005 0 0 1 -0.2011718,-0.142578 0.50005,0.50005 0 0 1 -0.017578,-0.02148 0.50005,0.50005 0 0 1 -0.00195,-0.002 0.50005,0.50005 0 0 1 -0.025391,-0.03906 0.50005,0.50005 0 0 1 -0.011719,-0.01953 0.50005,0.50005 0 0 1 -0.00781,-0.01563 0.50005,0.50005 0 0 1 -0.00781,-0.01172 0.50005,0.50005 0 0 1 -0.035156,-0.101562 l -0.00391,-0.0098 L 1.5703125,8.2675781 a 0.50005,0.50005 0 0 1 -0.042969,-0.4453125 0.50005,0.50005 0 0 1 0.017578,-0.044922 0.50005,0.50005 0 0 1 0.00391,-0.00391 0.50005,0.50005 0 0 1 0.00586,-0.013672 0.50005,0.50005 0 0 1 0.021484,-0.035156 0.50005,0.50005 0 0 1 0.023437,-0.033203 0.50005,0.50005 0 0 1 0.00195,-0.00391 0.50005,0.50005 0 0 1 0.00781,-0.00781 0.50005,0.50005 0 0 1 0.029297,-0.033203 0.50005,0.50005 0 0 1 0.3476562,-0.1523438 z"
     id="path2" />
</svg>
