<?xml version="1.0" encoding="UTF-8" standalone="no"?>
<svg
   xmlns:dc="http://purl.org/dc/elements/1.1/"
   xmlns:cc="http://creativecommons.org/ns#"
   xmlns:rdf="http://www.w3.org/1999/02/22-rdf-syntax-ns#"
   xmlns:svg="http://www.w3.org/2000/svg"
   xmlns="http://www.w3.org/2000/svg"
   xmlns:sodipodi="http://sodipodi.sourceforge.net/DTD/sodipodi-0.dtd"
   xmlns:inkscape="http://www.inkscape.org/namespaces/inkscape"
   data-dec="63"
   width="18"
   height="40"
   version="1.1"
   id="svg4"
   sodipodi:docname="63.svg"
   inkscape:version="0.92.4 5da689c313, 2019-01-14">
  <metadata
     id="metadata10">
    <rdf:RDF>
      <cc:Work
         rdf:about="">
        <dc:format>image/svg+xml</dc:format>
        <dc:type
           rdf:resource="http://purl.org/dc/dcmitype/StillImage" />
        <dc:title></dc:title>
      </cc:Work>
    </rdf:RDF>
  </metadata>
  <defs
     id="defs8" />
  <sodipodi:namedview
     pagecolor="#ffffff"
     bordercolor="#666666"
     borderopacity="1"
     objecttolerance="10"
     gridtolerance="10"
     guidetolerance="10"
     inkscape:pageopacity="0"
     inkscape:pageshadow="2"
     inkscape:window-width="1920"
     inkscape:window-height="1043"
     id="namedview6"
     showgrid="false"
     inkscape:zoom="5.9"
     inkscape:cx="9"
     inkscape:cy="20"
     inkscape:window-x="0"
     inkscape:window-y="37"
     inkscape:window-maximized="0"
     inkscape:current-layer="svg4" />
  <path
     style="color:#000000;font-style:normal;font-variant:normal;font-weight:normal;font-stretch:normal;font-size:medium;line-height:normal;font-family:sans-serif;font-variant-ligatures:normal;font-variant-position:normal;font-variant-caps:normal;font-variant-numeric:normal;font-variant-alternates:normal;font-feature-settings:normal;text-indent:0;text-align:start;text-decoration:none;text-decoration-line:none;text-decoration-style:solid;text-decoration-color:#000000;letter-spacing:normal;word-spacing:normal;text-transform:none;writing-mode:lr-tb;direction:ltr;text-orientation:mixed;dominant-baseline:auto;baseline-shift:baseline;text-anchor:start;white-space:normal;shape-padding:0;clip-rule:nonzero;display:inline;overflow:visible;visibility:visible;opacity:1;isolation:auto;mix-blend-mode:normal;color-interpolation:sRGB;color-interpolation-filters:linearRGB;solid-color:#000000;solid-opacity:1;vector-effect:none;fill:#000000;fill-opacity:1;fill-rule:nonzero;stroke:none;stroke-width:3;stroke-linecap:round;stroke-linejoin:round;stroke-miterlimit:4;stroke-dasharray:none;stroke-dashoffset:0;stroke-opacity:1;color-rendering:auto;image-rendering:auto;shape-rendering:auto;text-rendering:auto;enable-background:accumulate"
     d="m 8.984375,18.484375 a 1.50015,1.50015 0 0 1 0.054687,0.002 1.50015,1.50015 0 0 1 1.1953125,0.626953 l 0.826172,0.826172 a 1.50015,1.50015 0 0 1 0,2.121094 l -1,1 a 1.50015,1.50015 0 0 1 -2.1210939,0 l -1,-1 a 1.50015,1.50015 0 0 1 0,-2.121094 l 0.828125,-0.828125 A 1.50015,1.50015 0 0 1 8.984375,18.484375 Z M 7,-0.5 h 4 a 1.50015,1.50015 0 0 1 0.669922,0.15820312 l 2,1 a 1.50015,1.50015 0 0 1 0.390625,0.28125 l 1,0.99999998 a 1.50015,1.50015 0 0 1 0.28125,0.390625 l 1,2 A 1.50015,1.50015 0 0 1 16.5,5 v 2 a 1.50015,1.50015 0 0 1 -0.158203,0.6699219 l -1,2 a 1.50015,1.50015 0 0 1 -0.28125,0.3906251 l -1,1 a 1.50015,1.50015 0 0 1 -0.390625,0.28125 L 10.5,12.927734 V 15 a 1.50015,1.50015 0 1 1 -3,0 V 12 A 1.50015,1.50015 0 0 1 8.3300781,10.658203 L 12.111328,8.7675781 12.767578,8.1113281 13.5,6.6464844 V 5.3535156 L 12.767578,3.8886719 12.111328,3.2324219 10.646484,2.5 H 7.3535156 L 5.8886719,3.2324219 5.2324219,3.8886719 4.5,5.3535156 V 6 a 1.50015,1.50015 0 1 1 -3,0 V 5 A 1.50015,1.50015 0 0 1 1.6582031,4.3300781 l 1,-2 a 1.50015,1.50015 0 0 1 0.28125,-0.390625 l 1,-0.99999998 a 1.50015,1.50015 0 0 1 0.390625,-0.28125 l 2,-1 A 1.50015,1.50015 0 0 1 7,-0.5 Z"
     id="path2" />
</svg>
