<?xml version="1.0" encoding="UTF-8" standalone="no"?>
<svg
   xmlns:dc="http://purl.org/dc/elements/1.1/"
   xmlns:cc="http://creativecommons.org/ns#"
   xmlns:rdf="http://www.w3.org/1999/02/22-rdf-syntax-ns#"
   xmlns:svg="http://www.w3.org/2000/svg"
   xmlns="http://www.w3.org/2000/svg"
   xmlns:sodipodi="http://sodipodi.sourceforge.net/DTD/sodipodi-0.dtd"
   xmlns:inkscape="http://www.inkscape.org/namespaces/inkscape"
   data-dec="41"
   width="14"
   height="40"
   version="1.1"
   id="svg4"
   sodipodi:docname="41.svg"
   inkscape:version="0.92.4 (unknown)">
  <metadata
     id="metadata10">
    <rdf:RDF>
      <cc:Work
         rdf:about="">
        <dc:format>image/svg+xml</dc:format>
        <dc:type
           rdf:resource="http://purl.org/dc/dcmitype/StillImage" />
      </cc:Work>
    </rdf:RDF>
  </metadata>
  <defs
     id="defs8" />
  <sodipodi:namedview
     pagecolor="#ffffff"
     bordercolor="#666666"
     borderopacity="1"
     objecttolerance="10"
     gridtolerance="10"
     guidetolerance="10"
     inkscape:pageopacity="0"
     inkscape:pageshadow="2"
     inkscape:window-width="640"
     inkscape:window-height="480"
     id="namedview6"
     showgrid="false"
     inkscape:zoom="5.9"
     inkscape:cx="7"
     inkscape:cy="20"
     inkscape:window-x="0"
     inkscape:window-y="27"
     inkscape:window-maximized="0"
     inkscape:current-layer="svg4" />
  <path
     style="color:#000000;font-style:normal;font-variant:normal;font-weight:normal;font-stretch:normal;font-size:medium;line-height:normal;font-family:sans-serif;font-variant-ligatures:normal;font-variant-position:normal;font-variant-caps:normal;font-variant-numeric:normal;font-variant-alternates:normal;font-feature-settings:normal;text-indent:0;text-align:start;text-decoration:none;text-decoration-line:none;text-decoration-style:solid;text-decoration-color:#000000;letter-spacing:normal;word-spacing:normal;text-transform:none;writing-mode:lr-tb;direction:ltr;text-orientation:mixed;dominant-baseline:auto;baseline-shift:baseline;text-anchor:start;white-space:normal;shape-padding:0;clip-rule:nonzero;display:inline;overflow:visible;visibility:visible;opacity:1;isolation:auto;mix-blend-mode:normal;color-interpolation:sRGB;color-interpolation-filters:linearRGB;solid-color:#000000;solid-opacity:1;vector-effect:none;fill:#013272;fill-opacity:1;fill-rule:nonzero;stroke:none;stroke-width:2;stroke-linecap:round;stroke-linejoin:round;stroke-miterlimit:4;stroke-dasharray:none;stroke-dashoffset:0;stroke-opacity:1;color-rendering:auto;image-rendering:auto;shape-rendering:auto;text-rendering:auto;enable-background:accumulate"
     d="m 3.9902344,-4.0097656 a 1.0001,1.0001 0 0 1 0.7167968,0.3027344 l 1.9277344,1.9277343 a 1.0001,1.0001 0 0 1 0.1972656,0.2246094 1.0001,1.0001 0 0 1 0.013672,0.019531 l 0.00391,0.00586 1.9824218,2.9746094 a 1.0001,1.0001 0 0 1 0.0625,0.1074219 l 1.9999998,4 a 1.0001,1.0001 0 0 1 0.08594,0.2519531 l 1,5.0000005 A 1.0001,1.0001 0 0 1 12,11 v 4 a 1.0001,1.0001 0 0 1 -0.01953,0.195312 l -1,5 a 1.0001,1.0001 0 0 1 -0.08594,0.251954 l -1.9999998,4 a 1.0001,1.0001 0 0 1 -0.0625,0.107422 l -1.9707031,2.955078 a 1.0001,1.0001 0 0 1 -0.00977,0.01758 l -0.019531,0.02734 A 1.0001,1.0001 0 0 1 6.6367188,27.777344 L 4.7070312,29.707031 A 1.0001,1.0001 0 1 1 3.2929688,28.292969 L 5.1777344,26.408203 6.0742188,24.617188 7.0273438,21.757812 8,15.917969 V 10.082031 L 7.0273438,4.2421875 6.0742188,1.3828125 5.1777344,-0.40820312 3.2929688,-2.2929688 a 1.0001,1.0001 0 0 1 0.6972656,-1.7167968 z"
     id="path2" />
</svg>
