<?xml version="1.0" encoding="UTF-8" standalone="no"?>
<svg
   xmlns:dc="http://purl.org/dc/elements/1.1/"
   xmlns:cc="http://creativecommons.org/ns#"
   xmlns:rdf="http://www.w3.org/1999/02/22-rdf-syntax-ns#"
   xmlns:svg="http://www.w3.org/2000/svg"
   xmlns="http://www.w3.org/2000/svg"
   xmlns:sodipodi="http://sodipodi.sourceforge.net/DTD/sodipodi-0.dtd"
   xmlns:inkscape="http://www.inkscape.org/namespaces/inkscape"
   data-dec="119"
   width="24"
   height="40"
   version="1.1"
   id="svg4"
   sodipodi:docname="119.svg"
   inkscape:version="0.92.4 (unknown)">
  <metadata
     id="metadata10">
    <rdf:RDF>
      <cc:Work
         rdf:about="">
        <dc:format>image/svg+xml</dc:format>
        <dc:type
           rdf:resource="http://purl.org/dc/dcmitype/StillImage" />
      </cc:Work>
    </rdf:RDF>
  </metadata>
  <defs
     id="defs8" />
  <sodipodi:namedview
     pagecolor="#ffffff"
     bordercolor="#666666"
     borderopacity="1"
     objecttolerance="10"
     gridtolerance="10"
     guidetolerance="10"
     inkscape:pageopacity="0"
     inkscape:pageshadow="2"
     inkscape:window-width="615"
     inkscape:window-height="417"
     id="namedview6"
     showgrid="false"
     inkscape:zoom="5.9"
     inkscape:cx="12"
     inkscape:cy="20"
     inkscape:window-x="0"
     inkscape:window-y="27"
     inkscape:window-maximized="0"
     inkscape:current-layer="svg4" />
  <path
     style="color:#000000;font-style:normal;font-variant:normal;font-weight:normal;font-stretch:normal;font-size:medium;line-height:normal;font-family:sans-serif;font-variant-ligatures:normal;font-variant-position:normal;font-variant-caps:normal;font-variant-numeric:normal;font-variant-alternates:normal;font-feature-settings:normal;text-indent:0;text-align:start;text-decoration:none;text-decoration-line:none;text-decoration-style:solid;text-decoration-color:#000000;letter-spacing:normal;word-spacing:normal;text-transform:none;writing-mode:lr-tb;direction:ltr;text-orientation:mixed;dominant-baseline:auto;baseline-shift:baseline;text-anchor:start;white-space:normal;shape-padding:0;clip-rule:nonzero;display:inline;overflow:visible;visibility:visible;opacity:1;isolation:auto;mix-blend-mode:normal;color-interpolation:sRGB;color-interpolation-filters:linearRGB;solid-color:#000000;solid-opacity:1;vector-effect:none;fill:#013272;fill-opacity:1;fill-rule:nonzero;stroke:none;stroke-width:3;stroke-linecap:round;stroke-linejoin:round;stroke-miterlimit:4;stroke-dasharray:none;stroke-dashoffset:0;stroke-opacity:1;color-rendering:auto;image-rendering:auto;shape-rendering:auto;text-rendering:auto;enable-background:accumulate"
     d="M 4.0039062,6.4785156 A 1.50015,1.50015 0 0 1 4.2285156,6.5 H 7 a 1.50015,1.50015 0 1 1 0,3 H 5.9882812 L 8,16.542969 10.513672,7.7460938 a 1.50015,1.50015 0 0 1 1.287109,-1.2519532 1.50015,1.50015 0 0 1 0.13086,-0.011719 1.50015,1.50015 0 0 1 0.03125,-0.00195 1.50015,1.50015 0 0 1 0.0918,0.00195 1.50015,1.50015 0 0 1 0.0918,0.00586 1.50015,1.50015 0 0 1 0.0078,0 1.50015,1.50015 0 0 1 0.0098,0.00195 1.50015,1.50015 0 0 1 0.138672,0.021484 1.50015,1.50015 0 0 1 0.144532,0.037109 1.50015,1.50015 0 0 1 1.039062,1.1972657 L 16,16.542969 18.011719,9.5 H 17 a 1.50015,1.50015 0 1 1 0,-3 h 2.769531 A 1.50015,1.50015 0 0 1 20.25,6.5 H 23 a 1.50015,1.50015 0 1 1 0,3 h -1.869141 l -3.644531,12.753906 a 1.50015,1.50015 0 0 1 -1.287109,1.251953 1.50015,1.50015 0 0 1 -0.13086,0.01172 1.50015,1.50015 0 0 1 -0.01953,0.002 1.50015,1.50015 0 0 1 -0.01172,0 1.50015,1.50015 0 0 1 -0.0918,-0.002 1.50015,1.50015 0 0 1 -0.0918,-0.0059 1.50015,1.50015 0 0 1 -0.0078,0 1.50015,1.50015 0 0 1 -0.0098,-0.002 1.50015,1.50015 0 0 1 -0.138672,-0.02148 1.50015,1.50015 0 0 1 -0.144532,-0.03711 1.50015,1.50015 0 0 1 -1.039062,-1.197266 L 12,13.457031 9.4863281,22.253906 a 1.50015,1.50015 0 0 1 -1.2871093,1.251953 1.50015,1.50015 0 0 1 -0.1308594,0.01172 1.50015,1.50015 0 0 1 -0.019531,0.002 1.50015,1.50015 0 0 1 -0.011719,0 1.50015,1.50015 0 0 1 -0.091797,-0.002 1.50015,1.50015 0 0 1 -0.091797,-0.0059 1.50015,1.50015 0 0 1 -0.00781,0 1.50015,1.50015 0 0 1 -0.00977,-0.002 1.50015,1.50015 0 0 1 -0.1386719,-0.02148 1.50015,1.50015 0 0 1 -0.1445312,-0.03711 1.50015,1.50015 0 0 1 -1.0390625,-1.197266 L 2.8691406,9.5 H 1 a 1.50015,1.50015 0 1 1 0,-3 h 2.7597656 a 1.50015,1.50015 0 0 1 0.2441406,-0.021484 z"
     id="path2" />
</svg>
