<?xml version="1.0" encoding="UTF-8" standalone="no"?>
<svg
   xmlns:dc="http://purl.org/dc/elements/1.1/"
   xmlns:cc="http://creativecommons.org/ns#"
   xmlns:rdf="http://www.w3.org/1999/02/22-rdf-syntax-ns#"
   xmlns:svg="http://www.w3.org/2000/svg"
   xmlns="http://www.w3.org/2000/svg"
   xmlns:sodipodi="http://sodipodi.sourceforge.net/DTD/sodipodi-0.dtd"
   xmlns:inkscape="http://www.inkscape.org/namespaces/inkscape"
   data-dec="117"
   width="20"
   height="40"
   version="1.1"
   id="svg4"
   sodipodi:docname="117.svg"
   inkscape:version="0.92.4 (unknown)">
  <metadata
     id="metadata10">
    <rdf:RDF>
      <cc:Work
         rdf:about="">
        <dc:format>image/svg+xml</dc:format>
        <dc:type
           rdf:resource="http://purl.org/dc/dcmitype/StillImage" />
      </cc:Work>
    </rdf:RDF>
  </metadata>
  <defs
     id="defs8" />
  <sodipodi:namedview
     pagecolor="#ffffff"
     bordercolor="#666666"
     borderopacity="1"
     objecttolerance="10"
     gridtolerance="10"
     guidetolerance="10"
     inkscape:pageopacity="0"
     inkscape:pageshadow="2"
     inkscape:window-width="640"
     inkscape:window-height="480"
     id="namedview6"
     showgrid="false"
     inkscape:zoom="5.9"
     inkscape:cx="10"
     inkscape:cy="20"
     inkscape:window-x="0"
     inkscape:window-y="27"
     inkscape:window-maximized="0"
     inkscape:current-layer="svg4" />
  <path
     style="color:#000000;font-style:normal;font-variant:normal;font-weight:normal;font-stretch:normal;font-size:medium;line-height:normal;font-family:sans-serif;font-variant-ligatures:normal;font-variant-position:normal;font-variant-caps:normal;font-variant-numeric:normal;font-variant-alternates:normal;font-feature-settings:normal;text-indent:0;text-align:start;text-decoration:none;text-decoration-line:none;text-decoration-style:solid;text-decoration-color:#000000;letter-spacing:normal;word-spacing:normal;text-transform:none;writing-mode:lr-tb;direction:ltr;text-orientation:mixed;dominant-baseline:auto;baseline-shift:baseline;text-anchor:start;white-space:normal;shape-padding:0;clip-rule:nonzero;display:inline;overflow:visible;visibility:visible;opacity:1;isolation:auto;mix-blend-mode:normal;color-interpolation:sRGB;color-interpolation-filters:linearRGB;solid-color:#000000;solid-opacity:1;vector-effect:none;fill:#000000;fill-opacity:1;fill-rule:nonzero;stroke:none;stroke-width:0.30000001;stroke-linecap:round;stroke-linejoin:round;stroke-miterlimit:4;stroke-dasharray:none;stroke-dashoffset:0;stroke-opacity:1;color-rendering:auto;image-rendering:auto;shape-rendering:auto;text-rendering:auto;enable-background:accumulate"
     d="m 7.21875,21.150391 2.7636719,0.691406 1.3828121,-0.691406 z M 9.5,20.652344 8.5136719,20.849609 h 1.9726561 z m 4.742188,-1.105469 -1.154297,0.576172 -0.960938,0.958984 a 0.15001501,0.15001501 0 0 1 -0.002,0.0039 0.15001501,0.15001501 0 0 1 -0.01758,0.01953 h -0.002 a 0.15001501,0.15001501 0 0 1 -0.002,0.002 0.15001501,0.15001501 0 0 1 -0.0059,0.0078 0.15001501,0.15001501 0 0 1 -0.01758,0.01172 0.15001501,0.15001501 0 0 1 -0.0078,0.0059 0.15001501,0.15001501 0 0 1 -0.0059,0.002 0.15001501,0.15001501 0 0 1 -0.0078,0.0039 0.15001501,0.15001501 0 0 1 -0.01367,0.0059 l -1.408203,0.705078 h 0.328125 l 1.947265,-0.972656 z M 5.1503906,18.636719 V 19.9375 l 0.9257813,0.927734 0.7714843,0.19336 -0.953125,-0.953125 a 0.15001501,0.15001501 0 0 1 -0.029297,-0.03906 z m 10.6992184,-0.275391 -0.699218,0.699219 v 2.789062 h 0.699218 z m -1,0 -1.091797,1.091797 1.091797,-0.544922 z m 0,-1.724609 -0.714843,1.429687 a 0.15001501,0.15001501 0 0 1 -0.0293,0.03906 l -2,2 a 0.15001501,0.15001501 0 0 1 -0.07617,0.04102 L 10.261719,20.5 l 1.689453,0.337891 0.943359,-0.94336 a 0.15001501,0.15001501 0 0 1 0.01367,-0.01172 l 1.941406,-1.943359 z m 1.300782,-8.4863284 v 9.8339844 a 0.15001501,0.15001501 0 0 1 0.002,0.01367 0.15001501,0.15001501 0 0 1 -0.002,0.01563 v 3.835937 h 0.699218 V 8.1503906 Z m -1,0 v 7.8300784 a 0.15001501,0.15001501 0 0 1 0,0.0293 v 1.974609 a 0.15001501,0.15001501 0 0 1 0,0.0293 v 0.625 l 0.699218,-0.699219 V 8.1503906 Z m -10.0000004,0 v 9.8144534 l 0.9726563,1.947265 0.9257812,0.925782 1.6875,-0.337891 -1.765625,-0.353516 a 0.15001501,0.15001501 0 0 1 -0.1054687,-0.08008 l -1,-2 A 0.15001501,0.15001501 0 0 1 5.8496094,18 V 8.1503906 Z m -1,0 v 9.8261714 l 0.9726563,2.917969 1.9121093,0.955078 h 1.7402344 l -2.8125,-0.703125 a 0.15001501,0.15001501 0 0 1 -0.068359,-0.04102 l -1,-1 A 0.15001501,0.15001501 0 0 1 4.8496094,20 V 18 8.1503906 Z M 3.9980469,7.8476562 a 0.15001501,0.15001501 0 0 1 0.029297,0.00195 h 0.9550781 0.00195 a 0.15001501,0.15001501 0 0 1 0.042969,0 H 6 A 0.15001501,0.15001501 0 0 1 6.1503906,8 v 9.964844 L 7.1015625,19.867188 9.5,20.347656 l 2.425781,-0.486328 1.951172,-1.949219 0.972656,-1.947265 V 8.0175781 a 0.15001501,0.15001501 0 0 1 0.0098,-0.072266 0.15001501,0.15001501 0 0 1 0,-0.00195 0.15001501,0.15001501 0 0 1 0.0059,-0.011719 0.15001501,0.15001501 0 0 1 0,-0.00195 0.15001501,0.15001501 0 0 1 0.01563,-0.023437 0.15001501,0.15001501 0 0 1 0.0332,-0.03125 0.15001501,0.15001501 0 0 1 0.01172,-0.00781 0.15001501,0.15001501 0 0 1 0.0293,-0.011719 0.15001501,0.15001501 0 0 1 0.02734,-0.00586 0.15001501,0.15001501 0 0 1 0.002,0 0.15001501,0.15001501 0 0 1 0.04297,0 h 0.955078 0.002 a 0.15001501,0.15001501 0 0 1 0.04297,0 H 17 A 0.15001501,0.15001501 0 0 1 17.150391,8 v 13.982422 a 0.15001501,0.15001501 0 0 1 -0.0098,0.07227 0.15001501,0.15001501 0 0 1 0,0.002 0.15001501,0.15001501 0 0 1 -0.0059,0.01172 0.15001501,0.15001501 0 0 1 -0.0078,0.01367 0.15001501,0.15001501 0 0 1 -0.0078,0.01172 0.15001501,0.15001501 0 0 1 0,0.002 0.15001501,0.15001501 0 0 1 -0.0059,0.0039 0.15001501,0.15001501 0 0 1 -0.0059,0.0059 0.15001501,0.15001501 0 0 1 -0.02148,0.01953 0.15001501,0.15001501 0 0 1 -0.04102,0.01953 0.15001501,0.15001501 0 0 1 -0.02734,0.0059 0.15001501,0.15001501 0 0 1 -0.002,0 0.15001501,0.15001501 0 0 1 -0.04297,0 h -0.955078 a 0.15001501,0.15001501 0 0 1 -0.002,0 0.15001501,0.15001501 0 0 1 -0.04297,0 H 15 A 0.15001501,0.15001501 0 0 1 14.849609,22 v -2.638672 l -1.74414,1.744141 a 0.15001501,0.15001501 0 0 1 -0.03906,0.0293 l -2,1 A 0.15001501,0.15001501 0 0 1 11,22.150391 H 10 9.9941406 7 a 0.15001501,0.15001501 0 0 1 -0.066406,-0.01563 l -2,-1 a 0.15001501,0.15001501 0 0 1 -0.076172,-0.08789 l -1,-3 A 0.15001501,0.15001501 0 0 1 3.8496094,18 V 8.0175781 a 0.15001501,0.15001501 0 0 1 0.00977,-0.072266 0.15001501,0.15001501 0 0 1 0,-0.00195 0.15001501,0.15001501 0 0 1 0.00586,-0.011719 0.15001501,0.15001501 0 0 1 0,-0.00195 0.15001501,0.15001501 0 0 1 0.00781,-0.011719 0.15001501,0.15001501 0 0 1 0.00781,-0.013672 0.15001501,0.15001501 0 0 1 0.00586,-0.00391 0.15001501,0.15001501 0 0 1 0.015625,-0.015625 0.15001501,0.15001501 0 0 1 0.011719,-0.00977 0.15001501,0.15001501 0 0 1 0.041016,-0.019531 0.15001501,0.15001501 0 0 1 0.027344,-0.00586 0.15001501,0.15001501 0 0 1 0.00195,0 0.15001501,0.15001501 0 0 1 0.013672,-0.00195 z"
     id="path2" />
</svg>
