<?xml version="1.0" encoding="UTF-8" standalone="no"?>
<svg
   xmlns:dc="http://purl.org/dc/elements/1.1/"
   xmlns:cc="http://creativecommons.org/ns#"
   xmlns:rdf="http://www.w3.org/1999/02/22-rdf-syntax-ns#"
   xmlns:svg="http://www.w3.org/2000/svg"
   xmlns="http://www.w3.org/2000/svg"
   xmlns:sodipodi="http://sodipodi.sourceforge.net/DTD/sodipodi-0.dtd"
   xmlns:inkscape="http://www.inkscape.org/namespaces/inkscape"
   data-dec="51"
   width="15"
   height="40"
   version="1.1"
   id="svg4"
   sodipodi:docname="51.svg"
   inkscape:version="0.92.4 5da689c313, 2019-01-14">
  <metadata
     id="metadata10">
    <rdf:RDF>
      <cc:Work
         rdf:about="">
        <dc:format>image/svg+xml</dc:format>
        <dc:type
           rdf:resource="http://purl.org/dc/dcmitype/StillImage" />
        <dc:title></dc:title>
      </cc:Work>
    </rdf:RDF>
  </metadata>
  <defs
     id="defs8" />
  <sodipodi:namedview
     pagecolor="#ffffff"
     bordercolor="#666666"
     borderopacity="1"
     objecttolerance="10"
     gridtolerance="10"
     guidetolerance="10"
     inkscape:pageopacity="0"
     inkscape:pageshadow="2"
     inkscape:window-width="1920"
     inkscape:window-height="1043"
     id="namedview6"
     showgrid="false"
     inkscape:zoom="5.9"
     inkscape:cx="7.5"
     inkscape:cy="20"
     inkscape:window-x="0"
     inkscape:window-y="37"
     inkscape:window-maximized="0"
     inkscape:current-layer="svg4" />
  <path
     style="color:#000000;font-style:normal;font-variant:normal;font-weight:normal;font-stretch:normal;font-size:medium;line-height:normal;font-family:sans-serif;font-variant-ligatures:normal;font-variant-position:normal;font-variant-caps:normal;font-variant-numeric:normal;font-variant-alternates:normal;font-feature-settings:normal;text-indent:0;text-align:start;text-decoration:none;text-decoration-line:none;text-decoration-style:solid;text-decoration-color:#000000;letter-spacing:normal;word-spacing:normal;text-transform:none;writing-mode:lr-tb;direction:ltr;text-orientation:mixed;dominant-baseline:auto;baseline-shift:baseline;text-anchor:start;white-space:normal;shape-padding:0;clip-rule:nonzero;display:inline;overflow:visible;visibility:visible;opacity:1;isolation:auto;mix-blend-mode:normal;color-interpolation:sRGB;color-interpolation-filters:linearRGB;solid-color:#000000;solid-opacity:1;vector-effect:none;fill:#000000;fill-opacity:1;fill-rule:nonzero;stroke:none;stroke-width:1.5;stroke-linecap:round;stroke-linejoin:round;stroke-miterlimit:4;stroke-dasharray:none;stroke-dashoffset:0;stroke-opacity:1;color-rendering:auto;image-rendering:auto;shape-rendering:auto;text-rendering:auto;enable-background:accumulate"
     d="M 7.9746094,0.24609375 A 0.750075,0.750075 0 0 1 8.0644531,0.25 H 9 a 0.750075,0.750075 0 0 1 0.3359375,0.0800781 L 11.335938,1.3300781 a 0.750075,0.750075 0 0 1 0.333984,0.3339844 l 1,2 A 0.750075,0.750075 0 0 1 12.75,4 v 2 a 0.750075,0.750075 0 0 1 -0.21875,0.53125 l -1,1 -1,1 -1,1 -0.1425781,0.1425781 1.8476561,0.6152339 a 0.750075,0.750075 0 0 1 0.294922,0.179688 l 1,1 a 0.750075,0.750075 0 0 1 0.138672,0.195312 l 1,2 A 0.750075,0.750075 0 0 1 13.75,14 v 3 a 0.750075,0.750075 0 0 1 -0.08008,0.335938 l -1,2 A 0.750075,0.750075 0 0 1 12.53125,19.53125 l -2,2 a 0.750075,0.750075 0 0 1 -0.01172,0.0098 0.750075,0.750075 0 0 1 -0.183593,0.128906 l -2.0000005,1 a 0.750075,0.750075 0 0 1 -0.042969,0.02148 0.750075,0.750075 0 0 1 -0.011719,0.0039 0.750075,0.750075 0 0 1 -0.060547,0.02148 A 0.750075,0.750075 0 0 1 7.9101562,22.75 H 6.1015625 a 0.750075,0.750075 0 0 1 -0.3691406,-0.04883 0.750075,0.750075 0 0 1 -0.068359,-0.03125 l -2,-1 A 0.750075,0.750075 0 0 1 3.6347656,21.654297 0.750075,0.750075 0 0 1 3.5859375,21.625 0.750075,0.750075 0 0 1 3.46875,21.53125 l -0.025391,-0.02344 a 0.750075,0.750075 0 0 1 -0.00977,-0.01172 L 2.5410156,20.603516 A 0.750075,0.750075 0 0 1 2.4082031,20.470703 L 1.46875,19.53125 A 0.750075,0.750075 0 0 1 1.4414062,19.5 0.750075,0.750075 0 0 1 1.4335938,19.492188 0.750075,0.750075 0 0 1 1.3945312,19.441406 0.750075,0.750075 0 0 1 2.0917969,18.25 h 0.7851562 a 0.750075,0.750075 0 0 1 0.6445313,0.201172 0.750075,0.750075 0 0 1 0.00391,0.0039 0.750075,0.750075 0 0 1 0.00391,0.0039 0.750075,0.750075 0 0 1 0.046875,0.04883 0.750075,0.750075 0 0 1 0.00391,0.0059 A 0.750075,0.750075 0 0 1 3.75,19.123047 v 0.566406 L 4.4433594,20.382812 6.1777344,21.25 h 1.6445312 l 1.6191406,-0.808594 v -0.002 L 11.25,16.822266 V 14.177734 L 10.382812,12.443359 9.5566406,11.617188 7.7695312,10.722656 a 0.750075,0.750075 0 0 1 -0.4726562,-0.439453 0.750075,0.750075 0 0 1 -0.025391,-0.07031 0.750075,0.750075 0 0 1 -0.00781,-0.0293 0.750075,0.750075 0 0 1 -0.00195,-0.0078 0.750075,0.750075 0 0 1 -0.00391,-0.01953 0.750075,0.750075 0 0 1 -0.00195,-0.0098 0.750075,0.750075 0 0 1 -0.00195,-0.0059 0.750075,0.750075 0 0 1 -0.00391,-0.02148 0.750075,0.750075 0 0 1 -0.00195,-0.01953 0.750075,0.750075 0 0 1 -0.00586,-0.06641 0.750075,0.750075 0 0 1 0,-0.074219 0.750075,0.750075 0 0 1 0.00391,-0.060547 0.750075,0.750075 0 0 1 0.00586,-0.033203 0.750075,0.750075 0 0 1 0.00977,-0.044922 0.750075,0.750075 0 0 1 0.00977,-0.033203 0.750075,0.750075 0 0 1 0.00586,-0.025391 0.750075,0.750075 0 0 1 0.017578,-0.046875 0.750075,0.750075 0 0 1 0.00586,-0.015625 0.750075,0.750075 0 0 1 0.00781,-0.015625 0.750075,0.750075 0 0 1 0.023437,-0.046875 0.750075,0.750075 0 0 1 0.00195,-0.00586 0.750075,0.750075 0 0 1 0.029297,-0.048828 0.750075,0.750075 0 0 1 0.023438,-0.03125 0.750075,0.750075 0 0 1 0.025391,-0.03125 0.750075,0.750075 0 0 1 0.011719,-0.013672 0.750075,0.750075 0 0 1 0.046875,-0.050781 0.750075,0.750075 0 0 1 0.056641,-0.048828 0.750075,0.750075 0 0 1 0.011719,-0.00781 l 0.00586,-0.00586 0.00781,-0.00586 L 8.46875,8.46875 9.3828125,7.5566406 9.3847656,7.5527344 10.25,5.8222656 V 4.1777344 L 9.4414062,2.5585938 7.8242188,1.75 H 7.1777344 L 5.4433594,2.6171875 4.53125,3.53125 a 0.75130096,0.75130096 0 1 1 -1.0625,-1.0625 l 1,-1 A 0.750075,0.750075 0 0 1 4.6640625,1.3300781 l 2,-0.99999998 A 0.750075,0.750075 0 0 1 7,0.25 h 0.8984375 a 0.750075,0.750075 0 0 1 0.076172,-0.003906 z"
     id="path2" />
</svg>
