<?xml version="1.0" encoding="UTF-8" standalone="no"?>
<svg
   xmlns:dc="http://purl.org/dc/elements/1.1/"
   xmlns:cc="http://creativecommons.org/ns#"
   xmlns:rdf="http://www.w3.org/1999/02/22-rdf-syntax-ns#"
   xmlns:svg="http://www.w3.org/2000/svg"
   xmlns="http://www.w3.org/2000/svg"
   xmlns:sodipodi="http://sodipodi.sourceforge.net/DTD/sodipodi-0.dtd"
   xmlns:inkscape="http://www.inkscape.org/namespaces/inkscape"
   data-dec="8220"
   width="14"
   height="40"
   version="1.1"
   id="svg4"
   sodipodi:docname="8220.svg"
   inkscape:version="0.92.2 2405546, 2018-03-11">
  <metadata
     id="metadata10">
    <rdf:RDF>
      <cc:Work
         rdf:about="">
        <dc:format>image/svg+xml</dc:format>
        <dc:type
           rdf:resource="http://purl.org/dc/dcmitype/StillImage" />
        <dc:title></dc:title>
      </cc:Work>
    </rdf:RDF>
  </metadata>
  <defs
     id="defs8" />
  <sodipodi:namedview
     pagecolor="#ffffff"
     bordercolor="#666666"
     borderopacity="1"
     objecttolerance="10"
     gridtolerance="10"
     guidetolerance="10"
     inkscape:pageopacity="0"
     inkscape:pageshadow="2"
     inkscape:window-width="640"
     inkscape:window-height="480"
     id="namedview6"
     showgrid="false"
     inkscape:zoom="5.9"
     inkscape:cx="7"
     inkscape:cy="20"
     inkscape:window-x="0"
     inkscape:window-y="17"
     inkscape:window-maximized="0"
     inkscape:current-layer="svg4" />
  <path
     style="color:#000000;font-style:normal;font-variant:normal;font-weight:normal;font-stretch:normal;font-size:medium;line-height:normal;font-family:sans-serif;font-variant-ligatures:normal;font-variant-position:normal;font-variant-caps:normal;font-variant-numeric:normal;font-variant-alternates:normal;font-feature-settings:normal;text-indent:0;text-align:start;text-decoration:none;text-decoration-line:none;text-decoration-style:solid;text-decoration-color:#000000;letter-spacing:normal;word-spacing:normal;text-transform:none;writing-mode:lr-tb;direction:ltr;text-orientation:mixed;dominant-baseline:auto;baseline-shift:baseline;text-anchor:start;white-space:normal;shape-padding:0;clip-rule:nonzero;display:inline;overflow:visible;visibility:visible;opacity:1;isolation:auto;mix-blend-mode:normal;color-interpolation:sRGB;color-interpolation-filters:linearRGB;solid-color:#000000;solid-opacity:1;vector-effect:none;fill:#013272;fill-opacity:1;fill-rule:nonzero;stroke:none;stroke-width:2;stroke-linecap:round;stroke-linejoin:round;stroke-miterlimit:4;stroke-dasharray:none;stroke-dashoffset:0;stroke-opacity:1;color-rendering:auto;image-rendering:auto;shape-rendering:auto;text-rendering:auto;enable-background:accumulate"
     d="m 10.980469,1.9902344 a 1.0001,1.0001 0 0 1 0.726562,1.7167968 l -1.357422,1.3574219 a 1.0001,1.0001 0 0 1 0.357422,0.2285157 l 1,1 a 1.0001,1.0001 0 0 1 0,1.4140624 l -1,1 a 1.0001,1.0001 0 0 1 -1.4140622,0 L 8.40625,7.8203125 A 1.0001,1.0001 0 0 1 8,6.8730469 V 5 A 1.0001,1.0001 0 0 1 8.2929688,4.2929688 l 2.0000002,-2 a 1.0001,1.0001 0 0 1 0.6875,-0.3027344 z m -6.0000002,0 A 1.0001,1.0001 0 0 1 5.7070312,3.7070312 L 4.3496094,5.0644531 a 1.0001,1.0001 0 0 1 0.3574218,0.2285157 l 1,1 a 1.0001,1.0001 0 0 1 0,1.4140624 l -1,1 a 1.0001,1.0001 0 0 1 -1.4140624,0 L 2.40625,7.8203125 A 1.0001,1.0001 0 0 1 2,6.8730469 V 5 A 1.0001,1.0001 0 0 1 2.2929688,4.2929688 l 2,-2 a 1.0001,1.0001 0 0 1 0.6875,-0.3027344 z"
     id="path2" />
</svg>
