<?xml version="1.0" encoding="UTF-8"?>
<glyph name="c" format="1">
  <advance width="520"/>
  <unicode hex="0063"/>
  <outline>
    <contour>
      <point x="261" y="477" type="curve" smooth="yes"/>
      <point x="265" y="477" type="line"/>
      <point x="348" y="477" type="line" smooth="yes"/>
      <point x="352" y="477"/>
      <point x="359" y="476"/>
      <point x="363" y="474" type="curve" smooth="yes"/>
      <point x="421" y="444" type="line" smooth="yes"/>
      <point x="424" y="443"/>
      <point x="429" y="440"/>
      <point x="431" y="438" type="curve" smooth="yes"/>
      <point x="488" y="381" type="line" smooth="yes"/>
      <point x="494" y="375"/>
      <point x="499" y="363"/>
      <point x="499" y="354" type="curve" smooth="yes"/>
      <point x="499" y="326" type="line" smooth="yes"/>
      <point x="499" y="317"/>
      <point x="494" y="306"/>
      <point x="488" y="300" type="curve" smooth="yes"/>
      <point x="460" y="271" type="line" smooth="yes"/>
      <point x="454" y="265"/>
      <point x="443" y="261"/>
      <point x="434" y="261" type="curve" smooth="yes"/>
      <point x="425" y="261"/>
      <point x="414" y="265"/>
      <point x="408" y="271" type="curve" smooth="yes"/>
      <point x="380" y="300" type="line" smooth="yes"/>
      <point x="374" y="306"/>
      <point x="368" y="317"/>
      <point x="368" y="326" type="curve" smooth="yes"/>
      <point x="368" y="335"/>
      <point x="374" y="345"/>
      <point x="380" y="351" type="curve" smooth="yes"/>
      <point x="397" y="370" type="line"/>
      <point x="384" y="383" type="line"/>
      <point x="339" y="405" type="line"/>
      <point x="270" y="405" type="line"/>
      <point x="224" y="383" type="line"/>
      <point x="176" y="336" type="line"/>
      <point x="152" y="262" type="line"/>
      <point x="152" y="216" type="line"/>
      <point x="176" y="143" type="line"/>
      <point x="224" y="95" type="line"/>
      <point x="270" y="73" type="line"/>
      <point x="312" y="73" type="line"/>
      <point x="386" y="97" type="line"/>
      <point x="438" y="148" type="line" smooth="yes"/>
      <point x="444" y="154"/>
      <point x="454" y="160"/>
      <point x="463" y="160" type="curve" smooth="yes"/>
      <point x="483" y="160"/>
      <point x="499" y="143"/>
      <point x="499" y="123" type="curve" smooth="yes"/>
      <point x="499" y="114"/>
      <point x="494" y="104"/>
      <point x="488" y="98" type="curve" smooth="yes"/>
      <point x="431" y="40" type="line" smooth="yes"/>
      <point x="428" y="37"/>
      <point x="421" y="32"/>
      <point x="417" y="31" type="curve" smooth="yes"/>
      <point x="330" y="2" type="line" smooth="yes"/>
      <point x="327" y="1"/>
      <point x="321" y="0"/>
      <point x="318" y="0" type="curve" smooth="yes"/>
      <point x="265" y="0" type="line"/>
      <point x="261" y="0" type="line" smooth="yes"/>
      <point x="258" y="0"/>
      <point x="251" y="1"/>
      <point x="248" y="2" type="curve" smooth="yes"/>
      <point x="163" y="31" type="line" smooth="yes"/>
      <point x="159" y="32"/>
      <point x="151" y="37"/>
      <point x="148" y="40" type="curve" smooth="yes"/>
      <point x="90" y="98" type="line" smooth="yes"/>
      <point x="87" y="101"/>
      <point x="82" y="107"/>
      <point x="81" y="111" type="curve" smooth="yes"/>
      <point x="53" y="198" type="line" smooth="yes"/>
      <point x="52" y="201"/>
      <point x="51" y="207"/>
      <point x="51" y="210" type="curve" smooth="yes"/>
      <point x="51" y="267" type="line" smooth="yes"/>
      <point x="51" y="270"/>
      <point x="52" y="276"/>
      <point x="53" y="279" type="curve" smooth="yes"/>
      <point x="81" y="366" type="line" smooth="yes"/>
      <point x="82" y="370"/>
      <point x="87" y="378"/>
      <point x="90" y="381" type="curve" smooth="yes"/>
      <point x="148" y="438" type="line" smooth="yes"/>
      <point x="151" y="441"/>
      <point x="159" y="446"/>
      <point x="163" y="447" type="curve" smooth="yes"/>
      <point x="246" y="475" type="line"/>
      <point x="248" y="475" type="line" smooth="yes"/>
      <point x="251" y="476"/>
      <point x="257" y="477"/>
    </contour>
  </outline>
  <lib>
    <dict>
      <key>com.fontlab.hintData</key>
      <dict>
        <key>hhints</key>
        <array>
          <dict>
            <key>position</key>
            <integer>0</integer>
            <key>width</key>
            <integer>73</integer>
          </dict>
          <dict>
            <key>position</key>
            <integer>405</integer>
            <key>width</key>
            <integer>73</integer>
          </dict>
        </array>
        <key>vhints</key>
        <array>
          <dict>
            <key>position</key>
            <integer>51</integer>
            <key>width</key>
            <integer>101</integer>
          </dict>
          <dict>
            <key>position</key>
            <integer>369</integer>
            <key>width</key>
            <integer>131</integer>
          </dict>
        </array>
      </dict>
    </dict>
  </lib>
</glyph>
