<?xml version="1.0" encoding="UTF-8" standalone="no"?>
<svg
   xmlns:dc="http://purl.org/dc/elements/1.1/"
   xmlns:cc="http://creativecommons.org/ns#"
   xmlns:rdf="http://www.w3.org/1999/02/22-rdf-syntax-ns#"
   xmlns:svg="http://www.w3.org/2000/svg"
   xmlns="http://www.w3.org/2000/svg"
   xmlns:sodipodi="http://sodipodi.sourceforge.net/DTD/sodipodi-0.dtd"
   xmlns:inkscape="http://www.inkscape.org/namespaces/inkscape"
   data-dec="114"
   width="14"
   height="40"
   version="1.1"
   id="svg4"
   sodipodi:docname="114.svg"
   inkscape:version="0.92.4 5da689c313, 2019-01-14">
  <metadata
     id="metadata10">
    <rdf:RDF>
      <cc:Work
         rdf:about="">
        <dc:format>image/svg+xml</dc:format>
        <dc:type
           rdf:resource="http://purl.org/dc/dcmitype/StillImage" />
        <dc:title></dc:title>
      </cc:Work>
    </rdf:RDF>
  </metadata>
  <defs
     id="defs8" />
  <sodipodi:namedview
     pagecolor="#ffffff"
     bordercolor="#666666"
     borderopacity="1"
     objecttolerance="10"
     gridtolerance="10"
     guidetolerance="10"
     inkscape:pageopacity="0"
     inkscape:pageshadow="2"
     inkscape:window-width="1920"
     inkscape:window-height="1043"
     id="namedview6"
     showgrid="false"
     inkscape:zoom="5.9"
     inkscape:cx="7"
     inkscape:cy="20"
     inkscape:window-x="0"
     inkscape:window-y="37"
     inkscape:window-maximized="0"
     inkscape:current-layer="svg4" />
  <path
     style="color:#000000;font-style:normal;font-variant:normal;font-weight:normal;font-stretch:normal;font-size:medium;line-height:normal;font-family:sans-serif;font-variant-ligatures:normal;font-variant-position:normal;font-variant-caps:normal;font-variant-numeric:normal;font-variant-alternates:normal;font-feature-settings:normal;text-indent:0;text-align:start;text-decoration:none;text-decoration-line:none;text-decoration-style:solid;text-decoration-color:#000000;letter-spacing:normal;word-spacing:normal;text-transform:none;writing-mode:lr-tb;direction:ltr;text-orientation:mixed;dominant-baseline:auto;baseline-shift:baseline;text-anchor:start;white-space:normal;shape-padding:0;clip-rule:nonzero;display:inline;overflow:visible;visibility:visible;opacity:1;isolation:auto;mix-blend-mode:normal;color-interpolation:sRGB;color-interpolation-filters:linearRGB;solid-color:#000000;solid-opacity:1;vector-effect:none;fill:#000000;fill-opacity:1;fill-rule:nonzero;stroke:none;stroke-width:2.5;stroke-linecap:round;stroke-linejoin:round;stroke-miterlimit:4;stroke-dasharray:none;stroke-dashoffset:0;stroke-opacity:1;color-rendering:auto;image-rendering:auto;shape-rendering:auto;text-rendering:auto;enable-background:accumulate"
     d="M 3.9804688,6.7324219 A 1.250125,1.250125 0 0 1 4.203125,6.75 H 5 A 1.250125,1.250125 0 0 1 6.25,8 V 8.9804688 L 7.1152344,8.1152344 A 1.250125,1.250125 0 0 1 7.4414062,7.8828125 l 2,-1 A 1.250125,1.250125 0 0 1 10,6.75 h 2.800781 a 1.250125,1.250125 0 0 1 1.066407,0.3320312 1.250125,1.250125 0 0 1 0.0078,0.00781 1.250125,1.250125 0 0 1 0.0078,0.00781 1.250125,1.250125 0 0 1 0.0059,0.00586 A 1.250125,1.250125 0 0 1 14.25,8.203125 V 9 A 1.250125,1.250125 0 0 1 13,10.25 H 10.294922 L 8.7402344,11.027344 7.0273438,12.740234 6.25,14.292969 v 7.507812 a 1.250125,1.250125 0 0 1 -0.3320312,1.066407 1.250125,1.250125 0 0 1 -0.00781,0.0078 1.250125,1.250125 0 0 1 -0.00781,0.0078 1.250125,1.250125 0 0 1 -0.00586,0.0059 A 1.250125,1.250125 0 0 1 4.796875,23.25 H 4 A 1.250125,1.250125 0 0 1 2.75,22 V 8.1992188 a 1.250125,1.250125 0 0 1 0.3320312,-1.0664063 1.250125,1.250125 0 0 1 0.013672,-0.013672 1.250125,1.250125 0 0 1 0.00781,-0.00781 1.250125,1.250125 0 0 1 0.8769532,-0.3789062 z"
     id="path2" />
</svg>
