<?xml version="1.0" encoding="UTF-8" standalone="no"?>
<svg
   xmlns:dc="http://purl.org/dc/elements/1.1/"
   xmlns:cc="http://creativecommons.org/ns#"
   xmlns:rdf="http://www.w3.org/1999/02/22-rdf-syntax-ns#"
   xmlns:svg="http://www.w3.org/2000/svg"
   xmlns="http://www.w3.org/2000/svg"
   xmlns:sodipodi="http://sodipodi.sourceforge.net/DTD/sodipodi-0.dtd"
   xmlns:inkscape="http://www.inkscape.org/namespaces/inkscape"
   data-dec="8220"
   width="15"
   height="40"
   version="1.1"
   id="svg4"
   sodipodi:docname="8220.svg"
   inkscape:version="0.92.4 (unknown)">
  <metadata
     id="metadata10">
    <rdf:RDF>
      <cc:Work
         rdf:about="">
        <dc:format>image/svg+xml</dc:format>
        <dc:type
           rdf:resource="http://purl.org/dc/dcmitype/StillImage" />
      </cc:Work>
    </rdf:RDF>
  </metadata>
  <defs
     id="defs8" />
  <sodipodi:namedview
     pagecolor="#ffffff"
     bordercolor="#666666"
     borderopacity="1"
     objecttolerance="10"
     gridtolerance="10"
     guidetolerance="10"
     inkscape:pageopacity="0"
     inkscape:pageshadow="2"
     inkscape:window-width="640"
     inkscape:window-height="480"
     id="namedview6"
     showgrid="false"
     inkscape:zoom="5.9"
     inkscape:cx="7.5"
     inkscape:cy="20"
     inkscape:window-x="0"
     inkscape:window-y="27"
     inkscape:window-maximized="0"
     inkscape:current-layer="svg4" />
  <path
     style="color:#000000;font-style:normal;font-variant:normal;font-weight:normal;font-stretch:normal;font-size:medium;line-height:normal;font-family:sans-serif;font-variant-ligatures:normal;font-variant-position:normal;font-variant-caps:normal;font-variant-numeric:normal;font-variant-alternates:normal;font-feature-settings:normal;text-indent:0;text-align:start;text-decoration:none;text-decoration-line:none;text-decoration-style:solid;text-decoration-color:#000000;letter-spacing:normal;word-spacing:normal;text-transform:none;writing-mode:lr-tb;direction:ltr;text-orientation:mixed;dominant-baseline:auto;baseline-shift:baseline;text-anchor:start;white-space:normal;shape-padding:0;clip-rule:nonzero;display:inline;overflow:visible;visibility:visible;opacity:1;isolation:auto;mix-blend-mode:normal;color-interpolation:sRGB;color-interpolation-filters:linearRGB;solid-color:#000000;solid-opacity:1;vector-effect:none;fill:#013272;fill-opacity:1;fill-rule:nonzero;stroke:none;stroke-width:1.5;stroke-linecap:round;stroke-linejoin:round;stroke-miterlimit:4;stroke-dasharray:none;stroke-dashoffset:0;stroke-opacity:1;color-rendering:auto;image-rendering:auto;shape-rendering:auto;text-rendering:auto;enable-background:accumulate"
     d="M 12.003906,0.24609375 A 0.750075,0.750075 0 0 1 12.335938,1.6699219 L 10.644531,2.515625 10.232422,4.1699219 10.3125,4.25 H 11 a 0.750075,0.750075 0 0 1 0.53125,0.21875 l 1,1 A 0.750075,0.750075 0 0 1 12.75,6 v 1 a 0.750075,0.750075 0 0 1 -0.21875,0.53125 l -1,1 A 0.750075,0.750075 0 0 1 11,8.75 H 10 A 0.750075,0.750075 0 0 1 9.46875,8.53125 l -1,-1 A 0.750075,0.750075 0 0 1 8.25,7 V 6.1074219 a 0.750075,0.750075 0 0 1 0,-0.1992188 V 4.0996094 A 0.750075,0.750075 0 0 1 8.3847656,3.5546875 L 9.3105469,1.7050781 A 0.750075,0.750075 0 0 1 9.3125,1.6972656 0.750075,0.750075 0 0 1 9.7636719,1.2792969 L 11.664062,0.33007812 a 0.750075,0.750075 0 0 1 0.339844,-0.0839844 z m -5.9999998,0 A 0.750075,0.750075 0 0 1 6.3359375,1.6699219 L 4.6445312,2.515625 4.2324219,4.1699219 4.3125,4.25 H 5 a 0.750075,0.750075 0 0 1 0.53125,0.21875 l 1,1 A 0.750075,0.750075 0 0 1 6.75,6 V 7 A 0.750075,0.750075 0 0 1 6.53125,7.53125 l -1,1 A 0.750075,0.750075 0 0 1 5,8.75 H 4 A 0.750075,0.750075 0 0 1 3.46875,8.53125 l -1,-1 A 0.750075,0.750075 0 0 1 2.25,7 V 6.1074219 a 0.750075,0.750075 0 0 1 0,-0.1992188 V 4.0996094 A 0.750075,0.750075 0 0 1 2.3847656,3.5546875 L 3.3105469,1.7050781 A 0.750075,0.750075 0 0 1 3.3125,1.6972656 0.750075,0.750075 0 0 1 3.7636719,1.2792969 L 5.6640625,0.33007812 a 0.750075,0.750075 0 0 1 0.3398437,-0.0839844 z"
     id="path2" />
</svg>
