<?xml version="1.0" encoding="UTF-8" standalone="no"?>
<svg
   xmlns:dc="http://purl.org/dc/elements/1.1/"
   xmlns:cc="http://creativecommons.org/ns#"
   xmlns:rdf="http://www.w3.org/1999/02/22-rdf-syntax-ns#"
   xmlns:svg="http://www.w3.org/2000/svg"
   xmlns="http://www.w3.org/2000/svg"
   xmlns:sodipodi="http://sodipodi.sourceforge.net/DTD/sodipodi-0.dtd"
   xmlns:inkscape="http://www.inkscape.org/namespaces/inkscape"
   data-dec="109"
   width="34"
   height="40"
   version="1.1"
   id="svg4"
   sodipodi:docname="109.svg"
   inkscape:version="0.92.4 (unknown)">
  <metadata
     id="metadata10">
    <rdf:RDF>
      <cc:Work
         rdf:about="">
        <dc:format>image/svg+xml</dc:format>
        <dc:type
           rdf:resource="http://purl.org/dc/dcmitype/StillImage" />
      </cc:Work>
    </rdf:RDF>
  </metadata>
  <defs
     id="defs8" />
  <sodipodi:namedview
     pagecolor="#ffffff"
     bordercolor="#666666"
     borderopacity="1"
     objecttolerance="10"
     gridtolerance="10"
     guidetolerance="10"
     inkscape:pageopacity="0"
     inkscape:pageshadow="2"
     inkscape:window-width="615"
     inkscape:window-height="417"
     id="namedview6"
     showgrid="false"
     inkscape:zoom="5.9"
     inkscape:cx="17"
     inkscape:cy="20"
     inkscape:window-x="0"
     inkscape:window-y="27"
     inkscape:window-maximized="0"
     inkscape:current-layer="svg4" />
  <path
     style="color:#000000;font-style:normal;font-variant:normal;font-weight:normal;font-stretch:normal;font-size:medium;line-height:normal;font-family:sans-serif;font-variant-ligatures:normal;font-variant-position:normal;font-variant-caps:normal;font-variant-numeric:normal;font-variant-alternates:normal;font-feature-settings:normal;text-indent:0;text-align:start;text-decoration:none;text-decoration-line:none;text-decoration-style:solid;text-decoration-color:#000000;letter-spacing:normal;word-spacing:normal;text-transform:none;writing-mode:lr-tb;direction:ltr;text-orientation:mixed;dominant-baseline:auto;baseline-shift:baseline;text-anchor:start;white-space:normal;shape-padding:0;clip-rule:nonzero;display:inline;overflow:visible;visibility:visible;opacity:1;isolation:auto;mix-blend-mode:normal;color-interpolation:sRGB;color-interpolation-filters:linearRGB;solid-color:#000000;solid-opacity:1;vector-effect:none;fill:#013272;fill-opacity:1;fill-rule:nonzero;stroke:none;stroke-width:2.5;stroke-linecap:round;stroke-linejoin:round;stroke-miterlimit:4;stroke-dasharray:none;stroke-dashoffset:0;stroke-opacity:1;color-rendering:auto;image-rendering:auto;shape-rendering:auto;text-rendering:auto;enable-background:accumulate"
     d="M 4.9804688,6.7324219 A 1.250125,1.250125 0 0 1 5.203125,6.75 h 0.5976562 a 1.250125,1.250125 0 0 1 1.0664063,0.3320312 1.250125,1.250125 0 0 1 0.00781,0.00781 1.250125,1.250125 0 0 1 0.00586,0.00586 1.250125,1.250125 0 0 1 0.00781,0.00781 1.250125,1.250125 0 0 1 0.3789062,0.8847656 1.250125,1.250125 0 0 1 0.3378907,-0.1738281 l 3.0000002,-1 A 1.250125,1.250125 0 0 1 11,6.75 h 1.857422 a 1.250125,1.250125 0 0 1 0.58789,0.080078 l 0.0098,0.00391 2.939453,0.9804687 a 1.250125,1.250125 0 0 1 0.722657,0.6269531 l 0.224609,0.4472657 0.773437,-0.7734375 a 1.250125,1.250125 0 0 1 0.490235,-0.3007813 l 3,-1 A 1.250125,1.250125 0 0 1 22,6.75 h 1.857422 a 1.250125,1.250125 0 0 1 0.58789,0.080078 l 0.0098,0.00391 2.939453,0.9804687 a 1.250125,1.250125 0 0 1 0.722657,0.6269531 l 1,1.9999998 A 1.250125,1.250125 0 0 1 29.25,11 v 9.75 H 31 a 1.250125,1.250125 0 1 1 0,2.5 h -2.800781 a 1.250125,1.250125 0 0 1 -0.402344,0 h -0.597656 a 1.250125,1.250125 0 0 1 -0.402344,0 H 24 a 1.250125,1.250125 0 1 1 0,-2.5 h 1.75 V 11.294922 L 25.068359,9.9316406 23.707031,9.25 H 22.203125 L 19.675781,10.091797 18.25,11.519531 V 20.75 H 20 a 1.250125,1.250125 0 1 1 0,2.5 h -2.800781 a 1.250125,1.250125 0 0 1 -0.402344,0 h -0.597656 a 1.250125,1.250125 0 0 1 -0.402344,0 H 13 a 1.250125,1.250125 0 1 1 0,-2.5 h 1.75 V 11.294922 L 14.068359,9.9316406 12.707031,9.25 H 11.203125 L 8.6757812,10.091797 7.25,11.519531 V 20.75 H 9 a 1.250125,1.250125 0 1 1 0,2.5 H 6.1992188 a 1.250125,1.250125 0 0 1 -0.4023438,0 H 5.1992188 a 1.250125,1.250125 0 0 1 -0.4023438,0 H 2 a 1.250125,1.250125 0 1 1 0,-2.5 H 3.75 V 9.25 H 2 a 1.250125,1.250125 0 1 1 0,-2.5 h 2.8007812 a 1.250125,1.250125 0 0 1 0.1796876,-0.017578 z"
     id="path2" />
</svg>
