<?xml version="1.0" encoding="UTF-8" standalone="no"?>
<svg
   xmlns:dc="http://purl.org/dc/elements/1.1/"
   xmlns:cc="http://creativecommons.org/ns#"
   xmlns:rdf="http://www.w3.org/1999/02/22-rdf-syntax-ns#"
   xmlns:svg="http://www.w3.org/2000/svg"
   xmlns="http://www.w3.org/2000/svg"
   xmlns:sodipodi="http://sodipodi.sourceforge.net/DTD/sodipodi-0.dtd"
   xmlns:inkscape="http://www.inkscape.org/namespaces/inkscape"
   data-dec="41"
   id="dec_41"
   width="14"
   height="40"
   version="1.1"
   sodipodi:docname="41.svg"
   inkscape:version="0.91 r13725">
  <metadata
     id="metadata9">
    <rdf:RDF>
      <cc:Work
         rdf:about="">
        <dc:format>image/svg+xml</dc:format>
        <dc:type
           rdf:resource="http://purl.org/dc/dcmitype/StillImage" />
      </cc:Work>
    </rdf:RDF>
  </metadata>
  <defs
     id="defs7" />
  <sodipodi:namedview
     pagecolor="#ffffff"
     bordercolor="#666666"
     borderopacity="1"
     objecttolerance="10"
     gridtolerance="10"
     guidetolerance="10"
     inkscape:pageopacity="0"
     inkscape:pageshadow="2"
     inkscape:window-width="1333"
     inkscape:window-height="744"
     id="namedview5"
     showgrid="true"
     inkscape:zoom="23.6"
     inkscape:cx="5.75"
     inkscape:cy="23.516949"
     inkscape:window-x="33"
     inkscape:window-y="924"
     inkscape:window-maximized="1"
     inkscape:current-layer="dec_41">
    <inkscape:grid
       type="xygrid"
       id="grid11" />
  </sodipodi:namedview>
  <path
     style="color:#000000;font-style:normal;font-variant:normal;font-weight:normal;font-stretch:normal;font-size:medium;line-height:normal;font-family:sans-serif;text-indent:0;text-align:start;text-decoration:none;text-decoration-line:none;text-decoration-style:solid;text-decoration-color:#000000;letter-spacing:normal;word-spacing:normal;text-transform:none;direction:ltr;block-progression:tb;writing-mode:lr-tb;baseline-shift:baseline;text-anchor:start;white-space:normal;clip-rule:nonzero;display:inline;overflow:visible;visibility:visible;opacity:1;isolation:auto;mix-blend-mode:normal;color-interpolation:sRGB;color-interpolation-filters:linearRGB;solid-color:#000000;solid-opacity:1;fill:#000000;fill-opacity:1;fill-rule:nonzero;stroke:none;stroke-width:1;stroke-linecap:round;stroke-linejoin:round;stroke-miterlimit:4;stroke-dasharray:none;stroke-dashoffset:0;stroke-opacity:1;color-rendering:auto;image-rendering:auto;shape-rendering:auto;text-rendering:auto;enable-background:accumulate"
     d="M 2.9941406 -3.5058594 A 0.50005 0.50005 0 0 0 2.9453125 -3.5019531 A 0.50005 0.50005 0 0 0 2.8476562 -3.4824219 A 0.50005 0.50005 0 0 0 2.7558594 -3.4433594 A 0.50005 0.50005 0 0 0 2.7128906 -3.4179688 A 0.50005 0.50005 0 0 0 2.671875 -3.3867188 A 0.50005 0.50005 0 0 0 2.6035156 -3.3164062 A 0.50005 0.50005 0 0 0 2.5742188 -3.2753906 A 0.50005 0.50005 0 0 0 2.5488281 -3.2324219 A 0.50005 0.50005 0 0 0 2.5292969 -3.1855469 A 0.50005 0.50005 0 0 0 2.5019531 -3.0898438 A 0.50005 0.50005 0 0 0 2.4960938 -3.0410156 A 0.50005 0.50005 0 0 0 2.5078125 -2.890625 A 0.50005 0.50005 0 0 0 2.5214844 -2.84375 A 0.50005 0.50005 0 0 0 2.5625 -2.7519531 A 0.50005 0.50005 0 0 0 2.6230469 -2.671875 A 0.50005 0.50005 0 0 0 2.6464844 -2.6464844 A 0.50005 0.50005 0 0 0 2.65625 -2.6367188 L 4.5898438 -0.703125 L 6.5371094 3.1914062 L 7.515625 6.1289062 L 8.5 11.048828 L 8.5 14.951172 L 7.515625 19.871094 L 6.5371094 22.808594 L 4.5898438 26.703125 L 2.6816406 28.613281 L 2.6640625 28.628906 A 0.50005 0.50005 0 0 0 2.6464844 28.646484 A 0.50005 0.50005 0 0 0 2.5039062 28.90625 A 0.50005 0.50005 0 0 0 2.4941406 29.005859 A 0.50005 0.50005 0 0 0 2.5175781 29.152344 A 0.50005 0.50005 0 0 0 2.5566406 29.244141 A 0.50005 0.50005 0 0 0 2.5820312 29.287109 A 0.50005 0.50005 0 0 0 2.6835938 29.396484 A 0.50005 0.50005 0 0 0 2.7246094 29.425781 A 0.50005 0.50005 0 0 0 2.7675781 29.451172 A 0.50005 0.50005 0 0 0 2.7695312 29.451172 A 0.50005 0.50005 0 0 0 2.8144531 29.470703 A 0.50005 0.50005 0 0 0 2.8613281 29.486328 A 0.50005 0.50005 0 0 0 3.0097656 29.503906 A 0.50005 0.50005 0 0 0 3.0605469 29.5 A 0.50005 0.50005 0 0 0 3.1582031 29.476562 A 0.50005 0.50005 0 0 0 3.2773438 29.416016 L 3.2890625 29.408203 L 6.2148438 27.457031 A 0.50005 0.50005 0 0 0 6.2207031 27.453125 A 0.50005 0.50005 0 0 0 6.3183594 27.386719 A 0.50005 0.50005 0 0 0 6.3535156 27.353516 A 0.50005 0.50005 0 0 0 6.3886719 27.316406 A 0.50005 0.50005 0 0 0 6.4160156 27.277344 L 6.4316406 27.253906 L 8.4160156 24.277344 A 0.50005 0.50005 0 0 0 8.4472656 24.222656 L 10.447266 20.222656 A 0.50005 0.50005 0 0 0 10.490234 20.097656 L 11.490234 15.097656 A 0.50005 0.50005 0 0 0 11.5 15 L 11.5 11 A 0.50005 0.50005 0 0 0 11.490234 10.902344 L 10.490234 5.9023438 A 0.50005 0.50005 0 0 0 10.447266 5.7773438 L 8.4472656 1.7773438 A 0.50005 0.50005 0 0 0 8.4160156 1.7226562 L 6.4277344 -1.2578125 L 6.4238281 -1.2675781 A 0.50005 0.50005 0 0 0 6.4160156 -1.2773438 A 0.50005 0.50005 0 0 0 6.3945312 -1.3085938 A 0.50005 0.50005 0 0 0 6.3867188 -1.3183594 A 0.50005 0.50005 0 0 0 6.3164062 -1.3886719 A 0.50005 0.50005 0 0 0 6.2285156 -1.4492188 L 3.2929688 -3.40625 A 0.50005 0.50005 0 0 0 3.1894531 -3.4648438 A 0.50005 0.50005 0 0 0 3.0449219 -3.5019531 A 0.50005 0.50005 0 0 0 2.9941406 -3.5058594 z "
     id="path13" />
</svg>
