<svg xmlns:dc="http://purl.org/dc/elements/1.1/" xmlns:cc="http://creativecommons.org/ns#" xmlns:rdf="http://www.w3.org/1999/02/22-rdf-syntax-ns#" xmlns:svg="http://www.w3.org/2000/svg" xmlns="http://www.w3.org/2000/svg" xmlns:sodipodi="http://sodipodi.sourceforge.net/DTD/sodipodi-0.dtd" xmlns:inkscape="http://www.inkscape.org/namespaces/inkscape" data-dec="109" id="dec_109" width="30" height="40" version="1.1" sodipodi:docname="109.svg" inkscape:version="0.92.2 5c3e80d, 2017-08-06">
  <metadata id="metadata9">
    <rdf:RDF>
      <cc:Work rdf:about="">
        <dc:format>image/svg+xml</dc:format>
        <dc:type rdf:resource="http://purl.org/dc/dcmitype/StillImage"/>
        <dc:title/>
      </cc:Work>
    </rdf:RDF>
  </metadata>
  <defs id="defs7"/>
  <sodipodi:namedview pagecolor="#ffffff" bordercolor="#666666" borderopacity="1" objecttolerance="10" gridtolerance="10" guidetolerance="10" inkscape:pageopacity="0" inkscape:pageshadow="2" inkscape:window-width="1364" inkscape:window-height="730" id="namedview5" showgrid="true" showguides="true" inkscape:zoom="5.9693432" inkscape:cx="-23.596265" inkscape:cy="32.754913" inkscape:window-x="0" inkscape:window-y="18" inkscape:window-maximized="0" inkscape:current-layer="dec_109">
    <inkscape:grid type="xygrid" id="grid825"/>
  </sodipodi:namedview>
  <path d="M 5,8 V 22 M 5,11 7,9 9,8 h 3 l 2,1 1,2 v 11 m 0,-11 2,-2 2,-1 h 3 l 2,1 1,2 V 22 M 2,8 H 5 M 2,22 h 6 m 4,0 h 6 m 3,0 h 7 " style="fill:#f2f2f2;stroke:#000000;stroke-width:1;stroke-linecap:round;stroke-linejoin:round" id="path2" inkscape:connector-curvature="0" sodipodi:nodetypes="cccccccccccccccccccccccc"/>
</svg>