<?xml version="1.0" encoding="UTF-8"?>
<glyph name="glyph39" format="1">
  <advance width="752"/>
  <unicode hex="2010"/>
  <outline>
    <contour>
      <point x="116" y="304" type="curve" smooth="yes"/>
      <point x="637" y="304" type="line" smooth="yes"/>
      <point x="657" y="304"/>
      <point x="673" y="287"/>
      <point x="673" y="267" type="curve" smooth="yes"/>
      <point x="673" y="247"/>
      <point x="657" y="232"/>
      <point x="637" y="232" type="curve" smooth="yes"/>
      <point x="116" y="232" type="line" smooth="yes"/>
      <point x="96" y="232"/>
      <point x="79" y="247"/>
      <point x="79" y="267" type="curve" smooth="yes"/>
      <point x="79" y="287"/>
      <point x="96" y="304"/>
    </contour>
  </outline>
  <lib>
    <dict>
      <key>com.fontlab.hintData</key>
      <dict>
        <key>hhints</key>
        <array>
          <dict>
            <key>position</key>
            <integer>232</integer>
            <key>width</key>
            <integer>72</integer>
          </dict>
        </array>
      </dict>
    </dict>
  </lib>
</glyph>
