<?xml version="1.0" encoding="UTF-8" standalone="no"?>
<svg
   xmlns:dc="http://purl.org/dc/elements/1.1/"
   xmlns:cc="http://creativecommons.org/ns#"
   xmlns:rdf="http://www.w3.org/1999/02/22-rdf-syntax-ns#"
   xmlns:svg="http://www.w3.org/2000/svg"
   xmlns="http://www.w3.org/2000/svg"
   xmlns:sodipodi="http://sodipodi.sourceforge.net/DTD/sodipodi-0.dtd"
   xmlns:inkscape="http://www.inkscape.org/namespaces/inkscape"
   data-dec="41"
   width="14"
   height="40"
   version="1.1"
   id="svg4"
   sodipodi:docname="41.svg"
   inkscape:version="0.92.4 (unknown)">
  <metadata
     id="metadata10">
    <rdf:RDF>
      <cc:Work
         rdf:about="">
        <dc:format>image/svg+xml</dc:format>
        <dc:type
           rdf:resource="http://purl.org/dc/dcmitype/StillImage" />
      </cc:Work>
    </rdf:RDF>
  </metadata>
  <defs
     id="defs8" />
  <sodipodi:namedview
     pagecolor="#ffffff"
     bordercolor="#666666"
     borderopacity="1"
     objecttolerance="10"
     gridtolerance="10"
     guidetolerance="10"
     inkscape:pageopacity="0"
     inkscape:pageshadow="2"
     inkscape:window-width="640"
     inkscape:window-height="480"
     id="namedview6"
     showgrid="false"
     inkscape:zoom="5.9"
     inkscape:cx="7"
     inkscape:cy="20"
     inkscape:window-x="0"
     inkscape:window-y="27"
     inkscape:window-maximized="0"
     inkscape:current-layer="svg4" />
  <path
     style="color:#000000;font-style:normal;font-variant:normal;font-weight:normal;font-stretch:normal;font-size:medium;line-height:normal;font-family:sans-serif;font-variant-ligatures:normal;font-variant-position:normal;font-variant-caps:normal;font-variant-numeric:normal;font-variant-alternates:normal;font-feature-settings:normal;text-indent:0;text-align:start;text-decoration:none;text-decoration-line:none;text-decoration-style:solid;text-decoration-color:#000000;letter-spacing:normal;word-spacing:normal;text-transform:none;writing-mode:lr-tb;direction:ltr;text-orientation:mixed;dominant-baseline:auto;baseline-shift:baseline;text-anchor:start;white-space:normal;shape-padding:0;clip-rule:nonzero;display:inline;overflow:visible;visibility:visible;opacity:1;isolation:auto;mix-blend-mode:normal;color-interpolation:sRGB;color-interpolation-filters:linearRGB;solid-color:#000000;solid-opacity:1;vector-effect:none;fill:#013272;fill-opacity:1;fill-rule:nonzero;stroke:none;stroke-width:0.5;stroke-linecap:round;stroke-linejoin:round;stroke-miterlimit:4;stroke-dasharray:none;stroke-dashoffset:0;stroke-opacity:1;color-rendering:auto;image-rendering:auto;shape-rendering:auto;text-rendering:auto;enable-background:accumulate"
     d="m 7.3457031,3.25 0.890625,2.671875 a 0.250025,0.250025 0 0 1 0.00977,0.029297 l 1,5.0000001 A 0.250025,0.250025 0 0 1 9.25,11 v 4 a 0.250025,0.250025 0 0 1 -0.00391,0.04883 l -1,5 a 0.250025,0.250025 0 0 1 -0.00977,0.0293 L 7.3457031,22.75 8.7617188,19.917969 9.75,14.974609 V 11.025391 L 8.7617188,6.0820312 Z M 2.9980469,-3.2539062 a 0.250025,0.250025 0 0 1 0.1796875,0.076172 l 1.9863281,1.9863282 0.013672,0.013672 a 0.250025,0.250025 0 0 1 0.00391,0.00391 0.250025,0.250025 0 0 1 0.011719,0.015625 0.250025,0.250025 0 0 1 0.00391,0.00391 0.250025,0.250025 0 0 1 0.00391,0.00391 0.250025,0.250025 0 0 1 0.00781,0.011719 l 2,3 a 0.250025,0.250025 0 0 1 0.013672,0.027344 l 2,4 a 0.250025,0.250025 0 0 1 0.023438,0.0625 L 10.246094,10.951172 A 0.250025,0.250025 0 0 1 10.25,11 v 4 a 0.250025,0.250025 0 0 1 -0.0039,0.04883 l -1.0000002,5 a 0.250025,0.250025 0 0 1 -0.023438,0.0625 l -2,4 a 0.250025,0.250025 0 0 1 -0.013672,0.02734 l -2,3 a 0.250025,0.250025 0 0 1 -0.00781,0.0098 0.250025,0.250025 0 0 1 -0.00781,0.0098 0.250025,0.250025 0 0 1 -0.00781,0.0098 0.250025,0.250025 0 0 1 -0.00781,0.0098 0.250025,0.250025 0 0 1 -0.00781,0.0078 L 3.1777344,29.177734 A 0.25135412,0.25135412 0 1 1 2.8222656,28.822266 L 4.796875,26.849609 6.7675781,22.904297 7.7578125,19.935547 8.75,14.974609 V 11.025391 L 7.7578125,6.0644531 6.7675781,3.0957031 4.796875,-0.84960938 2.8222656,-2.8222656 a 0.250025,0.250025 0 0 1 0.1503906,-0.4296875 0.250025,0.250025 0 0 1 0.025391,-0.00195 z"
     id="path2" />
</svg>
