<?xml version="1.0" encoding="UTF-8"?>
<glyph name="guillemotright" format="1">
  <advance width="404"/>
  <unicode hex="00BB"/>
  <outline>
    <contour>
      <point x="267" y="339" type="line"/>
      <point x="351" y="239" type="line" smooth="yes"/>
      <point x="351" y="238"/>
      <point x="352" y="236"/>
      <point x="352" y="235" type="curve" smooth="yes"/>
      <point x="352" y="234"/>
      <point x="351" y="234"/>
      <point x="351" y="233" type="curve" smooth="yes"/>
      <point x="267" y="133" type="line"/>
      <point x="371" y="235" type="line"/>
    </contour>
    <contour>
      <point x="94" y="339" type="line"/>
      <point x="177" y="239" type="line" smooth="yes"/>
      <point x="177" y="238"/>
      <point x="178" y="236"/>
      <point x="178" y="235" type="curve" smooth="yes"/>
      <point x="178" y="234"/>
      <point x="177" y="234"/>
      <point x="177" y="233" type="curve" smooth="yes"/>
      <point x="94" y="133" type="line"/>
      <point x="197" y="235" type="line"/>
    </contour>
    <contour>
      <point x="252" y="344" type="line"/>
      <point x="322" y="239" type="line"/>
      <point x="322" y="235" type="line"/>
      <point x="322" y="233" type="line"/>
      <point x="252" y="128" type="line"/>
      <point x="342" y="235" type="line"/>
    </contour>
    <contour>
      <point x="78" y="344" type="line"/>
      <point x="148" y="239" type="line" smooth="yes"/>
      <point x="148" y="238"/>
      <point x="150" y="236"/>
      <point x="150" y="235" type="curve" smooth="yes"/>
      <point x="150" y="234"/>
      <point x="148" y="234"/>
      <point x="148" y="233" type="curve" smooth="yes"/>
      <point x="78" y="128" type="line"/>
      <point x="168" y="235" type="line"/>
    </contour>
    <contour>
      <point x="202" y="414" type="line"/>
      <point x="204" y="414" type="line"/>
      <point x="205" y="414" type="line"/>
      <point x="206" y="412" type="line"/>
      <point x="207" y="412" type="line"/>
      <point x="380" y="239" type="line" smooth="yes"/>
      <point x="381" y="238"/>
      <point x="381" y="236"/>
      <point x="381" y="235" type="curve" smooth="yes"/>
      <point x="381" y="234"/>
      <point x="381" y="234"/>
      <point x="380" y="233" type="curve" smooth="yes"/>
      <point x="207" y="59" type="line"/>
      <point x="206" y="59" type="line"/>
      <point x="205" y="58" type="line"/>
      <point x="204" y="58" type="line"/>
      <point x="202" y="58" type="line"/>
      <point x="201" y="58" type="line"/>
      <point x="200" y="58" type="line"/>
      <point x="199" y="59" type="line"/>
      <point x="199" y="60" type="line"/>
      <point x="198" y="60" type="line"/>
      <point x="198" y="62" type="line"/>
      <point x="198" y="63" type="line"/>
      <point x="198" y="64" type="line"/>
      <point x="199" y="64" type="line"/>
      <point x="199" y="65" type="line"/>
      <point x="314" y="235" type="line"/>
      <point x="199" y="407" type="line"/>
      <point x="199" y="408" type="line"/>
      <point x="198" y="408" type="line"/>
      <point x="198" y="409" type="line"/>
      <point x="198" y="410" type="line"/>
      <point x="198" y="411" type="line"/>
      <point x="199" y="411" type="line"/>
      <point x="199" y="412" type="line"/>
      <point x="200" y="412" type="line"/>
      <point x="200" y="414" type="line"/>
      <point x="201" y="414" type="line"/>
    </contour>
    <contour>
      <point x="29" y="414" type="line"/>
      <point x="30" y="414" type="line"/>
      <point x="31" y="414" type="line"/>
      <point x="32" y="414" type="line"/>
      <point x="32" y="412" type="line"/>
      <point x="33" y="412" type="line"/>
      <point x="206" y="239" type="line" smooth="yes"/>
      <point x="207" y="238"/>
      <point x="207" y="236"/>
      <point x="207" y="235" type="curve" smooth="yes"/>
      <point x="207" y="234"/>
      <point x="207" y="234"/>
      <point x="206" y="233" type="curve" smooth="yes"/>
      <point x="33" y="59" type="line"/>
      <point x="32" y="59" type="line"/>
      <point x="32" y="58" type="line"/>
      <point x="31" y="58" type="line"/>
      <point x="30" y="58" type="line"/>
      <point x="29" y="58" type="line"/>
      <point x="28" y="58" type="line"/>
      <point x="26" y="58" type="line"/>
      <point x="25" y="59" type="line"/>
      <point x="25" y="60" type="line"/>
      <point x="24" y="62" type="line"/>
      <point x="24" y="63" type="line"/>
      <point x="25" y="64" type="line"/>
      <point x="25" y="65" type="line"/>
      <point x="140" y="235" type="line"/>
      <point x="25" y="407" type="line"/>
      <point x="25" y="408" type="line"/>
      <point x="24" y="409" type="line"/>
      <point x="24" y="410" type="line"/>
      <point x="25" y="411" type="line"/>
      <point x="25" y="412" type="line"/>
      <point x="26" y="412" type="line"/>
      <point x="26" y="414" type="line"/>
      <point x="28" y="414" type="line"/>
    </contour>
  </outline>
  <lib>
    <dict>
      <key>com.fontlab.hintData</key>
      <dict>
        <key>hhints</key>
        <array>
          <dict>
            <key>position</key>
            <integer>61</integer>
            <key>width</key>
            <integer>3</integer>
          </dict>
          <dict>
            <key>position</key>
            <integer>392</integer>
            <key>width</key>
            <integer>22</integer>
          </dict>
          <dict>
            <key>position</key>
            <integer>408</integer>
            <key>width</key>
            <integer>3</integer>
          </dict>
        </array>
        <key>vhints</key>
        <array>
          <dict>
            <key>position</key>
            <integer>26</integer>
            <key>width</key>
            <integer>6</integer>
          </dict>
        </array>
      </dict>
    </dict>
  </lib>
</glyph>
