<?xml version="1.0" encoding="UTF-8"?>
<glyph name="uacute" format="1">
  <advance width="607"/>
  <unicode hex="00FA"/>
  <outline>
    <component base="acute" xOffset="160" yOffset="124"/>
    <component base="u"/>
  </outline>
  <lib>
    <dict>
      <key>com.fontlab.hintData</key>
      <dict>
        <key>hhints</key>
        <array>
          <dict>
            <key>position</key>
            <integer>0</integer>
            <key>width</key>
            <integer>87</integer>
          </dict>
          <dict>
            <key>position</key>
            <integer>406</integer>
            <key>width</key>
            <integer>87</integer>
          </dict>
          <dict>
            <key>position</key>
            <integer>551</integer>
            <key>width</key>
            <integer>232</integer>
          </dict>
        </array>
        <key>vhints</key>
        <array>
          <dict>
            <key>position</key>
            <integer>14</integer>
            <key>width</key>
            <integer>174</integer>
          </dict>
          <dict>
            <key>position</key>
            <integer>101</integer>
            <key>width</key>
            <integer>87</integer>
          </dict>
          <dict>
            <key>position</key>
            <integer>184</integer>
            <key>width</key>
            <integer>262</integer>
          </dict>
          <dict>
            <key>position</key>
            <integer>304</integer>
            <key>width</key>
            <integer>204</integer>
          </dict>
          <dict>
            <key>position</key>
            <integer>420</integer>
            <key>width</key>
            <integer>87</integer>
          </dict>
        </array>
      </dict>
    </dict>
  </lib>
</glyph>
