<?xml version="1.0" encoding="UTF-8" standalone="no"?>
<svg
   xmlns:dc="http://purl.org/dc/elements/1.1/"
   xmlns:cc="http://creativecommons.org/ns#"
   xmlns:rdf="http://www.w3.org/1999/02/22-rdf-syntax-ns#"
   xmlns:svg="http://www.w3.org/2000/svg"
   xmlns="http://www.w3.org/2000/svg"
   xmlns:sodipodi="http://sodipodi.sourceforge.net/DTD/sodipodi-0.dtd"
   xmlns:inkscape="http://www.inkscape.org/namespaces/inkscape"
   data-dec="102"
   width="16"
   height="40"
   version="1.1"
   id="svg4"
   sodipodi:docname="102.svg"
   inkscape:version="0.92.4 (unknown)">
  <metadata
     id="metadata10">
    <rdf:RDF>
      <cc:Work
         rdf:about="">
        <dc:format>image/svg+xml</dc:format>
        <dc:type
           rdf:resource="http://purl.org/dc/dcmitype/StillImage" />
      </cc:Work>
    </rdf:RDF>
  </metadata>
  <defs
     id="defs8" />
  <sodipodi:namedview
     pagecolor="#ffffff"
     bordercolor="#666666"
     borderopacity="1"
     objecttolerance="10"
     gridtolerance="10"
     guidetolerance="10"
     inkscape:pageopacity="0"
     inkscape:pageshadow="2"
     inkscape:window-width="640"
     inkscape:window-height="480"
     id="namedview6"
     showgrid="false"
     inkscape:zoom="5.9"
     inkscape:cx="8"
     inkscape:cy="20"
     inkscape:window-x="0"
     inkscape:window-y="27"
     inkscape:window-maximized="0"
     inkscape:current-layer="svg4" />
  <path
     style="color:#000000;font-style:normal;font-variant:normal;font-weight:normal;font-stretch:normal;font-size:medium;line-height:normal;font-family:sans-serif;font-variant-ligatures:normal;font-variant-position:normal;font-variant-caps:normal;font-variant-numeric:normal;font-variant-alternates:normal;font-feature-settings:normal;text-indent:0;text-align:start;text-decoration:none;text-decoration-line:none;text-decoration-style:solid;text-decoration-color:#000000;letter-spacing:normal;word-spacing:normal;text-transform:none;writing-mode:lr-tb;direction:ltr;text-orientation:mixed;dominant-baseline:auto;baseline-shift:baseline;text-anchor:start;white-space:normal;shape-padding:0;clip-rule:nonzero;display:inline;overflow:visible;visibility:visible;opacity:1;isolation:auto;mix-blend-mode:normal;color-interpolation:sRGB;color-interpolation-filters:linearRGB;solid-color:#000000;solid-opacity:1;vector-effect:none;fill:#000000;fill-opacity:1;fill-rule:nonzero;stroke:none;stroke-width:1;stroke-linecap:round;stroke-linejoin:round;stroke-miterlimit:4;stroke-dasharray:none;stroke-dashoffset:0;stroke-opacity:1;color-rendering:auto;image-rendering:auto;shape-rendering:auto;text-rendering:auto;enable-background:accumulate"
     d="M 10.5,9.0800781 A 0.50005,0.50005 0 0 1 10.396484,9.3125 a 0.50005,0.50005 0 0 1 -0.002,0.00391 0.50005,0.50005 0 0 1 -0.03125,0.033203 0.50005,0.50005 0 0 1 -0.002,0.00391 0.50005,0.50005 0 0 1 -0.0332,0.03125 0.50005,0.50005 0 0 1 -0.0039,0.00195 A 0.50005,0.50005 0 0 1 10.082031,9.5 H 10.5 Z M 11.5,2 A 0.50005,0.50005 0 0 1 11,2.5 h 0.5 z M 10.992188,0.4921875 A 0.50005,0.50005 0 0 1 11.080078,0.5 h 0.837891 a 0.50005,0.50005 0 0 1 0.394531,0.10351562 0.50005,0.50005 0 0 1 0.0039,0.001953 0.50005,0.50005 0 0 1 0.0332,0.03125 0.50005,0.50005 0 0 1 0.0039,0.001953 0.50005,0.50005 0 0 1 0.03125,0.0332031 0.50005,0.50005 0 0 1 0.002,0.003906 A 0.50005,0.50005 0 0 1 12.5,1.0800781 V 3 A 0.50005,0.50005 0 0 1 12,3.5 H 9.2070312 L 8.9277344,3.7792969 C 8.6935388,4.2522454 8.5,4.681423 8.5,5 V 7.5 H 10 11 A 0.50005,0.50005 0 0 1 11.5,8 v 1.9179688 a 0.50005,0.50005 0 0 1 -0.103516,0.3945312 0.50005,0.50005 0 0 1 -0.002,0.0039 0.50005,0.50005 0 0 1 -0.03125,0.0332 0.50005,0.50005 0 0 1 -0.002,0.0039 0.50005,0.50005 0 0 1 -0.0332,0.03125 0.50005,0.50005 0 0 1 -0.0039,0.002 A 0.50005,0.50005 0 0 1 10.919922,10.5 H 8.5 v 11.417969 a 0.50005,0.50005 0 0 1 -0.1035156,0.394531 0.50005,0.50005 0 0 1 -0.00195,0.0039 0.50005,0.50005 0 0 1 -0.03125,0.0332 0.50005,0.50005 0 0 1 -0.00195,0.0039 0.50005,0.50005 0 0 1 -0.033203,0.03125 0.50005,0.50005 0 0 1 -0.00391,0.002 A 0.50005,0.50005 0 0 1 7.9199219,22.5 H 7.0820312 a 0.50005,0.50005 0 0 1 -0.1621093,0 H 6 A 0.50005,0.50005 0 0 1 5.5,22 V 10.5 H 3 A 0.50005,0.50005 0 0 1 2.5,10 V 9 8.0820312 A 0.50005,0.50005 0 0 1 2.5136719,7.859375 0.50005,0.50005 0 0 1 2.6035156,7.6875 a 0.50005,0.50005 0 0 1 0.00195,-0.00391 0.50005,0.50005 0 0 1 0.03125,-0.033203 0.50005,0.50005 0 0 1 0.00195,-0.00391 0.50005,0.50005 0 0 1 0.017578,-0.017578 0.50005,0.50005 0 0 1 0.019531,-0.015625 0.50005,0.50005 0 0 1 0.1230469,-0.078125 0.50005,0.50005 0 0 1 0.046875,-0.017578 0.50005,0.50005 0 0 1 0.046875,-0.013672 0.50005,0.50005 0 0 1 0.099609,-0.011719 A 0.50005,0.50005 0 0 1 3.0800781,7.5 H 5.5 V 5 C 5.5,4.3333333 5.8027344,3.7773438 6.0527344,3.2773438 6.3027344,2.7773437 6.5,2.3333333 6.5,2 A 0.50005,0.50005 0 0 1 7,1.5 C 7.3333333,1.5 7.3964844,1.3964844 7.6464844,1.1464844 7.8964844,0.89648435 8.3333333,0.5 9,0.5 h 1 0.917969 a 0.50005,0.50005 0 0 1 0.07422,-0.007813 z"
     id="path2" />
</svg>
