<?xml version="1.0" encoding="UTF-8" standalone="no"?>
<svg
   xmlns:dc="http://purl.org/dc/elements/1.1/"
   xmlns:cc="http://creativecommons.org/ns#"
   xmlns:rdf="http://www.w3.org/1999/02/22-rdf-syntax-ns#"
   xmlns:svg="http://www.w3.org/2000/svg"
   xmlns="http://www.w3.org/2000/svg"
   xmlns:sodipodi="http://sodipodi.sourceforge.net/DTD/sodipodi-0.dtd"
   xmlns:inkscape="http://www.inkscape.org/namespaces/inkscape"
   data-dec="61"
   width="26"
   height="40"
   version="1.1"
   id="svg4"
   sodipodi:docname="61.svg"
   inkscape:version="0.92.4 (unknown)">
  <metadata
     id="metadata10">
    <rdf:RDF>
      <cc:Work
         rdf:about="">
        <dc:format>image/svg+xml</dc:format>
        <dc:type
           rdf:resource="http://purl.org/dc/dcmitype/StillImage" />
      </cc:Work>
    </rdf:RDF>
  </metadata>
  <defs
     id="defs8" />
  <sodipodi:namedview
     pagecolor="#ffffff"
     bordercolor="#666666"
     borderopacity="1"
     objecttolerance="10"
     gridtolerance="10"
     guidetolerance="10"
     inkscape:pageopacity="0"
     inkscape:pageshadow="2"
     inkscape:window-width="615"
     inkscape:window-height="417"
     id="namedview6"
     showgrid="false"
     inkscape:zoom="5.9"
     inkscape:cx="13"
     inkscape:cy="20"
     inkscape:window-x="0"
     inkscape:window-y="27"
     inkscape:window-maximized="0"
     inkscape:current-layer="svg4" />
  <path
     style="color:#000000;font-style:normal;font-variant:normal;font-weight:normal;font-stretch:normal;font-size:medium;line-height:normal;font-family:sans-serif;font-variant-ligatures:normal;font-variant-position:normal;font-variant-caps:normal;font-variant-numeric:normal;font-variant-alternates:normal;font-feature-settings:normal;text-indent:0;text-align:start;text-decoration:none;text-decoration-line:none;text-decoration-style:solid;text-decoration-color:#000000;letter-spacing:normal;word-spacing:normal;text-transform:none;writing-mode:lr-tb;direction:ltr;text-orientation:mixed;dominant-baseline:auto;baseline-shift:baseline;text-anchor:start;white-space:normal;shape-padding:0;clip-rule:nonzero;display:inline;overflow:visible;visibility:visible;opacity:1;isolation:auto;mix-blend-mode:normal;color-interpolation:sRGB;color-interpolation-filters:linearRGB;solid-color:#000000;solid-opacity:1;vector-effect:none;fill:#013272;fill-opacity:1;fill-rule:nonzero;stroke:none;stroke-width:0.30000001;stroke-linecap:round;stroke-linejoin:round;stroke-miterlimit:4;stroke-dasharray:none;stroke-dashoffset:0;stroke-opacity:1;color-rendering:auto;image-rendering:auto;shape-rendering:auto;text-rendering:auto;enable-background:accumulate"
     d="m 4.1503906,16.150391 v 0.699218 H 20.849609 V 16.150391 Z M 3.9980469,15.847656 a 0.15001501,0.15001501 0 0 1 0.029297,0.002 H 21 A 0.15001501,0.15001501 0 0 1 21.150391,16 v 0.982422 a 0.15001501,0.15001501 0 0 1 -0.0098,0.07227 0.15001501,0.15001501 0 0 1 0,0.002 0.15001501,0.15001501 0 0 1 -0.0059,0.01172 0.15001501,0.15001501 0 0 1 -0.0078,0.01367 0.15001501,0.15001501 0 0 1 -0.0078,0.01172 0.15001501,0.15001501 0 0 1 0,0.002 0.15001501,0.15001501 0 0 1 -0.0059,0.0039 0.15001501,0.15001501 0 0 1 -0.01563,0.01563 0.15001501,0.15001501 0 0 1 -0.01172,0.0098 0.15001501,0.15001501 0 0 1 -0.04102,0.01953 0.15001501,0.15001501 0 0 1 -0.02734,0.0059 0.15001501,0.15001501 0 0 1 -0.002,0 0.15001501,0.15001501 0 0 1 -0.04297,0 H 4 A 0.15001501,0.15001501 0 0 1 3.8496094,17 v -0.982422 a 0.15001501,0.15001501 0 0 1 0.00977,-0.07227 0.15001501,0.15001501 0 0 1 0,-0.002 0.15001501,0.15001501 0 0 1 0.00586,-0.01172 0.15001501,0.15001501 0 0 1 0,-0.002 0.15001501,0.15001501 0 0 1 0.00781,-0.01172 0.15001501,0.15001501 0 0 1 0.00781,-0.01367 0.15001501,0.15001501 0 0 1 0.00586,-0.0039 0.15001501,0.15001501 0 0 1 0.027344,-0.02539 0.15001501,0.15001501 0 0 1 0.011719,-0.0078 0.15001501,0.15001501 0 0 1 0.029297,-0.01172 0.15001501,0.15001501 0 0 1 0.027344,-0.0059 0.15001501,0.15001501 0 0 1 0.00195,0 0.15001501,0.15001501 0 0 1 0.013672,-0.002 z M 4.1503906,8.1503906 V 8.8496094 H 20.849609 V 8.1503906 Z M 3.9980469,7.8476562 a 0.15001501,0.15001501 0 0 1 0.029297,0.00195 H 21 A 0.15001501,0.15001501 0 0 1 21.150391,8 v 0.9824219 a 0.15001501,0.15001501 0 0 1 -0.0098,0.072266 0.15001501,0.15001501 0 0 1 0,0.00195 0.15001501,0.15001501 0 0 1 -0.0059,0.011719 0.15001501,0.15001501 0 0 1 0,0.00195 0.15001501,0.15001501 0 0 1 -0.01563,0.023437 0.15001501,0.15001501 0 0 1 0,0.00195 0.15001501,0.15001501 0 0 1 -0.0059,0.00391 0.15001501,0.15001501 0 0 1 -0.0059,0.00586 0.15001501,0.15001501 0 0 1 -0.0098,0.00977 0.15001501,0.15001501 0 0 1 -0.05273,0.029297 0.15001501,0.15001501 0 0 1 -0.02734,0.00586 0.15001501,0.15001501 0 0 1 -0.002,0 0.15001501,0.15001501 0 0 1 -0.04297,0 H 4 A 0.15001501,0.15001501 0 0 1 3.8496094,9 V 8.0175781 a 0.15001501,0.15001501 0 0 1 0.00977,-0.072266 0.15001501,0.15001501 0 0 1 0,-0.00195 0.15001501,0.15001501 0 0 1 0.00586,-0.011719 0.15001501,0.15001501 0 0 1 0,-0.00195 0.15001501,0.15001501 0 0 1 0.00781,-0.011719 0.15001501,0.15001501 0 0 1 0.00781,-0.013672 0.15001501,0.15001501 0 0 1 0.00586,-0.00391 0.15001501,0.15001501 0 0 1 0.068359,-0.044922 0.15001501,0.15001501 0 0 1 0.027344,-0.00586 0.15001501,0.15001501 0 0 1 0.00195,0 0.15001501,0.15001501 0 0 1 0.013672,-0.00195 z"
     id="path2" />
</svg>
