<?xml version="1.0" encoding="UTF-8" standalone="no"?>
<svg
   xmlns:dc="http://purl.org/dc/elements/1.1/"
   xmlns:cc="http://creativecommons.org/ns#"
   xmlns:rdf="http://www.w3.org/1999/02/22-rdf-syntax-ns#"
   xmlns:svg="http://www.w3.org/2000/svg"
   xmlns="http://www.w3.org/2000/svg"
   xmlns:sodipodi="http://sodipodi.sourceforge.net/DTD/sodipodi-0.dtd"
   xmlns:inkscape="http://www.inkscape.org/namespaces/inkscape"
   data-dec="68"
   width="22"
   height="40"
   version="1.1"
   id="svg4"
   sodipodi:docname="68.svg"
   inkscape:version="0.92.4 5da689c313, 2019-01-14">
  <metadata
     id="metadata10">
    <rdf:RDF>
      <cc:Work
         rdf:about="">
        <dc:format>image/svg+xml</dc:format>
        <dc:type
           rdf:resource="http://purl.org/dc/dcmitype/StillImage" />
        <dc:title></dc:title>
      </cc:Work>
    </rdf:RDF>
  </metadata>
  <defs
     id="defs8" />
  <sodipodi:namedview
     pagecolor="#ffffff"
     bordercolor="#666666"
     borderopacity="1"
     objecttolerance="10"
     gridtolerance="10"
     guidetolerance="10"
     inkscape:pageopacity="0"
     inkscape:pageshadow="2"
     inkscape:window-width="1920"
     inkscape:window-height="1043"
     id="namedview6"
     showgrid="false"
     inkscape:zoom="5.9"
     inkscape:cx="11"
     inkscape:cy="20"
     inkscape:window-x="0"
     inkscape:window-y="37"
     inkscape:window-maximized="0"
     inkscape:current-layer="svg4" />
  <path
     style="color:#000000;font-style:normal;font-variant:normal;font-weight:normal;font-stretch:normal;font-size:medium;line-height:normal;font-family:sans-serif;font-variant-ligatures:normal;font-variant-position:normal;font-variant-caps:normal;font-variant-numeric:normal;font-variant-alternates:normal;font-feature-settings:normal;text-indent:0;text-align:start;text-decoration:none;text-decoration-line:none;text-decoration-style:solid;text-decoration-color:#000000;letter-spacing:normal;word-spacing:normal;text-transform:none;writing-mode:lr-tb;direction:ltr;text-orientation:mixed;dominant-baseline:auto;baseline-shift:baseline;text-anchor:start;white-space:normal;shape-padding:0;clip-rule:nonzero;display:inline;overflow:visible;visibility:visible;opacity:1;isolation:auto;mix-blend-mode:normal;color-interpolation:sRGB;color-interpolation-filters:linearRGB;solid-color:#000000;solid-opacity:1;vector-effect:none;fill:#000000;fill-opacity:1;fill-rule:nonzero;stroke:none;stroke-width:0.5;stroke-linecap:round;stroke-linejoin:round;stroke-miterlimit:4;stroke-dasharray:none;stroke-dashoffset:0;stroke-opacity:1;color-rendering:auto;image-rendering:auto;shape-rendering:auto;text-rendering:auto;enable-background:accumulate"
     d="m 5.25,2.25 v 18.5 h 5.708984 l 2.90625,-0.96875 0.929688,-0.929688 0.972656,-1.947265 L 16.75,13.958984 V 9.0410156 L 15.767578,6.0957031 14.794922,4.1484375 13.865234,3.21875 10.958984,2.25 Z M 4.9960938,1.7460938 A 0.250025,0.250025 0 0 1 5.046875,1.75 H 11 a 0.250025,0.250025 0 0 1 0.07813,0.013672 l 3,1 a 0.250025,0.250025 0 0 1 0.09961,0.058594 l 1,1 a 0.250025,0.250025 0 0 1 0.04492,0.066406 l 1,2 a 0.250025,0.250025 0 0 1 0.01367,0.033203 l 1,3 A 0.250025,0.250025 0 0 1 17.25,9 v 5 a 0.250025,0.250025 0 0 1 -0.01367,0.07813 l -1,3 a 0.250025,0.250025 0 0 1 -0.01367,0.0332 l -1,2 a 0.250025,0.250025 0 0 1 -0.04492,0.06641 l -1,1 a 0.250025,0.250025 0 0 1 -0.09961,0.05859 l -3,1 A 0.250025,0.250025 0 0 1 11,21.25 H 5.0410156 a 0.250025,0.250025 0 0 1 -0.1972656,-0.05273 0.250025,0.250025 0 0 1 -0.00195,0 0.250025,0.250025 0 0 1 -0.00781,-0.0078 0.250025,0.250025 0 0 1 -0.00977,-0.0098 0.250025,0.250025 0 0 1 -0.015625,-0.01563 0.250025,0.250025 0 0 1 -0.00195,-0.002 0.250025,0.250025 0 0 1 -0.013672,-0.01758 0.250025,0.250025 0 0 1 -0.00195,-0.002 0.250025,0.250025 0 0 1 -0.00391,-0.0078 0.250025,0.250025 0 0 1 -0.00781,-0.01367 A 0.250025,0.250025 0 0 1 4.75,20.953125 V 2.0410156 a 0.250025,0.250025 0 0 1 0.052734,-0.1972656 0.250025,0.250025 0 0 1 0,-0.00195 0.250025,0.250025 0 0 1 0.00781,-0.00781 0.250025,0.250025 0 0 1 0.027344,-0.027344 0.250025,0.250025 0 0 1 0.017578,-0.013672 0.250025,0.250025 0 0 1 0.00195,-0.00195 0.250025,0.250025 0 0 1 0.00781,-0.00391 0.250025,0.250025 0 0 1 0.013672,-0.00781 0.250025,0.250025 0 0 1 0.1171876,-0.033203 z M 4.25,1.25 v 20.5 h 6.708984 l 2.90625,-0.96875 1.929688,-1.929688 0.972656,-1.947265 L 17.75,13.958984 V 9.0410156 L 16.767578,6.0957031 15.794922,4.1484375 13.865234,2.21875 10.958984,1.25 Z M 3.9960938,0.74609375 A 0.250025,0.250025 0 0 1 4.046875,0.75 H 11 a 0.250025,0.250025 0 0 1 0.07813,0.0136719 l 3,1.00000002 a 0.250025,0.250025 0 0 1 0.09961,0.058594 l 2,2 a 0.250025,0.250025 0 0 1 0.04492,0.066406 l 1,2 a 0.250025,0.250025 0 0 1 0.01367,0.033203 l 1,3 A 0.250025,0.250025 0 0 1 18.25,9 v 5 a 0.250025,0.250025 0 0 1 -0.01367,0.07813 l -1,3 a 0.250025,0.250025 0 0 1 -0.01367,0.0332 l -1,2 a 0.250025,0.250025 0 0 1 -0.04492,0.06641 l -2,2 a 0.250025,0.250025 0 0 1 -0.09961,0.05859 l -3,1 A 0.250025,0.250025 0 0 1 11,22.25 H 4.0410156 a 0.250025,0.250025 0 0 1 -0.1972656,-0.05273 0.250025,0.250025 0 0 1 -0.00195,0 0.250025,0.250025 0 0 1 -0.00781,-0.0078 0.250025,0.250025 0 0 1 -0.00977,-0.0098 0.250025,0.250025 0 0 1 -0.015625,-0.01563 0.250025,0.250025 0 0 1 -0.00195,-0.002 0.250025,0.250025 0 0 1 -0.013672,-0.01758 0.250025,0.250025 0 0 1 -0.00195,-0.002 0.250025,0.250025 0 0 1 -0.00391,-0.0078 0.250025,0.250025 0 0 1 -0.00781,-0.01367 A 0.250025,0.250025 0 0 1 3.75,21.953125 V 1.0410156 a 0.250025,0.250025 0 0 1 0.052734,-0.1972656 0.250025,0.250025 0 0 1 0,-0.001953 0.250025,0.250025 0 0 1 0.00781,-0.007813 0.250025,0.250025 0 0 1 0.027344,-0.0273438 0.250025,0.250025 0 0 1 0.017578,-0.0136719 0.250025,0.250025 0 0 1 0.00195,-0.001953 0.250025,0.250025 0 0 1 0.00781,-0.003906 0.250025,0.250025 0 0 1 0.013672,-0.007813 0.250025,0.250025 0 0 1 0.1171876,-0.0332031 z"
     id="path2" />
</svg>
