<?xml version="1.0" encoding="UTF-8" standalone="no"?>
<svg
   xmlns:dc="http://purl.org/dc/elements/1.1/"
   xmlns:cc="http://creativecommons.org/ns#"
   xmlns:rdf="http://www.w3.org/1999/02/22-rdf-syntax-ns#"
   xmlns:svg="http://www.w3.org/2000/svg"
   xmlns="http://www.w3.org/2000/svg"
   xmlns:sodipodi="http://sodipodi.sourceforge.net/DTD/sodipodi-0.dtd"
   xmlns:inkscape="http://www.inkscape.org/namespaces/inkscape"
   data-dec="79"
   width="22"
   height="40"
   version="1.1"
   id="svg4"
   sodipodi:docname="79.svg"
   inkscape:version="0.92.4 (unknown)">
  <metadata
     id="metadata10">
    <rdf:RDF>
      <cc:Work
         rdf:about="">
        <dc:format>image/svg+xml</dc:format>
        <dc:type
           rdf:resource="http://purl.org/dc/dcmitype/StillImage" />
      </cc:Work>
    </rdf:RDF>
  </metadata>
  <defs
     id="defs8" />
  <sodipodi:namedview
     pagecolor="#ffffff"
     bordercolor="#666666"
     borderopacity="1"
     objecttolerance="10"
     gridtolerance="10"
     guidetolerance="10"
     inkscape:pageopacity="0"
     inkscape:pageshadow="2"
     inkscape:window-width="640"
     inkscape:window-height="480"
     id="namedview6"
     showgrid="false"
     inkscape:zoom="5.9"
     inkscape:cx="11"
     inkscape:cy="20"
     inkscape:window-x="0"
     inkscape:window-y="27"
     inkscape:window-maximized="0"
     inkscape:current-layer="svg4" />
  <path
     style="color:#000000;font-style:normal;font-variant:normal;font-weight:normal;font-stretch:normal;font-size:medium;line-height:normal;font-family:sans-serif;font-variant-ligatures:normal;font-variant-position:normal;font-variant-caps:normal;font-variant-numeric:normal;font-variant-alternates:normal;font-feature-settings:normal;text-indent:0;text-align:start;text-decoration:none;text-decoration-line:none;text-decoration-style:solid;text-decoration-color:#000000;letter-spacing:normal;word-spacing:normal;text-transform:none;writing-mode:lr-tb;direction:ltr;text-orientation:mixed;dominant-baseline:auto;baseline-shift:baseline;text-anchor:start;white-space:normal;shape-padding:0;clip-rule:nonzero;display:inline;overflow:visible;visibility:visible;opacity:1;isolation:auto;mix-blend-mode:normal;color-interpolation:sRGB;color-interpolation-filters:linearRGB;solid-color:#000000;solid-opacity:1;vector-effect:none;fill:#013272;fill-opacity:1;fill-rule:nonzero;stroke:none;stroke-width:0.5;stroke-linecap:round;stroke-linejoin:round;stroke-miterlimit:4;stroke-dasharray:none;stroke-dashoffset:0;stroke-opacity:1;color-rendering:auto;image-rendering:auto;shape-rendering:auto;text-rendering:auto;enable-background:accumulate"
     d="M 9.5722656,2.0722656 9.1347656,2.21875 7.1933594,4.1601562 5.2265625,7.1113281 4.2402344,10.070312 3.25,14.03125 v 2.927734 l 0.96875,2.90625 0.9296875,0.929688 0.5820313,0.291016 -0.9082032,-0.908204 a 0.250025,0.250025 0 0 1 -0.058594,-0.09961 l -1,-3 A 0.250025,0.250025 0 0 1 3.75,17 v -3 a 0.250025,0.250025 0 0 1 0.00781,-0.06055 l 1,-3.9999999 a 0.250025,0.250025 0 0 1 0.00586,-0.017578 l 1,-3 a 0.250025,0.250025 0 0 1 0.027344,-0.060547 l 2,-3 a 0.250025,0.250025 0 0 1 0.03125,-0.039063 z m 6.6972654,-0.1582031 0.908203,0.9082031 a 0.250025,0.250025 0 0 1 0.05859,0.099609 l 1,3 A 0.250025,0.250025 0 0 1 18.25,6 v 3 a 0.250025,0.250025 0 0 1 -0.0078,0.060547 l -1,4.0000001 a 0.250025,0.250025 0 0 1 -0.0059,0.01758 l -1,3 a 0.250025,0.250025 0 0 1 -0.02734,0.06055 l -2,3 a 0.250025,0.250025 0 0 1 -0.03125,0.03906 l -1.748046,1.748047 0.435546,-0.144531 1.941407,-1.941406 1.966797,-2.951172 0.986328,-2.958984 L 18.75,8.96875 V 6.0410156 L 17.78125,3.1347656 16.851562,2.2050781 Z M 12.056641,1.25 10.148438,2.2050781 8.1933594,4.1601562 6.2265625,7.1113281 5.2402344,10.070312 4.25,14.03125 v 2.927734 L 5.21875,19.865234 7.1054688,21.75 h 2.8378906 l 1.9082026,-0.955078 1.955079,-1.955078 1.966797,-2.951172 0.986328,-2.958984 L 17.75,8.96875 V 6.0410156 L 16.78125,3.1347656 14.894531,1.25 Z m -0.05469,-0.50195312 a 0.250025,0.250025 0 0 1 0.02149,0.001953 0.250025,0.250025 0 0 1 0.002,0 h 2.935547 a 0.250025,0.250025 0 0 1 0.128906,0.015625 0.250025,0.250025 0 0 1 0.0059,0.001953 0.250025,0.250025 0 0 1 0.04297,0.0234375 l 1.972656,0.98632818 a 0.250025,0.250025 0 0 1 0.06641,0.044922 l 1,1 a 0.250025,0.250025 0 0 1 0.05859,0.099609 l 1,3 A 0.250025,0.250025 0 0 1 19.25,6 v 3 a 0.250025,0.250025 0 0 1 -0.0078,0.060547 l -1,4.0000001 a 0.250025,0.250025 0 0 1 -0.0059,0.01758 l -1,3 a 0.250025,0.250025 0 0 1 -0.02734,0.06055 l -2,3 a 0.250025,0.250025 0 0 1 -0.03125,0.03906 l -2,2 a 0.250025,0.250025 0 0 1 -0.09961,0.05859 l -2.982422,0.994141 a 0.250025,0.250025 0 0 1 -0.02148,0.0078 0.250025,0.250025 0 0 1 -0.09961,0.01172 H 7.0390625 a 0.250025,0.250025 0 0 1 -0.1289063,-0.01563 0.250025,0.250025 0 0 1 -0.00586,-0.002 0.250025,0.250025 0 0 1 -0.042969,-0.02344 L 4.8886719,21.222656 a 0.250025,0.250025 0 0 1 -0.066406,-0.04492 l -1,-1 a 0.250025,0.250025 0 0 1 -0.058594,-0.09961 l -1,-3 A 0.250025,0.250025 0 0 1 2.75,17 v -3 a 0.250025,0.250025 0 0 1 0.00781,-0.06055 l 1,-3.9999999 a 0.250025,0.250025 0 0 1 0.00586,-0.017578 l 1,-3 a 0.250025,0.250025 0 0 1 0.027344,-0.060547 l 2,-3 a 0.250025,0.250025 0 0 1 0.03125,-0.039063 l 2,-2 a 0.250025,0.250025 0 0 1 0.099609,-0.058594 l 2.957031,-0.98437502 a 0.250025,0.250025 0 0 1 0.0078,-0.003906 0.250025,0.250025 0 0 1 0.03906,-0.015625 0.250025,0.250025 0 0 1 0.01172,-0.001953 0.250025,0.250025 0 0 1 0.01367,-0.003906 0.250025,0.250025 0 0 1 0.02344,-0.003906 0.250025,0.250025 0 0 1 0.002,0 0.250025,0.250025 0 0 1 0.0098,0 0.250025,0.250025 0 0 1 0.01563,-0.001953 z"
     id="path2" />
</svg>
