<svg xmlns:dc="http://purl.org/dc/elements/1.1/" xmlns:cc="http://creativecommons.org/ns#" xmlns:rdf="http://www.w3.org/1999/02/22-rdf-syntax-ns#" xmlns:svg="http://www.w3.org/2000/svg" xmlns="http://www.w3.org/2000/svg" xmlns:sodipodi="http://sodipodi.sourceforge.net/DTD/sodipodi-0.dtd" xmlns:inkscape="http://www.inkscape.org/namespaces/inkscape" data-dec="116" id="dec_110" width="12" height="40" version="1.1" sodipodi:docname="116.svg" inkscape:version="0.92.3 (2405546, 2018-03-11)">
  <metadata id="metadata9">
    <rdf:RDF>
      <cc:Work rdf:about="">
        <dc:format>image/svg+xml</dc:format>
        <dc:type rdf:resource="http://purl.org/dc/dcmitype/StillImage"/>
        <dc:title/>
      </cc:Work>
    </rdf:RDF>
  </metadata>
  <defs id="defs7"/>
  <sodipodi:namedview pagecolor="#ffffff" bordercolor="#666666" borderopacity="1" objecttolerance="10" gridtolerance="10" guidetolerance="10" inkscape:pageopacity="0" inkscape:pageshadow="2" inkscape:window-width="1360" inkscape:window-height="730" id="namedview5" showgrid="true" inkscape:zoom="16.98278" inkscape:cx="-13.269904" inkscape:cy="27.328757" inkscape:window-x="37" inkscape:window-y="18" inkscape:window-maximized="0" inkscape:current-layer="dec_110" showguides="false">
    <inkscape:grid type="xygrid" id="grid812"/>
  </sodipodi:namedview>
  <path id="path841" style="fill:none;fill-rule:evenodd;stroke:#000000;stroke-width:1px;stroke-linecap:round;stroke-linejoin:round;stroke-opacity:1" d="M 2,8 4,7 5,3 m 5,18 -1,1 h -2 l -2,-1 -1,-2 V 8 m 3,14 -1,-1 -1,-2 V 3 m 0,6 1,-1 h 2 -6 1 l 1,1              " inkscape:connector-curvature="0"/>
</svg>