<?xml version="1.0" encoding="UTF-8" standalone="no"?>
<svg
   xmlns:dc="http://purl.org/dc/elements/1.1/"
   xmlns:cc="http://creativecommons.org/ns#"
   xmlns:rdf="http://www.w3.org/1999/02/22-rdf-syntax-ns#"
   xmlns:svg="http://www.w3.org/2000/svg"
   xmlns="http://www.w3.org/2000/svg"
   xmlns:sodipodi="http://sodipodi.sourceforge.net/DTD/sodipodi-0.dtd"
   xmlns:inkscape="http://www.inkscape.org/namespaces/inkscape"
   data-dec="78"
   width="24"
   height="40"
   version="1.1"
   id="svg4"
   sodipodi:docname="78.svg"
   inkscape:version="0.92.4 (unknown)">
  <metadata
     id="metadata10">
    <rdf:RDF>
      <cc:Work
         rdf:about="">
        <dc:format>image/svg+xml</dc:format>
        <dc:type
           rdf:resource="http://purl.org/dc/dcmitype/StillImage" />
      </cc:Work>
    </rdf:RDF>
  </metadata>
  <defs
     id="defs8" />
  <sodipodi:namedview
     pagecolor="#ffffff"
     bordercolor="#666666"
     borderopacity="1"
     objecttolerance="10"
     gridtolerance="10"
     guidetolerance="10"
     inkscape:pageopacity="0"
     inkscape:pageshadow="2"
     inkscape:window-width="640"
     inkscape:window-height="480"
     id="namedview6"
     showgrid="false"
     inkscape:zoom="5.9"
     inkscape:cx="12"
     inkscape:cy="20"
     inkscape:window-x="0"
     inkscape:window-y="27"
     inkscape:window-maximized="0"
     inkscape:current-layer="svg4" />
  <path
     style="color:#000000;font-style:normal;font-variant:normal;font-weight:normal;font-stretch:normal;font-size:medium;line-height:normal;font-family:sans-serif;font-variant-ligatures:normal;font-variant-position:normal;font-variant-caps:normal;font-variant-numeric:normal;font-variant-alternates:normal;font-feature-settings:normal;text-indent:0;text-align:start;text-decoration:none;text-decoration-line:none;text-decoration-style:solid;text-decoration-color:#000000;letter-spacing:normal;word-spacing:normal;text-transform:none;writing-mode:lr-tb;direction:ltr;text-orientation:mixed;dominant-baseline:auto;baseline-shift:baseline;text-anchor:start;white-space:normal;shape-padding:0;clip-rule:nonzero;display:inline;overflow:visible;visibility:visible;opacity:1;isolation:auto;mix-blend-mode:normal;color-interpolation:sRGB;color-interpolation-filters:linearRGB;solid-color:#000000;solid-opacity:1;vector-effect:none;fill:#013272;fill-opacity:1;fill-rule:nonzero;stroke:none;stroke-width:0.5;stroke-linecap:round;stroke-linejoin:round;stroke-miterlimit:4;stroke-dasharray:none;stroke-dashoffset:0;stroke-opacity:1;color-rendering:auto;image-rendering:auto;shape-rendering:auto;text-rendering:auto;enable-background:accumulate"
     d="M 4.9960938,0.74609375 A 0.250025,0.250025 0 0 1 5.046875,0.75 h 0.90625 a 0.250025,0.250025 0 0 1 0.1132812,0.007813 0.250025,0.250025 0 0 1 0.00977,0.001953 0.250025,0.250025 0 0 1 0.013672,0.005859 0.250025,0.250025 0 0 1 0.00977,0.003906 0.250025,0.250025 0 0 1 0.013672,0.005859 0.250025,0.250025 0 0 1 0.00977,0.003906 0.250025,0.250025 0 0 1 0.011719,0.007813 0.250025,0.250025 0 0 1 0.00977,0.005859 0.250025,0.250025 0 0 1 0.011719,0.009766 0.250025,0.250025 0 0 1 0.00781,0.005859 0.250025,0.250025 0 0 1 0.00195,0.001953 0.250025,0.250025 0 0 1 0.015625,0.015625 0.250025,0.250025 0 0 1 0.054687,0.0800781 L 17.75,19.136719 V 1.25 H 15 a 0.250025,0.250025 0 1 1 0,-0.5 h 2.958984 a 0.250025,0.250025 0 0 1 0.08789,0 H 21 a 0.250025,0.250025 0 1 1 0,0.5 h -2.75 v 18.726562 a 0.250025,0.250025 0 0 1 0,0.04883 v 1.951171 a 0.250025,0.250025 0 0 1 0,0.04102 0.250025,0.250025 0 0 1 -0.01563,0.07227 0.250025,0.250025 0 0 1 -0.0098,0.02344 0.250025,0.250025 0 0 1 -0.01172,0.02148 0.250025,0.250025 0 0 1 -0.01563,0.02148 0.250025,0.250025 0 0 1 -0.0039,0.0059 0.250025,0.250025 0 0 1 -0.01172,0.01367 0.250025,0.250025 0 0 1 -0.01758,0.01563 0.250025,0.250025 0 0 1 -0.01953,0.01563 0.250025,0.250025 0 0 1 -0.02148,0.01367 0.250025,0.250025 0 0 1 -0.0059,0.0039 0.250025,0.250025 0 0 1 -0.01563,0.0078 0.250025,0.250025 0 0 1 -0.0078,0.002 0.250025,0.250025 0 0 1 -0.01563,0.0078 0.250025,0.250025 0 0 1 -0.0078,0.002 0.250025,0.250025 0 0 1 -0.01758,0.0039 0.250025,0.250025 0 0 1 -0.0059,0.002 0.250025,0.250025 0 0 1 -0.01172,0 0.250025,0.250025 0 0 1 -0.03125,0.0039 0.250025,0.250025 0 0 1 -0.03711,-0.002 0.250025,0.250025 0 0 1 -0.08984,-0.03125 0.250025,0.250025 0 0 1 -0.02148,-0.01367 0.250025,0.250025 0 0 1 -0.01367,-0.0098 0.250025,0.250025 0 0 1 -0.0059,-0.0059 0.250025,0.250025 0 0 1 -0.01172,-0.01172 0.250025,0.250025 0 0 1 -0.0059,-0.0059 0.250025,0.250025 0 0 1 -0.04883,-0.07031 l -0.002,-0.0059 L 5.7890625,3.1328125 a 0.250025,0.250025 0 1 1 0.421875,-0.265625 L 17.75,21.136719 V 20.070312 L 5.8632812,1.25 H 5.25 v 20.5 H 8 a 0.250025,0.250025 0 1 1 0,0.5 H 5.0410156 a 0.250025,0.250025 0 0 1 -0.087891,0 H 2 a 0.250025,0.250025 0 1 1 0,-0.5 H 4.75 V 1.25 H 2 a 0.250025,0.250025 0 1 1 0,-0.5 h 2.9589844 a 0.250025,0.250025 0 0 1 0.037109,-0.003906 z"
     id="path2" />
</svg>
