<svg xmlns:dc="http://purl.org/dc/elements/1.1/" xmlns:cc="http://creativecommons.org/ns#" xmlns:rdf="http://www.w3.org/1999/02/22-rdf-syntax-ns#" xmlns:svg="http://www.w3.org/2000/svg" xmlns="http://www.w3.org/2000/svg" xmlns:sodipodi="http://sodipodi.sourceforge.net/DTD/sodipodi-0.dtd" xmlns:inkscape="http://www.inkscape.org/namespaces/inkscape" data-dec="101" id="dec_101" width="17" height="40" version="1.1" sodipodi:docname="101.svg" inkscape:version="0.92.2 5c3e80d, 2017-08-06">
  <metadata id="metadata9">
    <rdf:RDF>
      <cc:Work rdf:about="">
        <dc:format>image/svg+xml</dc:format>
        <dc:type rdf:resource="http://purl.org/dc/dcmitype/StillImage"/>
        <dc:title/>
      </cc:Work>
    </rdf:RDF>
  </metadata>
  <defs id="defs7"/>
  <sodipodi:namedview pagecolor="#ffffff" bordercolor="#666666" borderopacity="1" objecttolerance="10" gridtolerance="10" guidetolerance="10" inkscape:pageopacity="0" inkscape:pageshadow="2" inkscape:window-width="1364" inkscape:window-height="730" id="namedview5" showgrid="true" showguides="false" inkscape:zoom="11.869141" inkscape:cx="7.5255883" inkscape:cy="20" inkscape:window-x="0" inkscape:window-y="18" inkscape:window-maximized="0" inkscape:current-layer="dec_101">
    <inkscape:grid type="xygrid" id="grid819"/>
  </sodipodi:namedview>
  <path d="M 4,14 H 15 V 12 L 14,10 13,9 10,8 H 8 L 5,9 3,11 2,14 v 2 l 1,3 2,2 3,1 h 2 l 3,-1 2,-2 m -1,-6 v -1 l -1,-2 m -9,1 -1,2 v 4 l 1,2 m 9,-5 V 11 L 12,9 10,8 M 8,8 6,9 5,10 4,13 v 4 l 1,3 1,1 2,1 " style="fill:none;stroke:#000000;stroke-width:1;stroke-linecap:round;stroke-linejoin:round" id="path2" inkscape:connector-curvature="0"/>
</svg>