<?xml version="1.0" encoding="UTF-8"?>
<glyph name="igrave" format="1">
  <advance width="231"/>
  <unicode hex="00EC"/>
  <outline>
    <contour>
      <point x="116" y="493" type="curve" smooth="yes"/>
      <point x="140" y="493"/>
      <point x="160" y="474"/>
      <point x="160" y="450" type="curve" smooth="yes"/>
      <point x="160" y="449" type="line"/>
      <point x="160" y="44" type="line"/>
      <point x="160" y="43" type="line" smooth="yes"/>
      <point x="160" y="19"/>
      <point x="140" y="0"/>
      <point x="116" y="0" type="curve" smooth="yes"/>
      <point x="92" y="0"/>
      <point x="73" y="19"/>
      <point x="73" y="43" type="curve" smooth="yes"/>
      <point x="73" y="44" type="line"/>
      <point x="73" y="449" type="line"/>
      <point x="73" y="450" type="line" smooth="yes"/>
      <point x="73" y="473"/>
      <point x="93" y="493"/>
    </contour>
    <component base="grave" xOffset="-58" yOffset="148"/>
  </outline>
  <lib>
    <dict>
      <key>com.fontlab.hintData</key>
      <dict>
        <key>hhints</key>
        <array>
          <dict>
            <key>position</key>
            <integer>0</integer>
            <key>width</key>
            <integer>23</integer>
          </dict>
          <dict>
            <key>position</key>
            <integer>471</integer>
            <key>width</key>
            <integer>22</integer>
          </dict>
          <dict>
            <key>position</key>
            <integer>580</integer>
            <key>width</key>
            <integer>144</integer>
          </dict>
          <dict>
            <key>position</key>
            <integer>782</integer>
            <key>width</key>
            <integer>232</integer>
          </dict>
        </array>
        <key>vhints</key>
        <array>
          <dict>
            <key>position</key>
            <integer>43</integer>
            <key>width</key>
            <integer>145</integer>
          </dict>
          <dict>
            <key>position</key>
            <integer>73</integer>
            <key>width</key>
            <integer>87</integer>
          </dict>
          <dict>
            <key>position</key>
            <integer>158</integer>
            <key>width</key>
            <integer>261</integer>
          </dict>
        </array>
      </dict>
    </dict>
  </lib>
</glyph>
