<svg xmlns:dc="http://purl.org/dc/elements/1.1/" xmlns:cc="http://creativecommons.org/ns#" xmlns:rdf="http://www.w3.org/1999/02/22-rdf-syntax-ns#" xmlns:svg="http://www.w3.org/2000/svg" xmlns="http://www.w3.org/2000/svg" xmlns:sodipodi="http://sodipodi.sourceforge.net/DTD/sodipodi-0.dtd" xmlns:inkscape="http://www.inkscape.org/namespaces/inkscape" data-dec="338" id="dec_79" width="28" height="40" version="1.1" sodipodi:docname="338.svg" inkscape:version="0.92.2 5c3e80d, 2017-08-06">
  <metadata id="metadata9">
    <rdf:RDF>
      <cc:Work rdf:about="">
        <dc:format>image/svg+xml</dc:format>
        <dc:type rdf:resource="http://purl.org/dc/dcmitype/StillImage"/>
        <dc:title/>
      </cc:Work>
    </rdf:RDF>
  </metadata>
  <defs id="defs7"/>
  <sodipodi:namedview pagecolor="#ffffff" bordercolor="#666666" borderopacity="1" objecttolerance="10" gridtolerance="10" guidetolerance="10" inkscape:pageopacity="0" inkscape:pageshadow="2" inkscape:window-width="1364" inkscape:window-height="730" id="namedview5" showgrid="true" inkscape:zoom="16.883852" inkscape:cx="16.23838" inkscape:cy="27.212787" inkscape:window-x="1920" inkscape:window-y="18" inkscape:window-maximized="0" inkscape:current-layer="dec_79" showguides="false">
    <inkscape:grid type="xygrid" id="grid844"/>
  </sodipodi:namedview>
  <path id="path816" style="fill:none;stroke:#000000;stroke-width:1;stroke-linecap:round;stroke-linejoin:round" d="M 10,1 8,2 6,4 5,6 4,9 v 5 l 1,3 1,2 2,2 2,1 h 4 M 14,1 H 10 M 10,3 7,4 6,6 5,9 v 5 l 2,5 3,1 h 3 1 M 14,3 H 10 M 14,1 V 22 M 15,2 V 21 M 14,1 H 26 M 15,3 H 26 V 1 m -11,9 h 6 v 2 m -6,0 h 6 m -6,8 h 11 v 2 M 14,22 H 26 M 9,1 7,2 5,4 4,6 3,9 v 5 l 1,3 1,2 2,2 2,1 h 4 M 13,1 H 9 M 10,2 7,3 5,6 4,9 v 5 l 1,3 2,3 3,1 h 3 M 13,2 H 10 M 13,1 V 22 M 14,2 V 21 M 13,1 H 25 M 14,2 H 25 V 1 M 14,11 h 6 v 1 m -6,0 h 6 m -6,9 h 11 v 1 m -12,0 h 12 "/>
</svg>