<?xml version="1.0" encoding="UTF-8" standalone="no"?>
<svg
   xmlns:dc="http://purl.org/dc/elements/1.1/"
   xmlns:cc="http://creativecommons.org/ns#"
   xmlns:rdf="http://www.w3.org/1999/02/22-rdf-syntax-ns#"
   xmlns:svg="http://www.w3.org/2000/svg"
   xmlns="http://www.w3.org/2000/svg"
   xmlns:sodipodi="http://sodipodi.sourceforge.net/DTD/sodipodi-0.dtd"
   xmlns:inkscape="http://www.inkscape.org/namespaces/inkscape"
   data-dec="102"
   width="16"
   height="40"
   version="1.1"
   id="svg4"
   sodipodi:docname="102.svg"
   inkscape:version="0.92.4 (unknown)">
  <metadata
     id="metadata10">
    <rdf:RDF>
      <cc:Work
         rdf:about="">
        <dc:format>image/svg+xml</dc:format>
        <dc:type
           rdf:resource="http://purl.org/dc/dcmitype/StillImage" />
      </cc:Work>
    </rdf:RDF>
  </metadata>
  <defs
     id="defs8" />
  <sodipodi:namedview
     pagecolor="#ffffff"
     bordercolor="#666666"
     borderopacity="1"
     objecttolerance="10"
     gridtolerance="10"
     guidetolerance="10"
     inkscape:pageopacity="0"
     inkscape:pageshadow="2"
     inkscape:window-width="640"
     inkscape:window-height="480"
     id="namedview6"
     showgrid="false"
     inkscape:zoom="5.9"
     inkscape:cx="8"
     inkscape:cy="20"
     inkscape:window-x="0"
     inkscape:window-y="27"
     inkscape:window-maximized="0"
     inkscape:current-layer="svg4" />
  <path
     style="color:#000000;font-style:normal;font-variant:normal;font-weight:normal;font-stretch:normal;font-size:medium;line-height:normal;font-family:sans-serif;font-variant-ligatures:normal;font-variant-position:normal;font-variant-caps:normal;font-variant-numeric:normal;font-variant-alternates:normal;font-feature-settings:normal;text-indent:0;text-align:start;text-decoration:none;text-decoration-line:none;text-decoration-style:solid;text-decoration-color:#000000;letter-spacing:normal;word-spacing:normal;text-transform:none;writing-mode:lr-tb;direction:ltr;text-orientation:mixed;dominant-baseline:auto;baseline-shift:baseline;text-anchor:start;white-space:normal;shape-padding:0;clip-rule:nonzero;display:inline;overflow:visible;visibility:visible;opacity:1;isolation:auto;mix-blend-mode:normal;color-interpolation:sRGB;color-interpolation-filters:linearRGB;solid-color:#000000;solid-opacity:1;vector-effect:none;fill:#013272;fill-opacity:1;fill-rule:nonzero;stroke:none;stroke-width:2;stroke-linecap:round;stroke-linejoin:round;stroke-miterlimit:4;stroke-dasharray:none;stroke-dashoffset:0;stroke-opacity:1;color-rendering:auto;image-rendering:auto;shape-rendering:auto;text-rendering:auto;enable-background:accumulate"
     d="M 13.980469,-0.00976563 A 1.0001,1.0001 0 0 1 14.146484,0 H 16 a 1.0001,1.0001 0 0 1 0.707031,0.29296875 l 1,1.00000005 A 1.0001,1.0001 0 0 1 18,2 V 4 A 1.0001,1.0001 0 0 1 17,5 H 15 A 1.0001,1.0001 0 0 1 14,4 V 2.4140625 L 12.822266,3.5917969 11.925781,5.3828125 11.386719,7 H 15 a 1.0001,1.0001 0 1 1 0,2 h -4.179688 l -0.8398432,4.195312 a 1.0001,1.0001 0 0 1 -0.00977,0.04688 l -2,8 a 1.0001,1.0001 0 0 1 -0.021484,0.07422 l -1,3 a 1.0001,1.0001 0 0 1 -0.054688,0.13086 l -1,2 a 1.0001,1.0001 0 0 1 -0.1875,0.259765 l -2,2 a 1.0001,1.0001 0 0 1 -0.2597656,0.1875 L 1.5136719,29.861328 A 1.0001,1.0001 0 0 1 0.85351562,30 H -1 a 1.0001,1.0001 0 0 1 -0.7070312,-0.292969 l -1,-1 A 1.0001,1.0001 0 0 1 -3,28 v -2 a 1.0001,1.0001 0 0 1 1,-1 h 2 a 1.0001,1.0001 0 0 1 1,1 v 1.585938 l 1.1777344,-1.177735 0.8964844,-1.791015 0.9609374,-2.884766 1.9882813,-8.949219 a 1.0001,1.0001 0 0 1 0.00586,-0.02539 L 6.96875,9 H 4 A 1.0001,1.0001 0 1 1 4,7 H 7.6113281 L 8.0507812,5.6835938 a 1.0001,1.0001 0 0 1 0.054688,-0.1308594 l 1,-2 a 1.0001,1.0001 0 0 1 0.1875,-0.2597656 l 2.0000002,-2 a 1.0001,1.0001 0 0 1 0.259765,-0.1875 l 1.933594,-0.96679692 a 1.0001,1.0001 0 0 1 0.494141,-0.14843751 z"
     id="path2" />
</svg>
