<?xml version="1.0" encoding="UTF-8" standalone="no"?>
<svg
   xmlns:dc="http://purl.org/dc/elements/1.1/"
   xmlns:cc="http://creativecommons.org/ns#"
   xmlns:rdf="http://www.w3.org/1999/02/22-rdf-syntax-ns#"
   xmlns:svg="http://www.w3.org/2000/svg"
   xmlns="http://www.w3.org/2000/svg"
   xmlns:sodipodi="http://sodipodi.sourceforge.net/DTD/sodipodi-0.dtd"
   xmlns:inkscape="http://www.inkscape.org/namespaces/inkscape"
   data-dec="79"
   width="22"
   height="40"
   version="1.1"
   id="svg4"
   sodipodi:docname="79.svg"
   inkscape:version="0.92.4 (unknown)">
  <metadata
     id="metadata10">
    <rdf:RDF>
      <cc:Work
         rdf:about="">
        <dc:format>image/svg+xml</dc:format>
        <dc:type
           rdf:resource="http://purl.org/dc/dcmitype/StillImage" />
      </cc:Work>
    </rdf:RDF>
  </metadata>
  <defs
     id="defs8" />
  <sodipodi:namedview
     pagecolor="#ffffff"
     bordercolor="#666666"
     borderopacity="1"
     objecttolerance="10"
     gridtolerance="10"
     guidetolerance="10"
     inkscape:pageopacity="0"
     inkscape:pageshadow="2"
     inkscape:window-width="615"
     inkscape:window-height="417"
     id="namedview6"
     showgrid="false"
     inkscape:zoom="5.9"
     inkscape:cx="11"
     inkscape:cy="20"
     inkscape:window-x="0"
     inkscape:window-y="27"
     inkscape:window-maximized="0"
     inkscape:current-layer="svg4" />
  <path
     style="color:#000000;font-style:normal;font-variant:normal;font-weight:normal;font-stretch:normal;font-size:medium;line-height:normal;font-family:sans-serif;font-variant-ligatures:normal;font-variant-position:normal;font-variant-caps:normal;font-variant-numeric:normal;font-variant-alternates:normal;font-feature-settings:normal;text-indent:0;text-align:start;text-decoration:none;text-decoration-line:none;text-decoration-style:solid;text-decoration-color:#000000;letter-spacing:normal;word-spacing:normal;text-transform:none;writing-mode:lr-tb;direction:ltr;text-orientation:mixed;dominant-baseline:auto;baseline-shift:baseline;text-anchor:start;white-space:normal;shape-padding:0;clip-rule:nonzero;display:inline;overflow:visible;visibility:visible;opacity:1;isolation:auto;mix-blend-mode:normal;color-interpolation:sRGB;color-interpolation-filters:linearRGB;solid-color:#000000;solid-opacity:1;vector-effect:none;fill:#013272;fill-opacity:1;fill-rule:nonzero;stroke:none;stroke-width:2;stroke-linecap:round;stroke-linejoin:round;stroke-miterlimit:4;stroke-dasharray:none;stroke-dashoffset:0;stroke-opacity:1;color-rendering:auto;image-rendering:auto;shape-rendering:auto;text-rendering:auto;enable-background:accumulate"
     d="M 10.236328,2 8.6855469,2.7753906 6.9277344,5.4101562 6,9.1230469 V 13.876953 L 6.9277344,17.589844 8.6855469,20.224609 10.236328,21 h 1.527344 L 13.314453,20.224609 15.072266,17.589844 16,13.876953 V 9.1230469 L 15.072266,5.4101562 13.314453,2.7753906 11.763672,2 Z m -0.232422,-2.00585938 a 1.0001,1.0001 0 0 1 0.04297,0.00195313 A 1.0001,1.0001 0 0 1 10.119141,0 h 1.771484 a 1.0001,1.0001 0 0 1 0.425781,0.05078125 l 0.0078,0.0019531 a 1.0001,1.0001 0 0 1 0.03125,0.01171875 l 2.960937,0.98632808 a 1.0001,1.0001 0 0 1 0.390625,0.2421876 l 2,2 a 1.0001,1.0001 0 0 1 0.1875,0.2597656 l 1,2 a 1.0001,1.0001 0 0 1 0.07617,0.2050781 l 1,4 A 1.0001,1.0001 0 0 1 20,10 v 3 a 1.0001,1.0001 0 0 1 -0.0293,0.242188 l -1,4 a 1.0001,1.0001 0 0 1 -0.07617,0.205078 l -1,2 a 1.0001,1.0001 0 0 1 -0.1875,0.259765 l -2,2 a 1.0001,1.0001 0 0 1 -0.390625,0.242188 l -2.99414,0.998047 -0.0059,0.002 A 1.0001,1.0001 0 0 1 11.880859,23 h -1.771484 a 1.0001,1.0001 0 0 1 -0.4257812,-0.05078 l -0.039063,-0.01367 -2.9609374,-0.986328 a 1.0001,1.0001 0 0 1 -0.390625,-0.242188 l -2,-2 a 1.0001,1.0001 0 0 1 -0.1875,-0.259765 l -1,-2 a 1.0001,1.0001 0 0 1 -0.076172,-0.205078 l -1,-4 A 1.0001,1.0001 0 0 1 2,13 v -3 a 1.0001,1.0001 0 0 1 0.029297,-0.2421875 l 1,-4 a 1.0001,1.0001 0 0 1 0.076172,-0.2050781 l 1,-2 a 1.0001,1.0001 0 0 1 0.1875,-0.2597656 l 2,-2 A 1.0001,1.0001 0 0 1 6.6835938,1.0507812 L 9.5996094,0.078125 a 1.0001,1.0001 0 0 1 0.00977,-0.0039063 1.0001,1.0001 0 0 1 0.1699219,-0.05078125 1.0001,1.0001 0 0 1 0.021484,-0.0058594 1.0001,1.0001 0 0 1 0.046875,-0.0078125 1.0001,1.0001 0 0 1 0.099609,-0.01171876 1.0001,1.0001 0 0 1 0.05664,-0.00390625 z"
     id="path2" />
</svg>
