<?xml version="1.0" encoding="UTF-8" standalone="no"?>
<svg
   xmlns:dc="http://purl.org/dc/elements/1.1/"
   xmlns:cc="http://creativecommons.org/ns#"
   xmlns:rdf="http://www.w3.org/1999/02/22-rdf-syntax-ns#"
   xmlns:svg="http://www.w3.org/2000/svg"
   xmlns="http://www.w3.org/2000/svg"
   xmlns:sodipodi="http://sodipodi.sourceforge.net/DTD/sodipodi-0.dtd"
   xmlns:inkscape="http://www.inkscape.org/namespaces/inkscape"
   data-dec="51"
   width="16"
   height="40"
   version="1.1"
   id="svg4"
   sodipodi:docname="51.svg"
   inkscape:version="0.92.2 2405546, 2018-03-11">
  <metadata
     id="metadata10">
    <rdf:RDF>
      <cc:Work
         rdf:about="">
        <dc:format>image/svg+xml</dc:format>
        <dc:type
           rdf:resource="http://purl.org/dc/dcmitype/StillImage" />
        <dc:title></dc:title>
      </cc:Work>
    </rdf:RDF>
  </metadata>
  <defs
     id="defs8" />
  <sodipodi:namedview
     pagecolor="#ffffff"
     bordercolor="#666666"
     borderopacity="1"
     objecttolerance="10"
     gridtolerance="10"
     guidetolerance="10"
     inkscape:pageopacity="0"
     inkscape:pageshadow="2"
     inkscape:window-width="640"
     inkscape:window-height="480"
     id="namedview6"
     showgrid="false"
     inkscape:zoom="5.9"
     inkscape:cx="8"
     inkscape:cy="20"
     inkscape:window-x="0"
     inkscape:window-y="17"
     inkscape:window-maximized="0"
     inkscape:current-layer="svg4" />
  <path
     style="color:#000000;font-style:normal;font-variant:normal;font-weight:normal;font-stretch:normal;font-size:medium;line-height:normal;font-family:sans-serif;font-variant-ligatures:normal;font-variant-position:normal;font-variant-caps:normal;font-variant-numeric:normal;font-variant-alternates:normal;font-feature-settings:normal;text-indent:0;text-align:start;text-decoration:none;text-decoration-line:none;text-decoration-style:solid;text-decoration-color:#000000;letter-spacing:normal;word-spacing:normal;text-transform:none;writing-mode:lr-tb;direction:ltr;text-orientation:mixed;dominant-baseline:auto;baseline-shift:baseline;text-anchor:start;white-space:normal;shape-padding:0;clip-rule:nonzero;display:inline;overflow:visible;visibility:visible;opacity:1;isolation:auto;mix-blend-mode:normal;color-interpolation:sRGB;color-interpolation-filters:linearRGB;solid-color:#000000;solid-opacity:1;vector-effect:none;fill:#013272;fill-opacity:1;fill-rule:nonzero;stroke:none;stroke-width:2;stroke-linecap:round;stroke-linejoin:round;stroke-miterlimit:4;stroke-dasharray:none;stroke-dashoffset:0;stroke-opacity:1;color-rendering:auto;image-rendering:auto;shape-rendering:auto;text-rendering:auto;enable-background:accumulate"
     d="m 5,2 h 3 a 1.0001,1.0001 0 0 1 0.4472656,0.1054688 l 2.0000004,1 a 1.0001,1.0001 0 0 1 0.259765,0.1875 l 1,1 a 1.0001,1.0001 0 0 1 0.1875,0.2597656 l 1,2 A 1.0001,1.0001 0 0 1 13,7 v 1 a 1.0001,1.0001 0 0 1 -0.105469,0.4472656 l -1,2.0000004 a 1.0001,1.0001 0 0 1 -0.339843,0.384765 l -1.298829,0.865235 1.060547,0.353515 a 1.0001,1.0001 0 0 1 0.390625,0.242188 l 1,1 a 1.0001,1.0001 0 0 1 0.1875,0.259765 l 1,2 A 1.0001,1.0001 0 0 1 14,16 v 2 a 1.0001,1.0001 0 0 1 -0.105469,0.447266 l -1,2 a 1.0001,1.0001 0 0 1 -0.1875,0.259765 l -1,1 a 1.0001,1.0001 0 0 1 -0.259765,0.1875 l -2.0000004,1 A 1.0001,1.0001 0 0 1 9,23 H 5 A 1.0001,1.0001 0 0 1 4.5527344,22.894531 l -2,-1 a 1.0001,1.0001 0 0 1 -0.2597656,-0.1875 l -1,-1 A 1.0001,1.0001 0 1 1 2.7070312,19.292969 L 3.5917969,20.177734 5.2363281,21 H 8.7636719 L 10.408203,20.177734 11.177734,19.408203 12,17.763672 V 16.236328 L 11.177734,14.591797 10.458984,13.875 7.8378906,13 H 6 A 1.0001,1.0001 0 1 1 6,11 H 7.6972656 L 10.224609,9.3144531 11,7.7636719 V 7.2363281 L 10.177734,5.5917969 9.4082031,4.8222656 7.7636719,4 H 5.2363281 L 3.5917969,4.8222656 2.7070312,5.7070312 A 1.0001,1.0001 0 1 1 1.2929688,4.2929688 l 1,-1 a 1.0001,1.0001 0 0 1 0.2597656,-0.1875 l 2,-1 A 1.0001,1.0001 0 0 1 5,2 Z"
     id="path2" />
</svg>
