<?xml version="1.0" encoding="UTF-8"?>
<glyph name="iacute" format="1">
  <advance width="346"/>
  <unicode hex="00ED"/>
  <outline>
    <contour>
      <point x="116" y="463" type="curve" smooth="yes"/>
      <point x="174" y="463" type="line" smooth="yes"/>
      <point x="181" y="463"/>
      <point x="191" y="458"/>
      <point x="195" y="454" type="curve" smooth="yes"/>
      <point x="220" y="428" type="line" smooth="yes"/>
      <point x="223" y="425"/>
      <point x="229" y="420"/>
      <point x="230" y="416" type="curve" smooth="yes"/>
      <point x="257" y="360" type="line" smooth="yes"/>
      <point x="259" y="357"/>
      <point x="261" y="349"/>
      <point x="261" y="346" type="curve" smooth="yes"/>
      <point x="261" y="260" type="line" smooth="yes"/>
      <point x="261" y="257"/>
      <point x="259" y="253"/>
      <point x="258" y="250" type="curve" smooth="yes"/>
      <point x="202" y="110" type="line"/>
      <point x="202" y="69" type="line"/>
      <point x="214" y="57" type="line"/>
      <point x="249" y="57" type="line"/>
      <point x="295" y="103" type="line"/>
      <point x="321" y="157" type="line" smooth="yes"/>
      <point x="325" y="166"/>
      <point x="338" y="173"/>
      <point x="348" y="173" type="curve" smooth="yes"/>
      <point x="364" y="173"/>
      <point x="376" y="160"/>
      <point x="376" y="144" type="curve" smooth="yes"/>
      <point x="376" y="141"/>
      <point x="375" y="134"/>
      <point x="373" y="131" type="curve" smooth="yes"/>
      <point x="344" y="74" type="line" smooth="yes"/>
      <point x="343" y="72"/>
      <point x="341" y="68"/>
      <point x="339" y="66" type="curve" smooth="yes"/>
      <point x="280" y="8" type="line" smooth="yes"/>
      <point x="276" y="4"/>
      <point x="268" y="0"/>
      <point x="261" y="0" type="curve" smooth="yes"/>
      <point x="202" y="0" type="line" smooth="yes"/>
      <point x="195" y="0"/>
      <point x="187" y="4"/>
      <point x="183" y="8" type="curve" smooth="yes"/>
      <point x="156" y="34" type="line" smooth="yes"/>
      <point x="153" y="37"/>
      <point x="147" y="42"/>
      <point x="146" y="46" type="curve" smooth="yes"/>
      <point x="119" y="102" type="line" smooth="yes"/>
      <point x="117" y="105"/>
      <point x="116" y="113"/>
      <point x="116" y="116" type="curve" smooth="yes"/>
      <point x="116" y="202" type="line" smooth="yes"/>
      <point x="116" y="205"/>
      <point x="117" y="210"/>
      <point x="118" y="213" type="curve" smooth="yes"/>
      <point x="174" y="352" type="line"/>
      <point x="174" y="393" type="line"/>
      <point x="162" y="405" type="line"/>
      <point x="128" y="405" type="line"/>
      <point x="81" y="359" type="line"/>
      <point x="55" y="305" type="line" smooth="yes"/>
      <point x="51" y="296"/>
      <point x="39" y="289"/>
      <point x="29" y="289" type="curve" smooth="yes"/>
      <point x="13" y="289"/>
      <point x="0" y="302"/>
      <point x="0" y="318" type="curve" smooth="yes"/>
      <point x="0" y="321"/>
      <point x="1" y="328"/>
      <point x="3" y="331" type="curve" smooth="yes"/>
      <point x="32" y="388" type="line" smooth="yes"/>
      <point x="33" y="390"/>
      <point x="35" y="394"/>
      <point x="37" y="396" type="curve" smooth="yes"/>
      <point x="96" y="454" type="line" smooth="yes"/>
      <point x="100" y="458"/>
      <point x="109" y="463"/>
    </contour>
    <component base="acute" xOffset="35" yOffset="117"/>
  </outline>
  <lib>
    <dict>
      <key>com.fontlab.hintData</key>
      <dict>
        <key>hhints</key>
        <array>
          <dict>
            <key>position</key>
            <integer>0</integer>
            <key>width</key>
            <integer>57</integer>
          </dict>
          <dict>
            <key>position</key>
            <integer>405</integer>
            <key>width</key>
            <integer>58</integer>
          </dict>
          <dict>
            <key>position</key>
            <integer>550</integer>
            <key>width</key>
            <integer>107</integer>
          </dict>
          <dict>
            <key>position</key>
            <integer>550</integer>
            <key>width</key>
            <integer>116</integer>
          </dict>
          <dict>
            <key>position</key>
            <integer>724</integer>
            <key>width</key>
            <integer>232</integer>
          </dict>
        </array>
        <key>vhints</key>
        <array>
          <dict>
            <key>position</key>
            <integer>0</integer>
            <key>width</key>
            <integer>55</integer>
          </dict>
          <dict>
            <key>position</key>
            <integer>116</integer>
            <key>width</key>
            <integer>87</integer>
          </dict>
          <dict>
            <key>position</key>
            <integer>174</integer>
            <key>width</key>
            <integer>87</integer>
          </dict>
          <dict>
            <key>position</key>
            <integer>202</integer>
            <key>width</key>
            <integer>116</integer>
          </dict>
          <dict>
            <key>position</key>
            <integer>321</integer>
            <key>width</key>
            <integer>55</integer>
          </dict>
          <dict>
            <key>position</key>
            <integer>324</integer>
            <key>width</key>
            <integer>230</integer>
          </dict>
        </array>
      </dict>
    </dict>
  </lib>
</glyph>
