<?xml version="1.0" encoding="UTF-8"?>
<glyph name="oacute" format="1">
  <advance width="578"/>
  <unicode hex="00F3"/>
  <outline>
    <component base="acute" xOffset="124" yOffset="96"/>
    <component base="o"/>
  </outline>
  <lib>
    <dict>
      <key>com.fontlab.hintData</key>
      <dict>
        <key>hhints</key>
        <array>
          <dict>
            <key>position</key>
            <integer>0</integer>
            <key>width</key>
            <integer>57</integer>
          </dict>
          <dict>
            <key>position</key>
            <integer>405</integer>
            <key>width</key>
            <integer>58</integer>
          </dict>
          <dict>
            <key>position</key>
            <integer>520</integer>
            <key>width</key>
            <integer>232</integer>
          </dict>
        </array>
        <key>vhints</key>
        <array>
          <dict>
            <key>position</key>
            <integer>58</integer>
            <key>width</key>
            <integer>116</integer>
          </dict>
          <dict>
            <key>position</key>
            <integer>320</integer>
            <key>width</key>
            <integer>230</integer>
          </dict>
          <dict>
            <key>position</key>
            <integer>405</integer>
            <key>width</key>
            <integer>117</integer>
          </dict>
        </array>
      </dict>
    </dict>
  </lib>
</glyph>
