<?xml version="1.0" encoding="UTF-8" standalone="no"?>
<svg
   xmlns:dc="http://purl.org/dc/elements/1.1/"
   xmlns:cc="http://creativecommons.org/ns#"
   xmlns:rdf="http://www.w3.org/1999/02/22-rdf-syntax-ns#"
   xmlns:svg="http://www.w3.org/2000/svg"
   xmlns="http://www.w3.org/2000/svg"
   xmlns:sodipodi="http://sodipodi.sourceforge.net/DTD/sodipodi-0.dtd"
   xmlns:inkscape="http://www.inkscape.org/namespaces/inkscape"
   data-dec="103"
   width="18"
   height="40"
   version="1.1"
   id="svg4"
   sodipodi:docname="103.svg"
   inkscape:version="0.92.4 (unknown)">
  <metadata
     id="metadata10">
    <rdf:RDF>
      <cc:Work
         rdf:about="">
        <dc:format>image/svg+xml</dc:format>
        <dc:type
           rdf:resource="http://purl.org/dc/dcmitype/StillImage" />
      </cc:Work>
    </rdf:RDF>
  </metadata>
  <defs
     id="defs8" />
  <sodipodi:namedview
     pagecolor="#ffffff"
     bordercolor="#666666"
     borderopacity="1"
     objecttolerance="10"
     gridtolerance="10"
     guidetolerance="10"
     inkscape:pageopacity="0"
     inkscape:pageshadow="2"
     inkscape:window-width="640"
     inkscape:window-height="480"
     id="namedview6"
     showgrid="false"
     inkscape:zoom="5.9"
     inkscape:cx="9"
     inkscape:cy="20"
     inkscape:window-x="0"
     inkscape:window-y="27"
     inkscape:window-maximized="0"
     inkscape:current-layer="svg4" />
  <path
     style="color:#000000;font-style:normal;font-variant:normal;font-weight:normal;font-stretch:normal;font-size:medium;line-height:normal;font-family:sans-serif;font-variant-ligatures:normal;font-variant-position:normal;font-variant-caps:normal;font-variant-numeric:normal;font-variant-alternates:normal;font-feature-settings:normal;text-indent:0;text-align:start;text-decoration:none;text-decoration-line:none;text-decoration-style:solid;text-decoration-color:#000000;letter-spacing:normal;word-spacing:normal;text-transform:none;writing-mode:lr-tb;direction:ltr;text-orientation:mixed;dominant-baseline:auto;baseline-shift:baseline;text-anchor:start;white-space:normal;shape-padding:0;clip-rule:nonzero;display:inline;overflow:visible;visibility:visible;opacity:1;isolation:auto;mix-blend-mode:normal;color-interpolation:sRGB;color-interpolation-filters:linearRGB;solid-color:#000000;solid-opacity:1;vector-effect:none;fill:#013272;fill-opacity:1;fill-rule:nonzero;stroke:none;stroke-width:2;stroke-linecap:round;stroke-linejoin:round;stroke-miterlimit:4;stroke-dasharray:none;stroke-dashoffset:0;stroke-opacity:1;color-rendering:auto;image-rendering:auto;shape-rendering:auto;text-rendering:auto;enable-background:accumulate"
     d="m 6.4765625,22.880859 a 1.0001,1.0001 0 0 1 -0.1601563,0.06836 L 3.7089844,23.818359 3,25.236328 v 0.527344 L 3.7089844,27.181641 6.1621094,28 H 11.837891 L 14.291016,27.181641 15,25.763672 V 25.236328 L 14.291016,23.818359 11.837891,23 H 7 A 1.0001,1.0001 0 0 1 6.6835938,22.949219 Z M 8.2363281,9 6.5917969,9.8222656 5.8222656,10.591797 5,12.236328 v 1.527344 l 0.8222656,1.642578 v 0.002 l 0.00195,0.002 0.7675781,0.767578 L 8.2363281,17 H 9.7636719 L 11.408203,16.177734 12.177734,15.408203 13,13.763672 V 12.236328 L 12.177734,10.59375 a 1.0001,1.0001 0 0 1 -0.002,-0.0039 L 11.408203,9.8222656 9.7636719,9 Z M 8.0039062,6.9941406 A 1.0001,1.0001 0 0 1 8.1191406,7 H 10 a 1.0001,1.0001 0 0 1 0.447266,0.1054688 l 2,1 a 1.0001,1.0001 0 0 1 0.259765,0.1875 L 13,8.5859375 13.292969,8.2929688 a 1.0001,1.0001 0 0 1 0.259765,-0.1875 l 2,-1 A 1.0001,1.0001 0 0 1 17,8 v 1 a 1.0001,1.0001 0 0 1 -1,1 H 15 A 1.0001,1.0001 0 0 1 14.525391,9.8886719 l -0.308594,0.3085941 0.677734,1.355468 A 1.0001,1.0001 0 0 1 15,12 v 2 a 1.0001,1.0001 0 0 1 -0.105469,0.447266 l -1,2 a 1.0001,1.0001 0 0 1 -0.1875,0.259765 l -1,1 a 1.0001,1.0001 0 0 1 -0.259765,0.1875 l -2,1 A 1.0001,1.0001 0 0 1 10,19 H 8 A 1.0001,1.0001 0 0 1 7.5527344,18.894531 l -2,-1 a 1.0001,1.0001 0 0 1 -0.2597656,-0.1875 L 5,17.414062 4.8222656,17.591797 4,19.236328 v 0.34961 L 4.5410156,20.125 7.1621094,21 H 12 a 1.0001,1.0001 0 0 1 0.316406,0.05078 l 3,1 a 1.0001,1.0001 0 0 1 0.578125,0.501953 l 1,2 A 1.0001,1.0001 0 0 1 17,25 v 1 a 1.0001,1.0001 0 0 1 -0.105469,0.447266 l -1,2 a 1.0001,1.0001 0 0 1 -0.578125,0.501953 l -3,1 A 1.0001,1.0001 0 0 1 12,30 H 6 a 1.0001,1.0001 0 0 1 -0.3164062,-0.05078 l -3,-1 a 1.0001,1.0001 0 0 1 -0.578125,-0.501953 l -1,-2 A 1.0001,1.0001 0 0 1 1,26 v -1 a 1.0001,1.0001 0 0 1 0.1054688,-0.447266 l 1,-2 a 1.0001,1.0001 0 0 1 0.578125,-0.501953 L 3.4121094,21.808594 A 1.0001,1.0001 0 0 1 3.2929688,21.707031 L 2.3964844,20.810547 A 1.0001,1.0001 0 0 1 2.0898438,20.425781 1.0001,1.0001 0 0 1 2.0742188,20.390625 1.0001,1.0001 0 0 1 2,19.853516 V 19 a 1.0001,1.0001 0 0 1 0.1054688,-0.447266 l 1,-2 a 1.0001,1.0001 0 0 1 0.1875,-0.259765 L 3.7832031,15.802734 3.1054688,14.447266 A 1.0001,1.0001 0 0 1 3,14 v -2 a 1.0001,1.0001 0 0 1 0.1054688,-0.447266 l 1,-1.9999996 a 1.0001,1.0001 0 0 1 0.1875,-0.2597656 l 1,-1 a 1.0001,1.0001 0 0 1 0.2597656,-0.1875 L 7.4335938,7.1660156 a 1.0001,1.0001 0 0 1 0.011719,-0.00586 1.0001,1.0001 0 0 1 0.3339844,-0.1367187 1.0001,1.0001 0 0 1 0.021484,-0.00586 1.0001,1.0001 0 0 1 0.203125,-0.023437 z"
     id="path2" />
</svg>
