<?xml version="1.0" encoding="UTF-8"?>
<glyph name="X" format="1">
  <advance width="578"/>
  <unicode hex="0058"/>
  <outline>
    <contour>
      <point x="87" y="637" type="curve" smooth="yes"/>
      <point x="91" y="637"/>
      <point x="97" y="633"/>
      <point x="99" y="630" type="curve" smooth="yes"/>
      <point x="289" y="344" type="line"/>
      <point x="480" y="630" type="line" smooth="yes"/>
      <point x="482" y="633"/>
      <point x="488" y="637"/>
      <point x="492" y="637" type="curve" smooth="yes"/>
      <point x="500" y="637"/>
      <point x="507" y="631"/>
      <point x="507" y="623" type="curve" smooth="yes"/>
      <point x="507" y="621"/>
      <point x="505" y="616"/>
      <point x="504" y="614" type="curve" smooth="yes"/>
      <point x="307" y="318" type="line"/>
      <point x="504" y="22" type="line" smooth="yes"/>
      <point x="505" y="20"/>
      <point x="507" y="16"/>
      <point x="507" y="14" type="curve" smooth="yes"/>
      <point x="507" y="6"/>
      <point x="500" y="0"/>
      <point x="492" y="0" type="curve" smooth="yes"/>
      <point x="488" y="0"/>
      <point x="482" y="4"/>
      <point x="480" y="7" type="curve" smooth="yes"/>
      <point x="289" y="292" type="line"/>
      <point x="99" y="7" type="line" smooth="yes"/>
      <point x="97" y="4"/>
      <point x="91" y="0"/>
      <point x="87" y="0" type="curve" smooth="yes"/>
      <point x="79" y="0"/>
      <point x="73" y="6"/>
      <point x="73" y="14" type="curve" smooth="yes"/>
      <point x="73" y="16"/>
      <point x="74" y="20"/>
      <point x="75" y="22" type="curve" smooth="yes"/>
      <point x="272" y="318" type="line"/>
      <point x="75" y="614" type="line" smooth="yes"/>
      <point x="74" y="616"/>
      <point x="73" y="621"/>
      <point x="73" y="623" type="curve" smooth="yes"/>
      <point x="73" y="631"/>
      <point x="79" y="637"/>
    </contour>
  </outline>
  <lib>
    <dict>
      <key>com.fontlab.hintData</key>
      <dict>
        <key>hhints</key>
        <array>
          <dict>
            <key>position</key>
            <integer>0</integer>
            <key>width</key>
            <integer>23</integer>
          </dict>
          <dict>
            <key>position</key>
            <integer>615</integer>
            <key>width</key>
            <integer>22</integer>
          </dict>
        </array>
      </dict>
    </dict>
  </lib>
</glyph>
