<svg xmlns:dc="http://purl.org/dc/elements/1.1/" xmlns:cc="http://creativecommons.org/ns#" xmlns:rdf="http://www.w3.org/1999/02/22-rdf-syntax-ns#" xmlns:svg="http://www.w3.org/2000/svg" xmlns="http://www.w3.org/2000/svg" xmlns:sodipodi="http://sodipodi.sourceforge.net/DTD/sodipodi-0.dtd" xmlns:inkscape="http://www.inkscape.org/namespaces/inkscape" data-dec="339" id="dec_111" width="30" height="40" version="1.1" sodipodi:docname="339.svg" inkscape:version="0.92.2 5c3e80d, 2017-08-06">
  <metadata id="metadata9">
    <rdf:RDF>
      <cc:Work rdf:about="">
        <dc:format>image/svg+xml</dc:format>
        <dc:type rdf:resource="http://purl.org/dc/dcmitype/StillImage"/>
        <dc:title/>
      </cc:Work>
    </rdf:RDF>
  </metadata>
  <defs id="defs7"/>
  <sodipodi:namedview pagecolor="#ffffff" bordercolor="#666666" borderopacity="1" objecttolerance="10" gridtolerance="10" guidetolerance="10" inkscape:pageopacity="0" inkscape:pageshadow="2" inkscape:window-width="1364" inkscape:window-height="730" id="namedview5" showgrid="true" inkscape:zoom="8.4419264" inkscape:cx="4.537501" inkscape:cy="24.600602" inkscape:window-x="1920" inkscape:window-y="18" inkscape:window-maximized="0" inkscape:current-layer="dec_111" showguides="false">
    <inkscape:grid type="xygrid" id="grid838"/>
  </sodipodi:namedview>
  <path d="M 8,8 5,9 3,11 2,14 v 2 l 1,3 2,2 3,1 h 2 l 3,-1 2,-2 1,-3 V 14 L 15,11 13,9 10,8 H 8 m 8,6 H 28 V 12 L 27,10 26,9 24,8 h -3 l -2,1 -2,2 -1,3 v 2 l 1,3 2,2 2,1 h 3 l 2,-1 2,-2 " style="fill:none;stroke:#000000;stroke-width:1;stroke-linecap:round;stroke-linejoin:round" id="path2" inkscape:connector-curvature="0" sodipodi:nodetypes="ccccccccccccccccc"/>
</svg>