<svg xmlns:dc="http://purl.org/dc/elements/1.1/" xmlns:cc="http://creativecommons.org/ns#" xmlns:rdf="http://www.w3.org/1999/02/22-rdf-syntax-ns#" xmlns:svg="http://www.w3.org/2000/svg" xmlns="http://www.w3.org/2000/svg" xmlns:sodipodi="http://sodipodi.sourceforge.net/DTD/sodipodi-0.dtd" xmlns:inkscape="http://www.inkscape.org/namespaces/inkscape" data-dec="80" id="dec_80" width="20" height="40" version="1.1" sodipodi:docname="80.svg" inkscape:version="0.92.2 5c3e80d, 2017-08-06">
  <metadata id="metadata9">
    <rdf:RDF>
      <cc:Work rdf:about="">
        <dc:format>image/svg+xml</dc:format>
        <dc:type rdf:resource="http://purl.org/dc/dcmitype/StillImage"/>
      </cc:Work>
    </rdf:RDF>
  </metadata>
  <defs id="defs7"/>
  <sodipodi:namedview pagecolor="#ffffff" bordercolor="#666666" borderopacity="1" objecttolerance="10" gridtolerance="10" guidetolerance="10" inkscape:pageopacity="0" inkscape:pageshadow="2" inkscape:window-width="1432" inkscape:window-height="857" id="namedview5" showgrid="true" inkscape:zoom="16.68772" inkscape:cx="5.985223" inkscape:cy="29.243765" inkscape:window-x="0" inkscape:window-y="841" inkscape:window-maximized="0" inkscape:current-layer="dec_80">
    <inkscape:grid type="xygrid" id="grid11"/>
  </sodipodi:namedview>
  <path id="path13" style="fill:none;stroke:#000000;stroke-width:1;stroke-linecap:round;stroke-linejoin:round" d="M 6,3 V 22 H 4 m 9,-21 3,1 1,1 1,2 v 3 l -1,2 -1,1 -2,1 H 6 M 6,3 h 8 l 2,1 v 5 l -2,1 H 6 M 4,1 V 22 M 5,2 V 21 M 4,1 h 9 m 1,11 H 6 M 5,2 h 8 l 3,1 1,2 v 3 l -1,2 -2,1 H 5 "/>
</svg>