<?xml version="1.0" encoding="UTF-8" standalone="no"?>
<svg
   xmlns:dc="http://purl.org/dc/elements/1.1/"
   xmlns:cc="http://creativecommons.org/ns#"
   xmlns:rdf="http://www.w3.org/1999/02/22-rdf-syntax-ns#"
   xmlns:svg="http://www.w3.org/2000/svg"
   xmlns="http://www.w3.org/2000/svg"
   xmlns:sodipodi="http://sodipodi.sourceforge.net/DTD/sodipodi-0.dtd"
   xmlns:inkscape="http://www.inkscape.org/namespaces/inkscape"
   data-dec="109"
   width="34"
   height="40"
   version="1.1"
   id="svg4"
   sodipodi:docname="109.svg"
   inkscape:version="0.92.4 (unknown)">
  <metadata
     id="metadata10">
    <rdf:RDF>
      <cc:Work
         rdf:about="">
        <dc:format>image/svg+xml</dc:format>
        <dc:type
           rdf:resource="http://purl.org/dc/dcmitype/StillImage" />
      </cc:Work>
    </rdf:RDF>
  </metadata>
  <defs
     id="defs8" />
  <sodipodi:namedview
     pagecolor="#ffffff"
     bordercolor="#666666"
     borderopacity="1"
     objecttolerance="10"
     gridtolerance="10"
     guidetolerance="10"
     inkscape:pageopacity="0"
     inkscape:pageshadow="2"
     inkscape:window-width="640"
     inkscape:window-height="480"
     id="namedview6"
     showgrid="false"
     inkscape:zoom="5.9"
     inkscape:cx="17"
     inkscape:cy="20"
     inkscape:window-x="0"
     inkscape:window-y="27"
     inkscape:window-maximized="0"
     inkscape:current-layer="svg4" />
  <path
     style="color:#000000;font-style:normal;font-variant:normal;font-weight:normal;font-stretch:normal;font-size:medium;line-height:normal;font-family:sans-serif;font-variant-ligatures:normal;font-variant-position:normal;font-variant-caps:normal;font-variant-numeric:normal;font-variant-alternates:normal;font-feature-settings:normal;text-indent:0;text-align:start;text-decoration:none;text-decoration-line:none;text-decoration-style:solid;text-decoration-color:#000000;letter-spacing:normal;word-spacing:normal;text-transform:none;writing-mode:lr-tb;direction:ltr;text-orientation:mixed;dominant-baseline:auto;baseline-shift:baseline;text-anchor:start;white-space:normal;shape-padding:0;clip-rule:nonzero;display:inline;overflow:visible;visibility:visible;opacity:1;isolation:auto;mix-blend-mode:normal;color-interpolation:sRGB;color-interpolation-filters:linearRGB;solid-color:#000000;solid-opacity:1;vector-effect:none;fill:#013272;fill-opacity:1;fill-rule:nonzero;stroke:none;stroke-width:0.30000001;stroke-linecap:round;stroke-linejoin:round;stroke-miterlimit:4;stroke-dasharray:none;stroke-dashoffset:0;stroke-opacity:1;color-rendering:auto;image-rendering:auto;shape-rendering:auto;text-rendering:auto;enable-background:accumulate"
     d="m 17.849609,12.224609 -0.703125,2.8125 a 0.15001501,0.15001501 0 0 1 -0.002,0.0039 l -1.945312,6.808593 h 0.683593 l 1.966797,-7.867187 z m -10.9999996,0 -0.703125,2.8125 a 0.15001501,0.15001501 0 0 1 -0.00195,0.0039 l -1.9453124,6.808593 h 0.6835937 l 1.9667969,-7.867187 z m 21.9999996,-0.445312 -1.699218,4.25 v 2.935547 l 0.699218,1.40039 v -1.347656 a 0.15001501,0.15001501 0 0 1 0,-0.0293 V 17 a 0.15001501,0.15001501 0 0 1 0.0039,-0.03711 l 0.996093,-3.980469 z m 0.300782,-2.1445314 v 1.3476564 a 0.15001501,0.15001501 0 0 1 0,0.0293 V 13 a 0.15001501,0.15001501 0 0 1 -0.0039,0.03711 l -0.996093,3.980469 v 1.203125 l 1.699218,-4.25 v -2.935547 z m -11,0 v 1.3574224 a 0.15001501,0.15001501 0 0 1 0,0.01367 V 14 a 0.15001501,0.15001501 0 0 1 -0.0039,0.03711 l -1.953125,7.8125 h 0.689453 l 1.966797,-7.863281 a 0.15001501,0.15001501 0 0 1 0,-0.0039 v -2.947266 z m -11.0000004,0 v 1.3574224 a 0.15001501,0.15001501 0 0 1 0,0.01367 V 14 a 0.15001501,0.15001501 0 0 1 -0.00391,0.03711 l -1.953125,7.8125 h 0.6894531 l 1.9667969,-7.863281 a 0.15001501,0.15001501 0 0 1 0,-0.0039 V 11.035156 Z M 3.984375,7.8496094 a 0.15001501,0.15001501 0 0 1 0.015625,0 h 2 a 0.15001501,0.15001501 0 0 1 0.1054688,0.044922 l 0.9765624,0.9785157 a 0.15001501,0.15001501 0 0 1 0.00391,0.00195 0.15001501,0.15001501 0 0 1 0.019531,0.017578 v 0.00195 a 0.15001501,0.15001501 0 0 1 0.00195,0.00195 0.15001501,0.15001501 0 0 1 0.019531,0.023437 0.15001501,0.15001501 0 0 1 0.00586,0.00781 0.15001501,0.15001501 0 0 1 0.00195,0.00586 0.15001501,0.15001501 0 0 1 0.00977,0.021484 L 8.1347656,10.933594 A 0.15001501,0.15001501 0 0 1 8.1503906,11 v 2.503906 L 9.875,10.916016 a 0.15001501,0.15001501 0 0 1 0.019531,-0.02149 L 11.894531,8.8945312 a 0.15001501,0.15001501 0 0 1 0.03906,-0.029297 l 2,-1 A 0.15001501,0.15001501 0 0 1 14,7.8496094 h 2 a 0.15001501,0.15001501 0 0 1 0.06641,0.015625 l 1.976563,0.9882812 a 0.15001501,0.15001501 0 0 1 0.01367,0.00586 0.15001501,0.15001501 0 0 1 0.04883,0.033203 0.15001501,0.15001501 0 0 1 0.002,0.00391 0.15001501,0.15001501 0 0 1 0.01953,0.023437 0.15001501,0.15001501 0 0 1 0.0059,0.00781 0.15001501,0.15001501 0 0 1 0.002,0.00586 0.15001501,0.15001501 0 0 1 0.0098,0.021484 l 0.990235,1.9785159 A 0.15001501,0.15001501 0 0 1 19.150391,11 v 2.503906 L 20.875,10.916016 a 0.15001501,0.15001501 0 0 1 0.01953,-0.02149 l 2,-1.9999998 a 0.15001501,0.15001501 0 0 1 0.03906,-0.029297 l 2,-1 A 0.15001501,0.15001501 0 0 1 25,7.8496094 h 2 a 0.15001501,0.15001501 0 0 1 0.06641,0.015625 l 1.976563,0.9882812 a 0.15001501,0.15001501 0 0 1 0.01367,0.00586 0.15001501,0.15001501 0 0 1 0.04883,0.033203 0.15001501,0.15001501 0 0 1 0.002,0.00391 0.15001501,0.15001501 0 0 1 0.01953,0.023437 0.15001501,0.15001501 0 0 1 0.0059,0.00781 0.15001501,0.15001501 0 0 1 0.002,0.00586 0.15001501,0.15001501 0 0 1 0.0098,0.021484 l 0.990235,1.9785159 A 0.15001501,0.15001501 0 0 1 30.150391,11 v 3 a 0.15001501,0.15001501 0 0 1 -0.01172,0.05664 l -1.988281,4.970703 v 1.912109 l 0.912109,0.910156 h 1.875 l 1.939453,-1.9375 0.988281,-1.978515 a 0.15023858,0.15023858 0 1 1 0.269532,0.132812 l -1,2 a 0.15001501,0.15001501 0 0 1 -0.0293,0.03906 l -2,2 A 0.15001501,0.15001501 0 0 1 31,22.150391 h -2 a 0.15001501,0.15001501 0 0 1 -0.105469,-0.04492 l -0.976562,-0.978516 a 0.15001501,0.15001501 0 0 1 -0.0039,-0.002 0.15001501,0.15001501 0 0 1 -0.01953,-0.01758 0.15001501,0.15001501 0 0 1 0,-0.002 0.15001501,0.15001501 0 0 1 -0.002,-0.002 0.15001501,0.15001501 0 0 1 -0.01953,-0.02344 0.15001501,0.15001501 0 0 1 -0.0059,-0.0078 0.15001501,0.15001501 0 0 1 -0.002,-0.0059 l -0.0039,-0.0078 a 0.15001501,0.15001501 0 0 1 -0.0059,-0.01367 L 26.865234,19.066406 A 0.15001501,0.15001501 0 0 1 26.849609,19 v -3 a 0.15001501,0.15001501 0 0 1 0.01172,-0.05664 l 1.988281,-4.970703 V 9.0917969 L 26.964844,8.1503906 h -1.929688 l -1.947265,0.9726563 -1.970703,1.9726561 -1.976563,2.964844 -1.988281,7.953125 a 0.15001501,0.15001501 0 0 1 -0.02148,0.06055 0.15001501,0.15001501 0 0 1 -0.0039,0.0078 0.15001501,0.15001501 0 0 1 -0.01367,0.01758 0.15001501,0.15001501 0 0 1 -0.0059,0.0059 0.15001501,0.15001501 0 0 1 -0.0039,0.0039 0.15001501,0.15001501 0 0 1 -0.0059,0.0059 0.15001501,0.15001501 0 0 1 -0.0059,0.0039 0.15001501,0.15001501 0 0 1 -0.0059,0.0059 0.15001501,0.15001501 0 0 1 -0.0059,0.0039 0.15001501,0.15001501 0 0 1 -0.0078,0.0039 0.15001501,0.15001501 0 0 1 -0.02734,0.01172 0.15001501,0.15001501 0 0 1 -0.06445,0.0059 h -0.955078 a 0.15001501,0.15001501 0 0 1 -0.04492,0 H 15 a 0.15001501,0.15001501 0 0 1 -0.144531,-0.191407 l 2,-6.998046 0.99414,-3.982422 V 9.0917969 L 15.964844,8.1503906 h -1.929688 l -1.947265,0.9726563 -1.970703,1.9726561 -1.976563,2.964844 -1.9882812,7.953125 a 0.15001501,0.15001501 0 0 1 -0.021484,0.06055 0.15001501,0.15001501 0 0 1 -0.00391,0.0078 0.15001501,0.15001501 0 0 1 -0.013672,0.01758 0.15001501,0.15001501 0 0 1 -0.00586,0.0059 0.15001501,0.15001501 0 0 1 -0.00391,0.0039 0.15001501,0.15001501 0 0 1 -0.00586,0.0059 0.15001501,0.15001501 0 0 1 -0.00586,0.0039 0.15001501,0.15001501 0 0 1 -0.00586,0.0059 0.15001501,0.15001501 0 0 1 -0.00586,0.0039 0.15001501,0.15001501 0 0 1 -0.00781,0.0039 0.15001501,0.15001501 0 0 1 -0.027344,0.01172 0.15001501,0.15001501 0 0 1 -0.064453,0.0059 H 5.0253906 a 0.15001501,0.15001501 0 0 1 -0.044922,0 H 4 A 0.15001501,0.15001501 0 0 1 3.8554688,21.958984 l 2,-6.998046 0.9941406,-3.982422 V 9.0605469 L 5.9375,8.1503906 H 4.0625 L 2.1230469,10.087891 1.1347656,12.066406 A 0.15023823,0.15023823 0 1 1 0.86523438,11.933594 L 1.8652344,9.9335938 a 0.15001501,0.15001501 0 0 1 0.029297,-0.039063 l 2,-2 a 0.15001501,0.15001501 0 0 1 0.089844,-0.044922 z"
     id="path2" />
</svg>
