<?xml version="1.0" encoding="UTF-8" standalone="no"?>
<svg
   xmlns:dc="http://purl.org/dc/elements/1.1/"
   xmlns:cc="http://creativecommons.org/ns#"
   xmlns:rdf="http://www.w3.org/1999/02/22-rdf-syntax-ns#"
   xmlns:svg="http://www.w3.org/2000/svg"
   xmlns="http://www.w3.org/2000/svg"
   xmlns:sodipodi="http://sodipodi.sourceforge.net/DTD/sodipodi-0.dtd"
   xmlns:inkscape="http://www.inkscape.org/namespaces/inkscape"
   data-dec="64"
   width="12"
   height="40"
   version="1.1"
   id="svg4"
   sodipodi:docname="64.svg"
   inkscape:version="0.92.4 5da689c313, 2019-01-14">
  <metadata
     id="metadata10">
    <rdf:RDF>
      <cc:Work
         rdf:about="">
        <dc:format>image/svg+xml</dc:format>
        <dc:type
           rdf:resource="http://purl.org/dc/dcmitype/StillImage" />
        <dc:title></dc:title>
      </cc:Work>
    </rdf:RDF>
  </metadata>
  <defs
     id="defs8" />
  <sodipodi:namedview
     pagecolor="#ffffff"
     bordercolor="#666666"
     borderopacity="1"
     objecttolerance="10"
     gridtolerance="10"
     guidetolerance="10"
     inkscape:pageopacity="0"
     inkscape:pageshadow="2"
     inkscape:window-width="1920"
     inkscape:window-height="1043"
     id="namedview6"
     showgrid="false"
     inkscape:zoom="5.9"
     inkscape:cx="6"
     inkscape:cy="20"
     inkscape:window-x="0"
     inkscape:window-y="37"
     inkscape:window-maximized="0"
     inkscape:current-layer="svg4" />
  <path
     style="color:#000000;font-style:normal;font-variant:normal;font-weight:normal;font-stretch:normal;font-size:medium;line-height:normal;font-family:sans-serif;font-variant-ligatures:normal;font-variant-position:normal;font-variant-caps:normal;font-variant-numeric:normal;font-variant-alternates:normal;font-feature-settings:normal;text-indent:0;text-align:start;text-decoration:none;text-decoration-line:none;text-decoration-style:solid;text-decoration-color:#000000;letter-spacing:normal;word-spacing:normal;text-transform:none;writing-mode:lr-tb;direction:ltr;text-orientation:mixed;dominant-baseline:auto;baseline-shift:baseline;text-anchor:start;white-space:normal;shape-padding:0;clip-rule:nonzero;display:inline;overflow:visible;visibility:visible;opacity:1;isolation:auto;mix-blend-mode:normal;color-interpolation:sRGB;color-interpolation-filters:linearRGB;solid-color:#000000;solid-opacity:1;vector-effect:none;fill:#000000;fill-opacity:1;fill-rule:nonzero;stroke:none;stroke-width:1.5;stroke-linecap:round;stroke-linejoin:round;stroke-miterlimit:4;stroke-dasharray:none;stroke-dashoffset:0;stroke-opacity:1;color-rendering:auto;image-rendering:auto;shape-rendering:auto;text-rendering:auto;enable-background:accumulate"
     d="M 5.4882812,6.75 4.9296875,7.4003906 4.5859375,8.2050781 4.1777344,11.052734 v 2.867188 L 4.5507812,15.65625 5.0585938,16.25 H 5.6542969 L 6.1640625,15.65625 6.5410156,13.902344 6.875,7.6308594 A 0.750075,0.750075 0 0 1 6.7167969,7.4882812 L 6.0839844,6.75 Z M 5.1425781,0.25 H 6.4277344 A 0.750075,0.750075 0 0 1 6.8886719,0.40820312 L 8.1738281,1.4082031 a 0.750075,0.750075 0 0 1 0.109375,0.1035157 l 0.8574219,1 a 0.750075,0.750075 0 0 1 0.1210938,0.1933593 l 0.8554692,2 a 0.750075,0.750075 0 0 1 0.04492,0.1386719 l 0.427735,2 a 0.750075,0.750075 0 0 1 0.0098,0.050781 l 0.427735,3 A 0.750075,0.750075 0 0 1 11.035156,10 v 2 a 0.750075,0.750075 0 0 1 -0.0078,0.105469 l -0.427735,3 a 0.750075,0.750075 0 0 1 -0.05273,0.189453 l -0.8574219,2 A 0.750075,0.750075 0 0 1 9,17.75 H 8.1425781 A 0.750075,0.750075 0 0 1 7.5742188,17.488281 L 7.0722656,16.902344 6.5703125,17.488281 A 0.750075,0.750075 0 0 1 6,17.75 H 4.7148438 A 0.750075,0.750075 0 0 1 4.1445312,17.488281 l -0.8574218,-1 A 0.750075,0.750075 0 0 1 3.1230469,16.15625 l -0.4277344,-2 A 0.750075,0.750075 0 0 1 2.6777344,14 v -3 a 0.750075,0.750075 0 0 1 0.00781,-0.105469 L 3.1152344,7.8945312 a 0.750075,0.750075 0 0 1 0.052734,-0.1894531 l 0.4277343,-1 A 0.750075,0.750075 0 0 1 3.7167969,6.5117188 l 0.8574219,-1 A 0.750075,0.750075 0 0 1 5.1425781,5.25 h 1.2851563 a 0.750075,0.750075 0 0 1 0.5703125,0.2617188 l 0.076172,0.089844 A 0.750075,0.750075 0 0 1 8.4628906,6.0410156 L 8.0371094,13.992188 a 0.750075,0.750075 0 0 1 -0.00195,0.02734 v 0.01367 1.689453 L 8.4882812,16.25 h 0.017578 l 0.6230468,-1.455078 0.40625,-2.847656 V 10.052734 L 9.1191406,7.1308594 8.7109375,5.2285156 7.9277344,3.4003906 7.1933594,2.5449219 6.171875,1.75 H 5.4003906 L 4.3769531,2.5449219 3.6445312,3.4003906 2.8613281,5.2285156 2.453125,7.1308594 2.0351562,10.052734 v 2.894532 l 0.4179688,2.921875 0.4082031,1.902343 0.7832031,1.828125 0.7324219,0.855469 L 5.4003906,21.25 H 6.171875 l 1.0214844,-0.794922 0.734375,-0.855469 0.3828125,-0.894531 a 0.750075,0.750075 0 1 1 1.3789062,0.589844 l -0.4277343,1 A 0.750075,0.750075 0 0 1 9.140625,20.488281 l -0.8574219,1 a 0.750075,0.750075 0 0 1 -0.109375,0.103516 l -1.2851562,1 A 0.750075,0.750075 0 0 1 6.4277344,22.75 H 5.1425781 A 0.750075,0.750075 0 0 1 4.6816406,22.591797 l -1.2851562,-1 a 0.750075,0.750075 0 0 1 -0.109375,-0.103516 l -0.8574219,-1 A 0.750075,0.750075 0 0 1 2.3105469,20.294922 l -0.8574219,-2 A 0.750075,0.750075 0 0 1 1.4101562,18.15625 l -0.42968745,-2 a 0.750075,0.750075 0 0 1 -0.007813,-0.05078 l -0.4296875,-3 A 0.750075,0.750075 0 0 1 0.53515625,13 v -3 a 0.750075,0.750075 0 0 1 0.007813,-0.1054688 l 0.4296875,-3 a 0.750075,0.750075 0 0 1 0.007813,-0.050781 l 0.42968745,-2 A 0.750075,0.750075 0 0 1 1.453125,4.7050781 l 0.8574219,-2 A 0.750075,0.750075 0 0 1 2.4296875,2.5117188 l 0.8574219,-1 A 0.750075,0.750075 0 0 1 3.3964844,1.4082031 L 4.6816406,0.40820312 A 0.750075,0.750075 0 0 1 5.1425781,0.25 Z"
     id="path2" />
</svg>
