<?xml version="1.0" encoding="UTF-8" standalone="no"?>
<svg
   xmlns:dc="http://purl.org/dc/elements/1.1/"
   xmlns:cc="http://creativecommons.org/ns#"
   xmlns:rdf="http://www.w3.org/1999/02/22-rdf-syntax-ns#"
   xmlns:svg="http://www.w3.org/2000/svg"
   xmlns="http://www.w3.org/2000/svg"
   xmlns:sodipodi="http://sodipodi.sourceforge.net/DTD/sodipodi-0.dtd"
   xmlns:inkscape="http://www.inkscape.org/namespaces/inkscape"
   data-dec="79"
   width="22"
   height="40"
   version="1.1"
   id="svg4"
   sodipodi:docname="79.svg"
   inkscape:version="0.92.4 (unknown)">
  <metadata
     id="metadata10">
    <rdf:RDF>
      <cc:Work
         rdf:about="">
        <dc:format>image/svg+xml</dc:format>
        <dc:type
           rdf:resource="http://purl.org/dc/dcmitype/StillImage" />
      </cc:Work>
    </rdf:RDF>
  </metadata>
  <defs
     id="defs8" />
  <sodipodi:namedview
     pagecolor="#ffffff"
     bordercolor="#666666"
     borderopacity="1"
     objecttolerance="10"
     gridtolerance="10"
     guidetolerance="10"
     inkscape:pageopacity="0"
     inkscape:pageshadow="2"
     inkscape:window-width="640"
     inkscape:window-height="480"
     id="namedview6"
     showgrid="false"
     inkscape:zoom="5.9"
     inkscape:cx="11"
     inkscape:cy="20"
     inkscape:window-x="0"
     inkscape:window-y="27"
     inkscape:window-maximized="0"
     inkscape:current-layer="svg4" />
  <path
     style="color:#000000;font-style:normal;font-variant:normal;font-weight:normal;font-stretch:normal;font-size:medium;line-height:normal;font-family:sans-serif;font-variant-ligatures:normal;font-variant-position:normal;font-variant-caps:normal;font-variant-numeric:normal;font-variant-alternates:normal;font-feature-settings:normal;text-indent:0;text-align:start;text-decoration:none;text-decoration-line:none;text-decoration-style:solid;text-decoration-color:#000000;letter-spacing:normal;word-spacing:normal;text-transform:none;writing-mode:lr-tb;direction:ltr;text-orientation:mixed;dominant-baseline:auto;baseline-shift:baseline;text-anchor:start;white-space:normal;shape-padding:0;clip-rule:nonzero;display:inline;overflow:visible;visibility:visible;opacity:1;isolation:auto;mix-blend-mode:normal;color-interpolation:sRGB;color-interpolation-filters:linearRGB;solid-color:#000000;solid-opacity:1;vector-effect:none;fill:#013272;fill-opacity:1;fill-rule:nonzero;stroke:none;stroke-width:1.5;stroke-linecap:round;stroke-linejoin:round;stroke-miterlimit:4;stroke-dasharray:none;stroke-dashoffset:0;stroke-opacity:1;color-rendering:auto;image-rendering:auto;shape-rendering:auto;text-rendering:auto;enable-background:accumulate"
     d="M 12.175781,1.75 10.443359,2.6171875 8.5820312,4.4785156 6.6796875,7.3320312 5.7207031,10.208984 4.75,14.091797 v 2.787109 L 5.65625,19.595703 7.3125,21.25 h 2.5117188 l 1.7324222,-0.867188 1.861328,-1.861328 1.902343,-2.853515 0.958985,-2.876953 L 17.25,8.9082031 V 6.1210938 L 16.34375,3.4042969 14.6875,1.75 Z m 2.816407,-1.5078125 a 0.750075,0.750075 0 0 1 0.396484,0.11328125 L 17.335938,1.3300781 A 0.750075,0.750075 0 0 1 17.53125,1.46875 l 1,1 a 0.750075,0.750075 0 0 1 0.179688,0.2949219 l 1,3 A 0.750075,0.750075 0 0 1 19.75,6 v 3 a 0.750075,0.750075 0 0 1 -0.02148,0.1816406 l -1,4.0000004 a 0.750075,0.750075 0 0 1 -0.01758,0.05469 l -1,3 A 0.750075,0.750075 0 0 1 17.625,16.416016 l -2,3 a 0.750075,0.750075 0 0 1 -0.09375,0.115234 l -2,2 a 0.750075,0.750075 0 0 1 -0.294922,0.179688 l -2.949219,0.982421 a 0.750075,0.750075 0 0 1 -0.01758,0.0059 l -0.0332,0.01172 a 0.750075,0.750075 0 0 1 -0.01563,0.0059 A 0.750075,0.750075 0 0 1 9.9101562,22.75 H 7.1074219 A 0.750075,0.750075 0 0 1 6.6113281,22.644531 L 4.6640625,21.669922 A 0.750075,0.750075 0 0 1 4.46875,21.53125 l -1,-1 A 0.750075,0.750075 0 0 1 3.2890625,20.236328 l -1,-3 A 0.750075,0.750075 0 0 1 2.25,17 v -3 a 0.750075,0.750075 0 0 1 0.021484,-0.181641 l 1,-3.9999996 a 0.750075,0.750075 0 0 1 0.017578,-0.054687 l 1,-3 A 0.750075,0.750075 0 0 1 4.375,6.5839844 l 2,-3 A 0.750075,0.750075 0 0 1 6.46875,3.46875 l 2,-2 A 0.750075,0.750075 0 0 1 8.7636719,1.2890625 L 11.681641,0.31640625 a 0.750075,0.750075 0 0 1 0.09961,-0.0351563 0.750075,0.750075 0 0 1 0.03125,-0.007813 0.750075,0.750075 0 0 1 0.0039,-0.001953 0.750075,0.750075 0 0 1 0.03516,-0.007813 0.750075,0.750075 0 0 1 0.04688,-0.007813 0.750075,0.750075 0 0 1 0.05859,-0.007813 0.750075,0.750075 0 0 1 0.0039,0 0.750075,0.750075 0 0 1 0.04297,-0.001953 0.750075,0.750075 0 0 1 0.04102,0.001953 0.750075,0.750075 0 0 1 0.04492,0.001953 h 2.802734 a 0.750075,0.750075 0 0 1 0.09961,-0.007813 z"
     id="path2" />
</svg>
