<?xml version="1.0" encoding="UTF-8" standalone="no"?>
<svg
   xmlns:dc="http://purl.org/dc/elements/1.1/"
   xmlns:cc="http://creativecommons.org/ns#"
   xmlns:rdf="http://www.w3.org/1999/02/22-rdf-syntax-ns#"
   xmlns:svg="http://www.w3.org/2000/svg"
   xmlns="http://www.w3.org/2000/svg"
   xmlns:sodipodi="http://sodipodi.sourceforge.net/DTD/sodipodi-0.dtd"
   xmlns:inkscape="http://www.inkscape.org/namespaces/inkscape"
   data-dec="180"
   width="12"
   height="40"
   version="1.1"
   id="svg4"
   sodipodi:docname="180.svg"
   inkscape:version="0.92.4 (unknown)">
  <metadata
     id="metadata10">
    <rdf:RDF>
      <cc:Work
         rdf:about="">
        <dc:format>image/svg+xml</dc:format>
        <dc:type
           rdf:resource="http://purl.org/dc/dcmitype/StillImage" />
      </cc:Work>
    </rdf:RDF>
  </metadata>
  <defs
     id="defs8" />
  <sodipodi:namedview
     pagecolor="#ffffff"
     bordercolor="#666666"
     borderopacity="1"
     objecttolerance="10"
     gridtolerance="10"
     guidetolerance="10"
     inkscape:pageopacity="0"
     inkscape:pageshadow="2"
     inkscape:window-width="640"
     inkscape:window-height="480"
     id="namedview6"
     showgrid="false"
     inkscape:zoom="5.9"
     inkscape:cx="6"
     inkscape:cy="20"
     inkscape:window-x="0"
     inkscape:window-y="27"
     inkscape:window-maximized="0"
     inkscape:current-layer="svg4" />
  <path
     style="color:#000000;font-style:normal;font-variant:normal;font-weight:normal;font-stretch:normal;font-size:medium;line-height:normal;font-family:sans-serif;font-variant-ligatures:normal;font-variant-position:normal;font-variant-caps:normal;font-variant-numeric:normal;font-variant-alternates:normal;font-feature-settings:normal;text-indent:0;text-align:start;text-decoration:none;text-decoration-line:none;text-decoration-style:solid;text-decoration-color:#000000;letter-spacing:normal;word-spacing:normal;text-transform:none;writing-mode:lr-tb;direction:ltr;text-orientation:mixed;dominant-baseline:auto;baseline-shift:baseline;text-anchor:start;white-space:normal;shape-padding:0;clip-rule:nonzero;display:inline;overflow:visible;visibility:visible;opacity:1;isolation:auto;mix-blend-mode:normal;color-interpolation:sRGB;color-interpolation-filters:linearRGB;solid-color:#000000;solid-opacity:1;vector-effect:none;fill:#013272;fill-opacity:1;fill-rule:nonzero;stroke:none;stroke-width:2;stroke-linecap:round;stroke-linejoin:round;stroke-miterlimit:4;stroke-dasharray:none;stroke-dashoffset:0;stroke-opacity:1;color-rendering:auto;image-rendering:auto;shape-rendering:auto;text-rendering:auto;enable-background:accumulate"
     d="M 7.9882812,-0.01171875 A 1.0001,1.0001 0 0 1 8.8222656,0.40820312 L 9.7070312,1.2929688 A 1.0001,1.0001 0 0 1 9.640625,2.7675781 L 3.6699219,7.7421875 A 1.0001,1.0001 0 0 1 3.5859375,7.8125 1.0001,1.0001 0 0 1 3.1269531,8 1.0001,1.0001 0 0 1 2.9277344,8.0078125 1.0001,1.0001 0 0 1 2.828125,7.9960938 1.0001,1.0001 0 0 1 2.6445312,7.9472656 a 1.0001,1.0001 0 0 1 -0.011719,-0.00391 1.0001,1.0001 0 0 1 -0.087891,-0.039063 1.0001,1.0001 0 0 1 -0.087891,-0.048828 1.0001,1.0001 0 0 1 -0.013672,-0.00781 1.0001,1.0001 0 0 1 -0.039063,-0.029297 1.0001,1.0001 0 0 1 -0.037109,-0.027344 1.0001,1.0001 0 0 1 -0.068359,-0.058594 1.0001,1.0001 0 0 1 -0.054687,-0.058594 1.0001,1.0001 0 0 1 -0.017578,-0.019531 1.0001,1.0001 0 0 1 -0.033203,-0.042969 1.0001,1.0001 0 0 1 -0.027344,-0.035156 1.0001,1.0001 0 0 1 -0.013672,-0.021484 1.0001,1.0001 0 0 1 -0.085938,-0.1621094 1.0001,1.0001 0 0 1 -0.033203,-0.09375 1.0001,1.0001 0 0 1 -0.023437,-0.097656 1.0001,1.0001 0 0 1 -0.015625,-0.099609 1.0001,1.0001 0 0 1 0.017578,-0.2949219 1.0001,1.0001 0 0 1 0.00195,-0.00977 1.0001,1.0001 0 0 1 0.1035156,-0.2734375 1.0001,1.0001 0 0 1 0.052734,-0.083984 1.0001,1.0001 0 0 1 0.0625,-0.080078 l 0.019531,-0.023437 4.875,-5.8515625 A 1.0001,1.0001 0 0 1 7.9375,-0.0078125 1.0001,1.0001 0 0 1 7.9882812,-0.01171875 Z"
     id="path2" />
</svg>
