<?xml version="1.0" encoding="UTF-8" standalone="no"?>
<svg
   xmlns:dc="http://purl.org/dc/elements/1.1/"
   xmlns:cc="http://creativecommons.org/ns#"
   xmlns:rdf="http://www.w3.org/1999/02/22-rdf-syntax-ns#"
   xmlns:svg="http://www.w3.org/2000/svg"
   xmlns="http://www.w3.org/2000/svg"
   xmlns:sodipodi="http://sodipodi.sourceforge.net/DTD/sodipodi-0.dtd"
   xmlns:inkscape="http://www.inkscape.org/namespaces/inkscape"
   data-dec="71"
   width="24"
   height="40"
   version="1.1"
   id="svg4"
   sodipodi:docname="71.svg"
   inkscape:version="0.92.4 (unknown)">
  <metadata
     id="metadata10">
    <rdf:RDF>
      <cc:Work
         rdf:about="">
        <dc:format>image/svg+xml</dc:format>
        <dc:type
           rdf:resource="http://purl.org/dc/dcmitype/StillImage" />
      </cc:Work>
    </rdf:RDF>
  </metadata>
  <defs
     id="defs8" />
  <sodipodi:namedview
     pagecolor="#ffffff"
     bordercolor="#666666"
     borderopacity="1"
     objecttolerance="10"
     gridtolerance="10"
     guidetolerance="10"
     inkscape:pageopacity="0"
     inkscape:pageshadow="2"
     inkscape:window-width="640"
     inkscape:window-height="480"
     id="namedview6"
     showgrid="false"
     inkscape:zoom="5.9"
     inkscape:cx="12"
     inkscape:cy="20"
     inkscape:window-x="0"
     inkscape:window-y="27"
     inkscape:window-maximized="0"
     inkscape:current-layer="svg4" />
  <path
     style="color:#000000;font-style:normal;font-variant:normal;font-weight:normal;font-stretch:normal;font-size:medium;line-height:normal;font-family:sans-serif;font-variant-ligatures:normal;font-variant-position:normal;font-variant-caps:normal;font-variant-numeric:normal;font-variant-alternates:normal;font-feature-settings:normal;text-indent:0;text-align:start;text-decoration:none;text-decoration-line:none;text-decoration-style:solid;text-decoration-color:#000000;letter-spacing:normal;word-spacing:normal;text-transform:none;writing-mode:lr-tb;direction:ltr;text-orientation:mixed;dominant-baseline:auto;baseline-shift:baseline;text-anchor:start;white-space:normal;shape-padding:0;clip-rule:nonzero;display:inline;overflow:visible;visibility:visible;opacity:1;isolation:auto;mix-blend-mode:normal;color-interpolation:sRGB;color-interpolation-filters:linearRGB;solid-color:#000000;solid-opacity:1;vector-effect:none;fill:#013272;fill-opacity:1;fill-rule:nonzero;stroke:none;stroke-width:2;stroke-linecap:round;stroke-linejoin:round;stroke-miterlimit:4;stroke-dasharray:none;stroke-dashoffset:0;stroke-opacity:1;color-rendering:auto;image-rendering:auto;shape-rendering:auto;text-rendering:auto;enable-background:accumulate"
     d="M 12.003906,-0.00585938 A 1.0001,1.0001 0 0 1 12.119141,0 H 15 a 1.0001,1.0001 0 0 1 0.447266,0.10546875 l 2,1.00000005 a 1.0001,1.0001 0 0 1 0.259765,0.1875 l 0.685547,0.6855468 0.712891,-1.42578122 a 1.0001,1.0001 0 0 1 1.880859,0.61132812 l -1,6 A 1.0001,1.0001 0 0 1 18,7 V 5.2363281 L 17.177734,3.5917969 16.408203,2.8222656 14.763672,2 H 12.236328 L 10.685547,2.7753906 8.8671875,5.5019531 7.9257812,7.3828125 6.9609375,10.279297 6,14.123047 v 4.640625 L 6.7460938,20.253906 8.2363281,21 H 9.7636719 L 11.314453,20.224609 13.09375,17.556641 13.445312,16.5 13.380859,16.308594 12.763672,16 H 12 a 1.0001,1.0001 0 1 1 0,-2 h 0.890625 a 1.0001,1.0001 0 0 1 0.203125,0 h 0.744141 a 1.0001,1.0001 0 0 1 0.320312,0 h 0.691406 a 1.0001,1.0001 0 0 1 0.310547,0 h 0.689453 a 1.0001,1.0001 0 0 1 0.310547,0 h 0.685547 a 1.0001,1.0001 0 0 1 0.318359,0 h 0.705079 a 1.0001,1.0001 0 0 1 0.277343,0 h 0.783204 a 1.0001,1.0001 0 0 1 0.167968,0 H 20 a 1.0001,1.0001 0 1 1 0,2 h -0.835938 l -1.125,0.375 -1.216796,1.216797 -0.927735,1.855469 a 1.0001,1.0001 0 0 1 -0.1875,0.259765 l -2,2 a 1.0001,1.0001 0 0 1 -0.390625,0.242188 l -2.99414,0.998047 -0.0059,0.002 A 1.0001,1.0001 0 0 1 9.8808594,23 H 8.109375 a 1.0001,1.0001 0 0 1 -0.4257812,-0.05078 l -0.039063,-0.01367 -2.9609374,-0.986328 a 1.0001,1.0001 0 0 1 -0.390625,-0.242188 l -1,-1 A 1.0001,1.0001 0 0 1 3.0507812,20.316406 l -1,-3 A 1.0001,1.0001 0 0 1 2,17 v -3 a 1.0001,1.0001 0 0 1 0.029297,-0.242188 l 1,-3.9999995 a 1.0001,1.0001 0 0 1 0.021484,-0.074219 l 1,-3 A 1.0001,1.0001 0 0 1 4.1679688,6.4453125 l 2,-3 a 1.0001,1.0001 0 0 1 0.125,-0.1523437 l 2,-2 A 1.0001,1.0001 0 0 1 8.6835938,1.0507812 L 11.677734,0.05273437 a 1.0001,1.0001 0 0 1 0.0059,-0.0019531 1.0001,1.0001 0 0 1 0.320312,-0.05664063 z"
     id="path2" />
</svg>
