<?xml version="1.0" encoding="UTF-8" standalone="no"?>
<svg
   xmlns:dc="http://purl.org/dc/elements/1.1/"
   xmlns:cc="http://creativecommons.org/ns#"
   xmlns:rdf="http://www.w3.org/1999/02/22-rdf-syntax-ns#"
   xmlns:svg="http://www.w3.org/2000/svg"
   xmlns="http://www.w3.org/2000/svg"
   xmlns:sodipodi="http://sodipodi.sourceforge.net/DTD/sodipodi-0.dtd"
   xmlns:inkscape="http://www.inkscape.org/namespaces/inkscape"
   data-dec="339"
   width="29"
   height="40"
   version="1.1"
   id="svg4"
   sodipodi:docname="339.svg"
   inkscape:version="0.92.2 2405546, 2018-03-11">
  <metadata
     id="metadata10">
    <rdf:RDF>
      <cc:Work
         rdf:about="">
        <dc:format>image/svg+xml</dc:format>
        <dc:type
           rdf:resource="http://purl.org/dc/dcmitype/StillImage" />
        <dc:title></dc:title>
      </cc:Work>
    </rdf:RDF>
  </metadata>
  <defs
     id="defs8" />
  <sodipodi:namedview
     pagecolor="#ffffff"
     bordercolor="#666666"
     borderopacity="1"
     objecttolerance="10"
     gridtolerance="10"
     guidetolerance="10"
     inkscape:pageopacity="0"
     inkscape:pageshadow="2"
     inkscape:window-width="640"
     inkscape:window-height="480"
     id="namedview6"
     showgrid="false"
     inkscape:zoom="5.9"
     inkscape:cx="14.5"
     inkscape:cy="20"
     inkscape:window-x="0"
     inkscape:window-y="17"
     inkscape:window-maximized="0"
     inkscape:current-layer="svg4" />
  <path
     style="color:#000000;font-style:normal;font-variant:normal;font-weight:normal;font-stretch:normal;font-size:medium;line-height:normal;font-family:sans-serif;font-variant-ligatures:normal;font-variant-position:normal;font-variant-caps:normal;font-variant-numeric:normal;font-variant-alternates:normal;font-feature-settings:normal;text-indent:0;text-align:start;text-decoration:none;text-decoration-line:none;text-decoration-style:solid;text-decoration-color:#000000;letter-spacing:normal;word-spacing:normal;text-transform:none;writing-mode:lr-tb;direction:ltr;text-orientation:mixed;dominant-baseline:auto;baseline-shift:baseline;text-anchor:start;white-space:normal;shape-padding:0;clip-rule:nonzero;display:inline;overflow:visible;visibility:visible;opacity:1;isolation:auto;mix-blend-mode:normal;color-interpolation:sRGB;color-interpolation-filters:linearRGB;solid-color:#000000;solid-opacity:1;vector-effect:none;fill:#013272;fill-opacity:1;fill-rule:nonzero;stroke:none;stroke-width:2;stroke-linecap:round;stroke-linejoin:round;stroke-miterlimit:4;stroke-dasharray:none;stroke-dashoffset:0;stroke-opacity:1;color-rendering:auto;image-rendering:auto;shape-rendering:auto;text-rendering:auto;enable-background:accumulate"
     d="M 20.236328,9 18.591797,9.8222656 16.875,11.541016 16.054688,14 H 25 V 13 12.236328 L 24.177734,10.591797 23.408203,9.8222656 21.763672,9 Z M 8.2363281,9 6.5917969,9.8222656 4.875,11.541016 4,14.162109 v 1.675782 l 0.875,2.621093 1.7167969,1.71875 L 8.2363281,21 H 9.7636719 L 11.408203,20.177734 13.125,18.458984 14,15.837891 v -0.679688 a 1.0001,1.0001 0 0 1 0,-0.326172 V 14.162109 L 13.125,11.541016 11.408203,9.8222656 9.7636719,9 Z M 8.0039062,6.9941406 A 1.0001,1.0001 0 0 1 8.1191406,7 H 10 a 1.0001,1.0001 0 0 1 0.447266,0.1054688 l 2,1 a 1.0001,1.0001 0 0 1 0.259765,0.1875 l 2,2.0000002 a 1.0001,1.0001 0 0 1 0.242188,0.390625 L 15,10.835938 l 0.05078,-0.152344 a 1.0001,1.0001 0 0 1 0.242188,-0.390625 l 2,-2.0000002 a 1.0001,1.0001 0 0 1 0.259765,-0.1875 l 2,-1 A 1.0001,1.0001 0 0 1 20,7 h 2 a 1.0001,1.0001 0 0 1 0.447266,0.1054688 l 2,1 a 1.0001,1.0001 0 0 1 0.259765,0.1875 l 1,1 a 1.0001,1.0001 0 0 1 0.1875,0.2597656 l 1,1.9999996 A 1.0001,1.0001 0 0 1 27,12 v 1 2 a 1.0001,1.0001 0 0 1 -1,1 H 16.054688 L 16.875,18.458984 18.591797,20.177734 20.236328,21 h 1.527344 l 1.644531,-0.822266 0.884766,-0.884765 a 1.0001,1.0001 0 1 1 1.414062,1.414062 l -1,1 a 1.0001,1.0001 0 0 1 -0.259765,0.1875 l -2,1 A 1.0001,1.0001 0 0 1 22,23 h -2 a 1.0001,1.0001 0 0 1 -0.447266,-0.105469 l -2,-1 a 1.0001,1.0001 0 0 1 -0.259765,-0.1875 l -2,-2 A 1.0001,1.0001 0 0 1 15.050781,19.316406 L 15,19.164062 l -0.05078,0.152344 a 1.0001,1.0001 0 0 1 -0.242188,0.390625 l -2,2 a 1.0001,1.0001 0 0 1 -0.259765,0.1875 l -2,1 A 1.0001,1.0001 0 0 1 10,23 H 8 A 1.0001,1.0001 0 0 1 7.5527344,22.894531 l -2,-1 a 1.0001,1.0001 0 0 1 -0.2597656,-0.1875 l -2,-2 A 1.0001,1.0001 0 0 1 3.0507812,19.316406 l -1,-3 A 1.0001,1.0001 0 0 1 2,16 v -2 a 1.0001,1.0001 0 0 1 0.050781,-0.316406 l 1,-3 a 1.0001,1.0001 0 0 1 0.2421876,-0.390625 l 2,-2.0000002 a 1.0001,1.0001 0 0 1 0.2597656,-0.1875 L 7.4335938,7.1660156 a 1.0001,1.0001 0 0 1 0.011719,-0.00586 1.0001,1.0001 0 0 1 0.3339844,-0.1367187 1.0001,1.0001 0 0 1 0.021484,-0.00586 1.0001,1.0001 0 0 1 0.203125,-0.023437 z"
     id="path2" />
</svg>
