<?xml version="1.0" encoding="UTF-8" standalone="no"?>
<svg
   xmlns:dc="http://purl.org/dc/elements/1.1/"
   xmlns:cc="http://creativecommons.org/ns#"
   xmlns:rdf="http://www.w3.org/1999/02/22-rdf-syntax-ns#"
   xmlns:svg="http://www.w3.org/2000/svg"
   xmlns="http://www.w3.org/2000/svg"
   xmlns:sodipodi="http://sodipodi.sourceforge.net/DTD/sodipodi-0.dtd"
   xmlns:inkscape="http://www.inkscape.org/namespaces/inkscape"
   data-dec="74"
   width="18"
   height="40"
   version="1.1"
   id="svg4"
   sodipodi:docname="74.svg"
   inkscape:version="0.92.4 (unknown)">
  <metadata
     id="metadata10">
    <rdf:RDF>
      <cc:Work
         rdf:about="">
        <dc:format>image/svg+xml</dc:format>
        <dc:type
           rdf:resource="http://purl.org/dc/dcmitype/StillImage" />
      </cc:Work>
    </rdf:RDF>
  </metadata>
  <defs
     id="defs8" />
  <sodipodi:namedview
     pagecolor="#ffffff"
     bordercolor="#666666"
     borderopacity="1"
     objecttolerance="10"
     gridtolerance="10"
     guidetolerance="10"
     inkscape:pageopacity="0"
     inkscape:pageshadow="2"
     inkscape:window-width="640"
     inkscape:window-height="480"
     id="namedview6"
     showgrid="false"
     inkscape:zoom="5.9"
     inkscape:cx="9"
     inkscape:cy="20"
     inkscape:window-x="0"
     inkscape:window-y="27"
     inkscape:window-maximized="0"
     inkscape:current-layer="svg4" />
  <path
     style="color:#000000;font-style:normal;font-variant:normal;font-weight:normal;font-stretch:normal;font-size:medium;line-height:normal;font-family:sans-serif;font-variant-ligatures:normal;font-variant-position:normal;font-variant-caps:normal;font-variant-numeric:normal;font-variant-alternates:normal;font-feature-settings:normal;text-indent:0;text-align:start;text-decoration:none;text-decoration-line:none;text-decoration-style:solid;text-decoration-color:#000000;letter-spacing:normal;word-spacing:normal;text-transform:none;writing-mode:lr-tb;direction:ltr;text-orientation:mixed;dominant-baseline:auto;baseline-shift:baseline;text-anchor:start;white-space:normal;shape-padding:0;clip-rule:nonzero;display:inline;overflow:visible;visibility:visible;opacity:1;isolation:auto;mix-blend-mode:normal;color-interpolation:sRGB;color-interpolation-filters:linearRGB;solid-color:#000000;solid-opacity:1;vector-effect:none;fill:#000000;fill-opacity:1;fill-rule:nonzero;stroke:none;stroke-width:0.30000001;stroke-linecap:round;stroke-linejoin:round;stroke-miterlimit:4;stroke-dasharray:none;stroke-dashoffset:0;stroke-opacity:1;color-rendering:auto;image-rendering:auto;shape-rendering:auto;text-rendering:auto;enable-background:accumulate"
     d="M 12.150391,1.1503906 V 17 a 0.15001501,0.15001501 0 0 1 -0.0078,0.04687 l -1,3 A 0.15001501,0.15001501 0 0 1 11,20.150391 H 9 7 6 A 0.15001501,0.15001501 0 0 1 5.8574219,20.046875 L 4.8925781,17.150391 H 4.2089844 l 0.9140625,2.74414 1.9121093,0.955078 h 2.9296876 l 1.9121092,-0.955078 0.972656,-2.917969 V 2 a 0.150391,0.150391 0 1 1 0.300782,0 v 15 a 0.15001501,0.15001501 0 0 1 -0.0078,0.04687 l -1,3 a 0.15001501,0.15001501 0 0 1 -0.07617,0.08789 l -2,1 A 0.15001501,0.15001501 0 0 1 10,21.150391 H 7 a 0.15001501,0.15001501 0 0 1 -0.066406,-0.01563 l -2,-1 a 0.15001501,0.15001501 0 0 1 -0.076172,-0.08789 L 3.8925781,17.150391 H 3.2089844 l 0.921875,2.769531 0.9570312,0.957031 1.9472656,0.972656 h 2.9296876 l 1.9472652,-0.972656 0.957032,-0.957031 0.980468,-2.94336 V 1.1503906 Z M 11.998047,0.84765625 a 0.15001501,0.15001501 0 0 1 0.0293,0.001953 H 14 A 0.15001501,0.15001501 0 0 1 14.150391,1 v 16 a 0.15001501,0.15001501 0 0 1 -0.0078,0.04687 l -1,3 a 0.15001501,0.15001501 0 0 1 -0.03711,0.05859 l -1,1 a 0.15001501,0.15001501 0 0 1 -0.03906,0.0293 l -2,1 A 0.15001501,0.15001501 0 0 1 10,22.150391 H 7 a 0.15001501,0.15001501 0 0 1 -0.066406,-0.01563 l -2,-1 a 0.15001501,0.15001501 0 0 1 -0.039063,-0.0293 l -1,-1 a 0.15001501,0.15001501 0 0 1 -0.037109,-0.05859 L 2.8671875,17.074219 a 0.15001501,0.15001501 0 0 1 -0.00586,-0.01367 0.15001501,0.15001501 0 0 1 -0.00977,-0.03711 0.15001501,0.15001501 0 0 1 0.00586,-0.07422 0.15001501,0.15001501 0 0 1 0.00195,-0.0059 0.15001501,0.15001501 0 0 1 0.00391,-0.0078 0.15001501,0.15001501 0 0 1 0.00195,-0.0059 0.15001501,0.15001501 0 0 1 0.00586,-0.0078 0.15001501,0.15001501 0 0 1 0.00195,-0.0039 0.15001501,0.15001501 0 0 1 0.00586,-0.0098 0.15001501,0.15001501 0 0 1 0.00195,-0.0039 0.15001501,0.15001501 0 0 1 0.00781,-0.0059 0.15001501,0.15001501 0 0 1 0.00391,-0.0039 0.15001501,0.15001501 0 0 1 0.00586,-0.0078 0.15001501,0.15001501 0 0 1 0.00391,-0.002 0.15001501,0.15001501 0 0 1 0.00781,-0.0078 0.15001501,0.15001501 0 0 1 0.00391,-0.002 0.15001501,0.15001501 0 0 1 0.00781,-0.0059 0.15001501,0.15001501 0 0 1 0.00586,-0.002 0.15001501,0.15001501 0 0 1 0.056641,-0.01758 0.15001501,0.15001501 0 0 1 0.039063,0 h 0.9550781 a 0.15001501,0.15001501 0 0 1 0.044922,0 H 5 a 0.15001501,0.15001501 0 0 1 0.1425781,0.103516 l 0.9648438,2.896484 H 7 9 10.892578 l 0.957031,-2.873047 V 1.0175781 a 0.15001501,0.15001501 0 0 1 0.0098,-0.0722656 0.15001501,0.15001501 0 0 1 0,-0.001953 0.15001501,0.15001501 0 0 1 0.0059,-0.0117188 0.15001501,0.15001501 0 0 1 0,-0.001953 0.15001501,0.15001501 0 0 1 0.01563,-0.0234375 0.15001501,0.15001501 0 0 1 0,-0.001953 0.15001501,0.15001501 0 0 1 0.0059,-0.003906 0.15001501,0.15001501 0 0 1 0.01563,-0.015625 0.15001501,0.15001501 0 0 1 0.02344,-0.0175781 0.15001501,0.15001501 0 0 1 0.0293,-0.0117188 0.15001501,0.15001501 0 0 1 0.02734,-0.005859 0.15001501,0.15001501 0 0 1 0.002,0 0.15001501,0.15001501 0 0 1 0.01367,-0.001953 z"
     id="path2" />
</svg>
