<?xml version="1.0" encoding="UTF-8"?>
<glyph name="bracketleft" format="1">
  <advance width="404"/>
  <unicode hex="005B"/>
  <outline>
    <contour>
      <point x="116" y="812" type="curve" smooth="yes"/>
      <point x="118" y="812"/>
      <point x="121" y="811"/>
      <point x="123" y="811" type="curve" smooth="yes"/>
      <point x="318" y="811" type="line"/>
      <point x="319" y="811" type="line" smooth="yes"/>
      <point x="343" y="811"/>
      <point x="363" y="792"/>
      <point x="363" y="768" type="curve" smooth="yes"/>
      <point x="363" y="744"/>
      <point x="343" y="724"/>
      <point x="319" y="724" type="curve" smooth="yes"/>
      <point x="318" y="724" type="line"/>
      <point x="160" y="724" type="line"/>
      <point x="160" y="-116" type="line"/>
      <point x="318" y="-116" type="line"/>
      <point x="319" y="-116" type="line" smooth="yes"/>
      <point x="343" y="-116"/>
      <point x="363" y="-134"/>
      <point x="363" y="-158" type="curve" smooth="yes"/>
      <point x="363" y="-182"/>
      <point x="343" y="-202"/>
      <point x="319" y="-202" type="curve" smooth="yes"/>
      <point x="318" y="-202" type="line"/>
      <point x="123" y="-202" type="line"/>
      <point x="116" y="-202" type="line" smooth="yes"/>
      <point x="106" y="-202"/>
      <point x="93" y="-197"/>
      <point x="86" y="-190" type="curve"/>
      <point x="85" y="-190" type="line"/>
      <point x="77" y="-183"/>
      <point x="72" y="-168"/>
      <point x="72" y="-158" type="curve" smooth="yes"/>
      <point x="72" y="-156"/>
      <point x="73" y="-154"/>
      <point x="73" y="-152" type="curve" smooth="yes"/>
      <point x="73" y="760" type="line" smooth="yes"/>
      <point x="73" y="762"/>
      <point x="72" y="766"/>
      <point x="72" y="768" type="curve" smooth="yes"/>
      <point x="72" y="778"/>
      <point x="77" y="791"/>
      <point x="84" y="798" type="curve" smooth="yes"/>
      <point x="85" y="799" type="line" smooth="yes"/>
      <point x="92" y="806"/>
      <point x="106" y="812"/>
    </contour>
  </outline>
  <lib>
    <dict>
      <key>com.fontlab.hintData</key>
      <dict>
        <key>hhints</key>
        <array>
          <dict>
            <key>position</key>
            <integer>-202</integer>
            <key>width</key>
            <integer>87</integer>
          </dict>
          <dict>
            <key>position</key>
            <integer>724</integer>
            <key>width</key>
            <integer>87</integer>
          </dict>
        </array>
        <key>vhints</key>
        <array>
          <dict>
            <key>position</key>
            <integer>73</integer>
            <key>width</key>
            <integer>87</integer>
          </dict>
        </array>
      </dict>
    </dict>
  </lib>
</glyph>
