<?xml version="1.0" encoding="UTF-8" standalone="no"?>
<svg
   xmlns:dc="http://purl.org/dc/elements/1.1/"
   xmlns:cc="http://creativecommons.org/ns#"
   xmlns:rdf="http://www.w3.org/1999/02/22-rdf-syntax-ns#"
   xmlns:svg="http://www.w3.org/2000/svg"
   xmlns="http://www.w3.org/2000/svg"
   xmlns:sodipodi="http://sodipodi.sourceforge.net/DTD/sodipodi-0.dtd"
   xmlns:inkscape="http://www.inkscape.org/namespaces/inkscape"
   data-dec="122"
   width="18"
   height="40"
   version="1.1"
   id="svg4"
   sodipodi:docname="122.svg"
   inkscape:version="0.92.4 (unknown)">
  <metadata
     id="metadata10">
    <rdf:RDF>
      <cc:Work
         rdf:about="">
        <dc:format>image/svg+xml</dc:format>
        <dc:type
           rdf:resource="http://purl.org/dc/dcmitype/StillImage" />
      </cc:Work>
    </rdf:RDF>
  </metadata>
  <defs
     id="defs8" />
  <sodipodi:namedview
     pagecolor="#ffffff"
     bordercolor="#666666"
     borderopacity="1"
     objecttolerance="10"
     gridtolerance="10"
     guidetolerance="10"
     inkscape:pageopacity="0"
     inkscape:pageshadow="2"
     inkscape:window-width="640"
     inkscape:window-height="480"
     id="namedview6"
     showgrid="false"
     inkscape:zoom="5.9"
     inkscape:cx="9"
     inkscape:cy="20"
     inkscape:window-x="0"
     inkscape:window-y="27"
     inkscape:window-maximized="0"
     inkscape:current-layer="svg4" />
  <path
     style="color:#000000;font-style:normal;font-variant:normal;font-weight:normal;font-stretch:normal;font-size:medium;line-height:normal;font-family:sans-serif;font-variant-ligatures:normal;font-variant-position:normal;font-variant-caps:normal;font-variant-numeric:normal;font-variant-alternates:normal;font-feature-settings:normal;text-indent:0;text-align:start;text-decoration:none;text-decoration-line:none;text-decoration-style:solid;text-decoration-color:#000000;letter-spacing:normal;word-spacing:normal;text-transform:none;writing-mode:lr-tb;direction:ltr;text-orientation:mixed;dominant-baseline:auto;baseline-shift:baseline;text-anchor:start;white-space:normal;shape-padding:0;clip-rule:nonzero;display:inline;overflow:visible;visibility:visible;opacity:1;isolation:auto;mix-blend-mode:normal;color-interpolation:sRGB;color-interpolation-filters:linearRGB;solid-color:#000000;solid-opacity:1;vector-effect:none;fill:#013272;fill-opacity:1;fill-rule:nonzero;stroke:none;stroke-width:2.5;stroke-linecap:round;stroke-linejoin:round;stroke-miterlimit:4;stroke-dasharray:none;stroke-dashoffset:0;stroke-opacity:1;color-rendering:auto;image-rendering:auto;shape-rendering:auto;text-rendering:auto;enable-background:accumulate"
     d="M 4.0410156,6.7324219 A 1.250125,1.250125 0 0 1 4.1992188,6.75 h 9.6269532 a 1.250125,1.250125 0 0 1 0.373047,0 h 0.626953 a 1.250125,1.250125 0 0 1 1.279297,0.6347656 1.250125,1.250125 0 0 1 0.04687,0.09375 1.250125,1.250125 0 0 1 -0.275391,1.4257813 L 6.5703125,20.75 h 6.4531255 l 0.763671,-3.052734 A 1.250125,1.250125 0 0 1 16.25,18 v 4 A 1.250125,1.250125 0 0 1 15,23.25 h -0.792969 a 1.250125,1.250125 0 0 1 -0.40625,0 H 4.1738281 a 1.250125,1.250125 0 0 1 -0.3730469,0 H 3.1738281 a 1.250125,1.250125 0 0 1 -1.2792969,-0.634766 1.250125,1.250125 0 0 1 -0.046875,-0.0918 1.250125,1.250125 0 0 1 0,-0.002 1.250125,1.250125 0 0 1 0.2753907,-1.425781 L 11.429688,9.25 H 4.9765625 L 4.2128906,12.302734 A 1.250125,1.250125 0 0 1 1.75,12 V 8 A 1.250125,1.250125 0 0 1 3,6.75 h 0.7929688 a 1.250125,1.250125 0 0 1 0.2480468,-0.017578 z"
     id="path2" />
</svg>
