<?xml version="1.0" encoding="UTF-8" standalone="no"?>
<svg
   xmlns:dc="http://purl.org/dc/elements/1.1/"
   xmlns:cc="http://creativecommons.org/ns#"
   xmlns:rdf="http://www.w3.org/1999/02/22-rdf-syntax-ns#"
   xmlns:svg="http://www.w3.org/2000/svg"
   xmlns="http://www.w3.org/2000/svg"
   xmlns:sodipodi="http://sodipodi.sourceforge.net/DTD/sodipodi-0.dtd"
   xmlns:inkscape="http://www.inkscape.org/namespaces/inkscape"
   data-dec="171"
   width="14"
   height="40"
   version="1.1"
   id="svg4"
   sodipodi:docname="171.svg"
   inkscape:version="0.92.4 (unknown)">
  <metadata
     id="metadata10">
    <rdf:RDF>
      <cc:Work
         rdf:about="">
        <dc:format>image/svg+xml</dc:format>
        <dc:type
           rdf:resource="http://purl.org/dc/dcmitype/StillImage" />
      </cc:Work>
    </rdf:RDF>
  </metadata>
  <defs
     id="defs8" />
  <sodipodi:namedview
     pagecolor="#ffffff"
     bordercolor="#666666"
     borderopacity="1"
     objecttolerance="10"
     gridtolerance="10"
     guidetolerance="10"
     inkscape:pageopacity="0"
     inkscape:pageshadow="2"
     inkscape:window-width="615"
     inkscape:window-height="417"
     id="namedview6"
     showgrid="false"
     inkscape:zoom="5.9"
     inkscape:cx="7"
     inkscape:cy="20"
     inkscape:window-x="0"
     inkscape:window-y="27"
     inkscape:window-maximized="0"
     inkscape:current-layer="svg4" />
  <path
     style="color:#000000;font-style:normal;font-variant:normal;font-weight:normal;font-stretch:normal;font-size:medium;line-height:normal;font-family:sans-serif;font-variant-ligatures:normal;font-variant-position:normal;font-variant-caps:normal;font-variant-numeric:normal;font-variant-alternates:normal;font-feature-settings:normal;text-indent:0;text-align:start;text-decoration:none;text-decoration-line:none;text-decoration-style:solid;text-decoration-color:#000000;letter-spacing:normal;word-spacing:normal;text-transform:none;writing-mode:lr-tb;direction:ltr;text-orientation:mixed;dominant-baseline:auto;baseline-shift:baseline;text-anchor:start;white-space:normal;shape-padding:0;clip-rule:nonzero;display:inline;overflow:visible;visibility:visible;opacity:1;isolation:auto;mix-blend-mode:normal;color-interpolation:sRGB;color-interpolation-filters:linearRGB;solid-color:#000000;solid-opacity:1;vector-effect:none;fill:#013272;fill-opacity:1;fill-rule:nonzero;stroke:none;stroke-width:1.5;stroke-linecap:round;stroke-linejoin:round;stroke-miterlimit:4;stroke-dasharray:none;stroke-dashoffset:0;stroke-opacity:1;color-rendering:auto;image-rendering:auto;shape-rendering:auto;text-rendering:auto;enable-background:accumulate"
     d="m 12.984375,7.2421875 a 0.750075,0.750075 0 0 1 0.07617,0.00195 0.750075,0.750075 0 0 1 0.0059,0 0.750075,0.750075 0 0 1 0.06836,0.00977 0.750075,0.750075 0 0 1 0.05273,0.011719 0.750075,0.750075 0 0 1 0.01953,0.00391 0.750075,0.750075 0 0 1 0.0059,0.00195 0.750075,0.750075 0 0 1 0.06641,0.021484 0.750075,0.750075 0 0 1 0.0059,0.00195 0.750075,0.750075 0 0 1 0.0625,0.029297 0.750075,0.750075 0 0 1 0.0059,0.00195 0.750075,0.750075 0 0 1 0.05859,0.035156 0.750075,0.750075 0 0 1 0.0059,0.00391 0.750075,0.750075 0 0 1 0.05469,0.039063 0.750075,0.750075 0 0 1 0.0059,0.00391 0.750075,0.750075 0 0 1 0.05078,0.046875 0.750075,0.750075 0 0 1 0.0039,0.00391 0.750075,0.750075 0 0 1 0.04687,0.050781 0.750075,0.750075 0 0 1 0.0039,0.00391 0.750075,0.750075 0 0 1 0.0098,0.013672 0.750075,0.750075 0 0 1 0.07422,0.1113281 0.750075,0.750075 0 0 1 0.01367,0.027344 0.750075,0.750075 0 0 1 0.01563,0.033203 0.750075,0.750075 0 0 1 0.01172,0.03125 0.750075,0.750075 0 0 1 0.03125,0.1015624 0.750075,0.750075 0 0 1 0.002,0.011719 0.750075,0.750075 0 0 1 0.002,0.00586 0.750075,0.750075 0 0 1 0.0098,0.068359 0.750075,0.750075 0 0 1 0,0.00586 0.750075,0.750075 0 0 1 -0.002,0.1503907 0.750075,0.750075 0 0 1 -0.0098,0.066406 0.750075,0.750075 0 0 1 -0.002,0.00586 0.750075,0.750075 0 0 1 -0.01953,0.074219 0.750075,0.750075 0 0 1 -0.02539,0.070312 0.750075,0.750075 0 0 1 -0.0293,0.060547 0.750075,0.750075 0 0 1 -0.0039,0.00586 0.750075,0.750075 0 0 1 -0.08008,0.1171875 0.750075,0.750075 0 0 1 -0.0059,0.00586 l -0.0078,0.00977 L 8.9765625,14 l 4.5898435,5.507812 0.0098,0.01172 a 0.750075,0.750075 0 0 1 0.0332,0.04102 0.750075,0.750075 0 0 1 0.0039,0.0059 0.750075,0.750075 0 0 1 0.03711,0.05664 0.750075,0.750075 0 0 1 0.0039,0.0059 0.750075,0.750075 0 0 1 0.03125,0.06055 0.750075,0.750075 0 0 1 0.0039,0.0059 0.750075,0.750075 0 0 1 0.02539,0.0625 0.750075,0.750075 0 0 1 0.01563,0.05273 0.750075,0.750075 0 0 1 0.0059,0.01953 0.750075,0.750075 0 0 1 0.002,0.0059 0.750075,0.750075 0 0 1 0.01172,0.06836 0.750075,0.750075 0 0 1 0.0059,0.150391 0.750075,0.750075 0 0 1 0,0.0059 0.750075,0.750075 0 0 1 -0.0039,0.02344 0.750075,0.750075 0 0 1 -0.0059,0.05078 0.750075,0.750075 0 0 1 -0.01367,0.06641 0.750075,0.750075 0 0 1 -0.002,0.0059 0.750075,0.750075 0 0 1 -0.02149,0.06641 0.750075,0.750075 0 0 1 -0.002,0.0059 0.750075,0.750075 0 0 1 -0.0293,0.0625 0.750075,0.750075 0 0 1 -0.002,0.0059 0.750075,0.750075 0 0 1 -0.0332,0.05859 0.750075,0.750075 0 0 1 -0.0039,0.0059 0.750075,0.750075 0 0 1 -0.03906,0.05664 0.750075,0.750075 0 0 1 -0.0039,0.0039 0.750075,0.750075 0 0 1 -0.05078,0.05664 0.750075,0.750075 0 0 1 -0.04883,0.04687 0.750075,0.750075 0 0 1 -0.03125,0.02344 0.750075,0.750075 0 0 1 -0.160156,0.0957 0.750075,0.750075 0 0 1 -0.0039,0.002 0.750075,0.750075 0 0 1 -0.06445,0.02539 0.750075,0.750075 0 0 1 -0.002,0 0.750075,0.750075 0 0 1 -0.01953,0.0059 0.750075,0.750075 0 0 1 -0.05859,0.01367 0.750075,0.750075 0 0 1 -0.07422,0.01172 0.750075,0.750075 0 0 1 -0.06836,0.0039 0.750075,0.750075 0 0 1 -0.01172,0 0.750075,0.750075 0 0 1 -0.06836,-0.0039 0.750075,0.750075 0 0 1 -0.21875,-0.05469 0.750075,0.750075 0 0 1 -0.02734,-0.01367 0.750075,0.750075 0 0 1 -0.09961,-0.05664 0.750075,0.750075 0 0 1 -0.0039,-0.002 0.750075,0.750075 0 0 1 -0.05859,-0.04492 0.750075,0.750075 0 0 1 -0.05078,-0.04687 0.750075,0.750075 0 0 1 -0.0059,-0.0039 l -6,-6 a 0.750075,0.750075 0 0 1 0,-1.0625 l 5.990234,-5.9882812 a 0.750075,0.750075 0 0 1 0.0098,-0.011719 0.750075,0.750075 0 0 1 0.01953,-0.017578 0.750075,0.750075 0 0 1 0.01953,-0.017578 0.750075,0.750075 0 0 1 0.121094,-0.087891 0.750075,0.750075 0 0 1 0.0059,-0.00391 0.750075,0.750075 0 0 1 0.06055,-0.03125 0.750075,0.750075 0 0 1 0.136719,-0.046875 0.750075,0.750075 0 0 1 0.0039,-0.00195 0.750075,0.750075 0 0 1 0.03125,-0.00586 0.750075,0.750075 0 0 1 0.117187,-0.013672 z m -6,0 a 0.750075,0.750075 0 0 1 0.076172,0.00195 0.750075,0.750075 0 0 1 0.00586,0 0.750075,0.750075 0 0 1 0.068359,0.00977 0.750075,0.750075 0 0 1 0.052734,0.011719 0.750075,0.750075 0 0 1 0.019531,0.00391 0.750075,0.750075 0 0 1 0.00586,0.00195 0.750075,0.750075 0 0 1 0.066406,0.021484 0.750075,0.750075 0 0 1 0.00586,0.00195 0.750075,0.750075 0 0 1 0.0625,0.029297 0.750075,0.750075 0 0 1 0.00586,0.00195 0.750075,0.750075 0 0 1 0.058594,0.035156 0.750075,0.750075 0 0 1 0.00586,0.00391 0.750075,0.750075 0 0 1 0.054687,0.039063 0.750075,0.750075 0 0 1 0.00586,0.00391 0.750075,0.750075 0 0 1 0.050781,0.046875 0.750075,0.750075 0 0 1 0.00391,0.00391 0.750075,0.750075 0 0 1 0.046875,0.050781 0.750075,0.750075 0 0 1 0.00391,0.00391 0.750075,0.750075 0 0 1 0.00977,0.013672 0.750075,0.750075 0 0 1 0.074219,0.1113281 0.750075,0.750075 0 0 1 0.013672,0.027344 0.750075,0.750075 0 0 1 0.015625,0.033203 0.750075,0.750075 0 0 1 0.011719,0.03125 0.750075,0.750075 0 0 1 0.03125,0.1015624 0.750075,0.750075 0 0 1 0.00195,0.011719 0.750075,0.750075 0 0 1 0.00195,0.00586 0.750075,0.750075 0 0 1 0.00977,0.068359 0.750075,0.750075 0 0 1 0,0.00586 0.750075,0.750075 0 0 1 -0.00195,0.1503907 0.750075,0.750075 0 0 1 -0.00977,0.066406 0.750075,0.750075 0 0 1 -0.00195,0.00586 0.750075,0.750075 0 0 1 -0.019531,0.074219 0.750075,0.750075 0 0 1 -0.025391,0.070312 0.750075,0.750075 0 0 1 -0.029297,0.060547 0.750075,0.750075 0 0 1 -0.00391,0.00586 0.750075,0.750075 0 0 1 -0.080078,0.1171875 0.750075,0.750075 0 0 1 -0.00586,0.00586 l -0.00781,0.00977 L 2.9765625,14 l 4.5898437,5.507812 0.00977,0.01172 a 0.750075,0.750075 0 0 1 0.033203,0.04102 0.750075,0.750075 0 0 1 0.00391,0.0059 0.750075,0.750075 0 0 1 0.037109,0.05664 0.750075,0.750075 0 0 1 0.00391,0.0059 0.750075,0.750075 0 0 1 0.03125,0.06055 0.750075,0.750075 0 0 1 0.00391,0.0059 0.750075,0.750075 0 0 1 0.025391,0.0625 0.750075,0.750075 0 0 1 0.015625,0.05273 0.750075,0.750075 0 0 1 0.00586,0.01953 0.750075,0.750075 0 0 1 0.00195,0.0059 0.750075,0.750075 0 0 1 0.011719,0.06836 0.750075,0.750075 0 0 1 0.00586,0.150391 0.750075,0.750075 0 0 1 0,0.0059 0.750075,0.750075 0 0 1 -0.00391,0.02344 0.750075,0.750075 0 0 1 -0.00586,0.05078 0.750075,0.750075 0 0 1 -0.013672,0.06641 0.750075,0.750075 0 0 1 -0.00195,0.0059 0.750075,0.750075 0 0 1 -0.021484,0.06641 0.750075,0.750075 0 0 1 -0.00195,0.0059 0.750075,0.750075 0 0 1 -0.029297,0.0625 0.750075,0.750075 0 0 1 -0.00195,0.0059 0.750075,0.750075 0 0 1 -0.033203,0.05859 0.750075,0.750075 0 0 1 -0.00391,0.0059 0.750075,0.750075 0 0 1 -0.039063,0.05664 0.750075,0.750075 0 0 1 -0.00391,0.0039 0.750075,0.750075 0 0 1 -0.050781,0.05664 0.750075,0.750075 0 0 1 -0.048828,0.04687 0.750075,0.750075 0 0 1 -0.03125,0.02344 0.750075,0.750075 0 0 1 -0.1601563,0.0957 0.750075,0.750075 0 0 1 -0.00391,0.002 0.750075,0.750075 0 0 1 -0.064453,0.02539 0.750075,0.750075 0 0 1 -0.00195,0 0.750075,0.750075 0 0 1 -0.019531,0.0059 0.750075,0.750075 0 0 1 -0.058594,0.01367 0.750075,0.750075 0 0 1 -0.074219,0.01172 0.750075,0.750075 0 0 1 -0.068359,0.0039 0.750075,0.750075 0 0 1 -0.011719,0 0.750075,0.750075 0 0 1 -0.068359,-0.0039 0.750075,0.750075 0 0 1 -0.068359,-0.0098 0.750075,0.750075 0 0 1 -0.00586,-0.002 0.750075,0.750075 0 0 1 -0.066406,-0.01563 0.750075,0.750075 0 0 1 -0.00586,-0.002 0.750075,0.750075 0 0 1 -0.066406,-0.02344 0.750075,0.750075 0 0 1 -0.00586,-0.002 0.750075,0.750075 0 0 1 -0.027344,-0.01367 0.750075,0.750075 0 0 1 -0.039063,-0.01953 0.750075,0.750075 0 0 1 -0.058594,-0.03516 0.750075,0.750075 0 0 1 -0.00195,-0.002 0.750075,0.750075 0 0 1 -0.021484,-0.01563 0.750075,0.750075 0 0 1 -0.041016,-0.03125 0.750075,0.750075 0 0 1 -0.050781,-0.04687 0.750075,0.750075 0 0 1 -0.00586,-0.0039 l -6,-6 a 0.750075,0.750075 0 0 1 0,-1.0625 L 6.4589844,7.4804688 a 0.750075,0.750075 0 0 1 0.00977,-0.011719 0.750075,0.750075 0 0 1 0.019531,-0.017578 0.750075,0.750075 0 0 1 0.019531,-0.017578 0.750075,0.750075 0 0 1 0.1210937,-0.087891 0.750075,0.750075 0 0 1 0.00586,-0.00391 0.750075,0.750075 0 0 1 0.060547,-0.03125 0.750075,0.750075 0 0 1 0.1367187,-0.046875 0.750075,0.750075 0 0 1 0.00391,-0.00195 0.750075,0.750075 0 0 1 0.03125,-0.00586 0.750075,0.750075 0 0 1 0.1171875,-0.013672 z"
     id="path2" />
</svg>
