<?xml version="1.0" encoding="UTF-8" standalone="no"?>
<svg
   xmlns:dc="http://purl.org/dc/elements/1.1/"
   xmlns:cc="http://creativecommons.org/ns#"
   xmlns:rdf="http://www.w3.org/1999/02/22-rdf-syntax-ns#"
   xmlns:svg="http://www.w3.org/2000/svg"
   xmlns="http://www.w3.org/2000/svg"
   xmlns:sodipodi="http://sodipodi.sourceforge.net/DTD/sodipodi-0.dtd"
   xmlns:inkscape="http://www.inkscape.org/namespaces/inkscape"
   data-dec="55"
   width="20"
   height="40"
   version="1.1"
   id="svg4"
   sodipodi:docname="55.svg"
   inkscape:version="0.92.4 (unknown)">
  <metadata
     id="metadata10">
    <rdf:RDF>
      <cc:Work
         rdf:about="">
        <dc:format>image/svg+xml</dc:format>
        <dc:type
           rdf:resource="http://purl.org/dc/dcmitype/StillImage" />
      </cc:Work>
    </rdf:RDF>
  </metadata>
  <defs
     id="defs8" />
  <sodipodi:namedview
     pagecolor="#ffffff"
     bordercolor="#666666"
     borderopacity="1"
     objecttolerance="10"
     gridtolerance="10"
     guidetolerance="10"
     inkscape:pageopacity="0"
     inkscape:pageshadow="2"
     inkscape:window-width="640"
     inkscape:window-height="480"
     id="namedview6"
     showgrid="false"
     inkscape:zoom="5.9"
     inkscape:cx="10"
     inkscape:cy="20"
     inkscape:window-x="0"
     inkscape:window-y="27"
     inkscape:window-maximized="0"
     inkscape:current-layer="svg4" />
  <path
     style="color:#000000;font-style:normal;font-variant:normal;font-weight:normal;font-stretch:normal;font-size:medium;line-height:normal;font-family:sans-serif;font-variant-ligatures:normal;font-variant-position:normal;font-variant-caps:normal;font-variant-numeric:normal;font-variant-alternates:normal;font-feature-settings:normal;text-indent:0;text-align:start;text-decoration:none;text-decoration-line:none;text-decoration-style:solid;text-decoration-color:#000000;letter-spacing:normal;word-spacing:normal;text-transform:none;writing-mode:lr-tb;direction:ltr;text-orientation:mixed;dominant-baseline:auto;baseline-shift:baseline;text-anchor:start;white-space:normal;shape-padding:0;clip-rule:nonzero;display:inline;overflow:visible;visibility:visible;opacity:1;isolation:auto;mix-blend-mode:normal;color-interpolation:sRGB;color-interpolation-filters:linearRGB;solid-color:#000000;solid-opacity:1;vector-effect:none;fill:#013272;fill-opacity:1;fill-rule:nonzero;stroke:none;stroke-width:1.5;stroke-linecap:round;stroke-linejoin:round;stroke-miterlimit:4;stroke-dasharray:none;stroke-dashoffset:0;stroke-opacity:1;color-rendering:auto;image-rendering:auto;shape-rendering:auto;text-rendering:auto;enable-background:accumulate"
     d="M 2.9882812,0.24023438 A 0.750075,0.750075 0 0 1 3.75,1 V 2.1875 L 5.46875,0.46875 A 0.750075,0.750075 0 0 1 6,0.25 H 8 A 0.750075,0.750075 0 0 1 8.3867188,0.35742188 L 13.207031,3.25 h 1.482422 l 0.693359,-0.6933594 0.91211,-1.8222656 a 0.750075,0.750075 0 0 1 0.002,-0.005859 0.750075,0.750075 0 0 1 0.595703,-0.48046874 0.750075,0.750075 0 0 1 0.07422,-0.005859 0.750075,0.750075 0 0 1 0.07422,0 0.750075,0.750075 0 0 1 0.05859,0.003906 0.750075,0.750075 0 0 1 0.03906,0.005859 0.750075,0.750075 0 0 1 0.03125,0.007813 0.750075,0.750075 0 0 1 0.04102,0.009766 0.750075,0.750075 0 0 1 0.0078,0.003906 0.750075,0.750075 0 0 1 0.0625,0.0214844 0.750075,0.750075 0 0 1 0.06836,0.03125 0.750075,0.750075 0 0 1 0.06445,0.0371094 0.750075,0.750075 0 0 1 0.06055,0.0449219 A 0.750075,0.750075 0 0 1 17.75,1.0644531 V 4 a 0.750075,0.750075 0 0 1 -0.03906,0.2363281 l -0.96875,2.9042969 a 0.750075,0.750075 0 0 1 -0.002,0.00781 0.750075,0.750075 0 0 1 -0.154296,0.3203125 0.750075,0.750075 0 0 1 -0.0039,0.00586 l -0.0078,0.00781 L 12.634766,12.40625 11.695312,14.287109 10.75,17.121094 V 22 A 0.750075,0.750075 0 0 1 9.5,22.568359 0.750075,0.750075 0 0 1 8.25,22 v -5 a 0.750075,0.750075 0 0 1 0.039063,-0.236328 l 1,-3 a 0.750075,0.750075 0 0 1 0.041016,-0.09961 l 0.9999999,-2 A 0.750075,0.750075 0 0 1 10.46875,11.46875 L 15.345703,6.5917969 16.25,3.8789062 V 3.8125 L 15.53125,4.53125 A 0.750075,0.750075 0 0 1 15,4.75 H 13.087891 A 0.750075,0.750075 0 0 1 12.75,4.7070312 a 0.750075,0.750075 0 0 1 -0.0293,-0.00977 L 7.8554688,2.75 H 6.1777344 L 4.5605469,3.5585938 3.75,5.1757812 V 7 A 0.750075,0.750075 0 1 1 2.25,7 V 5.1015625 a 0.750075,0.750075 0 0 1 0,-0.1660156 V 1 A 0.750075,0.750075 0 0 1 2.9882812,0.24023438 Z"
     id="path2" />
</svg>
