<?xml version="1.0" encoding="UTF-8" standalone="no"?>
<svg
   xmlns:dc="http://purl.org/dc/elements/1.1/"
   xmlns:cc="http://creativecommons.org/ns#"
   xmlns:rdf="http://www.w3.org/1999/02/22-rdf-syntax-ns#"
   xmlns:svg="http://www.w3.org/2000/svg"
   xmlns="http://www.w3.org/2000/svg"
   xmlns:sodipodi="http://sodipodi.sourceforge.net/DTD/sodipodi-0.dtd"
   xmlns:inkscape="http://www.inkscape.org/namespaces/inkscape"
   data-dec="59"
   width="8"
   height="40"
   version="1.1"
   id="svg4"
   sodipodi:docname="59.svg"
   inkscape:version="0.92.4 (unknown)">
  <metadata
     id="metadata10">
    <rdf:RDF>
      <cc:Work
         rdf:about="">
        <dc:format>image/svg+xml</dc:format>
        <dc:type
           rdf:resource="http://purl.org/dc/dcmitype/StillImage" />
      </cc:Work>
    </rdf:RDF>
  </metadata>
  <defs
     id="defs8" />
  <sodipodi:namedview
     pagecolor="#ffffff"
     bordercolor="#666666"
     borderopacity="1"
     objecttolerance="10"
     gridtolerance="10"
     guidetolerance="10"
     inkscape:pageopacity="0"
     inkscape:pageshadow="2"
     inkscape:window-width="640"
     inkscape:window-height="480"
     id="namedview6"
     showgrid="false"
     inkscape:zoom="5.9"
     inkscape:cx="4"
     inkscape:cy="20"
     inkscape:window-x="0"
     inkscape:window-y="27"
     inkscape:window-maximized="0"
     inkscape:current-layer="svg4" />
  <path
     style="color:#000000;font-style:normal;font-variant:normal;font-weight:normal;font-stretch:normal;font-size:medium;line-height:normal;font-family:sans-serif;font-variant-ligatures:normal;font-variant-position:normal;font-variant-caps:normal;font-variant-numeric:normal;font-variant-alternates:normal;font-feature-settings:normal;text-indent:0;text-align:start;text-decoration:none;text-decoration-line:none;text-decoration-style:solid;text-decoration-color:#000000;letter-spacing:normal;word-spacing:normal;text-transform:none;writing-mode:lr-tb;direction:ltr;text-orientation:mixed;dominant-baseline:auto;baseline-shift:baseline;text-anchor:start;white-space:normal;shape-padding:0;clip-rule:nonzero;display:inline;overflow:visible;visibility:visible;opacity:1;isolation:auto;mix-blend-mode:normal;color-interpolation:sRGB;color-interpolation-filters:linearRGB;solid-color:#000000;solid-opacity:1;vector-effect:none;fill:#000000;fill-opacity:1;fill-rule:nonzero;stroke:none;stroke-width:1;stroke-linecap:round;stroke-linejoin:round;stroke-miterlimit:4;stroke-dasharray:none;stroke-dashoffset:0;stroke-opacity:1;color-rendering:auto;image-rendering:auto;shape-rendering:auto;text-rendering:auto;enable-background:accumulate"
     d="M 4,17.707031 3.7070312,18 4,18.292969 4.2929688,18 Z M 3.9921875,16.5 a 0.50005,0.50005 0 0 1 0.3613281,0.146484 l 0.9433594,0.94336 A 0.50005,0.50005 0 0 1 5.5,18.060547 V 20 a 0.50005,0.50005 0 0 1 -0.1464844,0.353516 l -2,2 A 0.50005,0.50005 0 1 1 2.6464844,21.646484 L 4.5,19.792969 v -0.585938 l -0.1464844,0.146485 a 0.50005,0.50005 0 0 1 -0.7070312,0 l -1,-1 a 0.50005,0.50005 0 0 1 0,-0.707032 l 1,-1 A 0.50005,0.50005 0 0 1 3.9921875,16.5 Z M 4,10.707031 3.7070312,11 4,11.292969 4.2929688,11 Z m -0.00586,-1.2128904 a 0.50005,0.50005 0 0 1 0.025391,0.00195 0.50005,0.50005 0 0 1 0.074219,0.00781 0.50005,0.50005 0 0 1 0.3183594,0.2011719 0.50005,0.50005 0 0 1 0.00586,0.00781 l 0.9355468,0.9335934 a 0.50005,0.50005 0 0 1 0,0.707032 l -1,1 a 0.50005,0.50005 0 0 1 -0.7070312,0 l -1,-1 a 0.50005,0.50005 0 0 1 0,-0.707032 L 3.5898438,9.703125 A 0.50005,0.50005 0 0 1 3.890625,9.5078125 0.50005,0.50005 0 0 1 3.9394531,9.5 a 0.50005,0.50005 0 0 1 0.054687,-0.00586 z"
     id="path2" />
</svg>
