<?xml version="1.0" encoding="UTF-8"?>
<glyph name="q" format="1">
  <advance width="578"/>
  <unicode hex="0071"/>
  <outline>
    <contour>
      <point x="265" y="406" type="line"/>
      <point x="218" y="382" type="line"/>
      <point x="164" y="301" type="line"/>
      <point x="138" y="221" type="line"/>
      <point x="138" y="114" type="line"/>
      <point x="161" y="67" type="line"/>
      <point x="208" y="44" type="line"/>
      <point x="255" y="44" type="line"/>
      <point x="304" y="68" type="line"/>
      <point x="356" y="147" type="line"/>
      <point x="384" y="228" type="line"/>
      <point x="384" y="308" type="line"/>
      <point x="359" y="383" type="line"/>
      <point x="314" y="406" type="line"/>
    </contour>
    <contour>
      <point x="492" y="449" type="curve" smooth="yes"/>
      <point x="504" y="449"/>
      <point x="514" y="440"/>
      <point x="514" y="428" type="curve" smooth="yes"/>
      <point x="514" y="426"/>
      <point x="513" y="423"/>
      <point x="513" y="421" type="curve" smooth="yes"/>
      <point x="348" y="-160" type="line"/>
      <point x="405" y="-160" type="line"/>
      <point x="406" y="-160" type="line" smooth="yes"/>
      <point x="418" y="-160"/>
      <point x="427" y="-168"/>
      <point x="427" y="-180" type="curve" smooth="yes"/>
      <point x="427" y="-192"/>
      <point x="418" y="-202"/>
      <point x="406" y="-202" type="curve" smooth="yes"/>
      <point x="405" y="-202" type="line"/>
      <point x="322" y="-202" type="line"/>
      <point x="318" y="-202" type="line"/>
      <point x="315" y="-202" type="line"/>
      <point x="293" y="-202" type="line"/>
      <point x="289" y="-202" type="line"/>
      <point x="286" y="-202" type="line"/>
      <point x="202" y="-202" type="line" smooth="yes"/>
      <point x="190" y="-202"/>
      <point x="180" y="-192"/>
      <point x="180" y="-180" type="curve" smooth="yes"/>
      <point x="180" y="-168"/>
      <point x="190" y="-160"/>
      <point x="202" y="-160" type="curve" smooth="yes"/>
      <point x="273" y="-160" type="line"/>
      <point x="328" y="31" type="line"/>
      <point x="271" y="2" type="line" smooth="yes"/>
      <point x="269" y="1"/>
      <point x="264" y="0"/>
      <point x="261" y="0" type="curve" smooth="yes"/>
      <point x="202" y="0" type="line" smooth="yes"/>
      <point x="199" y="0"/>
      <point x="194" y="1"/>
      <point x="192" y="2" type="curve" smooth="yes"/>
      <point x="138" y="30" type="line" smooth="yes"/>
      <point x="136" y="31"/>
      <point x="132" y="33"/>
      <point x="130" y="35" type="curve" smooth="yes"/>
      <point x="129" y="36" type="line"/>
      <point x="100" y="65" type="line" smooth="yes"/>
      <point x="99" y="66"/>
      <point x="98" y="68"/>
      <point x="97" y="70" type="curve" smooth="yes"/>
      <point x="67" y="128" type="line" smooth="yes"/>
      <point x="66" y="130"/>
      <point x="65" y="135"/>
      <point x="65" y="138" type="curve" smooth="yes"/>
      <point x="65" y="224" type="line" smooth="yes"/>
      <point x="65" y="226"/>
      <point x="65" y="229"/>
      <point x="66" y="231" type="curve" smooth="yes"/>
      <point x="96" y="318" type="line" smooth="yes"/>
      <point x="96" y="319"/>
      <point x="97" y="322"/>
      <point x="98" y="323" type="curve" smooth="yes"/>
      <point x="155" y="410" type="line" smooth="yes"/>
      <point x="157" y="413"/>
      <point x="163" y="418"/>
      <point x="167" y="419" type="curve" smooth="yes"/>
      <point x="252" y="448" type="line"/>
      <point x="254" y="448" type="line" smooth="yes"/>
      <point x="256" y="449"/>
      <point x="259" y="449"/>
      <point x="261" y="449" type="curve" smooth="yes"/>
      <point x="263" y="449" type="line"/>
      <point x="318" y="449" type="line" smooth="yes"/>
      <point x="321" y="449"/>
      <point x="326" y="448"/>
      <point x="328" y="447" type="curve" smooth="yes"/>
      <point x="386" y="418" type="line" smooth="yes"/>
      <point x="390" y="416"/>
      <point x="396" y="409"/>
      <point x="397" y="405" type="curve" smooth="yes"/>
      <point x="417" y="344" type="line"/>
      <point x="442" y="433" type="line" smooth="yes"/>
      <point x="444" y="442"/>
      <point x="453" y="449"/>
      <point x="462" y="449" type="curve" smooth="yes"/>
      <point x="463" y="449" type="line" smooth="yes"/>
      <point x="467" y="449"/>
      <point x="474" y="446"/>
      <point x="477" y="443" type="curve"/>
      <point x="480" y="446"/>
      <point x="488" y="449"/>
    </contour>
  </outline>
  <lib>
    <dict>
      <key>com.fontlab.hintData</key>
      <dict>
        <key>hhints</key>
        <array>
          <dict>
            <key>position</key>
            <integer>-202</integer>
            <key>width</key>
            <integer>43</integer>
          </dict>
          <dict>
            <key>position</key>
            <integer>0</integer>
            <key>width</key>
            <integer>44</integer>
          </dict>
          <dict>
            <key>position</key>
            <integer>406</integer>
            <key>width</key>
            <integer>43</integer>
          </dict>
        </array>
        <key>vhints</key>
        <array>
          <dict>
            <key>position</key>
            <integer>65</integer>
            <key>width</key>
            <integer>73</integer>
          </dict>
        </array>
      </dict>
    </dict>
  </lib>
</glyph>
