<?xml version="1.0" encoding="UTF-8" standalone="no"?>
<svg
   xmlns:dc="http://purl.org/dc/elements/1.1/"
   xmlns:cc="http://creativecommons.org/ns#"
   xmlns:rdf="http://www.w3.org/1999/02/22-rdf-syntax-ns#"
   xmlns:svg="http://www.w3.org/2000/svg"
   xmlns="http://www.w3.org/2000/svg"
   xmlns:sodipodi="http://sodipodi.sourceforge.net/DTD/sodipodi-0.dtd"
   xmlns:inkscape="http://www.inkscape.org/namespaces/inkscape"
   data-dec="63"
   id="dec_63"
   width="20"
   height="40"
   version="1.1"
   sodipodi:docname="63.svg"
   inkscape:version="0.91 r13725">
  <metadata
     id="metadata9">
    <rdf:RDF>
      <cc:Work
         rdf:about="">
        <dc:format>image/svg+xml</dc:format>
        <dc:type
           rdf:resource="http://purl.org/dc/dcmitype/StillImage" />
      </cc:Work>
    </rdf:RDF>
  </metadata>
  <defs
     id="defs7" />
  <sodipodi:namedview
     pagecolor="#ffffff"
     bordercolor="#666666"
     borderopacity="1"
     objecttolerance="10"
     gridtolerance="10"
     guidetolerance="10"
     inkscape:pageopacity="0"
     inkscape:pageshadow="2"
     inkscape:window-width="1333"
     inkscape:window-height="744"
     id="namedview5"
     showgrid="true"
     inkscape:zoom="16.68772"
     inkscape:cx="-4.6513409"
     inkscape:cy="32.427968"
     inkscape:window-x="33"
     inkscape:window-y="924"
     inkscape:window-maximized="1"
     inkscape:current-layer="dec_63">
    <inkscape:grid
       type="xygrid"
       id="grid11" />
  </sodipodi:namedview>
  <path
     style="color:#000000;font-style:normal;font-variant:normal;font-weight:normal;font-stretch:normal;font-size:medium;line-height:normal;font-family:sans-serif;text-indent:0;text-align:start;text-decoration:none;text-decoration-line:none;text-decoration-style:solid;text-decoration-color:#000000;letter-spacing:normal;word-spacing:normal;text-transform:none;direction:ltr;block-progression:tb;writing-mode:lr-tb;baseline-shift:baseline;text-anchor:start;white-space:normal;clip-rule:nonzero;display:inline;overflow:visible;visibility:visible;opacity:1;isolation:auto;mix-blend-mode:normal;color-interpolation:sRGB;color-interpolation-filters:linearRGB;solid-color:#000000;solid-opacity:1;fill:#000000;fill-opacity:1;fill-rule:nonzero;stroke:none;stroke-width:1px;stroke-linecap:round;stroke-linejoin:round;stroke-miterlimit:4;stroke-dasharray:none;stroke-dashoffset:0;stroke-opacity:1;color-rendering:auto;image-rendering:auto;shape-rendering:auto;text-rendering:auto;enable-background:accumulate"
     d="M 11.986328 0.49804688 A 0.50005 0.50005 0 0 0 11.96875 0.5 L 11.011719 0.5 L 11 0.5 L 9 0.5 L 8 0.5 A 0.50005 0.50005 0 0 0 7.8417969 0.52539062 L 4.8417969 1.5253906 A 0.50005 0.50005 0 0 0 4.6464844 1.6464844 L 3.6464844 2.6464844 A 0.50005 0.50005 0 0 0 3.5527344 2.7773438 L 2.5527344 4.7773438 A 0.50005 0.50005 0 0 0 2.5 5 L 2.5 5.9199219 A 0.50005 0.50005 0 0 0 2.6132812 6.3242188 A 0.50005 0.50005 0 0 0 2.6289062 6.34375 A 0.50005 0.50005 0 0 0 2.6464844 6.3613281 A 0.50005 0.50005 0 0 0 2.6503906 6.3632812 A 0.50005 0.50005 0 0 0 2.6835938 6.3945312 A 0.50005 0.50005 0 0 0 2.6875 6.3964844 A 0.50005 0.50005 0 0 0 3.0820312 6.5 L 3.9199219 6.5 A 0.50005 0.50005 0 0 0 4.0820312 6.5 L 5 6.5 A 0.50005 0.50005 0 0 0 5.5 6 L 5.5 5 L 5.5 4.3085938 L 8.6875 2.7148438 L 12.974609 3.25 L 13.861328 3.8417969 L 14.5 5.1171875 L 14.5 6.8828125 L 13.806641 8.2695312 L 12.732422 9.0742188 L 11.882812 9.5 L 10.080078 9.5 A 0.50005 0.50005 0 0 0 9.9179688 9.5 L 9.0800781 9.5 A 0.50005 0.50005 0 0 0 8.6757812 9.6132812 A 0.50005 0.50005 0 0 0 8.65625 9.6289062 A 0.50005 0.50005 0 0 0 8.6386719 9.6464844 A 0.50005 0.50005 0 0 0 8.6367188 9.6503906 A 0.50005 0.50005 0 0 0 8.6054688 9.6835938 A 0.50005 0.50005 0 0 0 8.6035156 9.6875 A 0.50005 0.50005 0 0 0 8.5 10.082031 L 8.5 11.921875 L 8.5 11.929688 A 0.50005 0.50005 0 0 0 8.4980469 11.943359 A 0.50005 0.50005 0 0 0 8.4941406 11.992188 A 0.50005 0.50005 0 0 0 8.4960938 12.042969 A 0.50005 0.50005 0 0 0 8.5 12.076172 A 0.50005 0.50005 0 0 0 8.5 12.080078 L 8.5 15 A 0.50005 0.50005 0 0 0 9 15.5 L 10 15.5 L 11 15.5 A 0.50005 0.50005 0 0 0 11.5 15 L 11.5 12.027344 L 13.158203 11.474609 A 0.50005 0.50005 0 0 0 13.222656 11.447266 L 15.222656 10.447266 A 0.50005 0.50005 0 0 0 15.353516 10.353516 L 16.353516 9.3535156 A 0.50005 0.50005 0 0 0 16.447266 9.2226562 L 17.447266 7.2226562 A 0.50005 0.50005 0 0 0 17.5 7 L 17.5 5 A 0.50005 0.50005 0 0 0 17.447266 4.7773438 L 16.447266 2.7773438 A 0.50005 0.50005 0 0 0 16.353516 2.6464844 L 15.353516 1.6464844 A 0.50005 0.50005 0 0 0 15.158203 1.5253906 L 12.205078 0.54101562 A 0.50005 0.50005 0 0 0 12.011719 0.5 A 0.50005 0.50005 0 0 0 11.986328 0.49804688 z M 10.5 10.5 L 10.832031 10.5 L 10.753906 10.558594 A 0.50005 0.50005 0 0 0 10.705078 10.589844 L 10.5 10.691406 L 10.5 10.5 z M 8.9902344 17.496094 A 0.50005 0.50005 0 0 0 8.8515625 17.519531 A 0.50005 0.50005 0 0 0 8.8203125 17.53125 A 0.50005 0.50005 0 0 0 8.8046875 17.537109 A 0.50005 0.50005 0 0 0 8.796875 17.541016 A 0.50005 0.50005 0 0 0 8.7597656 17.558594 A 0.50005 0.50005 0 0 0 8.7460938 17.566406 A 0.50005 0.50005 0 0 0 8.5957031 17.697266 L 7.6464844 18.646484 A 0.50005 0.50005 0 0 0 7.5 19 L 7.5 21 A 0.50005 0.50005 0 0 0 7.6464844 21.353516 L 8.6464844 22.353516 A 0.50005 0.50005 0 0 0 9 22.5 L 11 22.5 A 0.50005 0.50005 0 0 0 11.353516 22.353516 L 12.353516 21.353516 A 0.50005 0.50005 0 0 0 12.5 21 L 12.5 19 A 0.50005 0.50005 0 0 0 12.353516 18.646484 L 11.353516 17.646484 A 0.50005 0.50005 0 0 0 11 17.5 L 9.0742188 17.5 A 0.50005 0.50005 0 0 0 8.9902344 17.496094 z "
     id="path19" />
</svg>
