<?xml version="1.0" encoding="UTF-8" standalone="no"?>
<svg
   xmlns:dc="http://purl.org/dc/elements/1.1/"
   xmlns:cc="http://creativecommons.org/ns#"
   xmlns:rdf="http://www.w3.org/1999/02/22-rdf-syntax-ns#"
   xmlns:svg="http://www.w3.org/2000/svg"
   xmlns="http://www.w3.org/2000/svg"
   xmlns:sodipodi="http://sodipodi.sourceforge.net/DTD/sodipodi-0.dtd"
   xmlns:inkscape="http://www.inkscape.org/namespaces/inkscape"
   data-dec="36"
   width="20"
   height="40"
   version="1.1"
   id="svg4"
   sodipodi:docname="36.svg"
   inkscape:version="0.92.4 (unknown)">
  <metadata
     id="metadata10">
    <rdf:RDF>
      <cc:Work
         rdf:about="">
        <dc:format>image/svg+xml</dc:format>
        <dc:type
           rdf:resource="http://purl.org/dc/dcmitype/StillImage" />
      </cc:Work>
    </rdf:RDF>
  </metadata>
  <defs
     id="defs8" />
  <sodipodi:namedview
     pagecolor="#ffffff"
     bordercolor="#666666"
     borderopacity="1"
     objecttolerance="10"
     gridtolerance="10"
     guidetolerance="10"
     inkscape:pageopacity="0"
     inkscape:pageshadow="2"
     inkscape:window-width="615"
     inkscape:window-height="417"
     id="namedview6"
     showgrid="false"
     inkscape:zoom="5.9"
     inkscape:cx="10"
     inkscape:cy="20"
     inkscape:window-x="0"
     inkscape:window-y="27"
     inkscape:window-maximized="0"
     inkscape:current-layer="svg4" />
  <path
     style="color:#000000;font-style:normal;font-variant:normal;font-weight:normal;font-stretch:normal;font-size:medium;line-height:normal;font-family:sans-serif;font-variant-ligatures:normal;font-variant-position:normal;font-variant-caps:normal;font-variant-numeric:normal;font-variant-alternates:normal;font-feature-settings:normal;text-indent:0;text-align:start;text-decoration:none;text-decoration-line:none;text-decoration-style:solid;text-decoration-color:#000000;letter-spacing:normal;word-spacing:normal;text-transform:none;writing-mode:lr-tb;direction:ltr;text-orientation:mixed;dominant-baseline:auto;baseline-shift:baseline;text-anchor:start;white-space:normal;shape-padding:0;clip-rule:nonzero;display:inline;overflow:visible;visibility:visible;opacity:1;isolation:auto;mix-blend-mode:normal;color-interpolation:sRGB;color-interpolation-filters:linearRGB;solid-color:#000000;solid-opacity:1;vector-effect:none;fill:#013272;fill-opacity:1;fill-rule:nonzero;stroke:none;stroke-width:0.30000001;stroke-linecap:round;stroke-linejoin:round;stroke-miterlimit:4;stroke-dasharray:none;stroke-dashoffset:0;stroke-opacity:1;color-rendering:auto;image-rendering:auto;shape-rendering:auto;text-rendering:auto;enable-background:accumulate"
     d="m 12.150391,12.875 v 8.916016 l 2.742187,-0.91211 0.957031,-1.914062 V 16.035156 L 14.888672,14.111328 12.943359,13.138672 Z M 8.1503906,11.541016 V 21.849609 H 11.849609 V 12.773438 Z M 12.150391,10.875 v 0.683594 l 0.896484,0.298828 a 0.15001501,0.15001501 0 0 1 0.01953,0.0078 l 2,1 a 0.15001501,0.15001501 0 0 1 0.06836,0.06836 l 1,2 a 0.15023858,0.15023858 0 0 1 -0.269532,0.132812 L 14.888672,13.111328 12.943359,12.138672 12.150391,11.875 v 0.683594 l 0.896484,0.298828 a 0.15001501,0.15001501 0 0 1 0.01953,0.0078 l 2,1 a 0.15001501,0.15001501 0 0 1 0.06836,0.06836 l 1,2 A 0.15001501,0.15001501 0 0 1 16.150391,16 v 3 a 0.15001501,0.15001501 0 0 1 -0.01563,0.06641 l -0.587891,1.175782 0.330078,-0.330079 0.972656,-1.947265 v -2.929688 l -0.966797,-1.93164 -2.949218,-1.966797 z M 8.1503906,10.541016 v 0.683593 l 3.6992184,1.234375 v -0.685546 z m 0,-1.0000004 v 0.6855464 l 3.6992184,1.232422 V 10.775391 Z M 4.453125,2.7597656 3.1503906,4.0625 V 6.9648438 L 4.1171875,8.8964844 7.0664062,10.863281 7.8496094,11.125 V 10.441406 L 6.953125,10.142578 a 0.15001501,0.15001501 0 0 1 -0.019531,-0.0078 l -2,-1.0000004 a 0.15001501,0.15001501 0 0 1 -0.068359,-0.068359 l -1,-2 A 0.15023831,0.15023831 0 0 1 4.1347656,6.9335938 L 5.1113281,8.8886719 7.0566406,9.8613281 7.8496094,10.125 V 9.4414062 L 6.953125,9.1425781 a 0.15001501,0.15001501 0 0 1 -0.019531,-0.00781 l -2,-1 a 0.15001501,0.15001501 0 0 1 -0.068359,-0.068359 l -1,-2 A 0.15001501,0.15001501 0 0 1 3.8496094,6 V 4 a 0.15001501,0.15001501 0 0 1 0.015625,-0.066406 z M 7.8496094,1.2089844 5.1074219,2.1210938 4.1503906,4.0351562 V 5.9648438 L 5.1113281,7.8886719 7.0566406,8.8613281 7.8496094,9.125 Z M 8.1503906,1.1503906 V 9.2265625 L 11.849609,10.458984 V 1.1503906 Z M 7.9824219,-3.1523438 a 0.15001501,0.15001501 0 0 1 0.015625,0 A 0.15001501,0.15001501 0 0 1 8.1503906,-3 V 0.84960938 H 11.849609 V -3 a 0.150391,0.150391 0 1 1 0.300782,0 v 3.89257812 l 2.896484,0.96484378 a 0.15001501,0.15001501 0 0 1 0.05859,0.037109 l 1,1 a 0.15001501,0.15001501 0 0 1 0.0293,0.039063 l 1,2 A 0.15001501,0.15001501 0 0 1 17.150391,5 V 7 A 0.15001501,0.15001501 0 0 1 17,7.1503906 H 15 A 0.15001501,0.15001501 0 0 1 14.849609,7 V 5 A 0.15001501,0.15001501 0 0 1 15,4.8496094 h 1 A 0.15001501,0.15001501 0 0 1 16.150391,5 V 6 A 0.150391,0.150391 0 0 1 15.849609,6 V 5.1503906 h -0.699218 v 1.6992188 h 1.699218 V 5.0351562 L 15.876953,3.0878906 14.919922,2.1308594 12.150391,1.2089844 v 9.3496096 l 0.896484,0.298828 a 0.15001501,0.15001501 0 0 1 0.03711,0.01758 l 3,2 a 0.15001501,0.15001501 0 0 1 0.05078,0.05859 l 1,2 A 0.15001501,0.15001501 0 0 1 17.150391,15 v 3 a 0.15001501,0.15001501 0 0 1 -0.01563,0.06641 l -1,2 a 0.15001501,0.15001501 0 0 1 -0.0293,0.03906 l -0.984375,0.984375 -0.01563,0.01563 a 0.15001501,0.15001501 0 0 1 -0.0059,0.0078 0.15001501,0.15001501 0 0 1 -0.002,0.002 0.15001501,0.15001501 0 0 1 -0.0098,0.0059 0.15001501,0.15001501 0 0 1 -0.0098,0.0078 0.15001501,0.15001501 0 0 1 -0.0039,0.002 0.15001501,0.15001501 0 0 1 -0.02734,0.01172 l -0.01758,0.0059 a 0.15001501,0.15001501 0 0 1 -0.0078,0.002 l -2.871093,0.957031 V 26 a 0.150391,0.150391 0 1 1 -0.300782,0 V 22.150391 H 8.1503906 V 26 A 0.1503906,0.1503906 0 1 1 7.8496094,26 V 22.107422 L 4.953125,21.142578 a 0.15001501,0.15001501 0 0 1 -0.058594,-0.03711 l -1,-1 a 0.15001501,0.15001501 0 0 1 -0.029297,-0.03906 l -1,-2 A 0.15001501,0.15001501 0 0 1 2.8496094,18 V 16 A 0.15001501,0.15001501 0 0 1 3,15.849609 H 5 A 0.15001501,0.15001501 0 0 1 5.1503906,16 v 2 A 0.15001501,0.15001501 0 0 1 5,18.150391 H 4 A 0.15001501,0.15001501 0 0 1 3.8496094,18 v -1 a 0.1503906,0.1503906 0 1 1 0.3007812,0 v 0.849609 H 4.8496094 V 16.150391 H 3.1503906 v 1.814453 l 0.9726563,1.947265 0.9570312,0.957032 2.7695313,0.921875 V 11.441406 L 6.953125,11.142578 A 0.15001501,0.15001501 0 0 1 6.9160156,11.125 l -3,-2 a 0.15001501,0.15001501 0 0 1 -0.050781,-0.058594 l -1,-2 A 0.15001501,0.15001501 0 0 1 2.8496094,7 V 4 a 0.15001501,0.15001501 0 0 1 0.044922,-0.1054688 l 1.984375,-1.984375 a 0.15001501,0.15001501 0 0 1 0.015625,-0.015625 0.15001501,0.15001501 0 0 1 0.00391,-0.00586 0.15001501,0.15001501 0 0 1 0.00195,-0.00195 0.15001501,0.15001501 0 0 1 0.00195,-0.00195 0.15001501,0.15001501 0 0 1 0.023437,-0.015625 0.15001501,0.15001501 0 0 1 0.027344,-0.011719 0.15001501,0.15001501 0 0 1 0.017578,-0.00586 l 0.00781,-0.00195 2.8710938,-0.95703128 V -3 a 0.15001501,0.15001501 0 0 1 0.1328125,-0.1523438 z"
     id="path2" />
</svg>
