<?xml version="1.0" encoding="UTF-8"?>
<glyph name="Igrave" format="1">
  <advance width="346"/>
  <unicode hex="00CC"/>
  <outline>
    <component base="grave" xOffset="-1" yOffset="270"/>
    <component base="I"/>
  </outline>
  <lib>
    <dict>
      <key>com.fontlab.hintData</key>
      <dict>
        <key>hhints</key>
        <array>
          <dict>
            <key>position</key>
            <integer>0</integer>
            <key>width</key>
            <integer>29</integer>
          </dict>
          <dict>
            <key>position</key>
            <integer>607</integer>
            <key>width</key>
            <integer>30</integer>
          </dict>
          <dict>
            <key>position</key>
            <integer>695</integer>
            <key>width</key>
            <integer>202</integer>
          </dict>
        </array>
        <key>vhints</key>
        <array>
          <dict>
            <key>position</key>
            <integer>130</integer>
            <key>width</key>
            <integer>87</integer>
          </dict>
          <dict>
            <key>position</key>
            <integer>218</integer>
            <key>width</key>
            <integer>202</integer>
          </dict>
        </array>
      </dict>
    </dict>
  </lib>
</glyph>
