<?xml version="1.0" encoding="UTF-8"?>
<glyph name="glyph46" format="1">
  <advance width="115"/>
  <unicode hex="2009"/>
  <outline>
    <contour>
      <point x="0" y="681" type="move" smooth="yes"/>
    </contour>
  </outline>
</glyph>
