<?xml version="1.0" encoding="UTF-8" standalone="no"?>
<svg
   xmlns:dc="http://purl.org/dc/elements/1.1/"
   xmlns:cc="http://creativecommons.org/ns#"
   xmlns:rdf="http://www.w3.org/1999/02/22-rdf-syntax-ns#"
   xmlns:svg="http://www.w3.org/2000/svg"
   xmlns="http://www.w3.org/2000/svg"
   xmlns:sodipodi="http://sodipodi.sourceforge.net/DTD/sodipodi-0.dtd"
   xmlns:inkscape="http://www.inkscape.org/namespaces/inkscape"
   data-dec="56"
   width="17"
   height="40"
   version="1.1"
   id="svg4"
   sodipodi:docname="56.svg"
   inkscape:version="0.92.4 (unknown)">
  <metadata
     id="metadata10">
    <rdf:RDF>
      <cc:Work
         rdf:about="">
        <dc:format>image/svg+xml</dc:format>
        <dc:type
           rdf:resource="http://purl.org/dc/dcmitype/StillImage" />
      </cc:Work>
    </rdf:RDF>
  </metadata>
  <defs
     id="defs8" />
  <sodipodi:namedview
     pagecolor="#ffffff"
     bordercolor="#666666"
     borderopacity="1"
     objecttolerance="10"
     gridtolerance="10"
     guidetolerance="10"
     inkscape:pageopacity="0"
     inkscape:pageshadow="2"
     inkscape:window-width="640"
     inkscape:window-height="480"
     id="namedview6"
     showgrid="false"
     inkscape:zoom="5.9"
     inkscape:cx="8.5"
     inkscape:cy="20"
     inkscape:window-x="0"
     inkscape:window-y="27"
     inkscape:window-maximized="0"
     inkscape:current-layer="svg4" />
  <path
     style="color:#000000;font-style:normal;font-variant:normal;font-weight:normal;font-stretch:normal;font-size:medium;line-height:normal;font-family:sans-serif;font-variant-ligatures:normal;font-variant-position:normal;font-variant-caps:normal;font-variant-numeric:normal;font-variant-alternates:normal;font-feature-settings:normal;text-indent:0;text-align:start;text-decoration:none;text-decoration-line:none;text-decoration-style:solid;text-decoration-color:#000000;letter-spacing:normal;word-spacing:normal;text-transform:none;writing-mode:lr-tb;direction:ltr;text-orientation:mixed;dominant-baseline:auto;baseline-shift:baseline;text-anchor:start;white-space:normal;shape-padding:0;clip-rule:nonzero;display:inline;overflow:visible;visibility:visible;opacity:1;isolation:auto;mix-blend-mode:normal;color-interpolation:sRGB;color-interpolation-filters:linearRGB;solid-color:#000000;solid-opacity:1;vector-effect:none;fill:#000000;fill-opacity:1;fill-rule:nonzero;stroke:none;stroke-width:1;stroke-linecap:round;stroke-linejoin:round;stroke-miterlimit:4;stroke-dasharray:none;stroke-dashoffset:0;stroke-opacity:1;color-rendering:auto;image-rendering:auto;shape-rendering:auto;text-rendering:auto;enable-background:accumulate"
     d="m 7.0820312,12.5 -2.8125,0.9375 -0.859375,0.859375 L 2.5,16.117188 v 1.765624 l 0.9101562,1.820313 0.859375,0.859375 2.8125,0.9375 H 9.9179688 L 12.730469,20.5625 13.589844,19.703125 14.5,17.882812 V 16.117188 L 13.589844,14.296875 12.730469,13.4375 9.9179688,12.5 Z M 7.1171875,3.5 5.296875,4.4101562 4.4101562,5.296875 3.5,7.1171875 v 0.765625 L 4.4101562,9.703125 5.296875,10.589844 7.1171875,11.5 h 2.765625 L 11.703125,10.589844 12.589844,9.703125 13.5,7.8828125 V 7.1171875 L 12.589844,5.296875 11.703125,4.4101562 9.8828125,3.5 Z M 7,2.5 h 3 a 0.50005,0.50005 0 0 1 0.222656,0.052734 l 2,1 a 0.50005,0.50005 0 0 1 0.13086,0.09375 l 1,1 a 0.50005,0.50005 0 0 1 0.09375,0.1308594 l 1,2 A 0.50005,0.50005 0 0 1 14.5,7 v 1 a 0.50005,0.50005 0 0 1 -0.05273,0.2226562 l -1,1.9999998 a 0.50005,0.50005 0 0 1 -0.09375,0.13086 l -1,1 a 0.50005,0.50005 0 0 1 -0.13086,0.09375 l -0.919922,0.458984 1.855469,0.619141 a 0.50005,0.50005 0 0 1 0.195313,0.121093 l 1,1 a 0.50005,0.50005 0 0 1 0.09375,0.13086 l 1,2 A 0.50005,0.50005 0 0 1 15.5,16 v 2 a 0.50005,0.50005 0 0 1 -0.05273,0.222656 l -1,2 a 0.50005,0.50005 0 0 1 -0.09375,0.13086 l -1,1 a 0.50005,0.50005 0 0 1 -0.195313,0.121093 l -3,1 A 0.50005,0.50005 0 0 1 10,22.5 H 7 a 0.50005,0.50005 0 0 1 -0.1582031,-0.02539 l -3,-1 A 0.50005,0.50005 0 0 1 3.6464844,21.353516 l -1,-1 a 0.50005,0.50005 0 0 1 -0.09375,-0.13086 l -1,-2 A 0.50005,0.50005 0 0 1 1.5,18 v -2 a 0.50005,0.50005 0 0 1 0.052734,-0.222656 l 1,-2 a 0.50005,0.50005 0 0 1 0.09375,-0.13086 l 1,-1 A 0.50005,0.50005 0 0 1 3.8417969,12.525391 L 5.6972656,11.90625 4.7773438,11.447266 a 0.50005,0.50005 0 0 1 -0.1308594,-0.09375 l -1,-1 a 0.50005,0.50005 0 0 1 -0.09375,-0.13086 l -1,-1.9999998 A 0.50005,0.50005 0 0 1 2.5,8 V 7 a 0.50005,0.50005 0 0 1 0.052734,-0.2226562 l 1,-2 a 0.50005,0.50005 0 0 1 0.09375,-0.1308594 l 1,-1 a 0.50005,0.50005 0 0 1 0.1308594,-0.09375 l 2,-1 A 0.50005,0.50005 0 0 1 7,2.5 Z"
     id="path2" />
</svg>
