<?xml version="1.0" encoding="UTF-8"?>
<glyph name="asterisk" format="1">
  <advance width="463"/>
  <unicode hex="002A"/>
  <outline>
    <contour>
      <point x="231" y="522" type="curve" smooth="yes"/>
      <point x="232" y="522" type="line" smooth="yes"/>
      <point x="256" y="522"/>
      <point x="275" y="502"/>
      <point x="275" y="478" type="curve" smooth="yes"/>
      <point x="275" y="381" type="line"/>
      <point x="354" y="429" type="line" smooth="yes"/>
      <point x="360" y="432"/>
      <point x="369" y="434"/>
      <point x="376" y="434" type="curve" smooth="yes"/>
      <point x="400" y="434"/>
      <point x="420" y="416"/>
      <point x="420" y="392" type="curve" smooth="yes"/>
      <point x="420" y="379"/>
      <point x="410" y="361"/>
      <point x="398" y="354" type="curve" smooth="yes"/>
      <point x="316" y="305" type="line"/>
      <point x="398" y="255" type="line" smooth="yes"/>
      <point x="410" y="248"/>
      <point x="420" y="231"/>
      <point x="420" y="218" type="curve" smooth="yes"/>
      <point x="420" y="194"/>
      <point x="400" y="174"/>
      <point x="376" y="174" type="curve" smooth="yes"/>
      <point x="369" y="174"/>
      <point x="360" y="177"/>
      <point x="354" y="180" type="curve" smooth="yes"/>
      <point x="275" y="228" type="line"/>
      <point x="275" y="131" type="line"/>
      <point x="275" y="130" type="line" smooth="yes"/>
      <point x="275" y="106"/>
      <point x="256" y="87"/>
      <point x="232" y="87" type="curve" smooth="yes"/>
      <point x="208" y="87"/>
      <point x="188" y="106"/>
      <point x="188" y="130" type="curve" smooth="yes"/>
      <point x="188" y="131" type="line"/>
      <point x="188" y="228" type="line"/>
      <point x="109" y="180" type="line" smooth="yes"/>
      <point x="103" y="177"/>
      <point x="94" y="174"/>
      <point x="87" y="174" type="curve" smooth="yes"/>
      <point x="63" y="174"/>
      <point x="43" y="194"/>
      <point x="43" y="218" type="curve" smooth="yes"/>
      <point x="43" y="231"/>
      <point x="53" y="248"/>
      <point x="65" y="255" type="curve" smooth="yes"/>
      <point x="147" y="305" type="line"/>
      <point x="65" y="354" type="line" smooth="yes"/>
      <point x="53" y="361"/>
      <point x="43" y="379"/>
      <point x="43" y="392" type="curve" smooth="yes"/>
      <point x="43" y="416"/>
      <point x="63" y="434"/>
      <point x="87" y="434" type="curve" smooth="yes"/>
      <point x="94" y="434"/>
      <point x="103" y="432"/>
      <point x="109" y="429" type="curve" smooth="yes"/>
      <point x="188" y="381" type="line"/>
      <point x="188" y="478" type="line" smooth="yes"/>
      <point x="188" y="501"/>
      <point x="208" y="522"/>
    </contour>
  </outline>
  <lib>
    <dict>
      <key>com.fontlab.hintData</key>
      <dict>
        <key>vhints</key>
        <array>
          <dict>
            <key>position</key>
            <integer>188</integer>
            <key>width</key>
            <integer>87</integer>
          </dict>
        </array>
      </dict>
    </dict>
  </lib>
</glyph>
