<?xml version="1.0" encoding="UTF-8"?>
<glyph name="ccedilla" format="1">
  <advance width="346"/>
  <unicode hex="00E7"/>
  <outline>
    <component base="cedilla" xOffset="-91" yOffset="-39"/>
    <component base="c"/>
  </outline>
  <lib>
    <dict>
      <key>com.fontlab.hintData</key>
      <dict>
        <key>hhints</key>
        <array>
          <dict>
            <key>position</key>
            <integer>-154</integer>
            <key>width</key>
            <integer>43</integer>
          </dict>
          <dict>
            <key>position</key>
            <integer>-96</integer>
            <key>width</key>
            <integer>41</integer>
          </dict>
          <dict>
            <key>position</key>
            <integer>-36</integer>
            <key>width</key>
            <integer>42</integer>
          </dict>
          <dict>
            <key>position</key>
            <integer>0</integer>
            <key>width</key>
            <integer>44</integer>
          </dict>
          <dict>
            <key>position</key>
            <integer>261</integer>
            <key>width</key>
            <integer>73</integer>
          </dict>
          <dict>
            <key>position</key>
            <integer>406</integer>
            <key>width</key>
            <integer>43</integer>
          </dict>
        </array>
        <key>vhints</key>
        <array>
          <dict>
            <key>position</key>
            <integer>0</integer>
            <key>width</key>
            <integer>184</integer>
          </dict>
          <dict>
            <key>position</key>
            <integer>28</integer>
            <key>width</key>
            <integer>43</integer>
          </dict>
          <dict>
            <key>position</key>
            <integer>220</integer>
            <key>width</key>
            <integer>82</integer>
          </dict>
        </array>
      </dict>
    </dict>
  </lib>
</glyph>
