<?xml version="1.0" encoding="UTF-8"?>
<glyph name="Ugrave" format="1">
  <advance width="665"/>
  <unicode hex="00D9"/>
  <outline>
    <component base="grave" xOffset="86" yOffset="328"/>
    <component base="U"/>
  </outline>
  <lib>
    <dict>
      <key>com.fontlab.hintData</key>
      <dict>
        <key>hhints</key>
        <array>
          <dict>
            <key>position</key>
            <integer>0</integer>
            <key>width</key>
            <integer>87</integer>
          </dict>
          <dict>
            <key>position</key>
            <integer>608</integer>
            <key>width</key>
            <integer>87</integer>
          </dict>
          <dict>
            <key>position</key>
            <integer>754</integer>
            <key>width</key>
            <integer>232</integer>
          </dict>
        </array>
        <key>vhints</key>
        <array>
          <dict>
            <key>position</key>
            <integer>14</integer>
            <key>width</key>
            <integer>262</integer>
          </dict>
          <dict>
            <key>position</key>
            <integer>101</integer>
            <key>width</key>
            <integer>87</integer>
          </dict>
          <dict>
            <key>position</key>
            <integer>188</integer>
            <key>width</key>
            <integer>261</integer>
          </dict>
          <dict>
            <key>position</key>
            <integer>391</integer>
            <key>width</key>
            <integer>262</integer>
          </dict>
          <dict>
            <key>position</key>
            <integer>477</integer>
            <key>width</key>
            <integer>87</integer>
          </dict>
        </array>
      </dict>
    </dict>
  </lib>
</glyph>
