<?xml version="1.0" encoding="UTF-8" standalone="no"?>
<svg
   xmlns:dc="http://purl.org/dc/elements/1.1/"
   xmlns:cc="http://creativecommons.org/ns#"
   xmlns:rdf="http://www.w3.org/1999/02/22-rdf-syntax-ns#"
   xmlns:svg="http://www.w3.org/2000/svg"
   xmlns="http://www.w3.org/2000/svg"
   xmlns:sodipodi="http://sodipodi.sourceforge.net/DTD/sodipodi-0.dtd"
   xmlns:inkscape="http://www.inkscape.org/namespaces/inkscape"
   data-dec="187"
   width="14"
   height="40"
   version="1.1"
   id="svg4"
   sodipodi:docname="187.svg"
   inkscape:version="0.92.4 (unknown)">
  <metadata
     id="metadata10">
    <rdf:RDF>
      <cc:Work
         rdf:about="">
        <dc:format>image/svg+xml</dc:format>
        <dc:type
           rdf:resource="http://purl.org/dc/dcmitype/StillImage" />
      </cc:Work>
    </rdf:RDF>
  </metadata>
  <defs
     id="defs8" />
  <sodipodi:namedview
     pagecolor="#ffffff"
     bordercolor="#666666"
     borderopacity="1"
     objecttolerance="10"
     gridtolerance="10"
     guidetolerance="10"
     inkscape:pageopacity="0"
     inkscape:pageshadow="2"
     inkscape:window-width="640"
     inkscape:window-height="480"
     id="namedview6"
     showgrid="false"
     inkscape:zoom="5.9"
     inkscape:cx="7"
     inkscape:cy="20"
     inkscape:window-x="0"
     inkscape:window-y="27"
     inkscape:window-maximized="0"
     inkscape:current-layer="svg4" />
  <path
     style="color:#000000;font-style:normal;font-variant:normal;font-weight:normal;font-stretch:normal;font-size:medium;line-height:normal;font-family:sans-serif;font-variant-ligatures:normal;font-variant-position:normal;font-variant-caps:normal;font-variant-numeric:normal;font-variant-alternates:normal;font-feature-settings:normal;text-indent:0;text-align:start;text-decoration:none;text-decoration-line:none;text-decoration-style:solid;text-decoration-color:#000000;letter-spacing:normal;word-spacing:normal;text-transform:none;writing-mode:lr-tb;direction:ltr;text-orientation:mixed;dominant-baseline:auto;baseline-shift:baseline;text-anchor:start;white-space:normal;shape-padding:0;clip-rule:nonzero;display:inline;overflow:visible;visibility:visible;opacity:1;isolation:auto;mix-blend-mode:normal;color-interpolation:sRGB;color-interpolation-filters:linearRGB;solid-color:#000000;solid-opacity:1;vector-effect:none;fill:#000000;fill-opacity:1;fill-rule:nonzero;stroke:none;stroke-width:1;stroke-linecap:round;stroke-linejoin:round;stroke-miterlimit:4;stroke-dasharray:none;stroke-dashoffset:0;stroke-opacity:1;color-rendering:auto;image-rendering:auto;shape-rendering:auto;text-rendering:auto;enable-background:accumulate"
     d="m 0.99023438,7.4941406 a 0.50005,0.50005 0 0 1 0.007813,0 0.50005,0.50005 0 0 1 0.0800781,0.00781 0.50005,0.50005 0 0 1 0.011719,0.00195 0.50005,0.50005 0 0 1 0.00391,0 0.50005,0.50005 0 0 1 0.044922,0.011719 0.50005,0.50005 0 0 1 0.00391,0.00195 0.50005,0.50005 0 0 1 0.091797,0.039063 0.50005,0.50005 0 0 1 0.03125,0.017578 0.50005,0.50005 0 0 1 0.021484,0.015625 0.50005,0.50005 0 0 1 0.066406,0.056641 l 0.013672,0.013672 a 0.50005,0.50005 0 0 1 0.017578,0.019531 l 5.96875,5.9667965 a 0.50005,0.50005 0 0 1 0,0.707032 l -5.96875,5.966796 a 0.50005,0.50005 0 0 1 -0.023437,0.02539 l -0.00781,0.0078 a 0.50005,0.50005 0 0 1 -0.025391,0.02344 0.50005,0.50005 0 0 1 -0.074219,0.05664 0.50005,0.50005 0 0 1 -0.00586,0.0039 0.50005,0.50005 0 0 1 -0.00391,0.002 0.50005,0.50005 0 0 1 -0.087891,0.03906 0.50005,0.50005 0 0 1 -0.00391,0.002 0.50005,0.50005 0 0 1 -0.042969,0.01172 0.50005,0.50005 0 0 1 -0.048828,0.0078 0.50005,0.50005 0 0 1 -0.10156252,0.0039 0.50005,0.50005 0 0 1 -0.003906,0 0.50005,0.50005 0 0 1 -0.0449219,-0.0059 0.50005,0.50005 0 0 1 -0.003906,0 0.50005,0.50005 0 0 1 -0.0449219,-0.01172 0.50005,0.50005 0 0 1 -0.003906,0 0.50005,0.50005 0 0 1 -0.0429688,-0.01563 0.50005,0.50005 0 0 1 -0.03125,-0.01172 0.50005,0.50005 0 0 1 -0.0175781,-0.0098 0.50005,0.50005 0 0 1 -0.0410156,-0.02344 0.50005,0.50005 0 0 1 -0.003906,-0.002 0.50005,0.50005 0 0 1 -0.0234375,-0.01758 0.50005,0.50005 0 0 1 -0.015625,-0.01172 0.50005,0.50005 0 0 1 -0.0351562,-0.03125 0.50005,0.50005 0 0 1 -0.001953,-0.002 0.50005,0.50005 0 0 1 -0.03125,-0.0332 0.50005,0.50005 0 0 1 -0.003906,-0.0039 0.50005,0.50005 0 0 1 -0.0136719,-0.01953 0.50005,0.50005 0 0 1 -0.015625,-0.02148 0.50005,0.50005 0 0 1 -0.0234375,-0.03906 0.50005,0.50005 0 0 1 -0.001953,-0.002 0.50005,0.50005 0 0 1 -0.0195313,-0.04297 0.50005,0.50005 0 0 1 -0.001953,-0.0039 0.50005,0.50005 0 0 1 -0.015625,-0.04297 0.50005,0.50005 0 0 1 -0.001953,-0.0039 0.50005,0.50005 0 0 1 -0.009766,-0.04297 0.50005,0.50005 0 0 1 -0.001953,-0.0059 A 0.50005,0.50005 0 0 1 0.5,20.068359 a 0.50005,0.50005 0 0 1 -0.001953,-0.01758 0.50005,0.50005 0 0 1 0,-0.0918 0.50005,0.50005 0 0 1 0,-0.0039 0.50005,0.50005 0 0 1 0,-0.0039 0.50005,0.50005 0 0 1 0.001953,-0.01172 0.50005,0.50005 0 0 1 0.005859,-0.03711 0.50005,0.50005 0 0 1 0.0117187,-0.04492 0.50005,0.50005 0 0 1 0.001953,-0.0039 0.50005,0.50005 0 0 1 0.015625,-0.04297 0.50005,0.50005 0 0 1 0.001953,-0.0039 0.50005,0.50005 0 0 1 0.0273437,-0.05273 0.50005,0.50005 0 0 1 0.0214844,-0.03516 0.50005,0.50005 0 0 1 0.0273438,-0.03516 0.50005,0.50005 0 0 1 0.001953,-0.0039 L 5.3496094,14 0.62304688,8.328125 a 0.50005,0.50005 0 0 1 -0.007813,-0.00781 0.50005,0.50005 0 0 1 -0.0234375,-0.03125 0.50005,0.50005 0 0 1 -0.0253906,-0.037109 0.50005,0.50005 0 0 1 -0.0234375,-0.044922 0.50005,0.50005 0 0 1 -0.001953,-0.00391 A 0.50005,0.50005 0 0 1 0.5234375,8.1601562 0.50005,0.50005 0 0 1 0.52148438,8.15625 0.50005,0.50005 0 0 1 0.50976562,8.1132812 0.50005,0.50005 0 0 1 0.5078125,8.109375 0.50005,0.50005 0 0 1 0.50390625,8.0800781 0.50005,0.50005 0 0 1 0.5,8.0605469 a 0.50005,0.50005 0 0 1 -0.003906,-0.046875 0.50005,0.50005 0 0 1 0,-0.00391 0.50005,0.50005 0 0 1 0,-0.044922 0.50005,0.50005 0 0 1 0,-0.00586 0.50005,0.50005 0 0 1 0.005859,-0.044922 0.50005,0.50005 0 0 1 0,-0.00391 0.50005,0.50005 0 0 1 0.003906,-0.019531 0.50005,0.50005 0 0 1 0.007813,-0.029297 0.50005,0.50005 0 0 1 0.0136719,-0.042969 0.50005,0.50005 0 0 1 0.001953,-0.00391 0.50005,0.50005 0 0 1 0.0175781,-0.042969 0.50005,0.50005 0 0 1 0.001953,-0.00195 0.50005,0.50005 0 0 1 0.0234375,-0.041016 0.50005,0.50005 0 0 1 0.001953,-0.00391 0.50005,0.50005 0 0 1 0.0273438,-0.037109 0.50005,0.50005 0 0 1 0.001953,-0.00391 0.50005,0.50005 0 0 1 0.0234375,-0.025391 0.50005,0.50005 0 0 1 0.007813,-0.00977 0.50005,0.50005 0 0 1 0.0351563,-0.033203 0.50005,0.50005 0 0 1 0.001953,-0.00195 0.50005,0.50005 0 0 1 0.009766,-0.00781 0.50005,0.50005 0 0 1 0.03125,-0.023438 0.50005,0.50005 0 0 1 0.0390625,-0.023437 0.50005,0.50005 0 0 1 0.003906,-0.00195 0.50005,0.50005 0 0 1 0.0917969,-0.039063 0.50005,0.50005 0 0 1 0.14257813,-0.023437 z"
     id="path2" />
</svg>
