<?xml version="1.0" encoding="UTF-8" standalone="no"?>
<svg
   xmlns:dc="http://purl.org/dc/elements/1.1/"
   xmlns:cc="http://creativecommons.org/ns#"
   xmlns:rdf="http://www.w3.org/1999/02/22-rdf-syntax-ns#"
   xmlns:svg="http://www.w3.org/2000/svg"
   xmlns="http://www.w3.org/2000/svg"
   xmlns:sodipodi="http://sodipodi.sourceforge.net/DTD/sodipodi-0.dtd"
   xmlns:inkscape="http://www.inkscape.org/namespaces/inkscape"
   data-dec="98"
   width="20"
   height="40"
   version="1.1"
   id="svg4"
   sodipodi:docname="98.svg"
   inkscape:version="0.92.4 (unknown)">
  <metadata
     id="metadata10">
    <rdf:RDF>
      <cc:Work
         rdf:about="">
        <dc:format>image/svg+xml</dc:format>
        <dc:type
           rdf:resource="http://purl.org/dc/dcmitype/StillImage" />
      </cc:Work>
    </rdf:RDF>
  </metadata>
  <defs
     id="defs8" />
  <sodipodi:namedview
     pagecolor="#ffffff"
     bordercolor="#666666"
     borderopacity="1"
     objecttolerance="10"
     gridtolerance="10"
     guidetolerance="10"
     inkscape:pageopacity="0"
     inkscape:pageshadow="2"
     inkscape:window-width="640"
     inkscape:window-height="480"
     id="namedview6"
     showgrid="false"
     inkscape:zoom="5.9"
     inkscape:cx="10"
     inkscape:cy="20"
     inkscape:window-x="0"
     inkscape:window-y="27"
     inkscape:window-maximized="0"
     inkscape:current-layer="svg4" />
  <path
     style="color:#000000;font-style:normal;font-variant:normal;font-weight:normal;font-stretch:normal;font-size:medium;line-height:normal;font-family:sans-serif;font-variant-ligatures:normal;font-variant-position:normal;font-variant-caps:normal;font-variant-numeric:normal;font-variant-alternates:normal;font-feature-settings:normal;text-indent:0;text-align:start;text-decoration:none;text-decoration-line:none;text-decoration-style:solid;text-decoration-color:#000000;letter-spacing:normal;word-spacing:normal;text-transform:none;writing-mode:lr-tb;direction:ltr;text-orientation:mixed;dominant-baseline:auto;baseline-shift:baseline;text-anchor:start;white-space:normal;shape-padding:0;clip-rule:nonzero;display:inline;overflow:visible;visibility:visible;opacity:1;isolation:auto;mix-blend-mode:normal;color-interpolation:sRGB;color-interpolation-filters:linearRGB;solid-color:#000000;solid-opacity:1;vector-effect:none;fill:#000000;fill-opacity:1;fill-rule:nonzero;stroke:none;stroke-width:2;stroke-linecap:round;stroke-linejoin:round;stroke-miterlimit:4;stroke-dasharray:none;stroke-dashoffset:0;stroke-opacity:1;color-rendering:auto;image-rendering:auto;shape-rendering:auto;text-rendering:auto;enable-background:accumulate"
     d="M 9.2363281,11 7.8183594,11.708984 7,14.164062 v 1.671876 L 7.8183594,18.291016 9.2363281,19 H 13.585938 L 14.125,18.458984 15,15.837891 V 14.162109 L 14.181641,11.708984 12.763672,11 Z M 3.984375,-0.01367188 A 1.0001,1.0001 0 0 1 4.1679688,0 H 4.8417969 A 1.0001,1.0001 0 0 1 5.1679688,0 H 6 A 1.0001,1.0001 0 0 1 7,1 V 7.8828125 L 8.5527344,7.1054688 A 1.0001,1.0001 0 0 1 9,7 h 1 2 1 a 1.0001,1.0001 0 0 1 0.447266,0.1054688 l 2,1 a 1.0001,1.0001 0 0 1 0.259765,0.1875 l 2,2.0000002 a 1.0001,1.0001 0 0 1 0.242188,0.390625 l 1,3 A 1.0001,1.0001 0 0 1 19,14 v 2 a 1.0001,1.0001 0 0 1 -0.05078,0.316406 l -1,3 a 1.0001,1.0001 0 0 1 -0.242188,0.390625 l -2,2 a 1.0001,1.0001 0 0 1 -0.259765,0.1875 l -2,1 A 1.0001,1.0001 0 0 1 13,23 H 12 10 9 A 1.0001,1.0001 0 0 1 8.5527344,22.894531 l -1.546875,-0.773437 a 1.0001,1.0001 0 0 1 -0.2695313,0.570312 1.0001,1.0001 0 0 1 -0.013672,0.01367 1.0001,1.0001 0 0 1 -0.00586,0.0059 A 1.0001,1.0001 0 0 1 5.8320312,23 H 5.1582031 A 1.0001,1.0001 0 0 1 4.8320312,23 H 4 A 1.0001,1.0001 0 0 1 3,22 V 1.1582031 a 1.0001,1.0001 0 0 1 0.2636719,-0.84960935 1.0001,1.0001 0 0 1 0.013672,-0.0136719 1.0001,1.0001 0 0 1 0.00586,-0.005859 1.0001,1.0001 0 0 1 0.7011719,-0.30273438 z"
     id="path2" />
</svg>
