<svg xmlns:dc="http://purl.org/dc/elements/1.1/" xmlns:cc="http://creativecommons.org/ns#" xmlns:rdf="http://www.w3.org/1999/02/22-rdf-syntax-ns#" xmlns:svg="http://www.w3.org/2000/svg" xmlns="http://www.w3.org/2000/svg" xmlns:sodipodi="http://sodipodi.sourceforge.net/DTD/sodipodi-0.dtd" xmlns:inkscape="http://www.inkscape.org/namespaces/inkscape" data-dec="187" id="dec_94" width="14" height="40" version="1.1" sodipodi:docname="187.svg" style="shape-rendering:crispEdges" inkscape:version="0.92.4 5da689c313, 2019-01-14">
  <metadata id="metadata9">
    <rdf:RDF>
      <cc:Work rdf:about="">
        <dc:format>image/svg+xml</dc:format>
        <dc:type rdf:resource="http://purl.org/dc/dcmitype/StillImage"/>
        <dc:title/>
      </cc:Work>
    </rdf:RDF>
  </metadata>
  <defs id="defs7"/>
  <sodipodi:namedview pagecolor="#ffffff" bordercolor="#666666" borderopacity="1" objecttolerance="10000" gridtolerance="10000" guidetolerance="10000" inkscape:pageopacity="0" inkscape:pageshadow="2" inkscape:window-width="1920" inkscape:window-height="1043" id="namedview5" showgrid="true" showguides="true" inkscape:zoom="19.982256" inkscape:cx="-7.1014243" inkscape:cy="18.329523" inkscape:window-x="0" inkscape:window-y="37" inkscape:window-maximized="0" inkscape:current-layer="dec_94">
    <inkscape:grid type="xygrid" id="grid819"/>
  </sodipodi:namedview>
  <path id="path8-3" style="fill:none;fill-rule:evenodd;stroke:#000000;stroke-width:1px;stroke-linecap:round;stroke-linejoin:round;stroke-opacity:1;shape-rendering:crispEdges" d="M 1,8 6,14 1,20 M 7,8 12,14 7,20 M 7,20 13,14 7,8 M 7,20 11,14 7,8 M 1,20 7,14 1,8 M 1,20 5,14 1,8 " inkscape:connector-curvature="0" sodipodi:nodetypes="cccccccccccccccccc"/>
</svg>