<?xml version="1.0" encoding="UTF-8" standalone="no"?>
<svg
   xmlns:dc="http://purl.org/dc/elements/1.1/"
   xmlns:cc="http://creativecommons.org/ns#"
   xmlns:rdf="http://www.w3.org/1999/02/22-rdf-syntax-ns#"
   xmlns:svg="http://www.w3.org/2000/svg"
   xmlns="http://www.w3.org/2000/svg"
   xmlns:sodipodi="http://sodipodi.sourceforge.net/DTD/sodipodi-0.dtd"
   xmlns:inkscape="http://www.inkscape.org/namespaces/inkscape"
   data-dec="115"
   width="18"
   height="40"
   version="1.1"
   id="svg4"
   sodipodi:docname="115.svg"
   inkscape:version="0.92.4 (unknown)">
  <metadata
     id="metadata10">
    <rdf:RDF>
      <cc:Work
         rdf:about="">
        <dc:format>image/svg+xml</dc:format>
        <dc:type
           rdf:resource="http://purl.org/dc/dcmitype/StillImage" />
      </cc:Work>
    </rdf:RDF>
  </metadata>
  <defs
     id="defs8" />
  <sodipodi:namedview
     pagecolor="#ffffff"
     bordercolor="#666666"
     borderopacity="1"
     objecttolerance="10"
     gridtolerance="10"
     guidetolerance="10"
     inkscape:pageopacity="0"
     inkscape:pageshadow="2"
     inkscape:window-width="640"
     inkscape:window-height="480"
     id="namedview6"
     showgrid="false"
     inkscape:zoom="5.9"
     inkscape:cx="9"
     inkscape:cy="20"
     inkscape:window-x="0"
     inkscape:window-y="27"
     inkscape:window-maximized="0"
     inkscape:current-layer="svg4" />
  <path
     style="color:#000000;font-style:normal;font-variant:normal;font-weight:normal;font-stretch:normal;font-size:medium;line-height:normal;font-family:sans-serif;font-variant-ligatures:normal;font-variant-position:normal;font-variant-caps:normal;font-variant-numeric:normal;font-variant-alternates:normal;font-feature-settings:normal;text-indent:0;text-align:start;text-decoration:none;text-decoration-line:none;text-decoration-style:solid;text-decoration-color:#000000;letter-spacing:normal;word-spacing:normal;text-transform:none;writing-mode:lr-tb;direction:ltr;text-orientation:mixed;dominant-baseline:auto;baseline-shift:baseline;text-anchor:start;white-space:normal;shape-padding:0;clip-rule:nonzero;display:inline;overflow:visible;visibility:visible;opacity:1;isolation:auto;mix-blend-mode:normal;color-interpolation:sRGB;color-interpolation-filters:linearRGB;solid-color:#000000;solid-opacity:1;vector-effect:none;fill:#013272;fill-opacity:1;fill-rule:nonzero;stroke:none;stroke-width:3;stroke-linecap:round;stroke-linejoin:round;stroke-miterlimit:4;stroke-dasharray:none;stroke-dashoffset:0;stroke-opacity:1;color-rendering:auto;image-rendering:auto;shape-rendering:auto;text-rendering:auto;enable-background:accumulate"
     d="m 6,6.5 h 4 a 1.50015,1.50015 0 0 1 0.669922,0.1582031 l 2,1 A 1.50015,1.50015 0 0 1 12.988281,7.8730469 1.50015,1.50015 0 0 1 15.5,9 v 3 a 1.50015,1.50015 0 0 1 -2.841797,0.669922 l -0.890625,-1.78125 -0.65625,-0.65625 L 9.6464844,9.5 H 6.3535156 L 4.8886719,10.232422 4.5,10.621094 v 0.757812 l 0.3886719,0.388672 1.6015625,0.800781 4.8046876,0.960938 a 1.50015,1.50015 0 0 1 0.375,0.128906 l 2,1 a 1.50015,1.50015 0 0 1 0.390625,0.28125 l 1,1 A 1.50015,1.50015 0 0 1 15.5,17 v 3 a 1.50015,1.50015 0 0 1 -0.439453,1.060547 l -1,1 a 1.50015,1.50015 0 0 1 -0.390625,0.28125 l -2,1 A 1.50015,1.50015 0 0 1 11,23.5 H 7 A 1.50015,1.50015 0 0 1 6.3300781,23.341797 L 4.4511719,22.402344 A 1.50015,1.50015 0 0 1 1.5,22 v -4 a 1.50015,1.50015 0 0 1 2.8417969,-0.669922 l 0.890625,1.78125 0.65625,0.65625 L 7.3535156,20.5 H 10.646484 L 12.111328,19.767578 12.5,19.378906 V 17.621094 L 12.111328,17.232422 10.509766,16.431641 5.7050781,15.470703 a 1.50015,1.50015 0 0 1 -0.375,-0.128906 l -2,-1 a 1.50015,1.50015 0 0 1 -0.390625,-0.28125 l -1,-1 A 1.50015,1.50015 0 0 1 1.5,12 V 10 A 1.50015,1.50015 0 0 1 1.9394531,8.9394531 l 1,-1 a 1.50015,1.50015 0 0 1 0.390625,-0.28125 l 2,-1 A 1.50015,1.50015 0 0 1 6,6.5 Z"
     id="path2" />
</svg>
