<?xml version="1.0" encoding="UTF-8" standalone="no"?>
<svg
   xmlns:dc="http://purl.org/dc/elements/1.1/"
   xmlns:cc="http://creativecommons.org/ns#"
   xmlns:rdf="http://www.w3.org/1999/02/22-rdf-syntax-ns#"
   xmlns:svg="http://www.w3.org/2000/svg"
   xmlns="http://www.w3.org/2000/svg"
   xmlns:sodipodi="http://sodipodi.sourceforge.net/DTD/sodipodi-0.dtd"
   xmlns:inkscape="http://www.inkscape.org/namespaces/inkscape"
   data-dec="33"
   width="12"
   height="40"
   version="1.1"
   id="svg4"
   sodipodi:docname="33.svg"
   inkscape:version="0.92.4 (unknown)">
  <metadata
     id="metadata10">
    <rdf:RDF>
      <cc:Work
         rdf:about="">
        <dc:format>image/svg+xml</dc:format>
        <dc:type
           rdf:resource="http://purl.org/dc/dcmitype/StillImage" />
      </cc:Work>
    </rdf:RDF>
  </metadata>
  <defs
     id="defs8" />
  <sodipodi:namedview
     pagecolor="#ffffff"
     bordercolor="#666666"
     borderopacity="1"
     objecttolerance="10"
     gridtolerance="10"
     guidetolerance="10"
     inkscape:pageopacity="0"
     inkscape:pageshadow="2"
     inkscape:window-width="640"
     inkscape:window-height="480"
     id="namedview6"
     showgrid="false"
     inkscape:zoom="5.9"
     inkscape:cx="6"
     inkscape:cy="20"
     inkscape:window-x="0"
     inkscape:window-y="27"
     inkscape:window-maximized="0"
     inkscape:current-layer="svg4" />
  <path
     style="color:#000000;font-style:normal;font-variant:normal;font-weight:normal;font-stretch:normal;font-size:medium;line-height:normal;font-family:sans-serif;font-variant-ligatures:normal;font-variant-position:normal;font-variant-caps:normal;font-variant-numeric:normal;font-variant-alternates:normal;font-feature-settings:normal;text-indent:0;text-align:start;text-decoration:none;text-decoration-line:none;text-decoration-style:solid;text-decoration-color:#000000;letter-spacing:normal;word-spacing:normal;text-transform:none;writing-mode:lr-tb;direction:ltr;text-orientation:mixed;dominant-baseline:auto;baseline-shift:baseline;text-anchor:start;white-space:normal;shape-padding:0;clip-rule:nonzero;display:inline;overflow:visible;visibility:visible;opacity:1;isolation:auto;mix-blend-mode:normal;color-interpolation:sRGB;color-interpolation-filters:linearRGB;solid-color:#000000;solid-opacity:1;vector-effect:none;fill:#013272;fill-opacity:1;fill-rule:nonzero;stroke:none;stroke-width:2.5;stroke-linecap:round;stroke-linejoin:round;stroke-miterlimit:4;stroke-dasharray:none;stroke-dashoffset:0;stroke-opacity:1;color-rendering:auto;image-rendering:auto;shape-rendering:auto;text-rendering:auto;enable-background:accumulate"
     d="m 2.9746094,18.738281 a 1.250125,1.250125 0 0 1 0.017578,0 1.250125,1.250125 0 0 1 1.0332031,0.517578 l 0.859375,0.859375 a 1.250125,1.250125 0 0 1 0,1.769532 l -1,1 a 1.250125,1.250125 0 0 1 -1.7695312,0 l -1,-1 a 1.250125,1.250125 0 0 1 0,-1.769532 l 0.8632812,-0.863281 a 1.250125,1.250125 0 0 1 0.9785156,-0.511719 1.250125,1.250125 0 0 1 0.017578,-0.002 z m 5,-18.99999975 a 1.250125,1.250125 0 0 1 0.017578,0 1.250125,1.250125 0 0 1 1.0332031,0.51757813 L 9.8847656,1.1152344 A 1.250125,1.250125 0 0 1 10.185547,2.3945312 L 6.2011719,14.345703 a 1.250125,1.250125 0 0 1 -0.011719,0.04102 1.250125,1.250125 0 0 1 -0.035156,0.09766 1.250125,1.250125 0 0 1 -0.00781,0.01953 1.250125,1.250125 0 0 1 -0.041016,0.08789 1.250125,1.250125 0 0 1 -0.013672,0.02539 1.250125,1.250125 0 0 1 -0.052734,0.08594 1.250125,1.250125 0 0 1 -0.011719,0.02148 1.250125,1.250125 0 0 1 -0.013672,0.01953 1.250125,1.250125 0 0 1 -0.037109,0.04492 1.250125,1.250125 0 0 1 -0.00781,0.01172 1.250125,1.250125 0 0 1 -0.00391,0.0039 1.250125,1.250125 0 0 1 -0.013672,0.01758 1.250125,1.250125 0 0 1 -0.066406,0.07226 1.250125,1.250125 0 0 1 -0.019531,0.01953 1.250125,1.250125 0 0 1 -0.072266,0.06445 1.250125,1.250125 0 0 1 -0.1230469,0.0918 1.250125,1.250125 0 0 1 -0.083984,0.04688 1.250125,1.250125 0 0 1 -0.023437,0.01367 1.250125,1.250125 0 0 1 -0.078125,0.03516 1.250125,1.250125 0 0 1 -0.011719,0.0059 1.250125,1.250125 0 0 1 -0.00391,0.002 1.250125,1.250125 0 0 1 -0.021484,0.0098 1.250125,1.250125 0 0 1 -0.021484,0.0078 1.250125,1.250125 0 0 1 -0.029297,0.0098 1.250125,1.250125 0 0 1 -0.041016,0.01172 1.250125,1.250125 0 0 1 -0.041016,0.01367 1.250125,1.250125 0 0 1 -0.048828,0.0098 1.250125,1.250125 0 0 1 -0.03125,0.0078 1.250125,1.250125 0 0 1 -0.00195,0 1.250125,1.250125 0 0 1 -0.00977,0.002 1.250125,1.250125 0 0 1 -0.015625,0.0039 1.250125,1.250125 0 0 1 -0.00977,0.002 1.250125,1.250125 0 0 1 -0.052734,0.0059 1.250125,1.250125 0 0 1 -0.011719,0 1.250125,1.250125 0 0 1 -0.039063,0.0039 1.250125,1.250125 0 0 1 -0.015625,0.002 1.250125,1.250125 0 0 1 -0.037109,0.002 1.250125,1.250125 0 0 1 -0.019531,0 1.250125,1.250125 0 0 1 -0.035156,0.002 1.250125,1.250125 0 0 1 -0.00977,0 1.250125,1.250125 0 0 1 -0.039063,-0.002 1.250125,1.250125 0 0 1 -0.00391,0 1.250125,1.250125 0 0 1 -0.041016,-0.0039 1.250125,1.250125 0 0 1 -0.03125,-0.002 1.250125,1.250125 0 0 1 -0.015625,-0.002 1.250125,1.250125 0 0 1 -0.011719,-0.002 1.250125,1.250125 0 0 1 -0.027344,-0.0039 1.250125,1.250125 0 0 1 -0.042969,-0.0078 1.250125,1.250125 0 0 1 -0.021484,-0.0039 1.250125,1.250125 0 0 1 -0.017578,-0.0039 1.250125,1.250125 0 0 1 -0.00977,-0.002 1.250125,1.250125 0 0 1 -0.015625,-0.0039 1.250125,1.250125 0 0 1 -0.011719,-0.002 1.250125,1.250125 0 0 1 -0.025391,-0.0078 1.250125,1.250125 0 0 1 -0.019531,-0.0059 1.250125,1.250125 0 0 1 -0.044922,-0.01367 1.250125,1.250125 0 0 1 -0.013672,-0.0039 1.250125,1.250125 0 0 1 -0.033203,-0.01367 1.250125,1.250125 0 0 1 -0.00977,-0.0039 A 1.250125,1.250125 0 0 1 4.5,15.164062 a 1.250125,1.250125 0 0 1 -0.046875,-0.02148 1.250125,1.250125 0 0 1 -0.035156,-0.01953 1.250125,1.250125 0 0 1 -0.033203,-0.01563 1.250125,1.250125 0 0 1 -0.011719,-0.0078 1.250125,1.250125 0 0 1 -0.00977,-0.0039 1.250125,1.250125 0 0 1 -0.00977,-0.0059 1.250125,1.250125 0 0 1 -0.039063,-0.02539 1.250125,1.250125 0 0 1 0,-0.002 1.250125,1.250125 0 0 1 -0.00195,0 1.250125,1.250125 0 0 1 -0.03125,-0.01953 1.250125,1.250125 0 0 1 -0.011719,-0.0098 1.250125,1.250125 0 0 1 -0.00977,-0.0059 1.250125,1.250125 0 0 1 -0.019531,-0.01563 A 1.250125,1.250125 0 0 1 4.2265625,15 a 1.250125,1.250125 0 0 1 -0.023437,-0.01758 1.250125,1.250125 0 0 1 -0.021484,-0.01758 1.250125,1.250125 0 0 1 -0.023437,-0.02149 1.250125,1.250125 0 0 1 -0.027344,-0.02539 1.250125,1.250125 0 0 1 -0.00781,-0.0078 1.250125,1.250125 0 0 1 -0.044922,-0.04492 1.250125,1.250125 0 0 1 -0.011719,-0.01367 1.250125,1.250125 0 0 1 -0.00781,-0.0098 1.250125,1.250125 0 0 1 -0.064453,-0.07813 1.250125,1.250125 0 0 1 -0.011719,-0.01563 1.250125,1.250125 0 0 1 -0.00195,-0.0039 1.250125,1.250125 0 0 1 -0.056641,-0.08399 1.250125,1.250125 0 0 1 -0.00977,-0.01953 1.250125,1.250125 0 0 1 -0.00586,-0.0098 1.250125,1.250125 0 0 1 -0.041016,-0.07617 1.250125,1.250125 0 0 1 -0.00586,-0.01172 1.250125,1.250125 0 0 1 -0.00586,-0.01563 1.250125,1.250125 0 0 1 -0.00586,-0.01367 1.250125,1.250125 0 0 1 -0.03125,-0.07813 1.250125,1.250125 0 0 1 -0.00781,-0.02344 1.250125,1.250125 0 0 1 -0.029297,-0.09766 1.250125,1.250125 0 0 1 -0.00391,-0.02344 1.250125,1.250125 0 0 1 -0.017578,-0.0918 1.250125,1.250125 0 0 1 -0.00391,-0.01953 1.250125,1.250125 0 0 1 0,-0.01172 1.250125,1.250125 0 0 1 -0.00977,-0.09961 1.250125,1.250125 0 0 1 0.00391,-0.15039 1.250125,1.250125 0 0 1 0.011719,-0.09961 1.250125,1.250125 0 0 1 0.017578,-0.09375 L 5.7675781,1.7949219 A 1.250125,1.250125 0 0 1 6.1152344,1.1152344 L 6.9785156,0.25195312 a 1.250125,1.250125 0 0 1 0.9785156,-0.51171874 1.250125,1.250125 0 0 1 0.017578,-0.001953 z"
     id="path2" />
</svg>
