<?xml version="1.0" encoding="UTF-8" standalone="no"?>
<svg
   xmlns:dc="http://purl.org/dc/elements/1.1/"
   xmlns:cc="http://creativecommons.org/ns#"
   xmlns:rdf="http://www.w3.org/1999/02/22-rdf-syntax-ns#"
   xmlns:svg="http://www.w3.org/2000/svg"
   xmlns="http://www.w3.org/2000/svg"
   xmlns:sodipodi="http://sodipodi.sourceforge.net/DTD/sodipodi-0.dtd"
   xmlns:inkscape="http://www.inkscape.org/namespaces/inkscape"
   data-dec="53"
   width="20"
   height="40"
   version="1.1"
   id="svg4"
   sodipodi:docname="53.svg"
   inkscape:version="0.92.4 5da689c313, 2019-01-14">
  <metadata
     id="metadata10">
    <rdf:RDF>
      <cc:Work
         rdf:about="">
        <dc:format>image/svg+xml</dc:format>
        <dc:type
           rdf:resource="http://purl.org/dc/dcmitype/StillImage" />
        <dc:title></dc:title>
      </cc:Work>
    </rdf:RDF>
  </metadata>
  <defs
     id="defs8" />
  <sodipodi:namedview
     pagecolor="#ffffff"
     bordercolor="#666666"
     borderopacity="1"
     objecttolerance="10"
     gridtolerance="10"
     guidetolerance="10"
     inkscape:pageopacity="0"
     inkscape:pageshadow="2"
     inkscape:window-width="1920"
     inkscape:window-height="1043"
     id="namedview6"
     showgrid="false"
     inkscape:zoom="5.9"
     inkscape:cx="10"
     inkscape:cy="20"
     inkscape:window-x="0"
     inkscape:window-y="37"
     inkscape:window-maximized="0"
     inkscape:current-layer="svg4" />
  <path
     style="color:#000000;font-style:normal;font-variant:normal;font-weight:normal;font-stretch:normal;font-size:medium;line-height:normal;font-family:sans-serif;font-variant-ligatures:normal;font-variant-position:normal;font-variant-caps:normal;font-variant-numeric:normal;font-variant-alternates:normal;font-feature-settings:normal;text-indent:0;text-align:start;text-decoration:none;text-decoration-line:none;text-decoration-style:solid;text-decoration-color:#000000;letter-spacing:normal;word-spacing:normal;text-transform:none;writing-mode:lr-tb;direction:ltr;text-orientation:mixed;dominant-baseline:auto;baseline-shift:baseline;text-anchor:start;white-space:normal;shape-padding:0;clip-rule:nonzero;display:inline;overflow:visible;visibility:visible;opacity:1;isolation:auto;mix-blend-mode:normal;color-interpolation:sRGB;color-interpolation-filters:linearRGB;solid-color:#000000;solid-opacity:1;vector-effect:none;fill:#000000;fill-opacity:1;fill-rule:nonzero;stroke:none;stroke-width:1;stroke-linecap:round;stroke-linejoin:round;stroke-miterlimit:4;stroke-dasharray:none;stroke-dashoffset:0;stroke-opacity:1;color-rendering:auto;image-rendering:auto;shape-rendering:auto;text-rendering:auto;enable-background:accumulate"
     d="m 5,0.5 h 10 a 0.50005,0.50005 0 1 1 0,1 H 5.4472656 L 4.6542969,8.640625 a 0.50005,0.50005 0 0 1 0.1875,-0.1152344 l 3,-1 A 0.50005,0.50005 0 0 1 8,7.5 h 3 a 0.50005,0.50005 0 0 1 0.158203,0.025391 l 3,1 a 0.50005,0.50005 0 0 1 0.195313,0.1210938 l 2,1.9999996 a 0.50005,0.50005 0 0 1 0.121093,0.195313 l 1,3 A 0.50005,0.50005 0 0 1 17.5,14 v 2 a 0.50005,0.50005 0 0 1 -0.02539,0.158203 l -1,3 a 0.50005,0.50005 0 0 1 -0.121093,0.195313 l -2,2 a 0.50005,0.50005 0 0 1 -0.195313,0.121093 l -3,1 A 0.50005,0.50005 0 0 1 11,22.5 H 8 a 0.50005,0.50005 0 0 1 -0.1582031,-0.02539 l -3,-1 A 0.50005,0.50005 0 0 1 4.6464844,21.353516 l -1,-1 a 0.50005,0.50005 0 0 1 -0.09375,-0.13086 l -1,-2 a 0.50005,0.50005 0 1 1 0.8945312,-0.445312 l 0.9628906,1.925781 0.859375,0.859375 2.8125,0.9375 h 2.8359378 l 2.8125,-0.9375 1.832031,-1.832031 0.9375,-2.8125 V 14.082031 L 15.5625,11.269531 13.730469,9.4375 10.917969,8.5 H 8.0820312 l -2.8125,0.9375 -0.9160156,0.916016 A 0.50005,0.50005 0 0 1 3.5039062,9.9453125 l 1,-9 A 0.50005,0.50005 0 0 1 5,0.5 Z"
     id="path2" />
</svg>
