<?xml version="1.0" encoding="UTF-8" standalone="no"?>
<svg
   xmlns:dc="http://purl.org/dc/elements/1.1/"
   xmlns:cc="http://creativecommons.org/ns#"
   xmlns:rdf="http://www.w3.org/1999/02/22-rdf-syntax-ns#"
   xmlns:svg="http://www.w3.org/2000/svg"
   xmlns="http://www.w3.org/2000/svg"
   xmlns:sodipodi="http://sodipodi.sourceforge.net/DTD/sodipodi-0.dtd"
   xmlns:inkscape="http://www.inkscape.org/namespaces/inkscape"
   data-dec="64"
   width="28"
   height="40"
   version="1.1"
   id="svg4"
   sodipodi:docname="64.svg"
   inkscape:version="0.92.4 (unknown)">
  <metadata
     id="metadata10">
    <rdf:RDF>
      <cc:Work
         rdf:about="">
        <dc:format>image/svg+xml</dc:format>
        <dc:type
           rdf:resource="http://purl.org/dc/dcmitype/StillImage" />
      </cc:Work>
    </rdf:RDF>
  </metadata>
  <defs
     id="defs8" />
  <sodipodi:namedview
     pagecolor="#ffffff"
     bordercolor="#666666"
     borderopacity="1"
     objecttolerance="10"
     gridtolerance="10"
     guidetolerance="10"
     inkscape:pageopacity="0"
     inkscape:pageshadow="2"
     inkscape:window-width="640"
     inkscape:window-height="480"
     id="namedview6"
     showgrid="false"
     inkscape:zoom="5.9"
     inkscape:cx="14"
     inkscape:cy="20"
     inkscape:window-x="0"
     inkscape:window-y="27"
     inkscape:window-maximized="0"
     inkscape:current-layer="svg4" />
  <path
     style="color:#000000;font-style:normal;font-variant:normal;font-weight:normal;font-stretch:normal;font-size:medium;line-height:normal;font-family:sans-serif;font-variant-ligatures:normal;font-variant-position:normal;font-variant-caps:normal;font-variant-numeric:normal;font-variant-alternates:normal;font-feature-settings:normal;text-indent:0;text-align:start;text-decoration:none;text-decoration-line:none;text-decoration-style:solid;text-decoration-color:#000000;letter-spacing:normal;word-spacing:normal;text-transform:none;writing-mode:lr-tb;direction:ltr;text-orientation:mixed;dominant-baseline:auto;baseline-shift:baseline;text-anchor:start;white-space:normal;shape-padding:0;clip-rule:nonzero;display:inline;overflow:visible;visibility:visible;opacity:1;isolation:auto;mix-blend-mode:normal;color-interpolation:sRGB;color-interpolation-filters:linearRGB;solid-color:#000000;solid-opacity:1;vector-effect:none;fill:#013272;fill-opacity:1;fill-rule:nonzero;stroke:none;stroke-width:2.5;stroke-linecap:round;stroke-linejoin:round;stroke-miterlimit:4;stroke-dasharray:none;stroke-dashoffset:0;stroke-opacity:1;color-rendering:auto;image-rendering:auto;shape-rendering:auto;text-rendering:auto;enable-background:accumulate"
     d="M 12.519531,7.25 11.091797,8.6757812 10.25,11.203125 v 2.501953 l 0.777344,1.554688 0.492187,0.490234 h 2.185547 l 1.363281,-0.681641 0.71875,-1.433593 0.625,-5.0156254 -0.34375,-0.6875 L 14.705078,7.25 Z M 12.203125,2.25 9.4804688,3.1582031 7.7402344,4.0273438 6.0273438,5.7402344 5.1582031,7.4804688 4.25,10.203125 v 2.59375 l 0.9082031,2.722656 0.8691407,1.740235 1.7128906,1.71289 1.7402344,0.869141 L 12.203125,20.75 h 2.59375 L 17.519531,19.841797 19.259766,18.972656 19.980469,18.25 H 19.179688 A 1.250125,1.250125 0 0 1 18.355469,18.074219 L 16.5,17.146484 14.558594,18.117188 A 1.250125,1.250125 0 0 1 14,18.25 H 11.179688 A 1.250125,1.250125 0 0 1 10.355469,18.074219 L 8.4414062,17.117188 A 1.250125,1.250125 0 0 1 7.8828125,16.558594 l -1,-2 A 1.250125,1.250125 0 0 1 6.75,14 v -3 a 1.250125,1.250125 0 0 1 0.064453,-0.394531 l 1,-3.0000002 A 1.250125,1.250125 0 0 1 8.1152344,7.1152344 l 1,-1 A 1.250125,1.250125 0 0 1 9.4414062,5.8828125 L 11.347656,4.9296875 A 1.250125,1.250125 0 0 1 12.177734,4.75 H 15 a 1.250125,1.250125 0 0 1 0.558594,0.1328125 l 1.28125,0.640625 a 1.250125,1.250125 0 0 1 1.662109,-0.6855469 1.250125,1.250125 0 0 1 1.738281,1.3164063 L 19.25,14.078125 v 1.404297 L 19.517578,15.75 h 0.964844 L 21.908203,14.324219 22.75,11.796875 v -1.59375 L 21.841797,7.4804688 20.972656,5.7402344 19.259766,4.0273438 17.519531,3.1582031 14.796875,2.25 Z M 12,-0.25 h 3 a 1.250125,1.250125 0 0 1 0.394531,0.0644531 l 3,1 a 1.250125,1.250125 0 0 1 0.164063,0.0683594 l 2,1 a 1.250125,1.250125 0 0 1 0.326172,0.2324219 l 2,2 a 1.250125,1.250125 0 0 1 0.232422,0.3261718 l 1,2 a 1.250125,1.250125 0 0 1 0.06836,0.1640626 l 1,3 A 1.250125,1.250125 0 0 1 25.25,10 v 2 a 1.250125,1.250125 0 0 1 -0.06445,0.394531 l -1,3 a 1.250125,1.250125 0 0 1 -0.300781,0.490235 l -2,2 a 1.250125,1.250125 0 0 1 -0.123047,0.103515 1.250125,1.250125 0 0 1 0.123047,1.896485 l -1,1 a 1.250125,1.250125 0 0 1 -0.326172,0.232422 l -2,1 a 1.250125,1.250125 0 0 1 -0.164063,0.06836 l -3,1 A 1.250125,1.250125 0 0 1 15,23.25 h -3 a 1.250125,1.250125 0 0 1 -0.394531,-0.06445 l -3.0000002,-1 a 1.250125,1.250125 0 0 1 -0.1640626,-0.06836 l -2,-1 A 1.250125,1.250125 0 0 1 6.1152344,20.884766 l -2,-2 A 1.250125,1.250125 0 0 1 3.8828125,18.558594 l -1,-2 a 1.250125,1.250125 0 0 1 -0.068359,-0.164063 l -1,-3 A 1.250125,1.250125 0 0 1 1.75,13 v -3 a 1.250125,1.250125 0 0 1 0.064453,-0.3945312 l 1,-3 a 1.250125,1.250125 0 0 1 0.068359,-0.1640626 l 1,-2 A 1.250125,1.250125 0 0 1 4.1152344,4.1152344 l 2,-2 A 1.250125,1.250125 0 0 1 6.4414062,1.8828125 l 2,-1 a 1.250125,1.250125 0 0 1 0.1640626,-0.0683594 l 3.0000002,-1 A 1.250125,1.250125 0 0 1 12,-0.25 Z"
     id="path2" />
</svg>
