<?xml version="1.0" encoding="UTF-8" standalone="no"?>
<svg
   xmlns:dc="http://purl.org/dc/elements/1.1/"
   xmlns:cc="http://creativecommons.org/ns#"
   xmlns:rdf="http://www.w3.org/1999/02/22-rdf-syntax-ns#"
   xmlns:svg="http://www.w3.org/2000/svg"
   xmlns="http://www.w3.org/2000/svg"
   xmlns:sodipodi="http://sodipodi.sourceforge.net/DTD/sodipodi-0.dtd"
   xmlns:inkscape="http://www.inkscape.org/namespaces/inkscape"
   data-dec="78"
   id="dec_78"
   width="22"
   height="40"
   version="1.1"
   sodipodi:docname="78.svg"
   inkscape:version="0.91 r13725">
  <metadata
     id="metadata9">
    <rdf:RDF>
      <cc:Work
         rdf:about="">
        <dc:format>image/svg+xml</dc:format>
        <dc:type
           rdf:resource="http://purl.org/dc/dcmitype/StillImage" />
      </cc:Work>
    </rdf:RDF>
  </metadata>
  <defs
     id="defs7" />
  <sodipodi:namedview
     pagecolor="#ffffff"
     bordercolor="#666666"
     borderopacity="1"
     objecttolerance="10"
     gridtolerance="10"
     guidetolerance="10"
     inkscape:pageopacity="0"
     inkscape:pageshadow="2"
     inkscape:window-width="1333"
     inkscape:window-height="744"
     id="namedview5"
     showgrid="true"
     inkscape:zoom="23.6"
     inkscape:cx="11.487289"
     inkscape:cy="26.461865"
     inkscape:window-x="33"
     inkscape:window-y="924"
     inkscape:window-maximized="1"
     inkscape:current-layer="dec_78">
    <inkscape:grid
       type="xygrid"
       id="grid819" />
  </sodipodi:namedview>
  <path
     style="color:#000000;font-style:normal;font-variant:normal;font-weight:normal;font-stretch:normal;font-size:medium;line-height:normal;font-family:sans-serif;text-indent:0;text-align:start;text-decoration:none;text-decoration-line:none;text-decoration-style:solid;text-decoration-color:#000000;letter-spacing:normal;word-spacing:normal;text-transform:none;direction:ltr;block-progression:tb;writing-mode:lr-tb;baseline-shift:baseline;text-anchor:start;white-space:normal;clip-rule:nonzero;display:inline;overflow:visible;visibility:visible;opacity:1;isolation:auto;mix-blend-mode:normal;color-interpolation:sRGB;color-interpolation-filters:linearRGB;solid-color:#000000;solid-opacity:1;fill:#000000;fill-opacity:1;fill-rule:nonzero;stroke:none;stroke-width:1px;stroke-linecap:round;stroke-linejoin:round;stroke-miterlimit:4;stroke-dasharray:none;stroke-dashoffset:0;stroke-opacity:1;color-rendering:auto;image-rendering:auto;shape-rendering:auto;text-rendering:auto;enable-background:accumulate"
     d="M 3.9921875 0.4921875 A 0.50005 0.50005 0 0 0 3.6757812 0.61328125 A 0.50005 0.50005 0 0 0 3.65625 0.62890625 A 0.50005 0.50005 0 0 0 3.6386719 0.64648438 A 0.50005 0.50005 0 0 0 3.6367188 0.65039062 A 0.50005 0.50005 0 0 0 3.6054688 0.68359375 A 0.50005 0.50005 0 0 0 3.6035156 0.6875 A 0.50005 0.50005 0 0 0 3.5 1.0820312 L 3.5 21.919922 A 0.50005 0.50005 0 0 0 3.6132812 22.324219 A 0.50005 0.50005 0 0 0 3.6289062 22.34375 A 0.50005 0.50005 0 0 0 3.6464844 22.361328 A 0.50005 0.50005 0 0 0 3.6503906 22.363281 A 0.50005 0.50005 0 0 0 3.6835938 22.394531 A 0.50005 0.50005 0 0 0 3.6875 22.396484 A 0.50005 0.50005 0 0 0 4.0820312 22.5 L 6 22.5 A 0.50005 0.50005 0 0 0 6.5 22 L 6.5 5.7753906 L 16.574219 22.259766 A 0.50005 0.50005 0 0 0 17 22.5 L 17.992188 22.5 L 19 22.5 A 0.50005 0.50005 0 0 0 19.5 22 L 19.5 1.0800781 A 0.50005 0.50005 0 0 0 19.507812 0.9921875 A 0.50005 0.50005 0 0 0 19.503906 0.94335938 A 0.50005 0.50005 0 0 0 19.496094 0.89257812 A 0.50005 0.50005 0 0 0 19.3125 0.60351562 A 0.50005 0.50005 0 0 0 19.226562 0.55078125 A 0.50005 0.50005 0 0 0 19.181641 0.53125 A 0.50005 0.50005 0 0 0 19.132812 0.515625 A 0.50005 0.50005 0 0 0 19 0.5 L 17.080078 0.5 A 0.50005 0.50005 0 0 0 16.675781 0.61328125 A 0.50005 0.50005 0 0 0 16.65625 0.62890625 A 0.50005 0.50005 0 0 0 16.638672 0.64648438 A 0.50005 0.50005 0 0 0 16.636719 0.65039062 A 0.50005 0.50005 0 0 0 16.605469 0.68359375 A 0.50005 0.50005 0 0 0 16.603516 0.6875 A 0.50005 0.50005 0 0 0 16.5 1.0820312 L 16.5 17.224609 L 6.4257812 0.74023438 L 6.4238281 0.74414062 A 0.50005 0.50005 0 0 0 6 0.5 L 5.0078125 0.5 L 4.0800781 0.5 A 0.50005 0.50005 0 0 0 3.9921875 0.4921875 z M 17.5 1.5 L 17.917969 1.5 A 0.50005 0.50005 0 0 0 17.5 1.9648438 L 17.5 1.5 z M 18.080078 1.5 L 18.5 1.5 L 18.5 2 A 0.50005 0.50005 0 0 0 18.080078 1.5 z M 5.5 2.7597656 L 5.9550781 3.4941406 L 5.9550781 3.4960938 A 0.50005 0.50005 0 0 0 5.9433594 3.4960938 A 0.50005 0.50005 0 0 0 5.9296875 3.4980469 A 0.50005 0.50005 0 0 0 5.90625 3.5019531 A 0.50005 0.50005 0 0 0 5.8691406 3.5117188 A 0.50005 0.50005 0 0 0 5.8652344 3.5117188 A 0.50005 0.50005 0 0 0 5.8613281 3.5136719 A 0.50005 0.50005 0 0 0 5.8300781 3.5234375 A 0.50005 0.50005 0 0 0 5.8105469 3.53125 A 0.50005 0.50005 0 0 0 5.7910156 3.5390625 A 0.50005 0.50005 0 0 0 5.7109375 3.5839844 A 0.50005 0.50005 0 0 0 5.671875 3.6152344 A 0.50005 0.50005 0 0 0 5.6035156 3.6875 A 0.50005 0.50005 0 0 0 5.5 3.9414062 L 5.5 2.7597656 z M 17.5 19.058594 L 17.5 20.240234 L 17.044922 19.505859 L 17.044922 19.503906 A 0.50005 0.50005 0 0 0 17.056641 19.503906 A 0.50005 0.50005 0 0 0 17.085938 19.5 A 0.50005 0.50005 0 0 0 17.09375 19.498047 A 0.50005 0.50005 0 0 0 17.130859 19.488281 A 0.50005 0.50005 0 0 0 17.134766 19.488281 A 0.50005 0.50005 0 0 0 17.154297 19.482422 A 0.50005 0.50005 0 0 0 17.181641 19.472656 A 0.50005 0.50005 0 0 0 17.201172 19.464844 A 0.50005 0.50005 0 0 0 17.208984 19.460938 A 0.50005 0.50005 0 0 0 17.289062 19.416016 A 0.50005 0.50005 0 0 0 17.328125 19.384766 A 0.50005 0.50005 0 0 0 17.396484 19.3125 A 0.50005 0.50005 0 0 0 17.5 19.058594 z M 4.5 21 A 0.50005 0.50005 0 0 0 5 21.5 A 0.50005 0.50005 0 0 0 5.5 21.080078 L 5.5 21.5 L 5 21.5 L 4.5 21.5 L 4.5 21 z "
     id="path825" />
</svg>
