<?xml version="1.0" encoding="UTF-8" standalone="no"?>
<svg
   xmlns:dc="http://purl.org/dc/elements/1.1/"
   xmlns:cc="http://creativecommons.org/ns#"
   xmlns:rdf="http://www.w3.org/1999/02/22-rdf-syntax-ns#"
   xmlns:svg="http://www.w3.org/2000/svg"
   xmlns="http://www.w3.org/2000/svg"
   xmlns:sodipodi="http://sodipodi.sourceforge.net/DTD/sodipodi-0.dtd"
   xmlns:inkscape="http://www.inkscape.org/namespaces/inkscape"
   data-dec="75"
   width="22"
   height="40"
   version="1.1"
   id="svg4"
   sodipodi:docname="75.svg"
   inkscape:version="0.92.4 (unknown)">
  <metadata
     id="metadata10">
    <rdf:RDF>
      <cc:Work
         rdf:about="">
        <dc:format>image/svg+xml</dc:format>
        <dc:type
           rdf:resource="http://purl.org/dc/dcmitype/StillImage" />
      </cc:Work>
    </rdf:RDF>
  </metadata>
  <defs
     id="defs8" />
  <sodipodi:namedview
     pagecolor="#ffffff"
     bordercolor="#666666"
     borderopacity="1"
     objecttolerance="10"
     gridtolerance="10"
     guidetolerance="10"
     inkscape:pageopacity="0"
     inkscape:pageshadow="2"
     inkscape:window-width="640"
     inkscape:window-height="480"
     id="namedview6"
     showgrid="false"
     inkscape:zoom="5.9"
     inkscape:cx="11"
     inkscape:cy="20"
     inkscape:window-x="0"
     inkscape:window-y="27"
     inkscape:window-maximized="0"
     inkscape:current-layer="svg4" />
  <path
     style="color:#000000;font-style:normal;font-variant:normal;font-weight:normal;font-stretch:normal;font-size:medium;line-height:normal;font-family:sans-serif;font-variant-ligatures:normal;font-variant-position:normal;font-variant-caps:normal;font-variant-numeric:normal;font-variant-alternates:normal;font-feature-settings:normal;text-indent:0;text-align:start;text-decoration:none;text-decoration-line:none;text-decoration-style:solid;text-decoration-color:#000000;letter-spacing:normal;word-spacing:normal;text-transform:none;writing-mode:lr-tb;direction:ltr;text-orientation:mixed;dominant-baseline:auto;baseline-shift:baseline;text-anchor:start;white-space:normal;shape-padding:0;clip-rule:nonzero;display:inline;overflow:visible;visibility:visible;opacity:1;isolation:auto;mix-blend-mode:normal;color-interpolation:sRGB;color-interpolation-filters:linearRGB;solid-color:#000000;solid-opacity:1;vector-effect:none;fill:#013272;fill-opacity:1;fill-rule:nonzero;stroke:none;stroke-width:0.30000001;stroke-linecap:round;stroke-linejoin:round;stroke-miterlimit:4;stroke-dasharray:none;stroke-dashoffset:0;stroke-opacity:1;color-rendering:auto;image-rendering:auto;shape-rendering:auto;text-rendering:auto;enable-background:accumulate"
     d="m 1.9453125,21.84375 -0.019531,0.0059 h 0.013672 z m 12.0527345,-0.173828 -0.361328,0.179687 h 0.269531 z m -8.7226564,-0.08594 -0.076172,0.265625 H 5.7578125 L 5.6933594,21.722656 Z M 2.9882812,21.496094 2.578125,21.632812 2.3613281,21.849609 h 0.5253907 z m 11.6386718,-0.140625 -0.181641,0.08984 -0.203124,0.404297 h 0.548828 z M 4.3613281,21.279297 4.1992188,21.849609 h 0.6875 L 4.9902344,21.488281 Z M 4,21.158203 3.3339844,21.380859 3.1992188,21.849609 h 0.6875 l 0.1894531,-0.666015 z m 1.4023438,-0.01758 -0.044922,0.154297 0.1464843,0.04883 z m -2.3046876,-0.02734 -0.042969,0.04297 0.033203,-0.0098 z M 10.566406,1.96875 10.068359,2.1347656 a 0.15001501,0.15001501 0 0 1 -0.01367,0.00586 l -0.0078,0.00195 a 0.15001501,0.15001501 0 0 1 -0.050781,0.00781 0.15001501,0.15001501 0 0 1 -0.00391,0 0.15001501,0.15001501 0 0 1 -0.00977,-0.00195 0.15001501,0.15001501 0 0 1 -0.00391,0 0.15001501,0.15001501 0 0 1 -0.011719,-0.00195 0.15001501,0.15001501 0 0 1 -0.00391,0 0.15001501,0.15001501 0 0 1 -0.00977,-0.00391 h -0.00391 a 0.15001501,0.15001501 0 0 1 -0.013672,-0.00586 L 9.8398438,2.1054688 4.4453125,20.990234 5.0722656,21.199219 5.203125,20.742188 4.8652344,20.066406 a 0.15023822,0.15023822 0 1 1 0.2695312,-0.132812 l 0.1914063,0.380859 2.1328125,-7.464844 -0.3710938,0.271485 A 0.15001501,0.15001501 0 1 1 6.9121094,12.878906 L 7.5917969,12.380859 10.296875,2.9140625 10.105469,3.1054688 A 0.15001501,0.15001501 0 1 1 9.8945312,2.8945312 L 10.464844,2.3242188 Z m 0.378906,-0.125 -0.0332,0.00977 -0.0098,0.033203 z M 8.9277344,1.8007812 8.796875,2.2578125 9.1347656,2.9335938 A 0.15023831,0.15023831 0 0 1 8.8652344,3.0664062 L 8.6738281,2.6855469 3.703125,20.085938 3.8945312,19.894531 a 0.15001501,0.15001501 0 1 1 0.2109376,0.210938 L 3.5351562,20.675781 3.4335938,21.03125 3.9316406,20.865234 a 0.15001501,0.15001501 0 0 1 0.021484,-0.0078 0.15001501,0.15001501 0 0 1 0.00586,-0.002 0.15001501,0.15001501 0 0 1 0.044922,-0.0059 0.15001501,0.15001501 0 0 1 0.00391,0 0.15001501,0.15001501 0 0 1 0.00977,0.002 0.15001501,0.15001501 0 0 1 0.00391,0 0.15001501,0.15001501 0 0 1 0.011719,0.002 0.15001501,0.15001501 0 0 1 0.00391,0 0.15001501,0.15001501 0 0 1 0.00977,0.0039 0.15001501,0.15001501 0 0 1 0.00391,0 l 0.013672,0.0059 0.095703,0.03125 L 9.5546875,2.0097656 Z M 8.4960938,1.65625 8.5976562,1.859375 8.6425781,1.7050781 Z M 20.636719,1.1503906 22,1.8320312 23.363281,1.1503906 Z m -8.576172,0 -0.0059,0.00586 0.01953,-0.00586 z m -0.947266,0 -0.101562,0.3535156 0.410156,-0.1367187 0.216797,-0.2167969 z m -1,0 L 9.9238281,1.8164062 10,1.8417969 l 0.666016,-0.2226563 0.134765,-0.46875 z m -0.9999998,0 -0.1035156,0.3613282 0.6289063,0.2089843 0.1621093,-0.5703125 z m -0.8710937,0 0.064453,0.1269532 0.4179688,0.1386718 0.076172,-0.265625 z M 7.9863281,0.84765625 a 0.15001501,0.15001501 0 0 1 0.03125,0.001953 h 0.9628907 a 0.15001501,0.15001501 0 0 1 0.044922,0 h 0.9550782 a 0.15001501,0.15001501 0 0 1 0.044922,0 h 0.955078 a 0.15001501,0.15001501 0 0 1 0.04492,0 h 0.957031 a 0.15001501,0.15001501 0 0 1 0.0293,0 h 0.980469 0.01562 H 14 a 0.15039061,0.15039061 0 1 1 0,0.30078122 h -0.976562 l -1.445313,0.4824219 -0.84375,0.84375 -2.7460938,9.6132815 2.8613278,-2.0976565 a 0.15001501,0.15001501 0 0 1 0.1875,-0.1386719 0.15001501,0.15001501 0 0 1 0.002,0 l 10.673829,-7.828125 -1.748047,-0.875 H 19 a 0.15039061,0.15039061 0 1 1 0,-0.30078122 h 0.980469 0.0293 3.976562 0.0293 H 25 a 0.15039061,0.15039061 0 1 1 0,0.30078122 h -0.964844 l -1.945312,0.9726563 -0.01367,0.00781 -0.0078,0.00391 -0.0059,0.00391 -10.867188,7.9707031 3.431641,10.298828 0.238281,-0.474609 a 0.15024237,0.15024237 0 0 1 0.269532,0.132812 l -0.373047,0.746094 0.04101,0.119141 0.13086,-0.06641 a 0.15023858,0.15023858 0 1 1 0.132812,0.269532 l -0.167968,0.08398 0.208984,0.630859 h 0.683594 L 11.857422,10.046875 a 0.15008581,0.15008581 0 0 1 0.285156,-0.09375 l 3.964844,11.896484 h 1.53125 l -0.71875,-0.720703 a 0.15001501,0.15001501 0 0 1 -0.01172,-0.0078 0.15001501,0.15001501 0 0 1 -0.02148,-0.02148 0.15001501,0.15001501 0 0 1 -0.0098,-0.01172 l -0.982422,-0.982422 a 0.15001501,0.15001501 0 1 1 0.210938,-0.210938 L 16.65625,20.445312 12.857422,9.046875 a 0.15008581,0.15008581 0 0 1 0.285156,-0.09375 l 3.990234,11.96875 0.927735,0.927734 H 19 a 0.150391,0.150391 0 1 1 0,0.300782 h -0.984375 a 0.15001501,0.15001501 0 0 1 -0.0293,0 h -1.964844 a 0.15001501,0.15001501 0 0 1 -0.04492,0 h -0.955078 a 0.15001501,0.15001501 0 0 1 -0.04492,0 h -0.955078 a 0.15001501,0.15001501 0 0 1 -0.04492,0 h -0.96289 -0.0293 H 12 a 0.150391,0.150391 0 0 1 0,-0.300782 h 0.964844 L 14.220703,21.220703 14.4375,20.789062 10.941406,10.296875 7.8535156,12.560547 5.5234375,20.712891 5.90625,21.476562 7.0234375,21.849609 H 8 a 0.150391,0.150391 0 1 1 0,0.300782 h -0.9882812 -0.015625 -0.96875 a 0.15001501,0.15001501 0 0 1 -0.044922,0 H 5.0195312 a 0.15001501,0.15001501 0 0 1 -0.044922,0 H 4.0195312 a 0.15001501,0.15001501 0 0 1 -0.044922,0 H 3.0195312 a 0.15001501,0.15001501 0 0 1 -0.044922,0 H 2.0175781 a 0.15001501,0.15001501 0 0 1 -0.029297,0 H 1.0078125 0.9921875 0 A 0.150391,0.150391 0 0 1 0,21.849609 H 0.9765625 L 2.421875,21.367188 3.265625,20.523438 8.4765625,2.2871094 8.09375,1.5234375 6.9765625,1.1503906 H 6 A 0.15039068,0.15039068 0 1 1 6,0.84960938 h 0.9882812 0.015625 0.96875 a 0.15001501,0.15001501 0 0 1 0.013672,-0.001953 z"
     id="path2" />
</svg>
