<?xml version="1.0" encoding="UTF-8"?>
<glyph name="glyph10" format="2">
  <advance width="839"/>
  <unicode hex="0153"/>
  <outline>
    <contour>
      <point x="586" y="405" type="line"/>
      <point x="538" y="381" type="line"/>
      <point x="488" y="331" type="line"/>
      <point x="464" y="260" type="line"/>
      <point x="724" y="260" type="line"/>
      <point x="724" y="289" type="line"/>
      <point x="724" y="311" type="line"/>
      <point x="700" y="359" type="line"/>
      <point x="678" y="381" type="line"/>
      <point x="630" y="405" type="line"/>
    </contour>
    <contour>
      <point x="239" y="405" type="line"/>
      <point x="190" y="381" type="line"/>
      <point x="141" y="331" type="line"/>
      <point x="116" y="255" type="line"/>
      <point x="116" y="207" type="line"/>
      <point x="141" y="131" type="line"/>
      <point x="190" y="81" type="line"/>
      <point x="239" y="57" type="line"/>
      <point x="283" y="57" type="line"/>
      <point x="330" y="81" type="line"/>
      <point x="380" y="131" type="line"/>
      <point x="405" y="207" type="line"/>
      <point x="405" y="227" type="line"/>
      <point x="405" y="231" type="line"/>
      <point x="405" y="236" type="line"/>
      <point x="405" y="255" type="line"/>
      <point x="380" y="331" type="line"/>
      <point x="330" y="381" type="line"/>
      <point x="283" y="405" type="line"/>
    </contour>
    <contour>
      <point x="232" y="463" type="curve" smooth="yes"/>
      <point x="235" y="463" type="line"/>
      <point x="289" y="463" type="line" smooth="yes"/>
      <point x="292" y="463"/>
      <point x="299" y="462"/>
      <point x="302" y="460" type="curve" smooth="yes"/>
      <point x="361" y="431" type="line" smooth="yes"/>
      <point x="363" y="430"/>
      <point x="365" y="428"/>
      <point x="367" y="426" type="curve" smooth="yes"/>
      <point x="426" y="367" type="line" smooth="yes"/>
      <point x="428" y="365"/>
      <point x="431" y="359"/>
      <point x="432" y="356" type="curve" smooth="yes"/>
      <point x="434" y="352" type="line"/>
      <point x="436" y="356" type="line" smooth="yes"/>
      <point x="437" y="359"/>
      <point x="440" y="365"/>
      <point x="442" y="367" type="curve" smooth="yes"/>
      <point x="500" y="426" type="line" smooth="yes"/>
      <point x="502" y="428"/>
      <point x="506" y="430"/>
      <point x="508" y="431" type="curve" smooth="yes"/>
      <point x="566" y="460" type="line" smooth="yes"/>
      <point x="569" y="462"/>
      <point x="576" y="463"/>
      <point x="579" y="463" type="curve" smooth="yes"/>
      <point x="637" y="463" type="line" smooth="yes"/>
      <point x="640" y="463"/>
      <point x="647" y="462"/>
      <point x="650" y="460" type="curve" smooth="yes"/>
      <point x="707" y="431" type="line" smooth="yes"/>
      <point x="709" y="430"/>
      <point x="713" y="428"/>
      <point x="715" y="426" type="curve" smooth="yes"/>
      <point x="745" y="396" type="line" smooth="yes"/>
      <point x="747" y="394"/>
      <point x="748" y="390"/>
      <point x="749" y="388" type="curve" smooth="yes"/>
      <point x="779" y="331" type="line" smooth="yes"/>
      <point x="781" y="328"/>
      <point x="782" y="321"/>
      <point x="782" y="318" type="curve" smooth="yes"/>
      <point x="782" y="289" type="line"/>
      <point x="782" y="231" type="line" smooth="yes"/>
      <point x="782" y="215"/>
      <point x="768" y="202"/>
      <point x="752" y="202" type="curve" smooth="yes"/>
      <point x="464" y="202" type="line"/>
      <point x="488" y="131" type="line"/>
      <point x="538" y="81" type="line"/>
      <point x="586" y="57" type="line"/>
      <point x="630" y="57" type="line"/>
      <point x="678" y="81" type="line"/>
      <point x="703" y="107" type="line" smooth="yes"/>
      <point x="707" y="111"/>
      <point x="717" y="116"/>
      <point x="724" y="116" type="curve" smooth="yes"/>
      <point x="740" y="116"/>
      <point x="754" y="103"/>
      <point x="754" y="87" type="curve" smooth="yes"/>
      <point x="754" y="80"/>
      <point x="749" y="70"/>
      <point x="745" y="66" type="curve" smooth="yes"/>
      <point x="715" y="37" type="line" smooth="yes"/>
      <point x="713" y="35"/>
      <point x="709" y="33"/>
      <point x="707" y="32" type="curve" smooth="yes"/>
      <point x="650" y="2" type="line" smooth="yes"/>
      <point x="647" y="0"/>
      <point x="640" y="0"/>
      <point x="637" y="0" type="curve" smooth="yes"/>
      <point x="579" y="0" type="line" smooth="yes"/>
      <point x="576" y="0"/>
      <point x="569" y="0"/>
      <point x="566" y="2" type="curve" smooth="yes"/>
      <point x="508" y="32" type="line" smooth="yes"/>
      <point x="506" y="33"/>
      <point x="502" y="35"/>
      <point x="500" y="37" type="curve" smooth="yes"/>
      <point x="442" y="95" type="line" smooth="yes"/>
      <point x="440" y="97"/>
      <point x="437" y="104"/>
      <point x="436" y="107" type="curve" smooth="yes"/>
      <point x="434" y="111" type="line"/>
      <point x="432" y="107" type="line" smooth="yes"/>
      <point x="431" y="104"/>
      <point x="428" y="97"/>
      <point x="426" y="95" type="curve" smooth="yes"/>
      <point x="367" y="37" type="line" smooth="yes"/>
      <point x="365" y="35"/>
      <point x="363" y="33"/>
      <point x="361" y="32" type="curve" smooth="yes"/>
      <point x="302" y="2" type="line" smooth="yes"/>
      <point x="299" y="0"/>
      <point x="292" y="0"/>
      <point x="289" y="0" type="curve" smooth="yes"/>
      <point x="232" y="0" type="line" smooth="yes"/>
      <point x="229" y="0"/>
      <point x="222" y="0"/>
      <point x="219" y="2" type="curve" smooth="yes"/>
      <point x="161" y="32" type="line" smooth="yes"/>
      <point x="159" y="33"/>
      <point x="155" y="35"/>
      <point x="153" y="37" type="curve" smooth="yes"/>
      <point x="96" y="95" type="line" smooth="yes"/>
      <point x="94" y="97"/>
      <point x="89" y="104"/>
      <point x="88" y="107" type="curve" smooth="yes"/>
      <point x="59" y="192" type="line" smooth="yes"/>
      <point x="58" y="194"/>
      <point x="58" y="200"/>
      <point x="58" y="202" type="curve" smooth="yes"/>
      <point x="58" y="260" type="line" smooth="yes"/>
      <point x="58" y="262"/>
      <point x="58" y="268"/>
      <point x="59" y="270" type="curve" smooth="yes"/>
      <point x="88" y="356" type="line" smooth="yes"/>
      <point x="89" y="359"/>
      <point x="94" y="365"/>
      <point x="96" y="367" type="curve" smooth="yes"/>
      <point x="153" y="426" type="line" smooth="yes"/>
      <point x="155" y="428"/>
      <point x="159" y="430"/>
      <point x="161" y="431" type="curve" smooth="yes"/>
      <point x="216" y="458" type="line" smooth="yes"/>
      <point x="218" y="459"/>
      <point x="223" y="461"/>
      <point x="226" y="462" type="curve" smooth="yes"/>
      <point x="227" y="462"/>
      <point x="231" y="463"/>
    </contour>
  </outline>
  <lib>
    <dict>
      <key>com.fontlab.hintData</key>
      <dict>
        <key>hhints</key>
        <array>
          <dict>
            <key>position</key>
            <integer>0</integer>
            <key>width</key>
            <integer>57</integer>
          </dict>
          <dict>
            <key>position</key>
            <integer>202</integer>
            <key>width</key>
            <integer>57</integer>
          </dict>
          <dict>
            <key>position</key>
            <integer>405</integer>
            <key>width</key>
            <integer>58</integer>
          </dict>
        </array>
        <key>vhints</key>
        <array>
          <dict>
            <key>position</key>
            <integer>58</integer>
            <key>width</key>
            <integer>57</integer>
          </dict>
          <dict>
            <key>position</key>
            <integer>724</integer>
            <key>width</key>
            <integer>58</integer>
          </dict>
        </array>
      </dict>
    </dict>
  </lib>
</glyph>
