<?xml version="1.0" encoding="UTF-8" standalone="no"?>
<svg
   xmlns:dc="http://purl.org/dc/elements/1.1/"
   xmlns:cc="http://creativecommons.org/ns#"
   xmlns:rdf="http://www.w3.org/1999/02/22-rdf-syntax-ns#"
   xmlns:svg="http://www.w3.org/2000/svg"
   xmlns="http://www.w3.org/2000/svg"
   xmlns:sodipodi="http://sodipodi.sourceforge.net/DTD/sodipodi-0.dtd"
   xmlns:inkscape="http://www.inkscape.org/namespaces/inkscape"
   data-dec="74"
   width="16"
   height="40"
   version="1.1"
   id="svg4"
   sodipodi:docname="74.svg"
   inkscape:version="0.92.4 (unknown)">
  <metadata
     id="metadata10">
    <rdf:RDF>
      <cc:Work
         rdf:about="">
        <dc:format>image/svg+xml</dc:format>
        <dc:type
           rdf:resource="http://purl.org/dc/dcmitype/StillImage" />
      </cc:Work>
    </rdf:RDF>
  </metadata>
  <defs
     id="defs8" />
  <sodipodi:namedview
     pagecolor="#ffffff"
     bordercolor="#666666"
     borderopacity="1"
     objecttolerance="10"
     gridtolerance="10"
     guidetolerance="10"
     inkscape:pageopacity="0"
     inkscape:pageshadow="2"
     inkscape:window-width="615"
     inkscape:window-height="417"
     id="namedview6"
     showgrid="false"
     inkscape:zoom="5.9"
     inkscape:cx="8"
     inkscape:cy="20"
     inkscape:window-x="0"
     inkscape:window-y="27"
     inkscape:window-maximized="0"
     inkscape:current-layer="svg4" />
  <path
     style="color:#000000;font-style:normal;font-variant:normal;font-weight:normal;font-stretch:normal;font-size:medium;line-height:normal;font-family:sans-serif;font-variant-ligatures:normal;font-variant-position:normal;font-variant-caps:normal;font-variant-numeric:normal;font-variant-alternates:normal;font-feature-settings:normal;text-indent:0;text-align:start;text-decoration:none;text-decoration-line:none;text-decoration-style:solid;text-decoration-color:#000000;letter-spacing:normal;word-spacing:normal;text-transform:none;writing-mode:lr-tb;direction:ltr;text-orientation:mixed;dominant-baseline:auto;baseline-shift:baseline;text-anchor:start;white-space:normal;shape-padding:0;clip-rule:nonzero;display:inline;overflow:visible;visibility:visible;opacity:1;isolation:auto;mix-blend-mode:normal;color-interpolation:sRGB;color-interpolation-filters:linearRGB;solid-color:#000000;solid-opacity:1;vector-effect:none;fill:#013272;fill-opacity:1;fill-rule:nonzero;stroke:none;stroke-width:2;stroke-linecap:round;stroke-linejoin:round;stroke-miterlimit:4;stroke-dasharray:none;stroke-dashoffset:0;stroke-opacity:1;color-rendering:auto;image-rendering:auto;shape-rendering:auto;text-rendering:auto;enable-background:accumulate"
     d="M 8.984375,-0.01367188 A 1.0001,1.0001 0 0 1 9.1679688,0 h 1.6738282 a 1.0001,1.0001 0 0 1 0.326172,0 h 0.677734 a 1.0001,1.0001 0 0 1 0.318359,0 h 0.740235 a 1.0001,1.0001 0 0 1 0.214844,0 H 14 a 1.0001,1.0001 0 1 1 0,2 H 13.236328 L 12.412109,2.4121094 12,3.2363281 V 18 a 1.0001,1.0001 0 0 1 -0.05078,0.316406 l -1,3 a 1.0001,1.0001 0 0 1 -0.632813,0.632813 l -2.9062498,0.96875 a 1.0001,1.0001 0 0 1 -0.00391,0.002 A 1.0001,1.0001 0 0 1 6.8535156,23 H 5 A 1.0001,1.0001 0 0 1 4.5527344,22.894531 l -2,-1 A 1.0001,1.0001 0 0 1 2.1054688,21.447266 l -1,-2 A 1.0001,1.0001 0 0 1 1,19 v -2 a 1.0001,1.0001 0 0 1 0.2929688,-0.707031 l 1,-1 A 1.0001,1.0001 0 0 1 3,15 h 1 a 1.0001,1.0001 0 0 1 0.7070312,0.292969 l 1,1 A 1.0001,1.0001 0 0 1 6,17 v 1 a 1.0001,1.0001 0 0 1 -0.2929688,0.707031 l -1,1 A 1.0001,1.0001 0 0 1 4,20 H 3.6191406 L 3.7460938,20.253906 5.2363281,21 H 6.5859375 L 7.125,20.458984 8,17.837891 V 3.2363281 L 7.5878906,2.4121094 6.7636719,2 H 6 A 1.0001,1.0001 0 1 1 6,0 H 6.890625 A 1.0001,1.0001 0 0 1 7.09375,0 h 0.75 A 1.0001,1.0001 0 0 1 8.1484375,0 H 8.8417969 A 1.0001,1.0001 0 0 1 8.984375,-0.01367188 Z"
     id="path2" />
</svg>
