<?xml version="1.0" encoding="UTF-8" standalone="no"?>
<svg
   xmlns:dc="http://purl.org/dc/elements/1.1/"
   xmlns:cc="http://creativecommons.org/ns#"
   xmlns:rdf="http://www.w3.org/1999/02/22-rdf-syntax-ns#"
   xmlns:svg="http://www.w3.org/2000/svg"
   xmlns="http://www.w3.org/2000/svg"
   xmlns:sodipodi="http://sodipodi.sourceforge.net/DTD/sodipodi-0.dtd"
   xmlns:inkscape="http://www.inkscape.org/namespaces/inkscape"
   data-dec="111"
   width="20"
   height="40"
   version="1.1"
   id="svg4"
   sodipodi:docname="111.svg"
   inkscape:version="0.92.4 5da689c313, 2019-01-14">
  <metadata
     id="metadata10">
    <rdf:RDF>
      <cc:Work
         rdf:about="">
        <dc:format>image/svg+xml</dc:format>
        <dc:type
           rdf:resource="http://purl.org/dc/dcmitype/StillImage" />
        <dc:title></dc:title>
      </cc:Work>
    </rdf:RDF>
  </metadata>
  <defs
     id="defs8" />
  <sodipodi:namedview
     pagecolor="#ffffff"
     bordercolor="#666666"
     borderopacity="1"
     objecttolerance="10"
     gridtolerance="10"
     guidetolerance="10"
     inkscape:pageopacity="0"
     inkscape:pageshadow="2"
     inkscape:window-width="1920"
     inkscape:window-height="1043"
     id="namedview6"
     showgrid="false"
     inkscape:zoom="5.9"
     inkscape:cx="10"
     inkscape:cy="20"
     inkscape:window-x="0"
     inkscape:window-y="37"
     inkscape:window-maximized="0"
     inkscape:current-layer="svg4" />
  <path
     style="color:#000000;font-style:normal;font-variant:normal;font-weight:normal;font-stretch:normal;font-size:medium;line-height:normal;font-family:sans-serif;font-variant-ligatures:normal;font-variant-position:normal;font-variant-caps:normal;font-variant-numeric:normal;font-variant-alternates:normal;font-feature-settings:normal;text-indent:0;text-align:start;text-decoration:none;text-decoration-line:none;text-decoration-style:solid;text-decoration-color:#000000;letter-spacing:normal;word-spacing:normal;text-transform:none;writing-mode:lr-tb;direction:ltr;text-orientation:mixed;dominant-baseline:auto;baseline-shift:baseline;text-anchor:start;white-space:normal;shape-padding:0;clip-rule:nonzero;display:inline;overflow:visible;visibility:visible;opacity:1;isolation:auto;mix-blend-mode:normal;color-interpolation:sRGB;color-interpolation-filters:linearRGB;solid-color:#000000;solid-opacity:1;vector-effect:none;fill:#000000;fill-opacity:1;fill-rule:nonzero;stroke:none;stroke-width:1.5;stroke-linecap:round;stroke-linejoin:round;stroke-miterlimit:4;stroke-dasharray:none;stroke-dashoffset:0;stroke-opacity:1;color-rendering:auto;image-rendering:auto;shape-rendering:auto;text-rendering:auto;enable-background:accumulate"
     d="M 8.1757812,9.75 6.4433594,10.617188 5.65625,11.404297 4.75,14.121094 v 1.757812 L 5.65625,18.595703 6.4433594,19.382812 8.1777344,20.25 H 10.822266 L 12.556641,19.382812 13.34375,18.595703 14.25,15.878906 V 14.121094 L 13.34375,11.404297 12.556641,10.617188 10.822266,9.75 Z M 8.0039062,7.2460938 A 0.750075,0.750075 0 0 1 8.0898438,7.25 H 11 a 0.750075,0.750075 0 0 1 0.335938,0.080078 l 2,1 A 0.750075,0.750075 0 0 1 13.53125,8.46875 l 2,2 a 0.750075,0.750075 0 0 1 0.179688,0.294922 l 1,3 A 0.750075,0.750075 0 0 1 16.75,14 v 2 a 0.750075,0.750075 0 0 1 -0.03906,0.236328 l -1,3 A 0.750075,0.750075 0 0 1 15.53125,19.53125 l -2,2 a 0.750075,0.750075 0 0 1 -0.195312,0.138672 l -2,1 A 0.750075,0.750075 0 0 1 11,22.75 H 8 a 0.750075,0.750075 0 0 1 -0.3359375,-0.08008 l -2,-1 A 0.750075,0.750075 0 0 1 5.46875,21.53125 l -2,-2 A 0.750075,0.750075 0 0 1 3.2890625,19.236328 l -1,-3 A 0.750075,0.750075 0 0 1 2.25,16 v -2 a 0.750075,0.750075 0 0 1 0.039063,-0.236328 l 1,-3 A 0.750075,0.750075 0 0 1 3.46875,10.46875 l 2,-2 A 0.750075,0.750075 0 0 1 5.6640625,8.3300781 L 7.5742188,7.375 A 0.750075,0.750075 0 0 1 7.78125,7.28125 a 0.750075,0.750075 0 0 1 0.035156,-0.00977 0.750075,0.750075 0 0 1 0.035156,-0.00781 0.750075,0.750075 0 0 1 0.1523437,-0.017578 z"
     id="path2" />
</svg>
