<?xml version="1.0" encoding="UTF-8"?>
<glyph name="cedilla" format="2">
  <advance width="144"/>
  <unicode hex="00B8"/>
  <outline>
    <contour>
      <point x="116" y="29" type="curve" smooth="yes"/>
      <point x="124" y="29"/>
      <point x="131" y="22"/>
      <point x="131" y="14" type="curve" smooth="yes"/>
      <point x="131" y="11"/>
      <point x="128" y="6"/>
      <point x="126" y="4" type="curve" smooth="yes"/>
      <point x="92" y="-30" type="line" smooth="yes"/>
      <point x="93" y="-31"/>
      <point x="96" y="-32"/>
      <point x="97" y="-33" type="curve" smooth="yes"/>
      <point x="126" y="-63" type="line" smooth="yes"/>
      <point x="128" y="-65"/>
      <point x="130" y="-70"/>
      <point x="130" y="-73" type="curve" smooth="yes"/>
      <point x="130" y="-76"/>
      <point x="128" y="-80"/>
      <point x="126" y="-82" type="curve" smooth="yes"/>
      <point x="97" y="-112" type="line" smooth="yes"/>
      <point x="95" y="-114"/>
      <point x="90" y="-117"/>
      <point x="87" y="-117" type="curve" smooth="yes"/>
      <point x="58" y="-117" type="line"/>
      <point x="57" y="-117" type="line" smooth="yes"/>
      <point x="49" y="-117"/>
      <point x="43" y="-109"/>
      <point x="43" y="-101" type="curve" smooth="yes"/>
      <point x="43" y="-93"/>
      <point x="49" y="-87"/>
      <point x="57" y="-87" type="curve" smooth="yes"/>
      <point x="58" y="-87" type="line"/>
      <point x="80" y="-87" type="line"/>
      <point x="96" y="-73" type="line"/>
      <point x="80" y="-58" type="line"/>
      <point x="58" y="-58" type="line" smooth="yes"/>
      <point x="50" y="-58"/>
      <point x="43" y="-52"/>
      <point x="43" y="-44" type="curve" smooth="yes"/>
      <point x="43" y="-41"/>
      <point x="45" y="-35"/>
      <point x="47" y="-33" type="curve" smooth="yes"/>
      <point x="106" y="24" type="line" smooth="yes"/>
      <point x="108" y="26"/>
      <point x="113" y="29"/>
    </contour>
  </outline>
  <lib>
    <dict>
      <key>com.fontlab.hintData</key>
      <dict>
        <key>hhints</key>
        <array>
          <dict>
            <key>position</key>
            <integer>-117</integer>
            <key>width</key>
            <integer>30</integer>
          </dict>
        </array>
        <key>vhints</key>
        <array>
          <dict>
            <key>position</key>
            <integer>43</integer>
            <key>width</key>
            <integer>87</integer>
          </dict>
        </array>
      </dict>
    </dict>
  </lib>
</glyph>
