<?xml version="1.0" encoding="UTF-8" standalone="no"?>
<svg
   xmlns:dc="http://purl.org/dc/elements/1.1/"
   xmlns:cc="http://creativecommons.org/ns#"
   xmlns:rdf="http://www.w3.org/1999/02/22-rdf-syntax-ns#"
   xmlns:svg="http://www.w3.org/2000/svg"
   xmlns="http://www.w3.org/2000/svg"
   xmlns:sodipodi="http://sodipodi.sourceforge.net/DTD/sodipodi-0.dtd"
   xmlns:inkscape="http://www.inkscape.org/namespaces/inkscape"
   data-dec="34"
   width="18"
   height="40"
   version="1.1"
   id="svg4"
   sodipodi:docname="34.svg"
   inkscape:version="0.92.4 (unknown)">
  <metadata
     id="metadata10">
    <rdf:RDF>
      <cc:Work
         rdf:about="">
        <dc:format>image/svg+xml</dc:format>
        <dc:type
           rdf:resource="http://purl.org/dc/dcmitype/StillImage" />
      </cc:Work>
    </rdf:RDF>
  </metadata>
  <defs
     id="defs8" />
  <sodipodi:namedview
     pagecolor="#ffffff"
     bordercolor="#666666"
     borderopacity="1"
     objecttolerance="10"
     gridtolerance="10"
     guidetolerance="10"
     inkscape:pageopacity="0"
     inkscape:pageshadow="2"
     inkscape:window-width="640"
     inkscape:window-height="480"
     id="namedview6"
     showgrid="false"
     inkscape:zoom="5.9"
     inkscape:cx="9"
     inkscape:cy="20"
     inkscape:window-x="0"
     inkscape:window-y="27"
     inkscape:window-maximized="0"
     inkscape:current-layer="svg4" />
  <path
     style="color:#000000;font-style:normal;font-variant:normal;font-weight:normal;font-stretch:normal;font-size:medium;line-height:normal;font-family:sans-serif;font-variant-ligatures:normal;font-variant-position:normal;font-variant-caps:normal;font-variant-numeric:normal;font-variant-alternates:normal;font-feature-settings:normal;text-indent:0;text-align:start;text-decoration:none;text-decoration-line:none;text-decoration-style:solid;text-decoration-color:#000000;letter-spacing:normal;word-spacing:normal;text-transform:none;writing-mode:lr-tb;direction:ltr;text-orientation:mixed;dominant-baseline:auto;baseline-shift:baseline;text-anchor:start;white-space:normal;shape-padding:0;clip-rule:nonzero;display:inline;overflow:visible;visibility:visible;opacity:1;isolation:auto;mix-blend-mode:normal;color-interpolation:sRGB;color-interpolation-filters:linearRGB;solid-color:#000000;solid-opacity:1;vector-effect:none;fill:#013272;fill-opacity:1;fill-rule:nonzero;stroke:none;stroke-width:2;stroke-linecap:round;stroke-linejoin:round;stroke-miterlimit:4;stroke-dasharray:none;stroke-dashoffset:0;stroke-opacity:1;color-rendering:auto;image-rendering:auto;shape-rendering:auto;text-rendering:auto;enable-background:accumulate"
     d="m 13.970703,-0.00976563 a 1.0001,1.0001 0 0 1 0.0293,0 1.0001,1.0001 0 0 1 0.08984,0.00390625 1.0001,1.0001 0 0 1 0.734375,0.41601563 l 0.882812,0.88281255 a 1.0001,1.0001 0 0 1 0.242188,1.0234374 L 13.96875,8.2558594 a 1.0001,1.0001 0 0 1 -0.002,0.011719 1.0001,1.0001 0 0 1 -0.01953,0.0625 1.0001,1.0001 0 0 1 -0.08203,0.1816407 1.0001,1.0001 0 0 1 -0.05469,0.083984 1.0001,1.0001 0 0 1 -0.130859,0.1503907 1.0001,1.0001 0 0 1 -0.0625,0.054687 1.0001,1.0001 0 0 1 -0.01367,0.00977 1.0001,1.0001 0 0 1 -0.02734,0.019531 1.0001,1.0001 0 0 1 -0.05664,0.037109 1.0001,1.0001 0 0 1 -0.002,0.00195 1.0001,1.0001 0 0 1 -0.08594,0.044922 1.0001,1.0001 0 0 1 -0.05274,0.023437 1.0001,1.0001 0 0 1 -0.01367,0.00586 1.0001,1.0001 0 0 1 -0.02539,0.00977 1.0001,1.0001 0 0 1 -0.05469,0.017578 1.0001,1.0001 0 0 1 -0.01172,0.00391 1.0001,1.0001 0 0 1 -0.0293,0.00781 1.0001,1.0001 0 0 1 -0.0059,0.00195 1.0001,1.0001 0 0 1 -0.04101,0.00781 1.0001,1.0001 0 0 1 -0.0098,0.00195 1.0001,1.0001 0 0 1 -0.0098,0.00195 1.0001,1.0001 0 0 1 -0.03125,0.00586 1.0001,1.0001 0 0 1 -0.05469,0.00781 1.0001,1.0001 0 0 1 -0.0039,0 1.0001,1.0001 0 0 1 -0.01172,0 1.0001,1.0001 0 0 1 -0.06055,0.00391 1.0001,1.0001 0 0 1 -0.01367,0 1.0001,1.0001 0 0 1 -0.01367,0 1.0001,1.0001 0 0 1 -0.07226,-0.00391 1.0001,1.0001 0 0 1 -0.0059,0 1.0001,1.0001 0 0 1 -0.04687,-0.00586 1.0001,1.0001 0 0 1 -0.01758,-0.00195 1.0001,1.0001 0 0 1 -0.05273,-0.00977 1.0001,1.0001 0 0 1 -0.01367,-0.00391 1.0001,1.0001 0 0 1 -0.01367,-0.00195 1.0001,1.0001 0 0 1 -0.01953,-0.00586 1.0001,1.0001 0 0 1 -0.01563,-0.00391 1.0001,1.0001 0 0 1 -0.03711,-0.00977 1.0001,1.0001 0 0 1 -0.02539,-0.00977 1.0001,1.0001 0 0 1 -0.01367,-0.00391 1.0001,1.0001 0 0 1 -0.01758,-0.00781 1.0001,1.0001 0 0 1 -0.01172,-0.00391 1.0001,1.0001 0 0 1 -0.002,-0.00195 1.0001,1.0001 0 0 1 -0.01563,-0.00586 1.0001,1.0001 0 0 1 -0.04102,-0.017578 1.0001,1.0001 0 0 1 -0.0039,-0.00195 1.0001,1.0001 0 0 1 -0.0293,-0.015625 1.0001,1.0001 0 0 1 -0.05273,-0.027344 1.0001,1.0001 0 0 1 -0.01563,-0.00977 1.0001,1.0001 0 0 1 -0.06641,-0.046875 1.0001,1.0001 0 0 1 -0.01367,-0.00977 1.0001,1.0001 0 0 1 -0.01758,-0.015625 1.0001,1.0001 0 0 1 -0.04688,-0.039063 1.0001,1.0001 0 0 1 -0.0039,-0.00391 1.0001,1.0001 0 0 1 -0.0039,-0.00391 1.0001,1.0001 0 0 1 -0.06641,-0.066406 1.0001,1.0001 0 0 1 -0.002,-0.00391 1.0001,1.0001 0 0 1 -0.06055,-0.076172 1.0001,1.0001 0 0 1 -0.05274,-0.083984 1.0001,1.0001 0 0 1 -0.04687,-0.087891 1.0001,1.0001 0 0 1 0,-0.00391 1.0001,1.0001 0 0 1 -0.03516,-0.089844 1.0001,1.0001 0 0 1 -0.02734,-0.097656 1.0001,1.0001 0 0 1 -0.01563,-0.083984 1.0001,1.0001 0 0 1 -0.002,-0.027344 1.0001,1.0001 0 0 1 -0.0059,-0.085938 A 1.0001,1.0001 0 0 1 12,7.9355469 V 7.9257812 2 A 1.0001,1.0001 0 0 1 12.292969,1.2929688 L 13.179688,0.40625 a 1.0001,1.0001 0 0 1 0.791015,-0.41601563 z m -8.9999999,0 a 1.0001,1.0001 0 0 1 0.029297,0 1.0001,1.0001 0 0 1 0.089844,0.00390625 1.0001,1.0001 0 0 1 0.734375,0.41601563 L 6.7070312,1.2929688 A 1.0001,1.0001 0 0 1 6.9492188,2.3164062 L 4.96875,8.2558594 a 1.0001,1.0001 0 0 1 -0.00195,0.011719 1.0001,1.0001 0 0 1 -0.019531,0.0625 1.0001,1.0001 0 0 1 -0.082031,0.1816407 1.0001,1.0001 0 0 1 -0.054687,0.083984 1.0001,1.0001 0 0 1 -0.1308594,0.1503907 1.0001,1.0001 0 0 1 -0.0625,0.054687 1.0001,1.0001 0 0 1 -0.013672,0.00977 1.0001,1.0001 0 0 1 -0.027344,0.019531 1.0001,1.0001 0 0 1 -0.056641,0.037109 1.0001,1.0001 0 0 1 -0.00195,0.00195 1.0001,1.0001 0 0 1 -0.085937,0.044922 1.0001,1.0001 0 0 1 -0.052734,0.023437 1.0001,1.0001 0 0 1 -0.013672,0.00586 1.0001,1.0001 0 0 1 -0.025391,0.00977 1.0001,1.0001 0 0 1 -0.054688,0.017578 1.0001,1.0001 0 0 1 -0.011719,0.00391 1.0001,1.0001 0 0 1 -0.029297,0.00781 1.0001,1.0001 0 0 1 -0.00586,0.00195 1.0001,1.0001 0 0 1 -0.041016,0.00781 1.0001,1.0001 0 0 1 -0.00977,0.00195 1.0001,1.0001 0 0 1 -0.00977,0.00195 1.0001,1.0001 0 0 1 -0.03125,0.00586 1.0001,1.0001 0 0 1 -0.054687,0.00781 1.0001,1.0001 0 0 1 -0.00391,0 1.0001,1.0001 0 0 1 -0.011719,0 1.0001,1.0001 0 0 1 -0.060547,0.00391 1.0001,1.0001 0 0 1 -0.013672,0 1.0001,1.0001 0 0 1 -0.013672,0 1.0001,1.0001 0 0 1 -0.072266,-0.00391 1.0001,1.0001 0 0 1 -0.00586,0 1.0001,1.0001 0 0 1 -0.046875,-0.00586 1.0001,1.0001 0 0 1 -0.017578,-0.00195 1.0001,1.0001 0 0 1 -0.052734,-0.00977 1.0001,1.0001 0 0 1 -0.00195,0 1.0001,1.0001 0 0 1 -0.011719,-0.00391 1.0001,1.0001 0 0 1 -0.013672,-0.00195 1.0001,1.0001 0 0 1 -0.019531,-0.00586 1.0001,1.0001 0 0 1 -0.015625,-0.00391 1.0001,1.0001 0 0 1 -0.011719,-0.00195 1.0001,1.0001 0 0 1 -0.013672,-0.00391 1.0001,1.0001 0 0 1 -0.011719,-0.00391 1.0001,1.0001 0 0 1 -0.025391,-0.00977 1.0001,1.0001 0 0 1 -0.03125,-0.011719 1.0001,1.0001 0 0 1 -0.011719,-0.00391 1.0001,1.0001 0 0 1 -0.00195,-0.00195 1.0001,1.0001 0 0 1 -0.015625,-0.00586 1.0001,1.0001 0 0 1 -0.041016,-0.017578 1.0001,1.0001 0 0 1 -0.00781,-0.00391 1.0001,1.0001 0 0 1 -0.025391,-0.013672 1.0001,1.0001 0 0 1 -0.052734,-0.027344 1.0001,1.0001 0 0 1 -0.015625,-0.00977 1.0001,1.0001 0 0 1 -0.066406,-0.046875 1.0001,1.0001 0 0 1 -0.013672,-0.00977 A 1.0001,1.0001 0 0 1 3.3671875,8.7890625 1.0001,1.0001 0 0 1 3.3203125,8.75 1.0001,1.0001 0 0 1 3.3125,8.7421875 a 1.0001,1.0001 0 0 1 -0.066406,-0.066406 1.0001,1.0001 0 0 1 -0.00195,-0.00391 1.0001,1.0001 0 0 1 -0.060547,-0.076172 1.0001,1.0001 0 0 1 -0.052734,-0.083984 1.0001,1.0001 0 0 1 -0.046875,-0.087891 1.0001,1.0001 0 0 1 0,-0.00391 1.0001,1.0001 0 0 1 -0.035156,-0.089844 1.0001,1.0001 0 0 1 -0.027344,-0.097656 1.0001,1.0001 0 0 1 -0.015625,-0.083984 1.0001,1.0001 0 0 1 -0.00195,-0.027344 1.0001,1.0001 0 0 1 -0.00586,-0.085938 A 1.0001,1.0001 0 0 1 3,7.9355469 V 7.9257812 2 A 1.0001,1.0001 0 0 1 3.2929688,1.2929688 L 4.1796875,0.40625 a 1.0001,1.0001 0 0 1 0.7910156,-0.41601563 z"
     id="path2" />
</svg>
