<?xml version="1.0" encoding="UTF-8" standalone="no"?>
<svg
   xmlns:dc="http://purl.org/dc/elements/1.1/"
   xmlns:cc="http://creativecommons.org/ns#"
   xmlns:rdf="http://www.w3.org/1999/02/22-rdf-syntax-ns#"
   xmlns:svg="http://www.w3.org/2000/svg"
   xmlns="http://www.w3.org/2000/svg"
   xmlns:sodipodi="http://sodipodi.sourceforge.net/DTD/sodipodi-0.dtd"
   xmlns:inkscape="http://www.inkscape.org/namespaces/inkscape"
   data-dec="104"
   width="22"
   height="40"
   version="1.1"
   id="svg4"
   sodipodi:docname="104.svg"
   inkscape:version="0.92.4 (unknown)">
  <metadata
     id="metadata10">
    <rdf:RDF>
      <cc:Work
         rdf:about="">
        <dc:format>image/svg+xml</dc:format>
        <dc:type
           rdf:resource="http://purl.org/dc/dcmitype/StillImage" />
      </cc:Work>
    </rdf:RDF>
  </metadata>
  <defs
     id="defs8" />
  <sodipodi:namedview
     pagecolor="#ffffff"
     bordercolor="#666666"
     borderopacity="1"
     objecttolerance="10"
     gridtolerance="10"
     guidetolerance="10"
     inkscape:pageopacity="0"
     inkscape:pageshadow="2"
     inkscape:window-width="640"
     inkscape:window-height="480"
     id="namedview6"
     showgrid="false"
     inkscape:zoom="5.9"
     inkscape:cx="11"
     inkscape:cy="20"
     inkscape:window-x="0"
     inkscape:window-y="27"
     inkscape:window-maximized="0"
     inkscape:current-layer="svg4" />
  <path
     style="color:#000000;font-style:normal;font-variant:normal;font-weight:normal;font-stretch:normal;font-size:medium;line-height:normal;font-family:sans-serif;font-variant-ligatures:normal;font-variant-position:normal;font-variant-caps:normal;font-variant-numeric:normal;font-variant-alternates:normal;font-feature-settings:normal;text-indent:0;text-align:start;text-decoration:none;text-decoration-line:none;text-decoration-style:solid;text-decoration-color:#000000;letter-spacing:normal;word-spacing:normal;text-transform:none;writing-mode:lr-tb;direction:ltr;text-orientation:mixed;dominant-baseline:auto;baseline-shift:baseline;text-anchor:start;white-space:normal;shape-padding:0;clip-rule:nonzero;display:inline;overflow:visible;visibility:visible;opacity:1;isolation:auto;mix-blend-mode:normal;color-interpolation:sRGB;color-interpolation-filters:linearRGB;solid-color:#000000;solid-opacity:1;vector-effect:none;fill:#013272;fill-opacity:1;fill-rule:nonzero;stroke:none;stroke-width:0.5;stroke-linecap:round;stroke-linejoin:round;stroke-miterlimit:4;stroke-dasharray:none;stroke-dashoffset:0;stroke-opacity:1;color-rendering:auto;image-rendering:auto;shape-rendering:auto;text-rendering:auto;enable-background:accumulate"
     d="m 14.269531,8.9140625 0.908203,0.9082031 A 0.250025,0.250025 0 0 1 15.25,10 v 2 a 0.250025,0.250025 0 0 1 -0.01367,0.07813 L 13.25,18.041016 v 2.855468 L 14.103516,21.75 h 0.291015 L 13.822266,21.177734 A 0.250025,0.250025 0 0 1 13.75,21 v -3 a 0.250025,0.250025 0 0 1 0.01367,-0.07813 L 15.75,11.958984 V 10.103516 L 14.851562,9.2050781 Z M 7.9921875,0.74609375 A 0.250025,0.250025 0 0 1 8.0410156,0.75 h 0.9179688 a 0.250025,0.250025 0 0 1 0.2148437,0.0664063 0.250025,0.250025 0 0 1 0.00195,0.001953 0.250025,0.250025 0 0 1 0.015625,0.015625 0.250025,0.250025 0 0 1 0,0.001953 0.250025,0.250025 0 0 1 0.015625,0.0175781 0.250025,0.250025 0 0 1 0.00781,0.0136719 0.250025,0.250025 0 0 1 0.00391,0.007813 0.250025,0.250025 0 0 1 0.00195,0.001953 0.250025,0.250025 0 0 1 0.00977,0.22656248 L 5.9765625,12.488281 6.7773438,10.888672 a 0.250025,0.250025 0 0 1 0.044922,-0.06641 l 2,-2.0000004 a 0.250025,0.250025 0 0 1 0.066406,-0.044922 l 2.0000001,-1 A 0.250025,0.250025 0 0 1 11,7.75 h 1.960938 a 0.250025,0.250025 0 0 1 0.128906,0.015625 0.250025,0.250025 0 0 1 0.0059,0.00195 0.250025,0.250025 0 0 1 0.04297,0.023437 l 1.972656,0.9863282 a 0.250025,0.250025 0 0 1 0.06641,0.044922 l 1,1 A 0.250025,0.250025 0 0 1 16.25,10 v 2 a 0.250025,0.250025 0 0 1 -0.01367,0.07813 L 14.25,18.041016 v 2.855468 L 15.105469,21.75 h 1.791015 l 1.898438,-1.898438 0.982422,-1.96289 a 0.250025,0.250025 0 1 1 0.445312,0.222656 l -1,2 a 0.250025,0.250025 0 0 1 -0.04492,0.06641 l -2,2 A 0.250025,0.250025 0 0 1 17,22.25 h -1.960938 a 0.250025,0.250025 0 0 1 -0.07422,0 H 14 a 0.250025,0.250025 0 0 1 -0.177734,-0.07227 l -1,-1 A 0.250025,0.250025 0 0 1 12.75,21 v -3 a 0.250025,0.250025 0 0 1 0.01367,-0.07813 L 14.75,11.958984 V 10.103516 L 12.894531,8.25 H 11.058594 L 9.1484375,9.2050781 7.2050781,11.148438 5.234375,15.085938 3.2402344,22.068359 A 0.250025,0.250025 0 1 1 2.7597656,21.931641 l 1.9921875,-6.972657 a 0.250025,0.250025 0 0 1 0.013672,-0.05078 L 8.6679688,1.25 H 8.1875 L 2.2402344,22.068359 A 0.250025,0.250025 0 1 1 1.7597656,21.931641 L 7.6679688,1.25 H 5 a 0.250025,0.250025 0 1 1 0,-0.5 h 2.9589844 a 0.250025,0.250025 0 0 1 0.033203,-0.003906 z"
     id="path2" />
</svg>
