<?xml version="1.0" encoding="UTF-8" standalone="no"?>
<svg
   xmlns:dc="http://purl.org/dc/elements/1.1/"
   xmlns:cc="http://creativecommons.org/ns#"
   xmlns:rdf="http://www.w3.org/1999/02/22-rdf-syntax-ns#"
   xmlns:svg="http://www.w3.org/2000/svg"
   xmlns="http://www.w3.org/2000/svg"
   xmlns:sodipodi="http://sodipodi.sourceforge.net/DTD/sodipodi-0.dtd"
   xmlns:inkscape="http://www.inkscape.org/namespaces/inkscape"
   data-dec="339"
   width="30"
   height="40"
   version="1.1"
   id="svg4"
   sodipodi:docname="339.svg"
   inkscape:version="0.92.4 5da689c313, 2019-01-14">
  <metadata
     id="metadata10">
    <rdf:RDF>
      <cc:Work
         rdf:about="">
        <dc:format>image/svg+xml</dc:format>
        <dc:type
           rdf:resource="http://purl.org/dc/dcmitype/StillImage" />
        <dc:title></dc:title>
      </cc:Work>
    </rdf:RDF>
  </metadata>
  <defs
     id="defs8" />
  <sodipodi:namedview
     pagecolor="#ffffff"
     bordercolor="#666666"
     borderopacity="1"
     objecttolerance="10"
     gridtolerance="10"
     guidetolerance="10"
     inkscape:pageopacity="0"
     inkscape:pageshadow="2"
     inkscape:window-width="1920"
     inkscape:window-height="1043"
     id="namedview6"
     showgrid="false"
     inkscape:zoom="5.9"
     inkscape:cx="15"
     inkscape:cy="20"
     inkscape:window-x="0"
     inkscape:window-y="37"
     inkscape:window-maximized="0"
     inkscape:current-layer="svg4" />
  <path
     style="color:#000000;font-style:normal;font-variant:normal;font-weight:normal;font-stretch:normal;font-size:medium;line-height:normal;font-family:sans-serif;font-variant-ligatures:normal;font-variant-position:normal;font-variant-caps:normal;font-variant-numeric:normal;font-variant-alternates:normal;font-feature-settings:normal;text-indent:0;text-align:start;text-decoration:none;text-decoration-line:none;text-decoration-style:solid;text-decoration-color:#000000;letter-spacing:normal;word-spacing:normal;text-transform:none;writing-mode:lr-tb;direction:ltr;text-orientation:mixed;dominant-baseline:auto;baseline-shift:baseline;text-anchor:start;white-space:normal;shape-padding:0;clip-rule:nonzero;display:inline;overflow:visible;visibility:visible;opacity:1;isolation:auto;mix-blend-mode:normal;color-interpolation:sRGB;color-interpolation-filters:linearRGB;solid-color:#000000;solid-opacity:1;vector-effect:none;fill:#000000;fill-opacity:1;fill-rule:nonzero;stroke:none;stroke-width:0.5;stroke-linecap:round;stroke-linejoin:round;stroke-miterlimit:4;stroke-dasharray:none;stroke-dashoffset:0;stroke-opacity:1;color-rendering:auto;image-rendering:auto;shape-rendering:auto;text-rendering:auto;enable-background:accumulate"
     d="m 16,16.787109 -0.236328,0.710938 0.455078,1.367187 1.929688,1.929688 1.910156,0.955078 h 2.882812 L 24.851562,20.794922 26.644531,19 l -0.578125,-0.578125 -0.84375,1.689453 a 0.250025,0.250025 0 0 1 -0.111328,0.111328 l -2,1 A 0.250025,0.250025 0 0 1 23,21.25 h -3 a 0.250025,0.250025 0 0 1 -0.111328,-0.02734 l -2,-1 a 0.250025,0.250025 0 0 1 -0.06641,-0.04492 l -1,-1 a 0.250025,0.250025 0 0 1 -0.05859,-0.09961 z m -0.5,-3.496093 -0.25,0.75 v 1.917968 l 0.25,0.75 0.25,-0.75 v -0.917968 a 0.250025,0.250025 0 0 1 0,-0.08789 V 14.041016 Z M 20.058594,9.25 18.148438,10.205078 17.21875,11.134766 16.347656,13.75 H 25.75 V 12.058594 L 24.814453,10.185547 22.941406,9.25 Z M 8.0566406,9.25 6.1484375,10.205078 5.21875,11.134766 4.25,14.041016 v 1.917968 l 0.96875,2.90625 0.9296875,0.929688 L 8.0585938,20.75 H 10.941406 L 12.851562,19.794922 13.78125,18.865234 14.75,15.958984 V 14.041016 L 13.78125,11.134766 12.851562,10.205078 10.941406,9.25 Z M 20.058594,8.25 18.148438,9.2050781 16.21875,11.134766 15.763672,12.501953 16,13.212891 16.763672,10.921875 a 0.250025,0.250025 0 0 1 0.05859,-0.09961 l 1,-1.0000004 a 0.250025,0.250025 0 0 1 0.06641,-0.044922 l 2,-1 A 0.250025,0.250025 0 0 1 20,8.75 h 3 a 0.250025,0.250025 0 0 1 0.111328,0.027344 l 2,1 a 0.250025,0.250025 0 0 1 0.111328,0.1113281 l 1,2.0000001 A 0.250025,0.250025 0 0 1 26.25,12 v 2 A 0.250025,0.250025 0 0 1 26,14.25 h -9.75 v 0.5 h 10.5 V 12.058594 L 25.794922,10.148438 24.851562,9.2050781 22.941406,8.25 Z M 8.0566406,8.25 6.1484375,9.2050781 4.21875,11.134766 3.25,14.041016 v 1.917968 l 0.96875,2.90625 1.9296875,1.929688 L 8.0585938,21.75 H 10.941406 L 12.851562,20.794922 14.78125,18.865234 15.236328,17.498047 15,16.787109 14.236328,19.078125 a 0.250025,0.250025 0 0 1 -0.05859,0.09961 l -1,1 a 0.250025,0.250025 0 0 1 -0.06641,0.04492 l -2,1 A 0.250025,0.250025 0 0 1 11,21.25 H 8 a 0.250025,0.250025 0 0 1 -0.1113281,-0.02734 l -2,-1 a 0.250025,0.250025 0 0 1 -0.066406,-0.04492 l -1,-1 a 0.250025,0.250025 0 0 1 -0.058594,-0.09961 l -1,-3 A 0.250025,0.250025 0 0 1 3.75,16 v -2 a 0.250025,0.250025 0 0 1 0.013672,-0.07813 l 1,-3 a 0.250025,0.250025 0 0 1 0.058594,-0.09961 l 1,-1.0000004 a 0.250025,0.250025 0 0 1 0.066406,-0.044922 L 7.8515625,8.796875 a 0.250025,0.250025 0 0 1 0.074219,-0.037109 0.250025,0.250025 0 0 1 0.025391,-0.00586 0.250025,0.250025 0 0 1 0.023437,-0.00391 0.250025,0.250025 0 0 1 0.00195,0 0.250025,0.250025 0 0 1 0.048828,0 H 11 a 0.250025,0.250025 0 0 1 0.111328,0.027344 l 2,1 a 0.250025,0.250025 0 0 1 0.06641,0.044922 l 1,1.0000004 a 0.250025,0.250025 0 0 1 0.05859,0.09961 L 15,13.212891 15.236328,12.501953 14.78125,11.134766 12.851562,9.2050781 10.941406,8.25 Z M 8.0019531,7.7480469 A 0.250025,0.250025 0 0 1 8.0253906,7.75 H 11 a 0.250025,0.250025 0 0 1 0.111328,0.027344 l 2,1 a 0.250025,0.250025 0 0 1 0.06641,0.044922 l 2,2.0000004 a 0.250025,0.250025 0 0 1 0.05859,0.09961 L 15.5,11.712891 15.763672,10.921875 a 0.250025,0.250025 0 0 1 0.05859,-0.09961 l 2,-2.0000004 a 0.250025,0.250025 0 0 1 0.06641,-0.044922 l 2,-1 A 0.250025,0.250025 0 0 1 20,7.75 h 3 a 0.250025,0.250025 0 0 1 0.111328,0.027344 l 2,1 a 0.250025,0.250025 0 0 1 0.06641,0.044922 l 1,1 a 0.250025,0.250025 0 0 1 0.04492,0.066406 l 1,2.0000001 A 0.250025,0.250025 0 0 1 27.25,12 v 3 A 0.250025,0.250025 0 0 1 27,15.25 H 16.25 v 0.708984 l 0.96875,2.90625 0.929688,0.929688 1.910156,0.955078 h 2.882812 l 1.873047,-0.935547 0.962891,-1.925781 a 0.250025,0.250025 0 0 1 0.40039,-0.06641 l 0.97461,0.974609 a 0.250025,0.250025 0 0 1 0.02344,0.02148 l 0.002,0.0039 a 0.250025,0.250025 0 0 1 0.05273,0.07617 0.250025,0.250025 0 0 1 0.002,0.002 0.250025,0.250025 0 0 1 0.01953,0.09375 0.250025,0.250025 0 0 1 0,0.0039 0.250025,0.250025 0 0 1 0,0.02148 0.250025,0.250025 0 0 1 0,0.002 0.250025,0.250025 0 0 1 -0.0039,0.02344 0.250025,0.250025 0 0 1 0,0.002 0.250025,0.250025 0 0 1 -0.002,0.0039 0.250025,0.250025 0 0 1 -0.02148,0.06445 0.250025,0.250025 0 0 1 -0.002,0.002 0.250025,0.250025 0 0 1 -0.04492,0.06055 l -0.02344,0.02344 a 0.250025,0.250025 0 0 1 -0.0098,0.0078 l -1.966797,1.96875 a 0.250025,0.250025 0 0 1 -0.06641,0.04492 l -2,1 A 0.250025,0.250025 0 0 1 23,22.25 h -3 a 0.250025,0.250025 0 0 1 -0.111328,-0.02734 l -2,-1 a 0.250025,0.250025 0 0 1 -0.06641,-0.04492 l -2,-2 a 0.250025,0.250025 0 0 1 -0.05859,-0.09961 L 15.5,18.287109 15.236328,19.078125 a 0.250025,0.250025 0 0 1 -0.05859,0.09961 l -2,2 a 0.250025,0.250025 0 0 1 -0.06641,0.04492 l -2,1 A 0.250025,0.250025 0 0 1 11,22.25 H 8 a 0.250025,0.250025 0 0 1 -0.1113281,-0.02734 l -2,-1 a 0.250025,0.250025 0 0 1 -0.066406,-0.04492 l -2,-2 a 0.250025,0.250025 0 0 1 -0.058594,-0.09961 l -1,-3 A 0.250025,0.250025 0 0 1 2.75,16 v -2 a 0.250025,0.250025 0 0 1 0.013672,-0.07813 l 1,-3 a 0.250025,0.250025 0 0 1 0.058594,-0.09961 l 2,-2.0000004 a 0.250025,0.250025 0 0 1 0.066406,-0.044922 L 7.8515625,7.796875 a 0.250025,0.250025 0 0 1 0.074219,-0.037109 0.250025,0.250025 0 0 1 0.050781,-0.00977 0.250025,0.250025 0 0 1 0.025391,-0.00195 z"
     id="path2" />
</svg>
