<?xml version="1.0" encoding="UTF-8" standalone="no"?>
<svg
   xmlns:dc="http://purl.org/dc/elements/1.1/"
   xmlns:cc="http://creativecommons.org/ns#"
   xmlns:rdf="http://www.w3.org/1999/02/22-rdf-syntax-ns#"
   xmlns:svg="http://www.w3.org/2000/svg"
   xmlns="http://www.w3.org/2000/svg"
   xmlns:sodipodi="http://sodipodi.sourceforge.net/DTD/sodipodi-0.dtd"
   xmlns:inkscape="http://www.inkscape.org/namespaces/inkscape"
   data-dec="8216"
   width="7"
   height="40"
   version="1.1"
   id="svg4"
   sodipodi:docname="8216.svg"
   inkscape:version="0.92.4 (unknown)">
  <metadata
     id="metadata10">
    <rdf:RDF>
      <cc:Work
         rdf:about="">
        <dc:format>image/svg+xml</dc:format>
        <dc:type
           rdf:resource="http://purl.org/dc/dcmitype/StillImage" />
      </cc:Work>
    </rdf:RDF>
  </metadata>
  <defs
     id="defs8" />
  <sodipodi:namedview
     pagecolor="#ffffff"
     bordercolor="#666666"
     borderopacity="1"
     objecttolerance="10"
     gridtolerance="10"
     guidetolerance="10"
     inkscape:pageopacity="0"
     inkscape:pageshadow="2"
     inkscape:window-width="640"
     inkscape:window-height="480"
     id="namedview6"
     showgrid="false"
     inkscape:zoom="5.9"
     inkscape:cx="3.5"
     inkscape:cy="20"
     inkscape:window-x="0"
     inkscape:window-y="27"
     inkscape:window-maximized="0"
     inkscape:current-layer="svg4" />
  <path
     style="color:#000000;font-style:normal;font-variant:normal;font-weight:normal;font-stretch:normal;font-size:medium;line-height:normal;font-family:sans-serif;font-variant-ligatures:normal;font-variant-position:normal;font-variant-caps:normal;font-variant-numeric:normal;font-variant-alternates:normal;font-feature-settings:normal;text-indent:0;text-align:start;text-decoration:none;text-decoration-line:none;text-decoration-style:solid;text-decoration-color:#000000;letter-spacing:normal;word-spacing:normal;text-transform:none;writing-mode:lr-tb;direction:ltr;text-orientation:mixed;dominant-baseline:auto;baseline-shift:baseline;text-anchor:start;white-space:normal;shape-padding:0;clip-rule:nonzero;display:inline;overflow:visible;visibility:visible;opacity:1;isolation:auto;mix-blend-mode:normal;color-interpolation:sRGB;color-interpolation-filters:linearRGB;solid-color:#000000;solid-opacity:1;vector-effect:none;fill:#013272;fill-opacity:1;fill-rule:nonzero;stroke:none;stroke-width:0.30000001;stroke-linecap:round;stroke-linejoin:round;stroke-miterlimit:4;stroke-dasharray:none;stroke-dashoffset:0;stroke-opacity:1;color-rendering:auto;image-rendering:auto;shape-rendering:auto;text-rendering:auto;enable-background:accumulate"
     d="M 3.1503906,6.1503906 V 6.8496094 H 3.8496094 V 6.1503906 Z M 2.984375,5.8496094 a 0.15001501,0.15001501 0 0 1 0.015625,0 H 4 A 0.15001501,0.15001501 0 0 1 4.1503906,6 v 0.9824219 a 0.15001501,0.15001501 0 0 1 -0.00977,0.072266 0.15001501,0.15001501 0 0 1 0,0.00195 0.15001501,0.15001501 0 0 1 -0.00586,0.011719 0.15001501,0.15001501 0 0 1 -0.00781,0.013672 0.15001501,0.15001501 0 0 1 -0.00781,0.011719 0.15001501,0.15001501 0 0 1 0,0.00195 0.15001501,0.15001501 0 0 1 -0.00586,0.00391 0.15001501,0.15001501 0 0 1 -0.00586,0.00586 0.15001501,0.15001501 0 0 1 -0.021484,0.019531 0.15001501,0.15001501 0 0 1 -0.041016,0.019531 0.15001501,0.15001501 0 0 1 -0.027344,0.00586 0.15001501,0.15001501 0 0 1 -0.00195,0 0.15001501,0.15001501 0 0 1 -0.042969,0 H 3 A 0.15001501,0.15001501 0 0 1 2.8496094,7 V 6 A 0.15001501,0.15001501 0 0 1 2.984375,5.8496094 Z M 3.0625,5.1503906 2.1503906,6.0605469 V 6.9375 L 3.0625,7.8496094 h 0.875 L 4.8496094,6.9375 V 6.0625 L 3.9375,5.1503906 Z M 2.4824219,4.6933594 2.2773438,5.5117188 2.7890625,5 Z M 2.1503906,4.3613281 V 4.7753906 L 2.2324219,4.4433594 Z M 2.5214844,3.2929688 2.1816406,3.9707031 2.3183594,4.1074219 Z M 4.9863281,0.84960938 A 0.15001501,0.15001501 0 0 1 5.0664062,1.1347656 L 3.1308594,2.1015625 2.5664062,4.3554688 3.0605469,4.8496094 H 4 a 0.15001501,0.15001501 0 0 1 0.1054688,0.044922 l 1,1 A 0.15001501,0.15001501 0 0 1 5.1503906,6 v 1 a 0.15001501,0.15001501 0 0 1 -0.044922,0.1054688 l -1,1 A 0.15001501,0.15001501 0 0 1 4,8.1503906 H 3 A 0.15001501,0.15001501 0 0 1 2.8945312,8.1054688 l -1,-1 A 0.15001501,0.15001501 0 0 1 1.8496094,7 V 6.015625 a 0.15001501,0.15001501 0 0 1 0,-0.00781 0.15001501,0.15001501 0 0 1 0,-0.013672 0.15001501,0.15001501 0 0 1 0,-0.00781 v -1.96875 a 0.15001501,0.15001501 0 0 1 0,-0.027344 0.15001501,0.15001501 0 0 1 0,-0.00195 0.15001501,0.15001501 0 0 1 0.00195,-0.013672 0.15001501,0.15001501 0 0 1 0,-0.00195 0.15001501,0.15001501 0 0 1 0.021484,-0.054687 L 2.8632812,1.9394531 a 0.15001501,0.15001501 0 0 1 0.00195,-0.00586 0.15001501,0.15001501 0 0 1 0.00195,-0.00195 0.15001501,0.15001501 0 0 1 0.00195,-0.00391 0.15001501,0.15001501 0 0 1 0,-0.00195 0.15001501,0.15001501 0 0 1 0.00781,-0.011719 0.15001501,0.15001501 0 0 1 0.00977,-0.013672 0.15001501,0.15001501 0 0 1 0.00977,-0.00781 0.15001501,0.15001501 0 0 1 0.056641,-0.037109 L 4.9335938,0.86523438 a 0.15001501,0.15001501 0 0 1 0.052734,-0.015625 z"
     id="path2" />
</svg>
