<?xml version="1.0" encoding="UTF-8" standalone="no"?>
<svg
   xmlns:dc="http://purl.org/dc/elements/1.1/"
   xmlns:cc="http://creativecommons.org/ns#"
   xmlns:rdf="http://www.w3.org/1999/02/22-rdf-syntax-ns#"
   xmlns:svg="http://www.w3.org/2000/svg"
   xmlns="http://www.w3.org/2000/svg"
   xmlns:sodipodi="http://sodipodi.sourceforge.net/DTD/sodipodi-0.dtd"
   xmlns:inkscape="http://www.inkscape.org/namespaces/inkscape"
   data-dec="37"
   width="12"
   height="40"
   version="1.1"
   id="svg4"
   sodipodi:docname="37.svg"
   inkscape:version="0.92.4 5da689c313, 2019-01-14">
  <metadata
     id="metadata10">
    <rdf:RDF>
      <cc:Work
         rdf:about="">
        <dc:format>image/svg+xml</dc:format>
        <dc:type
           rdf:resource="http://purl.org/dc/dcmitype/StillImage" />
        <dc:title></dc:title>
      </cc:Work>
    </rdf:RDF>
  </metadata>
  <defs
     id="defs8" />
  <sodipodi:namedview
     pagecolor="#ffffff"
     bordercolor="#666666"
     borderopacity="1"
     objecttolerance="10"
     gridtolerance="10"
     guidetolerance="10"
     inkscape:pageopacity="0"
     inkscape:pageshadow="2"
     inkscape:window-width="1920"
     inkscape:window-height="1043"
     id="namedview6"
     showgrid="false"
     inkscape:zoom="5.9"
     inkscape:cx="6"
     inkscape:cy="20"
     inkscape:window-x="0"
     inkscape:window-y="37"
     inkscape:window-maximized="0"
     inkscape:current-layer="svg4" />
  <path
     style="color:#000000;font-style:normal;font-variant:normal;font-weight:normal;font-stretch:normal;font-size:medium;line-height:normal;font-family:sans-serif;font-variant-ligatures:normal;font-variant-position:normal;font-variant-caps:normal;font-variant-numeric:normal;font-variant-alternates:normal;font-feature-settings:normal;text-indent:0;text-align:start;text-decoration:none;text-decoration-line:none;text-decoration-style:solid;text-decoration-color:#000000;letter-spacing:normal;word-spacing:normal;text-transform:none;writing-mode:lr-tb;direction:ltr;text-orientation:mixed;dominant-baseline:auto;baseline-shift:baseline;text-anchor:start;white-space:normal;shape-padding:0;clip-rule:nonzero;display:inline;overflow:visible;visibility:visible;opacity:1;isolation:auto;mix-blend-mode:normal;color-interpolation:sRGB;color-interpolation-filters:linearRGB;solid-color:#000000;solid-opacity:1;vector-effect:none;fill:#000000;fill-opacity:1;fill-rule:nonzero;stroke:none;stroke-width:1.5;stroke-linecap:round;stroke-linejoin:round;stroke-miterlimit:4;stroke-dasharray:none;stroke-dashoffset:0;stroke-opacity:1;color-rendering:auto;image-rendering:auto;shape-rendering:auto;text-rendering:auto;enable-background:accumulate"
     d="M 8.8125,15.75 8.1777344,16.382812 7.75,18.091797 v 1.730469 L 8.4628906,21.25 H 8.6894531 L 9.3222656,20.617188 9.75,18.908203 V 17.177734 L 9.0371094,15.75 Z M 8.484375,14.242188 A 0.750075,0.750075 0 0 1 8.6054688,14.25 H 9.5 a 0.750075,0.750075 0 0 1 0.669922,0.414062 l 1,2 A 0.750075,0.750075 0 0 1 11.25,17 v 2 a 0.750075,0.750075 0 0 1 -0.02148,0.181641 l -0.5,2 A 0.750075,0.750075 0 0 1 10.53125,21.53125 l -1,1 A 0.750075,0.750075 0 0 1 9,22.75 H 8 A 0.750075,0.750075 0 0 1 7.3300781,22.335938 l -1,-2 A 0.750075,0.750075 0 0 1 6.25,20 v -2 a 0.750075,0.750075 0 0 1 0.021484,-0.181641 l 0.5,-2 A 0.750075,0.750075 0 0 1 6.96875,15.46875 l 0.9277344,-0.927734 a 0.750075,0.750075 0 0 1 0.2988281,-0.230469 0.750075,0.750075 0 0 1 0.011719,-0.0059 0.750075,0.750075 0 0 1 0.023438,-0.0078 0.750075,0.750075 0 0 1 0.2539062,-0.05469 z M 3.3105469,1.75 2.6777344,2.3828125 2.25,4.0917969 V 5.8222656 L 2.9628906,7.25 H 3.1894531 L 3.8222656,6.6171875 4.25,4.9082031 V 3.1777344 L 3.5371094,1.75 Z M 4.0117188,0.24023438 A 0.750075,0.750075 0 0 1 4.53125,0.46875 0.750075,0.750075 0 0 1 4.5546875,0.4921875 L 5.4785156,1.4179688 6.7265625,2.25 h 1.046875 L 9.0214844,1.4179688 9.9355469,0.50195312 a 0.750075,0.750075 0 0 1 0.6250001,-0.2578125 0.750075,0.750075 0 0 1 0.146484,0.0253906 0.750075,0.750075 0 0 1 0.0625,0.0195313 0.750075,0.750075 0 0 1 0.0098,0.003906 0.750075,0.750075 0 0 1 0.0098,0.003906 0.750075,0.750075 0 0 1 0.05859,0.0273438 0.750075,0.750075 0 0 1 0.06445,0.0371094 0.750075,0.750075 0 0 1 0.0098,0.005859 0.750075,0.750075 0 0 1 0.05078,0.0371094 0.750075,0.750075 0 0 1 0.0098,0.007813 0.750075,0.750075 0 0 1 0.04687,0.0429687 0.750075,0.750075 0 0 1 0.0078,0.007813 0.750075,0.750075 0 0 1 0.04297,0.046875 0.750075,0.750075 0 0 1 0.0078,0.007813 0.750075,0.750075 0 0 1 0.01172,0.0175781 0.750075,0.750075 0 0 1 0.07031,0.10742187 0.750075,0.750075 0 0 1 0.03125,0.0683594 0.750075,0.750075 0 0 1 -0.03516,0.640625 l -0.002,0.00391 L 2.1894531,22.294922 A 0.750075,0.750075 0 1 1 0.81054688,21.705078 L 8.6171875,3.4921875 8.4160156,3.625 A 0.750075,0.750075 0 0 1 8,3.75 H 6.5 A 0.750075,0.750075 0 0 1 6.0839844,3.625 L 5.75,3.4023438 V 5 a 0.750075,0.750075 0 0 1 -0.021484,0.1816406 l -0.5,2 A 0.750075,0.750075 0 0 1 5.03125,7.53125 l -1,1 A 0.750075,0.750075 0 0 1 3.5,8.75 h -1 A 0.750075,0.750075 0 0 1 1.8300781,8.3359375 l -0.99999998,-2 A 0.750075,0.750075 0 0 1 0.75,6 V 4 a 0.750075,0.750075 0 0 1 0.0214844,-0.1816406 l 0.50000002,-2 A 0.750075,0.750075 0 0 1 1.46875,1.46875 l 1,-1 A 0.750075,0.750075 0 0 1 3,0.25 h 0.8769531 a 0.750075,0.750075 0 0 1 0.1347657,-0.009766 z"
     id="path2" />
</svg>
