<?xml version="1.0" encoding="UTF-8" standalone="no"?>
<svg
   xmlns:dc="http://purl.org/dc/elements/1.1/"
   xmlns:cc="http://creativecommons.org/ns#"
   xmlns:rdf="http://www.w3.org/1999/02/22-rdf-syntax-ns#"
   xmlns:svg="http://www.w3.org/2000/svg"
   xmlns="http://www.w3.org/2000/svg"
   xmlns:sodipodi="http://sodipodi.sourceforge.net/DTD/sodipodi-0.dtd"
   xmlns:inkscape="http://www.inkscape.org/namespaces/inkscape"
   data-dec="65"
   width="20"
   height="40"
   version="1.1"
   id="svg4"
   sodipodi:docname="65.svg"
   inkscape:version="0.92.4 5da689c313, 2019-01-14">
  <metadata
     id="metadata10">
    <rdf:RDF>
      <cc:Work
         rdf:about="">
        <dc:format>image/svg+xml</dc:format>
        <dc:type
           rdf:resource="http://purl.org/dc/dcmitype/StillImage" />
        <dc:title></dc:title>
      </cc:Work>
    </rdf:RDF>
  </metadata>
  <defs
     id="defs8" />
  <sodipodi:namedview
     pagecolor="#ffffff"
     bordercolor="#666666"
     borderopacity="1"
     objecttolerance="10"
     gridtolerance="10"
     guidetolerance="10"
     inkscape:pageopacity="0"
     inkscape:pageshadow="2"
     inkscape:window-width="1920"
     inkscape:window-height="1043"
     id="namedview6"
     showgrid="false"
     inkscape:zoom="5.9"
     inkscape:cx="10"
     inkscape:cy="20"
     inkscape:window-x="0"
     inkscape:window-y="37"
     inkscape:window-maximized="0"
     inkscape:current-layer="svg4" />
  <path
     style="color:#000000;font-style:normal;font-variant:normal;font-weight:normal;font-stretch:normal;font-size:medium;line-height:normal;font-family:sans-serif;font-variant-ligatures:normal;font-variant-position:normal;font-variant-caps:normal;font-variant-numeric:normal;font-variant-alternates:normal;font-feature-settings:normal;text-indent:0;text-align:start;text-decoration:none;text-decoration-line:none;text-decoration-style:solid;text-decoration-color:#000000;letter-spacing:normal;word-spacing:normal;text-transform:none;writing-mode:lr-tb;direction:ltr;text-orientation:mixed;dominant-baseline:auto;baseline-shift:baseline;text-anchor:start;white-space:normal;shape-padding:0;clip-rule:nonzero;display:inline;overflow:visible;visibility:visible;opacity:1;isolation:auto;mix-blend-mode:normal;color-interpolation:sRGB;color-interpolation-filters:linearRGB;solid-color:#000000;solid-opacity:1;vector-effect:none;fill:#000000;fill-opacity:1;fill-rule:nonzero;stroke:none;stroke-width:2.5;stroke-linecap:round;stroke-linejoin:round;stroke-miterlimit:4;stroke-dasharray:none;stroke-dashoffset:0;stroke-opacity:1;color-rendering:auto;image-rendering:auto;shape-rendering:auto;text-rendering:auto;enable-background:accumulate"
     d="M 10,7.4472656 7.1601562,14.75 H 12.839844 Z M 9.9433594,-0.265625 a 1.250125,1.250125 0 0 1 0.076172,0 1.250125,1.250125 0 0 1 0.111328,0.007813 1.250125,1.250125 0 0 1 0.01367,0 1.250125,1.250125 0 0 1 0.0098,0.001953 1.250125,1.250125 0 0 1 0.113281,0.0195313 1.250125,1.250125 0 0 1 0.958984,0.94335937 1.250125,1.250125 0 0 1 0,0.001953 L 19.099609,21.375 a 1.250125,1.250125 0 0 1 0.0078,1.232422 1.250125,1.250125 0 0 1 -0.06445,0.105469 1.250125,1.250125 0 0 1 -0.05664,0.07813 1.250125,1.250125 0 0 1 -0.002,0.002 A 1.250125,1.250125 0 0 1 17.810547,23.25 H 17 A 1.250125,1.250125 0 0 1 15.835938,22.453125 L 14.201172,18.25 H 5.7988281 L 4.1640625,22.453125 A 1.250125,1.250125 0 0 1 3,23.25 H 2.1914062 a 1.250125,1.250125 0 0 1 -1.1523437,-0.429688 1.250125,1.250125 0 0 1 -0.0605469,-0.07617 1.250125,1.250125 0 0 1 -0.003906,-0.0059 1.250125,1.250125 0 0 1 -0.0566406,-0.08594 1.250125,1.250125 0 0 1 -0.009766,-0.01563 1.250125,1.250125 0 0 1 -0.009766,-1.253907 L 8.7792969,0.6953125 a 1.250125,1.250125 0 0 1 1.0390625,-0.94726562 1.250125,1.250125 0 0 1 0.1113281,-0.0117188 1.250125,1.250125 0 0 1 0.013672,-0.001953 z"
     id="path2" />
</svg>
