<?xml version="1.0" encoding="UTF-8" standalone="no"?>
<svg
   xmlns:dc="http://purl.org/dc/elements/1.1/"
   xmlns:cc="http://creativecommons.org/ns#"
   xmlns:rdf="http://www.w3.org/1999/02/22-rdf-syntax-ns#"
   xmlns:svg="http://www.w3.org/2000/svg"
   xmlns="http://www.w3.org/2000/svg"
   xmlns:sodipodi="http://sodipodi.sourceforge.net/DTD/sodipodi-0.dtd"
   xmlns:inkscape="http://www.inkscape.org/namespaces/inkscape"
   data-dec="56"
   width="20"
   height="40"
   version="1.1"
   id="svg4"
   sodipodi:docname="56.svg"
   inkscape:version="0.92.4 5da689c313, 2019-01-14">
  <metadata
     id="metadata10">
    <rdf:RDF>
      <cc:Work
         rdf:about="">
        <dc:format>image/svg+xml</dc:format>
        <dc:type
           rdf:resource="http://purl.org/dc/dcmitype/StillImage" />
        <dc:title></dc:title>
      </cc:Work>
    </rdf:RDF>
  </metadata>
  <defs
     id="defs8" />
  <sodipodi:namedview
     pagecolor="#ffffff"
     bordercolor="#666666"
     borderopacity="1"
     objecttolerance="10"
     gridtolerance="10"
     guidetolerance="10"
     inkscape:pageopacity="0"
     inkscape:pageshadow="2"
     inkscape:window-width="1920"
     inkscape:window-height="1043"
     id="namedview6"
     showgrid="false"
     inkscape:zoom="5.9"
     inkscape:cx="10"
     inkscape:cy="20"
     inkscape:window-x="0"
     inkscape:window-y="37"
     inkscape:window-maximized="0"
     inkscape:current-layer="svg4" />
  <path
     style="color:#000000;font-style:normal;font-variant:normal;font-weight:normal;font-stretch:normal;font-size:medium;line-height:normal;font-family:sans-serif;font-variant-ligatures:normal;font-variant-position:normal;font-variant-caps:normal;font-variant-numeric:normal;font-variant-alternates:normal;font-feature-settings:normal;text-indent:0;text-align:start;text-decoration:none;text-decoration-line:none;text-decoration-style:solid;text-decoration-color:#000000;letter-spacing:normal;word-spacing:normal;text-transform:none;writing-mode:lr-tb;direction:ltr;text-orientation:mixed;dominant-baseline:auto;baseline-shift:baseline;text-anchor:start;white-space:normal;shape-padding:0;clip-rule:nonzero;display:inline;overflow:visible;visibility:visible;opacity:1;isolation:auto;mix-blend-mode:normal;color-interpolation:sRGB;color-interpolation-filters:linearRGB;solid-color:#000000;solid-opacity:1;vector-effect:none;fill:#000000;fill-opacity:1;fill-rule:nonzero;stroke:none;stroke-width:0.5;stroke-linecap:round;stroke-linejoin:round;stroke-miterlimit:4;stroke-dasharray:none;stroke-dashoffset:0;stroke-opacity:1;color-rendering:auto;image-rendering:auto;shape-rendering:auto;text-rendering:auto;enable-background:accumulate"
     d="m 3.8945312,19.230469 0.3105469,0.621093 0.9296875,0.929688 2.90625,0.96875 h 3.9179684 l 2.90625,-0.96875 0.929688,-0.929688 0.310547,-0.621093 -0.664063,0.443359 -0.21875,0.4375 a 0.250025,0.250025 0 0 1 -0.144531,0.125 l -0.960937,0.320313 -0.978516,0.652343 a 0.250025,0.250025 0 0 1 -0.392578,-0.195312 l -0.667969,0.222656 A 0.250025,0.250025 0 0 1 12,21.25 H 8 A 0.250025,0.250025 0 0 1 7.921875,21.236328 L 7.2519531,21.013672 a 0.250025,0.250025 0 0 1 -0.390625,0.195312 L 5.8828125,20.556641 4.921875,20.236328 a 0.250025,0.250025 0 0 1 -0.1445312,-0.125 l -0.21875,-0.4375 z M 10,10.757812 8.0878906,11.236328 6.1484375,12.205078 5.2050781,13.148438 4.25,15.058594 v 2.882812 L 4.9433594,19.328125 6.1113281,20.107422 8.0410156,20.75 H 11.958984 L 13.888672,20.107422 15.056641,19.328125 15.75,17.941406 v -2.882812 l -0.955078,-1.910156 -0.94336,-0.94336 -1.939453,-0.96875 z m 1.96875,-0.492187 -0.9375,0.234375 1.029297,0.257812 a 0.250025,0.250025 0 0 1 0.05078,0.01953 l 2,1 a 0.250025,0.250025 0 0 1 0.06641,0.04492 l 1,1 a 0.250025,0.250025 0 0 1 0.04492,0.06641 l 1,2 A 0.250025,0.250025 0 0 1 16.25,15 v 3 a 0.250025,0.250025 0 0 1 -0.02734,0.111328 l -0.332031,0.664063 a 0.250025,0.250025 0 0 1 0.357422,0.169921 L 16.75,17.941406 v -2.882812 l -0.955078,-1.910156 -1.94336,-1.94336 z m -3.9375,0 -1.8828125,0.939453 -1.9433594,1.94336 L 3.25,15.058594 v 2.882812 l 0.5019531,1.003906 A 0.250025,0.250025 0 0 1 4.109375,18.775391 L 3.7773438,18.111328 A 0.250025,0.250025 0 0 1 3.75,18 v -3 a 0.250025,0.250025 0 0 1 0.027344,-0.111328 l 1,-2 a 0.250025,0.250025 0 0 1 0.044922,-0.06641 l 1,-1 a 0.250025,0.250025 0 0 1 0.066406,-0.04492 l 2,-1 a 0.250025,0.250025 0 0 1 0.050781,-0.01953 L 8.96875,10.5 Z M 10,9.7578125 9.0332031,10 10,10.242188 10.966797,10 Z m 5.248047,-6.703125 a 0.250025,0.250025 0 0 1 -0.326172,0.1816406 l -0.03125,-0.00977 0.332031,0.6621094 A 0.250025,0.250025 0 0 1 15.25,4 v 2 a 0.250025,0.250025 0 0 1 -0.02734,0.1113281 l -1,2 a 0.250025,0.250025 0 0 1 -0.111328,0.1113281 l -2,1 a 0.250025,0.250025 0 0 1 -0.05078,0.019531 L 11.03125,9.5 11.96875,9.734375 13.851562,8.7949219 14.794922,7.8515625 15.75,5.9414062 V 4.0585938 Z m -10.4960939,0 L 4.25,4.0585938 V 5.9414062 L 5.2050781,7.8515625 6.1484375,8.7949219 8.03125,9.734375 8.96875,9.5 7.9394531,9.2421875 a 0.250025,0.250025 0 0 1 -0.050781,-0.019531 l -2,-1 A 0.250025,0.250025 0 0 1 5.7773438,8.1113281 l -1,-2 A 0.250025,0.250025 0 0 1 4.75,6 V 4 A 0.250025,0.250025 0 0 1 4.7773438,3.8886719 L 5.109375,3.2265625 5.078125,3.2363281 A 0.250025,0.250025 0 0 1 4.7519531,3.0546875 Z M 8.0410156,2.25 5.7773438,3.0039062 5.25,4.0585938 V 5.9414062 L 6.1855469,7.8144531 8.0878906,8.7636719 10,9.2421875 11.912109,8.7636719 13.814453,7.8144531 14.75,5.9414062 V 4.0585938 L 14.222656,3.0039062 11.958984,2.25 Z m 6.2519534,-0.2207031 0.283203,0.5664062 0.501953,0.1679688 a 0.250025,0.250025 0 0 1 0.0293,0.00977 L 14.822266,2.2050781 Z M 5.7070312,2.0273438 5.1777344,2.2050781 4.8925781,2.7734375 a 0.250025,0.250025 0 0 1 0.029297,-0.00977 L 5.4238281,2.5957031 Z M 8.0371094,1.25 6.2109375,1.859375 a 0.250025,0.250025 0 0 1 0.011719,0.2519531 L 6.0917969,2.3730469 7.921875,1.7636719 A 0.250025,0.250025 0 0 1 8,1.75 h 4 a 0.250025,0.250025 0 0 1 0.07813,0.013672 l 1.830078,0.609375 -0.130859,-0.2617188 a 0.250025,0.250025 0 0 1 0.01172,-0.25 L 11.958984,1.25 Z M 8.0117188,0.74804688 A 0.250025,0.250025 0 0 1 8.0234375,0.75 H 12 a 0.250025,0.250025 0 0 1 0.07813,0.0136719 l 3,1.00000002 a 0.250025,0.250025 0 0 1 0.144531,0.125 l 1,2 A 0.250025,0.250025 0 0 1 16.25,4 v 2 a 0.250025,0.250025 0 0 1 -0.02734,0.1113281 l -1,2 a 0.250025,0.250025 0 0 1 -0.04492,0.066406 l -1,1 a 0.250025,0.250025 0 0 1 -0.06641,0.044922 L 12.556641,10 l 1.554687,0.777344 a 0.250025,0.250025 0 0 1 0.06641,0.04492 l 2,2 a 0.250025,0.250025 0 0 1 0.04492,0.06641 l 1,2 A 0.250025,0.250025 0 0 1 17.25,15 v 3 a 0.250025,0.250025 0 0 1 -0.02734,0.111328 l -1,2 a 0.250025,0.250025 0 0 1 -0.04492,0.06641 l -1,1 a 0.250025,0.250025 0 0 1 -0.09961,0.05859 l -3,1 A 0.250025,0.250025 0 0 1 12,22.25 H 8 a 0.250025,0.250025 0 0 1 -0.078125,-0.01367 l -3,-1 a 0.250025,0.250025 0 0 1 -0.099609,-0.05859 l -1,-1 a 0.250025,0.250025 0 0 1 -0.044922,-0.06641 l -1,-2 A 0.250025,0.250025 0 0 1 2.75,18 v -3 a 0.250025,0.250025 0 0 1 0.027344,-0.111328 l 1,-2 a 0.250025,0.250025 0 0 1 0.044922,-0.06641 l 2,-2 a 0.250025,0.250025 0 0 1 0.066406,-0.04492 L 7.4433594,10 5.8886719,9.2226562 a 0.250025,0.250025 0 0 1 -0.066406,-0.044922 l -1,-1 a 0.250025,0.250025 0 0 1 -0.044922,-0.066406 l -1,-2 A 0.250025,0.250025 0 0 1 3.75,6 V 4 a 0.250025,0.250025 0 0 1 0.027344,-0.1113281 l 1,-2 a 0.250025,0.250025 0 0 1 0.1445312,-0.125 L 7.8789062,0.77929688 a 0.250025,0.250025 0 0 1 0.00781,-0.003906 0.250025,0.250025 0 0 1 0.050781,-0.0175781 0.250025,0.250025 0 0 1 0.013672,-0.003906 0.250025,0.250025 0 0 1 0.011719,-0.001953 0.250025,0.250025 0 0 1 0.011719,-0.001953 0.250025,0.250025 0 0 1 0.011719,0 0.250025,0.250025 0 0 1 0.013672,0 0.250025,0.250025 0 0 1 0.011719,-0.001953 z"
     id="path2" />
</svg>
