<?xml version="1.0" encoding="UTF-8" standalone="no"?>
<svg
   xmlns:dc="http://purl.org/dc/elements/1.1/"
   xmlns:cc="http://creativecommons.org/ns#"
   xmlns:rdf="http://www.w3.org/1999/02/22-rdf-syntax-ns#"
   xmlns:svg="http://www.w3.org/2000/svg"
   xmlns="http://www.w3.org/2000/svg"
   xmlns:sodipodi="http://sodipodi.sourceforge.net/DTD/sodipodi-0.dtd"
   xmlns:inkscape="http://www.inkscape.org/namespaces/inkscape"
   data-dec="123"
   width="14"
   height="40"
   version="1.1"
   id="svg4"
   sodipodi:docname="123.svg"
   inkscape:version="0.92.4 5da689c313, 2019-01-14">
  <metadata
     id="metadata10">
    <rdf:RDF>
      <cc:Work
         rdf:about="">
        <dc:format>image/svg+xml</dc:format>
        <dc:type
           rdf:resource="http://purl.org/dc/dcmitype/StillImage" />
        <dc:title></dc:title>
      </cc:Work>
    </rdf:RDF>
  </metadata>
  <defs
     id="defs8" />
  <sodipodi:namedview
     pagecolor="#ffffff"
     bordercolor="#666666"
     borderopacity="1"
     objecttolerance="10"
     gridtolerance="10"
     guidetolerance="10"
     inkscape:pageopacity="0"
     inkscape:pageshadow="2"
     inkscape:window-width="1920"
     inkscape:window-height="1043"
     id="namedview6"
     showgrid="false"
     inkscape:zoom="5.9"
     inkscape:cx="7"
     inkscape:cy="20"
     inkscape:window-x="0"
     inkscape:window-y="37"
     inkscape:window-maximized="0"
     inkscape:current-layer="svg4" />
  <path
     style="color:#000000;font-style:normal;font-variant:normal;font-weight:normal;font-stretch:normal;font-size:medium;line-height:normal;font-family:sans-serif;font-variant-ligatures:normal;font-variant-position:normal;font-variant-caps:normal;font-variant-numeric:normal;font-variant-alternates:normal;font-feature-settings:normal;text-indent:0;text-align:start;text-decoration:none;text-decoration-line:none;text-decoration-style:solid;text-decoration-color:#000000;letter-spacing:normal;word-spacing:normal;text-transform:none;writing-mode:lr-tb;direction:ltr;text-orientation:mixed;dominant-baseline:auto;baseline-shift:baseline;text-anchor:start;white-space:normal;shape-padding:0;clip-rule:nonzero;display:inline;overflow:visible;visibility:visible;opacity:1;isolation:auto;mix-blend-mode:normal;color-interpolation:sRGB;color-interpolation-filters:linearRGB;solid-color:#000000;solid-opacity:1;vector-effect:none;fill:#000000;fill-opacity:1;fill-rule:nonzero;stroke:none;stroke-width:3;stroke-linecap:round;stroke-linejoin:round;stroke-miterlimit:4;stroke-dasharray:none;stroke-dashoffset:0;stroke-opacity:1;color-rendering:auto;image-rendering:auto;shape-rendering:auto;text-rendering:auto;enable-background:accumulate"
     d="m 9.0078125,-4.5097656 a 1.50015,1.50015 0 0 1 0.6621094,2.8515625 l -1.78125,0.89062498 -0.65625,0.65625 L 6.5,1.3535156 v 1.2929688 l 0.7324219,1.4648437 0.828125,0.828125 a 1.50015,1.50015 0 0 1 0.28125,0.390625 l 1,2 A 1.50015,1.50015 0 0 1 9.5,8 v 2 A 1.50015,1.50015 0 0 1 9.0605469,11.060547 L 7.1679688,12.953125 A 1.50015,1.50015 0 0 1 7.1269531,13 a 1.50015,1.50015 0 0 1 0.037109,0.04297 l 1.8964844,1.896484 A 1.50015,1.50015 0 0 1 9.5,16 v 2 a 1.50015,1.50015 0 0 1 -0.1582031,0.669922 l -1,2 a 1.50015,1.50015 0 0 1 -0.28125,0.390625 L 7.2324219,21.888672 6.5,23.353516 v 1.292968 l 0.7324219,1.464844 0.65625,0.65625 1.78125,0.890625 a 1.50015,1.50015 0 1 1 -1.3398438,2.683594 l -2,-1 a 1.50015,1.50015 0 0 1 -0.390625,-0.28125 l -1,-1 a 1.50015,1.50015 0 0 1 -0.28125,-0.390625 l -1,-2 A 1.50015,1.50015 0 0 1 3.5,25 v -2 a 1.50015,1.50015 0 0 1 0.1582031,-0.669922 l 1,-2 a 1.50015,1.50015 0 0 1 0.28125,-0.390625 L 5.7675781,19.111328 6.5,17.646484 v -1.02539 l -1.3886719,-1.388672 -1.78125,-0.890625 a 1.50015,1.50015 0 0 1 0,-2.683594 L 5.1113281,10.767578 6.5,9.3789062 V 8.3535156 L 5.7675781,6.8886719 4.9394531,6.0605469 a 1.50015,1.50015 0 0 1 -0.28125,-0.390625 l -1,-2 A 1.50015,1.50015 0 0 1 3.5,3 V 1 A 1.50015,1.50015 0 0 1 3.6582031,0.33007812 l 1,-2.00000002 a 1.50015,1.50015 0 0 1 0.28125,-0.390625 l 1,-1 a 1.50015,1.50015 0 0 1 0.390625,-0.28125 l 2,-1 a 1.50015,1.50015 0 0 1 0.6777344,-0.1679687 z"
     id="path2" />
</svg>
