<?xml version="1.0" encoding="UTF-8" standalone="no"?>
<svg
   xmlns:dc="http://purl.org/dc/elements/1.1/"
   xmlns:cc="http://creativecommons.org/ns#"
   xmlns:rdf="http://www.w3.org/1999/02/22-rdf-syntax-ns#"
   xmlns:svg="http://www.w3.org/2000/svg"
   xmlns="http://www.w3.org/2000/svg"
   xmlns:sodipodi="http://sodipodi.sourceforge.net/DTD/sodipodi-0.dtd"
   xmlns:inkscape="http://www.inkscape.org/namespaces/inkscape"
   data-dec="53"
   width="22"
   height="40"
   version="1.1"
   id="svg4"
   sodipodi:docname="53.svg"
   inkscape:version="0.92.4 (unknown)">
  <metadata
     id="metadata10">
    <rdf:RDF>
      <cc:Work
         rdf:about="">
        <dc:format>image/svg+xml</dc:format>
        <dc:type
           rdf:resource="http://purl.org/dc/dcmitype/StillImage" />
      </cc:Work>
    </rdf:RDF>
  </metadata>
  <defs
     id="defs8" />
  <sodipodi:namedview
     pagecolor="#ffffff"
     bordercolor="#666666"
     borderopacity="1"
     objecttolerance="10"
     gridtolerance="10"
     guidetolerance="10"
     inkscape:pageopacity="0"
     inkscape:pageshadow="2"
     inkscape:window-width="640"
     inkscape:window-height="480"
     id="namedview6"
     showgrid="false"
     inkscape:zoom="5.9"
     inkscape:cx="11"
     inkscape:cy="20"
     inkscape:window-x="0"
     inkscape:window-y="27"
     inkscape:window-maximized="0"
     inkscape:current-layer="svg4" />
  <path
     style="color:#000000;font-style:normal;font-variant:normal;font-weight:normal;font-stretch:normal;font-size:medium;line-height:normal;font-family:sans-serif;font-variant-ligatures:normal;font-variant-position:normal;font-variant-caps:normal;font-variant-numeric:normal;font-variant-alternates:normal;font-feature-settings:normal;text-indent:0;text-align:start;text-decoration:none;text-decoration-line:none;text-decoration-style:solid;text-decoration-color:#000000;letter-spacing:normal;word-spacing:normal;text-transform:none;writing-mode:lr-tb;direction:ltr;text-orientation:mixed;dominant-baseline:auto;baseline-shift:baseline;text-anchor:start;white-space:normal;shape-padding:0;clip-rule:nonzero;display:inline;overflow:visible;visibility:visible;opacity:1;isolation:auto;mix-blend-mode:normal;color-interpolation:sRGB;color-interpolation-filters:linearRGB;solid-color:#000000;solid-opacity:1;vector-effect:none;fill:#013272;fill-opacity:1;fill-rule:nonzero;stroke:none;stroke-width:0.5;stroke-linecap:round;stroke-linejoin:round;stroke-miterlimit:4;stroke-dasharray:none;stroke-dashoffset:0;stroke-opacity:1;color-rendering:auto;image-rendering:auto;shape-rendering:auto;text-rendering:auto;enable-background:accumulate"
     d="m 13.429688,10.074219 0.748046,0.748047 a 0.250025,0.250025 0 0 1 0.04492,0.06641 l 1,2 A 0.250025,0.250025 0 0 1 15.25,13 v 3 a 0.250025,0.250025 0 0 1 -0.01367,0.07813 l -1,3 a 0.250025,0.250025 0 0 1 -0.05859,0.09961 l -1.748046,1.748047 0.435546,-0.144531 1.916016,-1.916016 0.96875,-2.90625 v -2.90039 L 14.794922,11.148438 13.865234,10.21875 Z M 9.1523438,1.25 8.8925781,1.7734375 A 0.250025,0.250025 0 0 1 9,1.75 h 4.974609 l 2.498047,-0.5 z M 8.9882812,0.74804688 A 0.250025,0.250025 0 0 1 9.0390625,0.75 H 18.992188 19 a 0.250025,0.250025 0 0 1 0.01758,0 0.250025,0.250025 0 0 1 0.04883,0.007813 0.250025,0.250025 0 0 1 0.02344,0.007813 0.250025,0.250025 0 0 1 0.02344,0.009766 0.250025,0.250025 0 0 1 0.02148,0.0117188 0.250025,0.250025 0 0 1 0.002,0 0.250025,0.250025 0 0 1 0.03906,0.03125 0.250025,0.250025 0 0 1 0.01563,0.0175781 0.250025,0.250025 0 0 1 0.0293,0.0410156 0.250025,0.250025 0 0 1 0.01172,0.0214844 0.250025,0.250025 0 0 1 0.0098,0.0234375 0.250025,0.250025 0 0 1 0.01172,0.0742188 0.250025,0.250025 0 0 1 -0.002,0.0253907 0.250025,0.250025 0 0 1 -0.002,0.025391 0.250025,0.250025 0 0 1 -0.0059,0.023437 0.250025,0.250025 0 0 1 -0.01953,0.046875 0.250025,0.250025 0 0 1 -0.02734,0.041016 0.250025,0.250025 0 0 1 -0.01758,0.017578 0.250025,0.250025 0 0 1 -0.01758,0.017578 0.250025,0.250025 0 0 1 -0.04102,0.027344 0.250025,0.250025 0 0 1 -0.002,0 0.250025,0.250025 0 0 1 -0.04492,0.019531 0.250025,0.250025 0 0 1 -0.02539,0.00586 L 19.025391,1.25 14.048828,2.2460938 A 0.250025,0.250025 0 0 1 14,2.25 H 9 A 0.250025,0.250025 0 0 1 8.7519531,2.0527344 L 4.890625,9.7753906 a 0.250025,0.250025 0 0 1 0.03125,-0.011719 l 3,-1 A 0.250025,0.250025 0 0 1 8,8.75 h 2.966797 a 0.250025,0.250025 0 0 1 0.03906,0 0.250025,0.250025 0 0 1 0.0098,0 0.250025,0.250025 0 0 1 0.01563,0.00195 0.250025,0.250025 0 0 1 0.02344,0.00391 0.250025,0.250025 0 0 1 0.0098,0.00195 0.250025,0.250025 0 0 1 0.03516,0.013672 l 2.978516,0.9921875 a 0.250025,0.250025 0 0 1 0.09961,0.058594 l 1,1.0000004 a 0.250025,0.250025 0 0 1 0.04492,0.06641 l 1,2 A 0.250025,0.250025 0 0 1 16.25,13 v 3 a 0.250025,0.250025 0 0 1 -0.01367,0.07813 l -1,3 a 0.250025,0.250025 0 0 1 -0.05859,0.09961 l -2,2 a 0.250025,0.250025 0 0 1 -0.09961,0.05859 l -2.982422,0.994141 a 0.250025,0.250025 0 0 1 -0.02148,0.0078 0.250025,0.250025 0 0 1 -0.09961,0.01172 H 7 a 0.250025,0.250025 0 0 1 -0.078125,-0.01367 l -3,-1 a 0.250025,0.250025 0 0 1 -0.099609,-0.05859 l -1,-1 a 0.250025,0.250025 0 0 1 -0.044922,-0.06641 l -1,-2 A 0.250025,0.250025 0 0 1 1.75,18 v -1 a 0.250025,0.250025 0 0 1 0.072266,-0.177734 l 1,-1 a 0.250025,0.250025 0 0 1 0.3554688,0 l 1,1 a 0.250025,0.250025 0 0 1 0,0.355468 l -1,1 A 0.25135412,0.25135412 0 1 1 2.8222656,17.822266 L 3.6445312,17 3,16.355469 2.25,17.103516 v 0.83789 l 0.9550781,1.910156 0.9296875,0.929688 2.90625,0.96875 H 9.9433594 L 11.851562,20.794922 13.78125,18.865234 14.75,15.958984 v -2.90039 L 13.794922,11.148438 12.851562,10.205078 10.943359,9.25 H 8.0410156 l -2.90625,0.96875 -0.9492187,0.949219 -0.00781,0.0098 a 0.250025,0.250025 0 0 1 -0.00391,0.0039 0.250025,0.250025 0 0 1 -0.00977,0.0078 0.250025,0.250025 0 0 1 -0.013672,0.01172 0.250025,0.250025 0 0 1 -0.00586,0.0039 0.250025,0.250025 0 0 1 -0.021484,0.01367 0.250025,0.250025 0 0 1 -0.021484,0.01172 0.250025,0.250025 0 0 1 -0.046875,0.01563 0.250025,0.250025 0 0 1 -0.019531,0.0039 0.250025,0.250025 0 0 1 -0.00586,0 0.250025,0.250025 0 0 1 -0.042969,0.002 0.250025,0.250025 0 0 1 -0.03125,-0.0039 0.250025,0.250025 0 0 1 -0.017578,-0.002 0.250025,0.250025 0 0 1 -0.00586,-0.002 0.250025,0.250025 0 0 1 -0.033203,-0.01172 0.250025,0.250025 0 0 1 -0.013672,-0.0078 0.250025,0.250025 0 0 1 -0.021484,-0.01172 0.250025,0.250025 0 0 1 -0.035156,-0.02734 0.250025,0.250025 0 0 1 -0.021484,-0.02149 0.250025,0.250025 0 0 1 -0.011719,-0.01562 0.250025,0.250025 0 0 1 -0.00391,-0.0039 0.250025,0.250025 0 0 1 -0.00977,-0.01758 0.250025,0.250025 0 0 1 -0.00977,-0.01758 0.250025,0.250025 0 0 1 -0.00391,-0.0098 0.250025,0.250025 0 0 1 -0.013672,-0.04101 0.250025,0.250025 0 0 1 -0.00195,-0.0059 0.250025,0.250025 0 0 1 -0.00195,-0.01953 0.250025,0.250025 0 0 1 -0.00195,-0.02539 0.250025,0.250025 0 0 1 0,-0.0059 0.250025,0.250025 0 0 1 0.00391,-0.04297 0.250025,0.250025 0 0 1 0.013672,-0.04883 0.250025,0.250025 0 0 1 0.00195,-0.0059 0.250025,0.250025 0 0 1 0.023437,-0.04297 L 8.7539062,0.93359375 a 0.250025,0.250025 0 0 1 0.00195,-0.003906 0.250025,0.250025 0 0 1 0.058594,-0.0976563 0.250025,0.250025 0 0 1 0.00586,-0.007813 0.250025,0.250025 0 0 1 0.00977,-0.009766 0.250025,0.250025 0 0 1 0.00781,-0.007813 0.250025,0.250025 0 0 1 0.011719,-0.007813 0.250025,0.250025 0 0 1 0.019531,-0.0136719 0.250025,0.250025 0 0 1 0.00977,-0.005859 0.250025,0.250025 0 0 1 0.013672,-0.007813 0.250025,0.250025 0 0 1 0.00977,-0.003906 0.250025,0.250025 0 0 1 0.013672,-0.005859 0.250025,0.250025 0 0 1 0.00977,-0.001953 0.250025,0.250025 0 0 1 0.048828,-0.009766 0.250025,0.250025 0 0 1 0.013672,-0.001953 z"
     id="path2" />
</svg>
