<svg xmlns:dc="http://purl.org/dc/elements/1.1/" xmlns:cc="http://creativecommons.org/ns#" xmlns:rdf="http://www.w3.org/1999/02/22-rdf-syntax-ns#" xmlns:svg="http://www.w3.org/2000/svg" xmlns="http://www.w3.org/2000/svg" xmlns:sodipodi="http://sodipodi.sourceforge.net/DTD/sodipodi-0.dtd" xmlns:inkscape="http://www.inkscape.org/namespaces/inkscape" data-dec="50" id="dec_67" width="17" height="40" version="1.1" sodipodi:docname="50.svg" inkscape:version="0.92.3 (2405546, 2018-03-11)">
  <metadata id="metadata9">
    <rdf:RDF>
      <cc:Work rdf:about="">
        <dc:format>image/svg+xml</dc:format>
        <dc:type rdf:resource="http://purl.org/dc/dcmitype/StillImage"/>
        <dc:title/>
      </cc:Work>
    </rdf:RDF>
  </metadata>
  <defs id="defs7"/>
  <sodipodi:namedview pagecolor="#ffffff" bordercolor="#666666" borderopacity="1" objecttolerance="10" gridtolerance="10" guidetolerance="10" inkscape:pageopacity="0" inkscape:pageshadow="2" inkscape:window-width="1403" inkscape:window-height="872" id="namedview5" showgrid="true" inkscape:zoom="11.938686" inkscape:cx="-14.672124" inkscape:cy="19.642885" inkscape:window-x="37" inkscape:window-y="0" inkscape:window-maximized="1" inkscape:current-layer="dec_67" showguides="true" inkscape:guide-bbox="true">
    <inkscape:grid type="xygrid" id="grid7"/>
    <sodipodi:guide position="2,26" orientation="1,0" id="guide856" inkscape:locked="false"/>
    <sodipodi:guide position="15,40" orientation="1,0" id="guide858" inkscape:locked="false"/>
    <sodipodi:guide position="16,18" orientation="0,1" id="guide860" inkscape:locked="false"/>
    <sodipodi:guide position="12,39" orientation="0,1" id="guide862" inkscape:locked="false"/>
  </sodipodi:namedview>
  <path id="path866" style="fill:none;fill-rule:evenodd;stroke:#000000;stroke-width:1px;stroke-linecap:round;stroke-linejoin:round;stroke-opacity:1" d="m 11,13 2,-2 1,-2 V 6 L 13,4 11,2 9,1 M 2,22 3,20 4,18 6,16 9,14 13,12 15,9 V 6 L 14,4 12,2 9,1 H 7 L 4,2 3,3 2,5 M 14,21 H 3 m 11,1 1,-2 -2,1 -1,1 m -9,0 v -1 m 2,1 v 0 h 9 -12              " inkscape:connector-curvature="0"/>
</svg>