<?xml version="1.0" encoding="UTF-8" standalone="no"?>
<svg
   xmlns:dc="http://purl.org/dc/elements/1.1/"
   xmlns:cc="http://creativecommons.org/ns#"
   xmlns:rdf="http://www.w3.org/1999/02/22-rdf-syntax-ns#"
   xmlns:svg="http://www.w3.org/2000/svg"
   xmlns="http://www.w3.org/2000/svg"
   xmlns:sodipodi="http://sodipodi.sourceforge.net/DTD/sodipodi-0.dtd"
   xmlns:inkscape="http://www.inkscape.org/namespaces/inkscape"
   data-dec="120"
   width="22"
   height="40"
   version="1.1"
   id="svg4"
   sodipodi:docname="120.svg"
   inkscape:version="0.92.4 (unknown)">
  <metadata
     id="metadata10">
    <rdf:RDF>
      <cc:Work
         rdf:about="">
        <dc:format>image/svg+xml</dc:format>
        <dc:type
           rdf:resource="http://purl.org/dc/dcmitype/StillImage" />
      </cc:Work>
    </rdf:RDF>
  </metadata>
  <defs
     id="defs8" />
  <sodipodi:namedview
     pagecolor="#ffffff"
     bordercolor="#666666"
     borderopacity="1"
     objecttolerance="10"
     gridtolerance="10"
     guidetolerance="10"
     inkscape:pageopacity="0"
     inkscape:pageshadow="2"
     inkscape:window-width="615"
     inkscape:window-height="417"
     id="namedview6"
     showgrid="false"
     inkscape:zoom="5.9"
     inkscape:cx="11"
     inkscape:cy="20"
     inkscape:window-x="0"
     inkscape:window-y="27"
     inkscape:window-maximized="0"
     inkscape:current-layer="svg4" />
  <path
     style="color:#000000;font-style:normal;font-variant:normal;font-weight:normal;font-stretch:normal;font-size:medium;line-height:normal;font-family:sans-serif;font-variant-ligatures:normal;font-variant-position:normal;font-variant-caps:normal;font-variant-numeric:normal;font-variant-alternates:normal;font-feature-settings:normal;text-indent:0;text-align:start;text-decoration:none;text-decoration-line:none;text-decoration-style:solid;text-decoration-color:#000000;letter-spacing:normal;word-spacing:normal;text-transform:none;writing-mode:lr-tb;direction:ltr;text-orientation:mixed;dominant-baseline:auto;baseline-shift:baseline;text-anchor:start;white-space:normal;shape-padding:0;clip-rule:nonzero;display:inline;overflow:visible;visibility:visible;opacity:1;isolation:auto;mix-blend-mode:normal;color-interpolation:sRGB;color-interpolation-filters:linearRGB;solid-color:#000000;solid-opacity:1;vector-effect:none;fill:#013272;fill-opacity:1;fill-rule:nonzero;stroke:none;stroke-width:1;stroke-linecap:round;stroke-linejoin:round;stroke-miterlimit:4;stroke-dasharray:none;stroke-dashoffset:0;stroke-opacity:1;color-rendering:auto;image-rendering:auto;shape-rendering:auto;text-rendering:auto;enable-background:accumulate"
     d="m 10.5,20.035156 a 0.50005,0.50005 0 0 1 -0.228516,0.390625 L 10.373047,20.626953 10.5,20.691406 Z M 2.0800781,19.5 A 0.50005,0.50005 0 0 1 2.5,20 V 19.5 Z M 1.5,19.5 v 0.464844 A 0.50005,0.50005 0 0 1 1.9179688,19.5 Z m 18,-9.464844 A 0.50005,0.50005 0 0 1 19.082031,10.5 H 19.5 Z M 18.5,10 v 0.5 h 0.419922 A 0.50005,0.50005 0 0 1 18.5,10 Z m -8,-0.6914062 v 0.65625 a 0.50005,0.50005 0 0 1 0.228516,-0.390625 L 10.626953,9.3730469 Z M 8.9941406,7.4941406 a 0.50005,0.50005 0 0 1 0.2617188,0.076172 l 1.9667966,0.9824219 a 0.50005,0.50005 0 0 1 0.22461,0.2246094 l 1,2.0000002 a 0.50005,0.50005 0 0 1 0.04297,0.123047 l 0.0625,-0.123047 a 0.50005,0.50005 0 0 1 0.09375,-0.13086 l 2,-1.9999996 a 0.50005,0.50005 0 0 1 0.13086,-0.09375 l 2,-1 A 0.50005,0.50005 0 0 1 17,7.5 h 2 a 0.50005,0.50005 0 0 1 0.353516,0.1464844 l 1,1 A 0.50005,0.50005 0 0 1 20.5,9 v 2 A 0.50005,0.50005 0 0 1 20,11.5 H 18 A 0.50005,0.50005 0 0 1 17.5,11 V 9 A 0.50005,0.50005 0 0 1 18,8.5 h -0.882812 l -1.820313,0.9101562 -1.886719,1.8867188 -0.9375,1.876953 L 11.5,17.0625 v 3.730469 L 12.207031,21.5 h 1.675781 l 1.775391,-0.888672 1.925781,-2.888672 a 0.50005,0.50005 0 1 1 0.832032,0.554688 l -2,3 a 0.50005,0.50005 0 0 1 -0.19336,0.169922 l -2,1 A 0.50005,0.50005 0 0 1 14,22.5 h -1.933594 a 0.50005,0.50005 0 0 1 -0.322265,-0.07031 L 9.7773438,21.447266 a 0.50005,0.50005 0 0 1 -0.2246094,-0.22461 l -1,-2 a 0.50005,0.50005 0 0 1 -0.042969,-0.123047 l -0.0625,0.123047 a 0.50005,0.50005 0 0 1 -0.09375,0.13086 l -2,2 a 0.50005,0.50005 0 0 1 -0.1308594,0.09375 l -2,1 A 0.50005,0.50005 0 0 1 4,22.5 H 2 A 0.50005,0.50005 0 0 1 1.6464844,22.353516 l -1.00000002,-1 A 0.50005,0.50005 0 0 1 0.5,21 V 19 A 0.50005,0.50005 0 0 1 1,18.5 H 3 A 0.50005,0.50005 0 0 1 3.5,19 v 2 A 0.50005,0.50005 0 0 1 3,21.5 H 3.8828125 L 5.703125,20.589844 7.5898438,18.703125 8.5273438,16.826172 9.5,12.9375 V 9.2070312 L 8.7929688,8.5 H 7.1171875 L 5.3417969,9.3886719 3.4160156,12.277344 A 0.50005,0.50005 0 1 1 2.5839844,11.722656 l 2,-2.9999998 A 0.50005,0.50005 0 0 1 4.7773438,8.5527344 l 2,-1 A 0.50005,0.50005 0 0 1 7,7.5 h 1.9335938 a 0.50005,0.50005 0 0 1 0.060547,-0.00586 z"
     id="path2" />
</svg>
