<?xml version="1.0" encoding="UTF-8" standalone="no"?>
<svg
   xmlns:dc="http://purl.org/dc/elements/1.1/"
   xmlns:cc="http://creativecommons.org/ns#"
   xmlns:rdf="http://www.w3.org/1999/02/22-rdf-syntax-ns#"
   xmlns:svg="http://www.w3.org/2000/svg"
   xmlns="http://www.w3.org/2000/svg"
   xmlns:sodipodi="http://sodipodi.sourceforge.net/DTD/sodipodi-0.dtd"
   xmlns:inkscape="http://www.inkscape.org/namespaces/inkscape"
   data-dec="187"
   width="14"
   height="40"
   version="1.1"
   id="svg4"
   sodipodi:docname="187.svg"
   inkscape:version="0.92.4 5da689c313, 2019-01-14">
  <metadata
     id="metadata10">
    <rdf:RDF>
      <cc:Work
         rdf:about="">
        <dc:format>image/svg+xml</dc:format>
        <dc:type
           rdf:resource="http://purl.org/dc/dcmitype/StillImage" />
        <dc:title></dc:title>
      </cc:Work>
    </rdf:RDF>
  </metadata>
  <defs
     id="defs8" />
  <sodipodi:namedview
     pagecolor="#ffffff"
     bordercolor="#666666"
     borderopacity="1"
     objecttolerance="10"
     gridtolerance="10"
     guidetolerance="10"
     inkscape:pageopacity="0"
     inkscape:pageshadow="2"
     inkscape:window-width="1920"
     inkscape:window-height="1043"
     id="namedview6"
     showgrid="false"
     inkscape:zoom="5.9"
     inkscape:cx="7"
     inkscape:cy="20"
     inkscape:window-x="0"
     inkscape:window-y="37"
     inkscape:window-maximized="0"
     inkscape:current-layer="svg4" />
  <path
     style="color:#000000;font-style:normal;font-variant:normal;font-weight:normal;font-stretch:normal;font-size:medium;line-height:normal;font-family:sans-serif;font-variant-ligatures:normal;font-variant-position:normal;font-variant-caps:normal;font-variant-numeric:normal;font-variant-alternates:normal;font-feature-settings:normal;text-indent:0;text-align:start;text-decoration:none;text-decoration-line:none;text-decoration-style:solid;text-decoration-color:#000000;letter-spacing:normal;word-spacing:normal;text-transform:none;writing-mode:lr-tb;direction:ltr;text-orientation:mixed;dominant-baseline:auto;baseline-shift:baseline;text-anchor:start;white-space:normal;shape-padding:0;clip-rule:nonzero;display:inline;overflow:visible;visibility:visible;opacity:1;isolation:auto;mix-blend-mode:normal;color-interpolation:sRGB;color-interpolation-filters:linearRGB;solid-color:#000000;solid-opacity:1;vector-effect:none;fill:#000000;fill-opacity:1;fill-rule:nonzero;stroke:none;stroke-width:0.5;stroke-linecap:round;stroke-linejoin:round;stroke-miterlimit:4;stroke-dasharray:none;stroke-dashoffset:0;stroke-opacity:1;color-rendering:auto;image-rendering:auto;shape-rendering:auto;text-rendering:auto;enable-background:accumulate"
     d="m 10.726562,12.082031 1.464844,1.757813 a 0.250025,0.250025 0 0 1 0,0.320312 L 10.726562,15.917969 12.644531,14 Z m -5.9999995,0 1.4648437,1.757813 a 0.250025,0.250025 0 0 1 0,0.320312 L 4.7265625,15.917969 6.6445312,14 Z M 6.9707031,7.7480469 a 0.250025,0.250025 0 0 1 0.025391,0 0.250025,0.250025 0 0 1 0.00195,0 0.250025,0.250025 0 0 1 0.021484,0 0.250025,0.250025 0 0 1 0.00195,0 0.250025,0.250025 0 0 1 0.023437,0.00391 0.250025,0.250025 0 0 1 0.00195,0 0.250025,0.250025 0 0 1 0.048828,0.015625 0.250025,0.250025 0 0 1 0.00977,0.00391 0.250025,0.250025 0 0 1 0.03125,0.017578 0.250025,0.250025 0 0 1 0.00195,0.00195 0.250025,0.250025 0 0 1 0.037109,0.03125 0.250025,0.250025 0 0 1 0.00195,0 l 5.9999996,6.0000004 a 0.250025,0.250025 0 0 1 0,0.355468 l -5.9980465,5.996094 -0.00195,0.0039 a 0.250025,0.250025 0 0 1 -0.013672,0.01172 0.250025,0.250025 0 0 1 -0.00195,0.002 0.250025,0.250025 0 0 1 -0.017578,0.01367 0.250025,0.250025 0 0 1 -0.044922,0.02539 0.250025,0.250025 0 0 1 -0.021484,0.0078 0.250025,0.250025 0 0 1 -0.00195,0.002 0.250025,0.250025 0 0 1 -0.015625,0.0039 0.250025,0.250025 0 0 1 -0.00586,0.002 0.250025,0.250025 0 0 1 -0.00195,0 0.250025,0.250025 0 0 1 -0.072266,0.0059 0.250025,0.250025 0 0 1 -0.00195,0 0.250025,0.250025 0 0 1 -0.023437,-0.0039 0.250025,0.250025 0 0 1 -0.00195,0 0.250025,0.250025 0 0 1 -0.00391,-0.002 0.250025,0.250025 0 0 1 -0.044922,-0.01172 0.250025,0.250025 0 0 1 -0.00977,-0.0039 0.250025,0.250025 0 0 1 -0.00977,-0.0059 0.250025,0.250025 0 0 1 -0.00195,0 0.250025,0.250025 0 0 1 -0.011719,-0.0078 0.250025,0.250025 0 0 1 -0.03125,-0.01953 0.250025,0.250025 0 0 1 -0.015625,-0.01563 0.250025,0.250025 0 0 1 -0.00195,-0.002 0.250025,0.250025 0 0 1 -0.015625,-0.01563 0.250025,0.250025 0 0 1 -0.00195,-0.002 0.250025,0.250025 0 0 1 -0.00195,-0.0039 0.250025,0.250025 0 0 1 -0.011719,-0.01563 0.250025,0.250025 0 0 1 -0.013672,-0.01953 0.250025,0.250025 0 0 1 0,-0.002 0.250025,0.250025 0 0 1 -0.00977,-0.02148 0.250025,0.250025 0 0 1 -0.00195,-0.002 0.250025,0.250025 0 0 1 -0.00391,-0.01367 0.250025,0.250025 0 0 1 -0.00391,-0.0098 0.250025,0.250025 0 0 1 -0.00586,-0.02148 0.250025,0.250025 0 0 1 0,-0.002 0.250025,0.250025 0 0 1 -0.00391,-0.02344 0.250025,0.250025 0 0 1 0,-0.002 0.250025,0.250025 0 0 1 0,-0.02344 0.250025,0.250025 0 0 1 0,-0.002 0.250025,0.250025 0 0 1 0.00977,-0.07031 0.250025,0.250025 0 0 1 0.00195,-0.0039 0.250025,0.250025 0 0 1 0.00781,-0.02148 0.250025,0.250025 0 0 1 0,-0.002 0.250025,0.250025 0 0 1 0.00586,-0.0098 0.250025,0.250025 0 0 1 0.00586,-0.01172 0.250025,0.250025 0 0 1 0.011719,-0.01953 0.250025,0.250025 0 0 1 0.00195,-0.002 0.250025,0.250025 0 0 1 0.013672,-0.01758 0.250025,0.250025 0 0 1 0.00195,-0.002 l 0.013672,-0.01758 0.00586,-0.0059 L 11.673828,14 6.828125,8.1835938 6.8222656,8.1777344 A 0.250025,0.250025 0 0 1 6.8085938,8.1601562 0.250025,0.250025 0 0 1 6.7949219,8.1445312 0.250025,0.250025 0 0 1 6.7832031,8.125 a 0.250025,0.250025 0 0 1 -0.00195,-0.00195 0.250025,0.250025 0 0 1 -0.00977,-0.019531 0.250025,0.250025 0 0 1 -0.00195,-0.00195 0.250025,0.250025 0 0 1 -0.00391,-0.013672 0.250025,0.250025 0 0 1 -0.00391,-0.00977 0.250025,0.250025 0 0 1 -0.00781,-0.021484 0.250025,0.250025 0 0 1 0,-0.00195 A 0.250025,0.250025 0 0 1 6.75,8.03125 a 0.250025,0.250025 0 0 1 0,-0.00195 0.250025,0.250025 0 0 1 -0.00195,-0.021484 0.250025,0.250025 0 0 1 0,-0.00195 0.250025,0.250025 0 0 1 0,-0.023437 0.250025,0.250025 0 0 1 0,-0.00195 0.250025,0.250025 0 0 1 0,-0.00195 0.250025,0.250025 0 0 1 0.00586,-0.041016 0.250025,0.250025 0 0 1 0.00195,-0.00391 0.250025,0.250025 0 0 1 0,-0.00195 0.250025,0.250025 0 0 1 0.00781,-0.023437 0.250025,0.250025 0 0 1 0,-0.00195 0.250025,0.250025 0 0 1 0.00586,-0.00977 0.250025,0.250025 0 0 1 0.00586,-0.011719 0.250025,0.250025 0 0 1 0.00977,-0.019531 0.250025,0.250025 0 0 1 0.00195,-0.00195 0.250025,0.250025 0 0 1 0.013672,-0.019531 0.250025,0.250025 0 0 1 0,-0.00195 0.250025,0.250025 0 0 1 0.00781,-0.00781 0.250025,0.250025 0 0 1 0.025391,-0.025391 0.250025,0.250025 0 0 1 0.00195,-0.00195 0.250025,0.250025 0 0 1 0.039063,-0.027344 0.250025,0.250025 0 0 1 0.023437,-0.011719 0.250025,0.250025 0 0 1 0.00195,0 0.250025,0.250025 0 0 1 0.00781,-0.00391 0.250025,0.250025 0 0 1 0.013672,-0.00391 0.250025,0.250025 0 0 1 0.048828,-0.011719 z m -5.99999998,0 a 0.250025,0.250025 0 0 1 0.0253906,0 0.250025,0.250025 0 0 1 0.001953,0 0.250025,0.250025 0 0 1 0.0214843,0 0.250025,0.250025 0 0 1 0.00195,0 0.250025,0.250025 0 0 1 0.023437,0.00391 0.250025,0.250025 0 0 1 0.00195,0 0.250025,0.250025 0 0 1 0.046875,0.013672 0.250025,0.250025 0 0 1 0.011719,0.00586 0.250025,0.250025 0 0 1 0.03125,0.017578 0.250025,0.250025 0 0 1 0.00195,0.00195 0.250025,0.250025 0 0 1 0.019531,0.015625 0.250025,0.250025 0 0 1 0.00195,0.00195 0.250025,0.250025 0 0 1 0.015625,0.013672 0.250025,0.250025 0 0 1 0.00195,0 l 6,6.0000004 a 0.250025,0.250025 0 0 1 0,0.355468 l -5.9980469,5.996094 -0.00195,0.0039 a 0.250025,0.250025 0 0 1 -0.013672,0.01172 0.250025,0.250025 0 0 1 -0.00195,0.002 0.250025,0.250025 0 0 1 -0.017578,0.01367 0.250025,0.250025 0 0 1 -0.00195,0.002 0.250025,0.250025 0 0 1 -0.00781,0.0039 0.250025,0.250025 0 0 1 -0.042969,0.02344 0.250025,0.250025 0 0 1 -0.013672,0.0039 0.250025,0.250025 0 0 1 -0.00195,0.002 0.250025,0.250025 0 0 1 -0.015625,0.0039 0.250025,0.250025 0 0 1 -0.0800782,0.0078 0.250025,0.250025 0 0 1 -0.001953,0 0.250025,0.250025 0 0 1 -0.0234375,-0.0039 0.250025,0.250025 0 0 1 -0.001953,0 0.250025,0.250025 0 0 1 -0.003906,-0.002 0.250025,0.250025 0 0 1 -0.0449219,-0.01172 0.250025,0.250025 0 0 1 -0.0195313,-0.0098 0.250025,0.250025 0 0 1 -0.001953,0 0.250025,0.250025 0 0 1 -0.0117188,-0.0078 0.250025,0.250025 0 0 1 -0.009766,-0.0059 0.250025,0.250025 0 0 1 -0.0195312,-0.01172 0.250025,0.250025 0 0 1 -0.001953,-0.002 0.250025,0.250025 0 0 1 -0.015625,-0.01563 0.250025,0.250025 0 0 1 -0.001953,-0.002 0.250025,0.250025 0 0 1 -0.015625,-0.01563 0.250025,0.250025 0 0 1 -0.001953,-0.002 0.250025,0.250025 0 0 1 -0.001953,-0.0039 0.250025,0.250025 0 0 1 -0.0117188,-0.01563 0.250025,0.250025 0 0 1 -0.0136719,-0.01953 0.250025,0.250025 0 0 1 0,-0.002 0.250025,0.250025 0 0 1 -0.009766,-0.02148 0.250025,0.250025 0 0 1 -0.001953,-0.002 0.250025,0.250025 0 0 1 -0.003906,-0.01367 0.250025,0.250025 0 0 1 -0.003906,-0.0098 0.250025,0.250025 0 0 1 -0.005859,-0.02148 0.250025,0.250025 0 0 1 0,-0.002 0.250025,0.250025 0 0 1 -0.003906,-0.02344 0.250025,0.250025 0 0 1 0,-0.002 0.250025,0.250025 0 0 1 0,-0.02344 0.250025,0.250025 0 0 1 0,-0.002 0.250025,0.250025 0 0 1 0.009766,-0.07031 0.250025,0.250025 0 0 1 0.001953,-0.0039 0.250025,0.250025 0 0 1 0.007813,-0.02148 0.250025,0.250025 0 0 1 0,-0.002 0.250025,0.250025 0 0 1 0.005859,-0.0098 0.250025,0.250025 0 0 1 0.005859,-0.01172 0.250025,0.250025 0 0 1 0.0117187,-0.01953 0.250025,0.250025 0 0 1 0.001953,-0.002 0.250025,0.250025 0 0 1 0.0136719,-0.01758 0.250025,0.250025 0 0 1 0.001953,-0.002 l 0.0136719,-0.01758 0.005859,-0.0059 L 5.6738281,14 0.828125,8.1835938 0.82226562,8.1777344 A 0.250025,0.250025 0 0 1 0.80859375,8.1601562 0.250025,0.250025 0 0 1 0.79492188,8.1445312 0.250025,0.250025 0 0 1 0.78320312,8.125 0.250025,0.250025 0 0 1 0.78125,8.1230469 a 0.250025,0.250025 0 0 1 -0.009766,-0.019531 0.250025,0.250025 0 0 1 -0.001953,-0.00195 0.250025,0.250025 0 0 1 -0.003906,-0.013672 0.250025,0.250025 0 0 1 -0.003906,-0.00977 0.250025,0.250025 0 0 1 -0.007813,-0.021484 0.250025,0.250025 0 0 1 0,-0.00195 A 0.250025,0.250025 0 0 1 0.75,8.03125 a 0.250025,0.250025 0 0 1 0,-0.00195 0.250025,0.250025 0 0 1 -0.001953,-0.021484 0.250025,0.250025 0 0 1 0,-0.00195 0.250025,0.250025 0 0 1 0,-0.023437 0.250025,0.250025 0 0 1 0,-0.00195 0.250025,0.250025 0 0 1 0,-0.00195 0.250025,0.250025 0 0 1 0.005859,-0.041016 0.250025,0.250025 0 0 1 0.001953,-0.00391 0.250025,0.250025 0 0 1 0,-0.00195 0.250025,0.250025 0 0 1 0.007813,-0.023437 0.250025,0.250025 0 0 1 0,-0.00195 0.250025,0.250025 0 0 1 0.005859,-0.00977 0.250025,0.250025 0 0 1 0.005859,-0.011719 0.250025,0.250025 0 0 1 0.009766,-0.019531 0.250025,0.250025 0 0 1 0.001953,-0.00195 0.250025,0.250025 0 0 1 0.0136719,-0.019531 0.250025,0.250025 0 0 1 0,-0.00195 0.250025,0.250025 0 0 1 0.007813,-0.00781 0.250025,0.250025 0 0 1 0.0273438,-0.027344 0.250025,0.250025 0 0 1 0.0390625,-0.027344 0.250025,0.250025 0 0 1 0.001953,-0.00195 0.250025,0.250025 0 0 1 0.0117188,-0.00391 0.250025,0.250025 0 0 1 0.0195312,-0.00977 0.250025,0.250025 0 0 1 0.0136719,-0.00391 0.250025,0.250025 0 0 1 0.001953,-0.00195 0.250025,0.250025 0 0 1 0.015625,-0.00391 0.250025,0.250025 0 0 1 0.03125,-0.00586 z"
     id="path2" />
</svg>
