<?xml version="1.0" encoding="UTF-8" standalone="no"?>
<svg
   xmlns:dc="http://purl.org/dc/elements/1.1/"
   xmlns:cc="http://creativecommons.org/ns#"
   xmlns:rdf="http://www.w3.org/1999/02/22-rdf-syntax-ns#"
   xmlns:svg="http://www.w3.org/2000/svg"
   xmlns="http://www.w3.org/2000/svg"
   xmlns:sodipodi="http://sodipodi.sourceforge.net/DTD/sodipodi-0.dtd"
   xmlns:inkscape="http://www.inkscape.org/namespaces/inkscape"
   data-dec="8221"
   width="15"
   height="40"
   version="1.1"
   id="svg4"
   sodipodi:docname="8221.svg"
   inkscape:version="0.92.4 (unknown)">
  <metadata
     id="metadata10">
    <rdf:RDF>
      <cc:Work
         rdf:about="">
        <dc:format>image/svg+xml</dc:format>
        <dc:type
           rdf:resource="http://purl.org/dc/dcmitype/StillImage" />
      </cc:Work>
    </rdf:RDF>
  </metadata>
  <defs
     id="defs8" />
  <sodipodi:namedview
     pagecolor="#ffffff"
     bordercolor="#666666"
     borderopacity="1"
     objecttolerance="10"
     gridtolerance="10"
     guidetolerance="10"
     inkscape:pageopacity="0"
     inkscape:pageshadow="2"
     inkscape:window-width="640"
     inkscape:window-height="480"
     id="namedview6"
     showgrid="false"
     inkscape:zoom="5.9"
     inkscape:cx="7.5"
     inkscape:cy="20"
     inkscape:window-x="0"
     inkscape:window-y="27"
     inkscape:window-maximized="0"
     inkscape:current-layer="svg4" />
  <path
     style="color:#000000;font-style:normal;font-variant:normal;font-weight:normal;font-stretch:normal;font-size:medium;line-height:normal;font-family:sans-serif;font-variant-ligatures:normal;font-variant-position:normal;font-variant-caps:normal;font-variant-numeric:normal;font-variant-alternates:normal;font-feature-settings:normal;text-indent:0;text-align:start;text-decoration:none;text-decoration-line:none;text-decoration-style:solid;text-decoration-color:#000000;letter-spacing:normal;word-spacing:normal;text-transform:none;writing-mode:lr-tb;direction:ltr;text-orientation:mixed;dominant-baseline:auto;baseline-shift:baseline;text-anchor:start;white-space:normal;shape-padding:0;clip-rule:nonzero;display:inline;overflow:visible;visibility:visible;opacity:1;isolation:auto;mix-blend-mode:normal;color-interpolation:sRGB;color-interpolation-filters:linearRGB;solid-color:#000000;solid-opacity:1;vector-effect:none;fill:#013272;fill-opacity:1;fill-rule:nonzero;stroke:none;stroke-width:0.5;stroke-linecap:round;stroke-linejoin:round;stroke-miterlimit:4;stroke-dasharray:none;stroke-dashoffset:0;stroke-opacity:1;color-rendering:auto;image-rendering:auto;shape-rendering:auto;text-rendering:auto;enable-background:accumulate"
     d="M 11.539062,3.8164062 11.355469,4 11.464844,4.109375 Z m -5.9999995,0 L 5.3554688,4 5.4648438,4.109375 Z M 10.25,2.25 v 0.5 h 0.5 v -0.5 z m -6,0 v 0.5 h 0.5 V 2.25 Z M 9.9960938,1.7460938 A 0.250025,0.250025 0 0 1 10.046875,1.75 H 11 A 0.250025,0.250025 0 0 1 11.25,2 V 3 A 0.250025,0.250025 0 0 1 11,3.25 H 10 A 0.250025,0.250025 0 0 1 9.75,3 V 2.0410156 a 0.250025,0.250025 0 0 1 0.052734,-0.1972656 0.250025,0.250025 0 0 1 0,-0.00195 0.250025,0.250025 0 0 1 0.00781,-0.00781 0.250025,0.250025 0 0 1 0.027344,-0.027344 0.250025,0.250025 0 0 1 0.017578,-0.013672 0.250025,0.250025 0 0 1 0.00195,-0.00195 0.250025,0.250025 0 0 1 0.00781,-0.00391 0.250025,0.250025 0 0 1 0.013672,-0.00781 0.250025,0.250025 0 0 1 0.1171876,-0.033203 z m -6,0 A 0.250025,0.250025 0 0 1 4.046875,1.75 H 5 A 0.250025,0.250025 0 0 1 5.25,2 V 3 A 0.250025,0.250025 0 0 1 5,3.25 H 4 A 0.250025,0.250025 0 0 1 3.75,3 V 2.0410156 a 0.250025,0.250025 0 0 1 0.052734,-0.1972656 0.250025,0.250025 0 0 1 0,-0.00195 0.250025,0.250025 0 0 1 0.00781,-0.00781 0.250025,0.250025 0 0 1 0.027344,-0.027344 0.250025,0.250025 0 0 1 0.017578,-0.013672 0.250025,0.250025 0 0 1 0.00195,-0.00195 0.250025,0.250025 0 0 1 0.00781,-0.00391 0.250025,0.250025 0 0 1 0.013672,-0.00781 0.250025,0.250025 0 0 1 0.1171876,-0.033203 z M 10.103516,1.25 9.25,2.1035156 V 2.8964844 L 10.103516,3.75 h 0.792968 L 11.75,2.8945312 V 2.1035156 L 10.896484,1.25 Z M 4.1035156,1.25 3.25,2.1035156 V 2.8964844 L 4.1035156,3.75 H 4.8964844 L 5.75,2.8945312 V 2.1035156 L 4.8964844,1.25 Z M 10,0.75 h 1 a 0.250025,0.250025 0 0 1 0.177734,0.0722656 l 1,0.99999998 A 0.250025,0.250025 0 0 1 12.25,2 v 0.9609375 a 0.250025,0.250025 0 0 1 0,0.074219 v 1.9355469 a 0.250025,0.250025 0 0 1 -0.05078,0.1875 L 11.238281,7.078125 a 0.250025,0.250025 0 0 1 -0.0098,0.023437 l -0.0059,0.00977 a 0.250025,0.250025 0 0 1 -0.0039,0.00977 0.250025,0.250025 0 0 1 0,0.00195 0.250025,0.250025 0 0 1 -0.01367,0.019531 0.250025,0.250025 0 0 1 0,0.00195 0.250025,0.250025 0 0 1 -0.01563,0.017578 0.250025,0.250025 0 0 1 0,0.00195 0.250025,0.250025 0 0 1 -0.117187,0.078125 0.250025,0.250025 0 0 1 -0.0059,0.00195 L 9.1113281,8.2226562 A 0.250025,0.250025 0 1 1 8.8886719,7.7773438 L 10.785156,6.828125 11.322266,4.6777344 10.894531,4.25 H 10 A 0.250025,0.250025 0 0 1 9.8222656,4.1777344 l -1,-1 A 0.250025,0.250025 0 0 1 8.75,3 V 2 a 0.250025,0.250025 0 0 1 0.072266,-0.1777344 l 1,-0.99999998 A 0.250025,0.250025 0 0 1 10,0.75 Z m -6,0 h 1 a 0.250025,0.250025 0 0 1 0.1777344,0.0722656 l 1,0.99999998 A 0.250025,0.250025 0 0 1 6.25,2 v 0.9609375 a 0.250025,0.250025 0 0 1 0,0.074219 v 1.9355469 a 0.250025,0.250025 0 0 1 -0.050781,0.1875 L 5.2382812,7.078125 a 0.250025,0.250025 0 0 1 -0.00977,0.023437 l -0.00586,0.00977 a 0.250025,0.250025 0 0 1 -0.00391,0.00977 0.250025,0.250025 0 0 1 0,0.00195 0.250025,0.250025 0 0 1 -0.013672,0.019531 0.250025,0.250025 0 0 1 0,0.00195 0.250025,0.250025 0 0 1 -0.015625,0.017578 0.250025,0.250025 0 0 1 0,0.00195 0.250025,0.250025 0 0 1 -0.1171875,0.078125 0.250025,0.250025 0 0 1 -0.00586,0.00195 L 3.1113281,8.2226562 A 0.250025,0.250025 0 1 1 2.8886719,7.7773438 L 4.7851562,6.828125 5.3222656,4.6777344 4.8945312,4.25 H 4 A 0.250025,0.250025 0 0 1 3.8222656,4.1777344 l -1,-1 A 0.250025,0.250025 0 0 1 2.75,3 V 2 a 0.250025,0.250025 0 0 1 0.072266,-0.1777344 l 1,-0.99999998 A 0.250025,0.250025 0 0 1 4,0.75 Z"
     id="path2" />
</svg>
