<?xml version="1.0" encoding="UTF-8" standalone="no"?>
<svg
   xmlns:dc="http://purl.org/dc/elements/1.1/"
   xmlns:cc="http://creativecommons.org/ns#"
   xmlns:rdf="http://www.w3.org/1999/02/22-rdf-syntax-ns#"
   xmlns:svg="http://www.w3.org/2000/svg"
   xmlns="http://www.w3.org/2000/svg"
   xmlns:sodipodi="http://sodipodi.sourceforge.net/DTD/sodipodi-0.dtd"
   xmlns:inkscape="http://www.inkscape.org/namespaces/inkscape"
   data-dec="40"
   width="16"
   height="40"
   version="1.1"
   id="svg4"
   sodipodi:docname="40.svg"
   inkscape:version="0.92.4 (unknown)">
  <metadata
     id="metadata10">
    <rdf:RDF>
      <cc:Work
         rdf:about="">
        <dc:format>image/svg+xml</dc:format>
        <dc:type
           rdf:resource="http://purl.org/dc/dcmitype/StillImage" />
      </cc:Work>
    </rdf:RDF>
  </metadata>
  <defs
     id="defs8" />
  <sodipodi:namedview
     pagecolor="#ffffff"
     bordercolor="#666666"
     borderopacity="1"
     objecttolerance="10"
     gridtolerance="10"
     guidetolerance="10"
     inkscape:pageopacity="0"
     inkscape:pageshadow="2"
     inkscape:window-width="640"
     inkscape:window-height="480"
     id="namedview6"
     showgrid="false"
     inkscape:zoom="5.9"
     inkscape:cx="8"
     inkscape:cy="20"
     inkscape:window-x="0"
     inkscape:window-y="27"
     inkscape:window-maximized="0"
     inkscape:current-layer="svg4" />
  <path
     style="color:#000000;font-style:normal;font-variant:normal;font-weight:normal;font-stretch:normal;font-size:medium;line-height:normal;font-family:sans-serif;font-variant-ligatures:normal;font-variant-position:normal;font-variant-caps:normal;font-variant-numeric:normal;font-variant-alternates:normal;font-feature-settings:normal;text-indent:0;text-align:start;text-decoration:none;text-decoration-line:none;text-decoration-style:solid;text-decoration-color:#000000;letter-spacing:normal;word-spacing:normal;text-transform:none;writing-mode:lr-tb;direction:ltr;text-orientation:mixed;dominant-baseline:auto;baseline-shift:baseline;text-anchor:start;white-space:normal;shape-padding:0;clip-rule:nonzero;display:inline;overflow:visible;visibility:visible;opacity:1;isolation:auto;mix-blend-mode:normal;color-interpolation:sRGB;color-interpolation-filters:linearRGB;solid-color:#000000;solid-opacity:1;vector-effect:none;fill:#013272;fill-opacity:1;fill-rule:nonzero;stroke:none;stroke-width:2.5;stroke-linecap:round;stroke-linejoin:round;stroke-miterlimit:4;stroke-dasharray:none;stroke-dashoffset:0;stroke-opacity:1;color-rendering:auto;image-rendering:auto;shape-rendering:auto;text-rendering:auto;enable-background:accumulate"
     d="M 15.029297,-4.2597656 A 1.250125,1.250125 0 0 1 15.75,-2 L 11.892578,0.89257812 9.0683594,4.6601562 7.1582031,8.4804688 6.2109375,11.322266 5.25,16.123047 v 4.753906 l 0.9609375,4.800781 0.9453125,2.841797 a 1.250125,1.250125 0 0 1 0.00781,0.01953 1.250125,1.250125 0 0 1 0.074219,0.271485 1.250125,1.250125 0 0 1 0.013672,0.113281 1.250125,1.250125 0 0 1 0.00195,0.0098 1.250125,1.250125 0 0 1 0,0.01367 1.250125,1.250125 0 0 1 0.00195,0.103515 1.250125,1.250125 0 0 1 0,0.0078 1.250125,1.250125 0 0 1 -0.00195,0.01172 1.250125,1.250125 0 0 1 -0.00977,0.113282 1.250125,1.250125 0 0 1 -0.023437,0.123047 1.250125,1.250125 0 0 1 -0.033203,0.11914 1.250125,1.250125 0 0 1 -0.046875,0.115235 1.250125,1.250125 0 0 1 0,0.002 1.250125,1.250125 0 0 1 -0.00195,0.002 1.250125,1.250125 0 0 1 -0.056641,0.105469 1.250125,1.250125 0 0 1 0,0.002 1.250125,1.250125 0 0 1 -0.00195,0.0039 1.250125,1.250125 0 0 1 -0.054687,0.08203 1.250125,1.250125 0 0 1 -0.011719,0.01953 1.250125,1.250125 0 0 1 -0.011719,0.01563 1.250125,1.250125 0 0 1 -0.068359,0.08008 1.250125,1.250125 0 0 1 -0.080078,0.08203 1.250125,1.250125 0 0 1 -0.00781,0.0078 1.250125,1.250125 0 0 1 -0.015625,0.01367 1.250125,1.250125 0 0 1 -0.076172,0.06055 1.250125,1.250125 0 0 1 -0.00586,0.0039 1.250125,1.250125 0 0 1 -0.00781,0.0059 1.250125,1.250125 0 0 1 -0.074219,0.05078 1.250125,1.250125 0 0 1 -0.064453,0.03711 1.250125,1.250125 0 0 1 -0.017578,0.0098 1.250125,1.250125 0 0 1 -0.011719,0.0059 1.250125,1.250125 0 0 1 -0.078125,0.03516 1.250125,1.250125 0 0 1 -0.044922,0.01953 1.250125,1.250125 0 0 1 -0.097656,0.03125 1.250125,1.250125 0 0 1 -0.109375,0.02539 1.250125,1.250125 0 0 1 -0.011719,0.0039 1.250125,1.250125 0 0 1 -0.00977,0.002 1.250125,1.250125 0 0 1 -0.1074219,0.01367 1.250125,1.250125 0 0 1 -0.00781,0 1.250125,1.250125 0 0 1 -0.00781,0 1.250125,1.250125 0 0 1 -0.09375,0.0039 1.250125,1.250125 0 0 1 -0.041016,-0.002 1.250125,1.250125 0 0 1 -0.1054687,-0.0078 1.250125,1.250125 0 0 1 -0.1132813,-0.01758 1.250125,1.250125 0 0 1 -0.015625,-0.0039 1.250125,1.250125 0 0 1 -0.2324218,-0.07813 1.250125,1.250125 0 0 1 -0.1113282,-0.05664 1.250125,1.250125 0 0 1 -0.097656,-0.06055 1.250125,1.250125 0 0 1 -0.015625,-0.01172 1.250125,1.250125 0 0 1 -0.089844,-0.07227 1.250125,1.250125 0 0 1 -0.2402344,-0.287109 1.250125,1.250125 0 0 1 -0.089844,-0.171875 l -0.96875,-1.9375 a 1.250125,1.250125 0 0 1 -0.068359,-0.164063 l -1,-3 a 1.250125,1.250125 0 0 1 -0.041016,-0.148437 l -1,-5 A 1.250125,1.250125 0 0 1 1.75,19 v -4 a 1.250125,1.250125 0 0 1 0.023437,-0.246094 l 1,-4.9999998 a 1.250125,1.250125 0 0 1 0.109375,-0.3125 l 2,-4 a 1.250125,1.250125 0 0 1 0.076172,-0.1347656 l 2,-3 a 1.250125,1.250125 0 0 1 0.15625,-0.1914062 l 2.9999996,-3.00000002 a 1.250125,1.250125 0 0 1 0.002,-0.001953 1.250125,1.250125 0 0 1 0.234374,-0.18945315 L 14.25,-4 a 1.250125,1.250125 0 0 1 0.779297,-0.2597656 z"
     id="path2" />
</svg>
