<?xml version="1.0" encoding="UTF-8" standalone="no"?>
<svg
   xmlns:dc="http://purl.org/dc/elements/1.1/"
   xmlns:cc="http://creativecommons.org/ns#"
   xmlns:rdf="http://www.w3.org/1999/02/22-rdf-syntax-ns#"
   xmlns:svg="http://www.w3.org/2000/svg"
   xmlns="http://www.w3.org/2000/svg"
   xmlns:sodipodi="http://sodipodi.sourceforge.net/DTD/sodipodi-0.dtd"
   xmlns:inkscape="http://www.inkscape.org/namespaces/inkscape"
   data-dec="50"
   width="16"
   height="40"
   version="1.1"
   id="svg4"
   sodipodi:docname="50.svg"
   inkscape:version="0.92.4 (unknown)">
  <metadata
     id="metadata10">
    <rdf:RDF>
      <cc:Work
         rdf:about="">
        <dc:format>image/svg+xml</dc:format>
        <dc:type
           rdf:resource="http://purl.org/dc/dcmitype/StillImage" />
      </cc:Work>
    </rdf:RDF>
  </metadata>
  <defs
     id="defs8" />
  <sodipodi:namedview
     pagecolor="#ffffff"
     bordercolor="#666666"
     borderopacity="1"
     objecttolerance="10"
     gridtolerance="10"
     guidetolerance="10"
     inkscape:pageopacity="0"
     inkscape:pageshadow="2"
     inkscape:window-width="640"
     inkscape:window-height="480"
     id="namedview6"
     showgrid="false"
     inkscape:zoom="5.9"
     inkscape:cx="8"
     inkscape:cy="20"
     inkscape:window-x="0"
     inkscape:window-y="27"
     inkscape:window-maximized="0"
     inkscape:current-layer="svg4" />
  <path
     style="color:#000000;font-style:normal;font-variant:normal;font-weight:normal;font-stretch:normal;font-size:medium;line-height:normal;font-family:sans-serif;font-variant-ligatures:normal;font-variant-position:normal;font-variant-caps:normal;font-variant-numeric:normal;font-variant-alternates:normal;font-feature-settings:normal;text-indent:0;text-align:start;text-decoration:none;text-decoration-line:none;text-decoration-style:solid;text-decoration-color:#000000;letter-spacing:normal;word-spacing:normal;text-transform:none;writing-mode:lr-tb;direction:ltr;text-orientation:mixed;dominant-baseline:auto;baseline-shift:baseline;text-anchor:start;white-space:normal;shape-padding:0;clip-rule:nonzero;display:inline;overflow:visible;visibility:visible;opacity:1;isolation:auto;mix-blend-mode:normal;color-interpolation:sRGB;color-interpolation-filters:linearRGB;solid-color:#000000;solid-opacity:1;vector-effect:none;fill:#000000;fill-opacity:1;fill-rule:nonzero;stroke:none;stroke-width:3;stroke-linecap:round;stroke-linejoin:round;stroke-miterlimit:4;stroke-dasharray:none;stroke-dashoffset:0;stroke-opacity:1;color-rendering:auto;image-rendering:auto;shape-rendering:auto;text-rendering:auto;enable-background:accumulate"
     d="m 7,1.5 h 2 a 1.50015,1.50015 0 0 1 0.6699219,0.1582031 l 2.0000001,1 a 1.50015,1.50015 0 0 1 0.390625,0.28125 l 1,1 a 1.50015,1.50015 0 0 1 0.28125,0.390625 l 1,2 A 1.50015,1.50015 0 0 1 14.5,7 v 2 a 1.50015,1.50015 0 0 1 -0.158203,0.6699219 l -1,2.0000001 a 1.50015,1.50015 0 0 1 -0.181641,0.279297 L 6.1640625,20.5 H 13 a 1.50015,1.50015 0 1 1 0,3 H 3 A 1.50015,1.50015 0 0 1 1.8398438,21.050781 L 10.732422,10.179688 11.5,8.6464844 V 7.3535156 L 10.767578,5.8886719 10.111328,5.2324219 8.6464844,4.5 H 7.3535156 L 5.8886719,5.2324219 5.2324219,5.8886719 4.5,7.3535156 V 8 a 1.50015,1.50015 0 1 1 -3,0 V 7 A 1.50015,1.50015 0 0 1 1.6582031,6.3300781 l 1,-2 a 1.50015,1.50015 0 0 1 0.28125,-0.390625 l 1,-1 a 1.50015,1.50015 0 0 1 0.390625,-0.28125 l 2,-1 A 1.50015,1.50015 0 0 1 7,1.5 Z"
     id="path2" />
</svg>
