<?xml version="1.0" encoding="UTF-8" standalone="no"?>
<svg
   xmlns:dc="http://purl.org/dc/elements/1.1/"
   xmlns:cc="http://creativecommons.org/ns#"
   xmlns:rdf="http://www.w3.org/1999/02/22-rdf-syntax-ns#"
   xmlns:svg="http://www.w3.org/2000/svg"
   xmlns="http://www.w3.org/2000/svg"
   xmlns:sodipodi="http://sodipodi.sourceforge.net/DTD/sodipodi-0.dtd"
   xmlns:inkscape="http://www.inkscape.org/namespaces/inkscape"
   data-dec="64256"
   width="18"
   height="40"
   version="1.1"
   id="svg4"
   sodipodi:docname="64256.svg"
   inkscape:version="0.92.4 5da689c313, 2019-01-14">
  <metadata
     id="metadata10">
    <rdf:RDF>
      <cc:Work
         rdf:about="">
        <dc:format>image/svg+xml</dc:format>
        <dc:type
           rdf:resource="http://purl.org/dc/dcmitype/StillImage" />
        <dc:title></dc:title>
      </cc:Work>
    </rdf:RDF>
  </metadata>
  <defs
     id="defs8" />
  <sodipodi:namedview
     pagecolor="#ffffff"
     bordercolor="#666666"
     borderopacity="1"
     objecttolerance="10"
     gridtolerance="10"
     guidetolerance="10"
     inkscape:pageopacity="0"
     inkscape:pageshadow="2"
     inkscape:window-width="1920"
     inkscape:window-height="1043"
     id="namedview6"
     showgrid="false"
     inkscape:zoom="5.9"
     inkscape:cx="9"
     inkscape:cy="20"
     inkscape:window-x="0"
     inkscape:window-y="37"
     inkscape:window-maximized="0"
     inkscape:current-layer="svg4" />
  <path
     style="color:#000000;font-style:normal;font-variant:normal;font-weight:normal;font-stretch:normal;font-size:medium;line-height:normal;font-family:sans-serif;font-variant-ligatures:normal;font-variant-position:normal;font-variant-caps:normal;font-variant-numeric:normal;font-variant-alternates:normal;font-feature-settings:normal;text-indent:0;text-align:start;text-decoration:none;text-decoration-line:none;text-decoration-style:solid;text-decoration-color:#000000;letter-spacing:normal;word-spacing:normal;text-transform:none;writing-mode:lr-tb;direction:ltr;text-orientation:mixed;dominant-baseline:auto;baseline-shift:baseline;text-anchor:start;white-space:normal;shape-padding:0;clip-rule:nonzero;display:inline;overflow:visible;visibility:visible;opacity:1;isolation:auto;mix-blend-mode:normal;color-interpolation:sRGB;color-interpolation-filters:linearRGB;solid-color:#000000;solid-opacity:1;vector-effect:none;fill:#000000;fill-opacity:1;fill-rule:nonzero;stroke:none;stroke-width:1.5;stroke-linecap:round;stroke-linejoin:round;stroke-miterlimit:4;stroke-dasharray:none;stroke-dashoffset:0;stroke-opacity:1;color-rendering:auto;image-rendering:auto;shape-rendering:auto;text-rendering:auto;enable-background:accumulate"
     d="M 8.3105469,1.75 6.65625,3.4042969 5.75,6.1191406 V 7.25 h 0.1503906 a 0.750075,0.750075 0 0 1 0.2050782,0 H 8 9.8925781 a 0.750075,0.750075 0 0 1 0.1992189,0 H 10.25 V 6.078125 a 0.750075,0.750075 0 0 1 0.0098,-0.1972656 0.750075,0.750075 0 0 1 0.0078,-0.046875 A 0.750075,0.750075 0 0 1 10.314453,5.6875 L 11.142578,3.2050781 9.6894531,1.75 Z M 15.988281,0.24023438 a 0.750075,0.750075 0 0 1 0.533203,0.2109375 0.750075,0.750075 0 0 1 0.0039,0.003906 0.750075,0.750075 0 0 1 0.0039,0.003906 0.750075,0.750075 0 0 1 0.04687,0.0488281 0.750075,0.750075 0 0 1 0.0039,0.005859 A 0.750075,0.750075 0 0 1 16.75,1.1230469 v 0.7773437 a 0.750075,0.750075 0 0 1 -0.380859,0.7636719 0.750075,0.750075 0 0 1 -0.03516,0.017578 0.750075,0.750075 0 0 1 -0.103515,0.042969 0.750075,0.750075 0 0 1 -0.822266,-0.2539063 L 15,2.0625 13.65625,3.4042969 12.75,6.1191406 V 7.25 h 0.150391 a 0.750075,0.750075 0 0 1 0.205078,0 H 15 a 0.750075,0.750075 0 1 1 0,1.5 H 13.3125 L 12.75,9.3125 v 11.375 L 13.310547,21.25 H 14 a 0.750075,0.750075 0 0 1 0,1.5 h -1 -0.876953 a 0.750075,0.750075 0 0 1 -0.246094,0 h -0.753906 a 0.750075,0.750075 0 0 1 -0.246094,0 h -0.777344 a 0.750075,0.750075 0 0 1 -0.2050778,0 H 9 a 0.750075,0.750075 0 1 1 0,-1.5 H 9.6875 L 10.25,20.6875 V 9.3125 L 9.6875,8.75 H 8 6.3125 L 5.75,9.3125 v 11.375 L 6.3105469,21.25 H 7 a 0.750075,0.750075 0 0 1 0,1.5 H 6 5.1230469 a 0.750075,0.750075 0 0 1 -0.2460938,0 H 4.1230469 a 0.750075,0.750075 0 0 1 -0.2460938,0 H 3.0996094 a 0.750075,0.750075 0 0 1 -0.2050782,0 H 2 a 0.750075,0.750075 0 1 1 0,-1.5 H 2.6875 L 3.25,20.6875 V 9.3125 L 2.6875,8.75 H 2 a 0.750075,0.750075 0 1 1 0,-1.5 h 0.8925781 a 0.750075,0.750075 0 0 1 0.1992188,0 H 3.25 V 6.078125 a 0.750075,0.750075 0 0 1 0.00977,-0.1972656 0.750075,0.750075 0 0 1 0.00781,-0.046875 A 0.750075,0.750075 0 0 1 3.3144531,5.6875 L 4.2890625,2.7636719 A 0.750075,0.750075 0 0 1 4.46875,2.46875 l 1,-1 A 0.750075,0.750075 0 0 1 5.6640625,1.3300781 L 7.640625,0.34179688 a 0.750075,0.750075 0 0 1 0.023437,-0.0117188 0.750075,0.750075 0 0 1 0.042969,-0.0214844 0.750075,0.750075 0 0 1 0.072266,-0.0253906 A 0.750075,0.750075 0 0 1 7.8515625,0.265625 0.750075,0.750075 0 0 1 8,0.25 h 1.8984375 a 0.750075,0.750075 0 0 1 0.2285155,0.009766 0.750075,0.750075 0 0 1 0.06836,0.0136719 0.750075,0.750075 0 0 1 0.220704,0.0976563 l 1.84375,0.91992185 a 0.750075,0.750075 0 0 1 0.177734,0.099609 0.750075,0.750075 0 0 1 0.0078,0.00391 0.750075,0.750075 0 0 1 0.0293,0.023438 0.750075,0.750075 0 0 1 0.02734,0.021484 0.750075,0.750075 0 0 1 0.162109,-0.109375 l 1.966797,-0.98242185 a 0.750075,0.750075 0 0 1 0.0332,-0.0175781 0.750075,0.750075 0 0 1 0.0332,-0.015625 0.750075,0.750075 0 0 1 0.06445,-0.0253906 0.750075,0.750075 0 0 1 0.0059,-0.001953 0.750075,0.750075 0 0 1 0.03906,-0.009766 0.750075,0.750075 0 0 1 0.04492,-0.0117188 0.750075,0.750075 0 0 1 0.0625,-0.009766 0.750075,0.750075 0 0 1 0.01172,-0.001953 0.750075,0.750075 0 0 1 0.03906,-0.001953 A 0.750075,0.750075 0 0 1 15,0.25 h 0.876953 a 0.750075,0.750075 0 0 1 0.111328,-0.009766 z"
     id="path2" />
</svg>
