<?xml version="1.0" encoding="UTF-8" standalone="no"?>
<svg
   xmlns:dc="http://purl.org/dc/elements/1.1/"
   xmlns:cc="http://creativecommons.org/ns#"
   xmlns:rdf="http://www.w3.org/1999/02/22-rdf-syntax-ns#"
   xmlns:svg="http://www.w3.org/2000/svg"
   xmlns="http://www.w3.org/2000/svg"
   xmlns:sodipodi="http://sodipodi.sourceforge.net/DTD/sodipodi-0.dtd"
   xmlns:inkscape="http://www.inkscape.org/namespaces/inkscape"
   data-dec="105"
   width="10"
   height="40"
   version="1.1"
   id="svg4"
   sodipodi:docname="105.svg"
   inkscape:version="0.92.4 (unknown)">
  <metadata
     id="metadata10">
    <rdf:RDF>
      <cc:Work
         rdf:about="">
        <dc:format>image/svg+xml</dc:format>
        <dc:type
           rdf:resource="http://purl.org/dc/dcmitype/StillImage" />
      </cc:Work>
    </rdf:RDF>
  </metadata>
  <defs
     id="defs8" />
  <sodipodi:namedview
     pagecolor="#ffffff"
     bordercolor="#666666"
     borderopacity="1"
     objecttolerance="10"
     gridtolerance="10"
     guidetolerance="10"
     inkscape:pageopacity="0"
     inkscape:pageshadow="2"
     inkscape:window-width="640"
     inkscape:window-height="480"
     id="namedview6"
     showgrid="false"
     inkscape:zoom="5.9"
     inkscape:cx="5"
     inkscape:cy="20"
     inkscape:window-x="0"
     inkscape:window-y="27"
     inkscape:window-maximized="0"
     inkscape:current-layer="svg4" />
  <path
     style="color:#000000;font-style:normal;font-variant:normal;font-weight:normal;font-stretch:normal;font-size:medium;line-height:normal;font-family:sans-serif;font-variant-ligatures:normal;font-variant-position:normal;font-variant-caps:normal;font-variant-numeric:normal;font-variant-alternates:normal;font-feature-settings:normal;text-indent:0;text-align:start;text-decoration:none;text-decoration-line:none;text-decoration-style:solid;text-decoration-color:#000000;letter-spacing:normal;word-spacing:normal;text-transform:none;writing-mode:lr-tb;direction:ltr;text-orientation:mixed;dominant-baseline:auto;baseline-shift:baseline;text-anchor:start;white-space:normal;shape-padding:0;clip-rule:nonzero;display:inline;overflow:visible;visibility:visible;opacity:1;isolation:auto;mix-blend-mode:normal;color-interpolation:sRGB;color-interpolation-filters:linearRGB;solid-color:#000000;solid-opacity:1;vector-effect:none;fill:#013272;fill-opacity:1;fill-rule:nonzero;stroke:none;stroke-width:2;stroke-linecap:round;stroke-linejoin:round;stroke-miterlimit:4;stroke-dasharray:none;stroke-dashoffset:0;stroke-opacity:1;color-rendering:auto;image-rendering:auto;shape-rendering:auto;text-rendering:auto;enable-background:accumulate"
     d="m 4.984375,6.9863281 a 1.0001,1.0001 0 0 1 0.7070312,0.2773438 1.0001,1.0001 0 0 1 0.00781,0.00781 1.0001,1.0001 0 0 1 0.00781,0.00781 1.0001,1.0001 0 0 1 0.00391,0.00391 A 1.0001,1.0001 0 0 1 6,8.1679688 V 21 h 2 a 1.0001,1.0001 0 1 1 0,2 H 5.1582031 A 1.0001,1.0001 0 0 1 4.8320312,23 H 2 A 1.0001,1.0001 0 1 1 2,21 H 4 V 9 H 2 A 1.0001,1.0001 0 1 1 2,7 H 4.8417969 A 1.0001,1.0001 0 0 1 4.984375,6.9863281 Z M 3.9707031,-0.00976563 a 1.0001,1.0001 0 0 1 0.029297,0 1.0001,1.0001 0 0 1 0.089844,0.00390625 1.0001,1.0001 0 0 1 0.734375,0.41601563 L 5.7070312,1.2929688 a 1.0001,1.0001 0 0 1 0,1.4140624 l -1,1 a 1.0001,1.0001 0 0 1 -1.4140624,0 l -1,-1 a 1.0001,1.0001 0 0 1 0,-1.4140624 L 3.1796875,0.40625 a 1.0001,1.0001 0 0 1 0.7910156,-0.41601563 z"
     id="path2" />
</svg>
