<?xml version="1.0" encoding="UTF-8" standalone="no"?>
<svg
   xmlns:dc="http://purl.org/dc/elements/1.1/"
   xmlns:cc="http://creativecommons.org/ns#"
   xmlns:rdf="http://www.w3.org/1999/02/22-rdf-syntax-ns#"
   xmlns:svg="http://www.w3.org/2000/svg"
   xmlns="http://www.w3.org/2000/svg"
   xmlns:sodipodi="http://sodipodi.sourceforge.net/DTD/sodipodi-0.dtd"
   xmlns:inkscape="http://www.inkscape.org/namespaces/inkscape"
   data-dec="80"
   width="20"
   height="40"
   version="1.1"
   id="svg4"
   sodipodi:docname="80.svg"
   inkscape:version="0.92.4 5da689c313, 2019-01-14">
  <metadata
     id="metadata10">
    <rdf:RDF>
      <cc:Work
         rdf:about="">
        <dc:format>image/svg+xml</dc:format>
        <dc:type
           rdf:resource="http://purl.org/dc/dcmitype/StillImage" />
        <dc:title></dc:title>
      </cc:Work>
    </rdf:RDF>
  </metadata>
  <defs
     id="defs8" />
  <sodipodi:namedview
     pagecolor="#ffffff"
     bordercolor="#666666"
     borderopacity="1"
     objecttolerance="10"
     gridtolerance="10"
     guidetolerance="10"
     inkscape:pageopacity="0"
     inkscape:pageshadow="2"
     inkscape:window-width="1920"
     inkscape:window-height="1043"
     id="namedview6"
     showgrid="false"
     inkscape:zoom="5.9"
     inkscape:cx="10"
     inkscape:cy="20"
     inkscape:window-x="0"
     inkscape:window-y="37"
     inkscape:window-maximized="0"
     inkscape:current-layer="svg4" />
  <path
     style="color:#000000;font-style:normal;font-variant:normal;font-weight:normal;font-stretch:normal;font-size:medium;line-height:normal;font-family:sans-serif;font-variant-ligatures:normal;font-variant-position:normal;font-variant-caps:normal;font-variant-numeric:normal;font-variant-alternates:normal;font-feature-settings:normal;text-indent:0;text-align:start;text-decoration:none;text-decoration-line:none;text-decoration-style:solid;text-decoration-color:#000000;letter-spacing:normal;word-spacing:normal;text-transform:none;writing-mode:lr-tb;direction:ltr;text-orientation:mixed;dominant-baseline:auto;baseline-shift:baseline;text-anchor:start;white-space:normal;shape-padding:0;clip-rule:nonzero;display:inline;overflow:visible;visibility:visible;opacity:1;isolation:auto;mix-blend-mode:normal;color-interpolation:sRGB;color-interpolation-filters:linearRGB;solid-color:#000000;solid-opacity:1;vector-effect:none;fill:#000000;fill-opacity:1;fill-rule:nonzero;stroke:none;stroke-width:1.5;stroke-linecap:round;stroke-linejoin:round;stroke-miterlimit:4;stroke-dasharray:none;stroke-dashoffset:0;stroke-opacity:1;color-rendering:auto;image-rendering:auto;shape-rendering:auto;text-rendering:auto;enable-background:accumulate"
     d="m 5.75,2.75 v 7.5 h 7.072266 L 14.441406,9.4414062 15.25,7.8222656 V 5.1777344 L 14.441406,3.5585938 12.822266,2.75 Z M 3.9882812,0.24023438 A 0.750075,0.750075 0 0 1 4.1230469,0.25 H 13 a 0.750075,0.750075 0 0 1 0.335938,0.0800781 l 2,0.99999998 A 0.750075,0.750075 0 0 1 15.53125,1.46875 l 1,1 a 0.750075,0.750075 0 0 1 0.138672,0.1953125 l 1,2 A 0.750075,0.750075 0 0 1 17.75,5 v 3 a 0.750075,0.750075 0 0 1 -0.08008,0.3359375 l -1,2.0000005 A 0.750075,0.750075 0 0 1 16.53125,10.53125 l -1,1 a 0.750075,0.750075 0 0 1 -0.195312,0.138672 l -2,1 A 0.750075,0.750075 0 0 1 13,12.75 H 5.75 V 22 A 0.750075,0.750075 0 0 1 5,22.75 H 4.1230469 a 0.750075,0.750075 0 0 1 -0.6445313,-0.201172 0.750075,0.750075 0 0 1 -0.00586,-0.0059 0.750075,0.750075 0 0 1 -0.00586,-0.0059 0.750075,0.750075 0 0 1 -0.046875,-0.05078 A 0.750075,0.750075 0 0 1 3.25,21.876953 V 1.1230469 a 0.750075,0.750075 0 0 1 0.2011719,-0.64453128 0.750075,0.750075 0 0 1 0.00586,-0.005859 0.750075,0.750075 0 0 1 0.00586,-0.005859 0.750075,0.750075 0 0 1 0.050781,-0.046875 0.750075,0.750075 0 0 1 0.4746093,-0.1796875 z"
     id="path2" />
</svg>
