<svg xmlns:dc="http://purl.org/dc/elements/1.1/" xmlns:cc="http://creativecommons.org/ns#" xmlns:rdf="http://www.w3.org/1999/02/22-rdf-syntax-ns#" xmlns:svg="http://www.w3.org/2000/svg" xmlns="http://www.w3.org/2000/svg" xmlns:sodipodi="http://sodipodi.sourceforge.net/DTD/sodipodi-0.dtd" xmlns:inkscape="http://www.inkscape.org/namespaces/inkscape" data-dec="102" id="dec_110" width="11" height="40" version="1.1" sodipodi:docname="102.svg" inkscape:version="0.92.3 (2405546, 2018-03-11)">
  <metadata id="metadata9">
    <rdf:RDF>
      <cc:Work rdf:about="">
        <dc:format>image/svg+xml</dc:format>
        <dc:type rdf:resource="http://purl.org/dc/dcmitype/StillImage"/>
        <dc:title/>
      </cc:Work>
    </rdf:RDF>
  </metadata>
  <defs id="defs7"/>
  <sodipodi:namedview pagecolor="#ffffff" bordercolor="#666666" borderopacity="1" objecttolerance="10" gridtolerance="10" guidetolerance="10" inkscape:pageopacity="0" inkscape:pageshadow="2" inkscape:window-width="1185" inkscape:window-height="693" id="namedview5" showgrid="true" inkscape:zoom="12.008639" inkscape:cx="0.68201384" inkscape:cy="30.430841" inkscape:window-x="190" inkscape:window-y="171" inkscape:window-maximized="0" inkscape:current-layer="dec_110" showguides="true" inkscape:guide-bbox="true">
    <inkscape:grid type="xygrid" id="grid812"/>
    <sodipodi:guide position="26,15" orientation="0,1" id="guide816" inkscape:locked="false"/>
    <sodipodi:guide position="15,36" orientation="0,1" id="guide873" inkscape:locked="false"/>
  </sodipodi:namedview>
  <path id="path870" style="fill:none;fill-rule:evenodd;stroke:#000000;stroke-width:1px;stroke-linecap:round;stroke-linejoin:round;stroke-opacity:1" d="M 9,2 V 1 M 4,9 3,8 M 5,9 6,8 M 2,8 H 8 M 3,22 4,21 m -2,1 h 2 m 1,-16 1,-3 2,-2 1,1 m -5,4 1,-3 1,-1 2,-1 h 1 m -4,21 v -16 m -1,16 v -16 m 0,16 H 7 6 l -1,-1              " inkscape:connector-curvature="0"/>
</svg>