<?xml version="1.0" encoding="UTF-8"?>
<glyph name="w" format="1">
  <advance width="694"/>
  <unicode hex="0077"/>
  <outline>
    <contour>
      <point x="116" y="434" type="curve" smooth="yes"/>
      <point x="117" y="434"/>
      <point x="117" y="433"/>
      <point x="118" y="433" type="curve" smooth="yes"/>
      <point x="202" y="433" type="line" smooth="yes"/>
      <point x="210" y="433"/>
      <point x="218" y="427"/>
      <point x="218" y="419" type="curve" smooth="yes"/>
      <point x="218" y="411"/>
      <point x="210" y="405"/>
      <point x="202" y="405" type="curve" smooth="yes"/>
      <point x="135" y="405" type="line"/>
      <point x="232" y="67" type="line"/>
      <point x="333" y="422" type="line" smooth="yes"/>
      <point x="334" y="425"/>
      <point x="337" y="430"/>
      <point x="340" y="432" type="curve" smooth="yes"/>
      <point x="341" y="432"/>
      <point x="341" y="433"/>
      <point x="342" y="433" type="curve" smooth="yes"/>
      <point x="343" y="433"/>
      <point x="344" y="434"/>
      <point x="345" y="434" type="curve" smooth="yes"/>
      <point x="346" y="434" type="line"/>
      <point x="348" y="434" type="line"/>
      <point x="349" y="434" type="line"/>
      <point x="350" y="433" type="line"/>
      <point x="352" y="433" type="line"/>
      <point x="353" y="433" type="line" smooth="yes"/>
      <point x="354" y="432"/>
      <point x="357" y="431"/>
      <point x="358" y="430" type="curve" smooth="yes"/>
      <point x="360" y="428"/>
      <point x="362" y="423"/>
      <point x="362" y="421" type="curve" smooth="yes"/>
      <point x="463" y="67" type="line"/>
      <point x="560" y="405" type="line"/>
      <point x="492" y="405" type="line" smooth="yes"/>
      <point x="484" y="405"/>
      <point x="477" y="411"/>
      <point x="477" y="419" type="curve" smooth="yes"/>
      <point x="477" y="427"/>
      <point x="484" y="433"/>
      <point x="492" y="433" type="curve" smooth="yes"/>
      <point x="576" y="433" type="line" smooth="yes"/>
      <point x="577" y="433"/>
      <point x="578" y="434"/>
      <point x="579" y="434" type="curve" smooth="yes"/>
      <point x="580" y="434"/>
      <point x="581" y="433"/>
      <point x="582" y="433" type="curve" smooth="yes"/>
      <point x="666" y="433" type="line" smooth="yes"/>
      <point x="674" y="433"/>
      <point x="681" y="427"/>
      <point x="681" y="419" type="curve" smooth="yes"/>
      <point x="681" y="411"/>
      <point x="674" y="405"/>
      <point x="666" y="405" type="curve" smooth="yes"/>
      <point x="590" y="405" type="line"/>
      <point x="477" y="12" type="line" smooth="yes"/>
      <point x="476" y="9"/>
      <point x="474" y="3"/>
      <point x="471" y="1" type="curve" smooth="yes"/>
      <point x="470" y="1"/>
      <point x="469" y="0"/>
      <point x="468" y="0" type="curve" smooth="yes"/>
      <point x="465" y="0" type="line"/>
      <point x="464" y="0" type="line"/>
      <point x="463" y="0" type="line"/>
      <point x="462" y="0" type="line"/>
      <point x="460" y="0" type="line"/>
      <point x="459" y="0" type="line"/>
      <point x="458" y="1" type="line" smooth="yes"/>
      <point x="457" y="2"/>
      <point x="454" y="3"/>
      <point x="453" y="4" type="curve" smooth="yes"/>
      <point x="451" y="6"/>
      <point x="449" y="10"/>
      <point x="449" y="12" type="curve" smooth="yes"/>
      <point x="348" y="366" type="line"/>
      <point x="246" y="12" type="line" smooth="yes"/>
      <point x="245" y="9"/>
      <point x="242" y="3"/>
      <point x="239" y="1" type="curve" smooth="yes"/>
      <point x="238" y="1"/>
      <point x="237" y="0"/>
      <point x="236" y="0" type="curve" smooth="yes"/>
      <point x="233" y="0" type="line"/>
      <point x="232" y="0" type="line"/>
      <point x="231" y="0" type="line"/>
      <point x="230" y="0" type="line"/>
      <point x="229" y="0" type="line"/>
      <point x="228" y="0" type="line"/>
      <point x="226" y="1" type="line" smooth="yes"/>
      <point x="225" y="2"/>
      <point x="222" y="3"/>
      <point x="221" y="4" type="curve" smooth="yes"/>
      <point x="219" y="6"/>
      <point x="217" y="10"/>
      <point x="217" y="12" type="curve" smooth="yes"/>
      <point x="104" y="405" type="line"/>
      <point x="29" y="405" type="line" smooth="yes"/>
      <point x="21" y="405"/>
      <point x="14" y="411"/>
      <point x="14" y="419" type="curve" smooth="yes"/>
      <point x="14" y="427"/>
      <point x="21" y="433"/>
      <point x="29" y="433" type="curve" smooth="yes"/>
      <point x="113" y="433" type="line" smooth="yes"/>
      <point x="114" y="433"/>
      <point x="115" y="434"/>
    </contour>
  </outline>
  <lib>
    <dict>
      <key>com.fontlab.hintData</key>
      <dict>
        <key>hhints</key>
        <array>
          <dict>
            <key>position</key>
            <integer>0</integer>
            <key>width</key>
            <integer>23</integer>
          </dict>
          <dict>
            <key>position</key>
            <integer>405</integer>
            <key>width</key>
            <integer>29</integer>
          </dict>
        </array>
      </dict>
    </dict>
  </lib>
</glyph>
