<?xml version="1.0" encoding="UTF-8" standalone="no"?>
<svg
   xmlns:dc="http://purl.org/dc/elements/1.1/"
   xmlns:cc="http://creativecommons.org/ns#"
   xmlns:rdf="http://www.w3.org/1999/02/22-rdf-syntax-ns#"
   xmlns:svg="http://www.w3.org/2000/svg"
   xmlns="http://www.w3.org/2000/svg"
   xmlns:sodipodi="http://sodipodi.sourceforge.net/DTD/sodipodi-0.dtd"
   xmlns:inkscape="http://www.inkscape.org/namespaces/inkscape"
   data-dec="168"
   width="15"
   height="40"
   version="1.1"
   id="svg4"
   sodipodi:docname="168.svg"
   inkscape:version="0.92.4 (unknown)">
  <metadata
     id="metadata10">
    <rdf:RDF>
      <cc:Work
         rdf:about="">
        <dc:format>image/svg+xml</dc:format>
        <dc:type
           rdf:resource="http://purl.org/dc/dcmitype/StillImage" />
      </cc:Work>
    </rdf:RDF>
  </metadata>
  <defs
     id="defs8" />
  <sodipodi:namedview
     pagecolor="#ffffff"
     bordercolor="#666666"
     borderopacity="1"
     objecttolerance="10"
     gridtolerance="10"
     guidetolerance="10"
     inkscape:pageopacity="0"
     inkscape:pageshadow="2"
     inkscape:window-width="640"
     inkscape:window-height="480"
     id="namedview6"
     showgrid="false"
     inkscape:zoom="5.9"
     inkscape:cx="7.5"
     inkscape:cy="20"
     inkscape:window-x="0"
     inkscape:window-y="27"
     inkscape:window-maximized="0"
     inkscape:current-layer="svg4" />
  <path
     style="color:#000000;font-style:normal;font-variant:normal;font-weight:normal;font-stretch:normal;font-size:medium;line-height:normal;font-family:sans-serif;font-variant-ligatures:normal;font-variant-position:normal;font-variant-caps:normal;font-variant-numeric:normal;font-variant-alternates:normal;font-feature-settings:normal;text-indent:0;text-align:start;text-decoration:none;text-decoration-line:none;text-decoration-style:solid;text-decoration-color:#000000;letter-spacing:normal;word-spacing:normal;text-transform:none;writing-mode:lr-tb;direction:ltr;text-orientation:mixed;dominant-baseline:auto;baseline-shift:baseline;text-anchor:start;white-space:normal;shape-padding:0;clip-rule:nonzero;display:inline;overflow:visible;visibility:visible;opacity:1;isolation:auto;mix-blend-mode:normal;color-interpolation:sRGB;color-interpolation-filters:linearRGB;solid-color:#000000;solid-opacity:1;vector-effect:none;fill:#000000;fill-opacity:1;fill-rule:nonzero;stroke:none;stroke-width:1;stroke-linecap:round;stroke-linejoin:round;stroke-miterlimit:4;stroke-dasharray:none;stroke-dashoffset:0;stroke-opacity:1;color-rendering:auto;image-rendering:auto;shape-rendering:auto;text-rendering:auto;enable-background:accumulate"
     d="M 9.9902344,1.4960938 A 0.50005,0.50005 0 0 1 10.074219,1.5 H 12 a 0.50005,0.50005 0 0 1 0.353516,0.1464844 l 1,1 A 0.50005,0.50005 0 0 1 13.5,3 v 2 a 0.50005,0.50005 0 0 1 -0.146484,0.3535156 l -1,1 A 0.50005,0.50005 0 0 1 12,6.5 H 10 A 0.50005,0.50005 0 0 1 9.6464844,6.3535156 l -1,-1 A 0.50005,0.50005 0 0 1 8.5,5 V 3 A 0.50005,0.50005 0 0 1 8.6464844,2.6464844 L 9.5957031,1.6972656 a 0.50005,0.50005 0 0 1 0.1503907,-0.1308594 0.50005,0.50005 0 0 1 0.013672,-0.00781 0.50005,0.50005 0 0 1 0.037109,-0.017578 0.50005,0.50005 0 0 1 0.00781,-0.00391 0.50005,0.50005 0 0 1 0.015625,-0.00586 0.50005,0.50005 0 0 1 0.03125,-0.011719 0.50005,0.50005 0 0 1 0.1386719,-0.023437 z m -7,0 A 0.50005,0.50005 0 0 1 3.0742188,1.5 H 5 a 0.50005,0.50005 0 0 1 0.3535156,0.1464844 l 1,1 A 0.50005,0.50005 0 0 1 6.5,3 V 5 A 0.50005,0.50005 0 0 1 6.3535156,5.3535156 l -1,1 A 0.50005,0.50005 0 0 1 5,6.5 H 3 A 0.50005,0.50005 0 0 1 2.6464844,6.3535156 l -1,-1 A 0.50005,0.50005 0 0 1 1.5,5 V 3 A 0.50005,0.50005 0 0 1 1.6464844,2.6464844 L 2.5957031,1.6972656 a 0.50005,0.50005 0 0 1 0.1503907,-0.1308594 0.50005,0.50005 0 0 1 0.013672,-0.00781 0.50005,0.50005 0 0 1 0.037109,-0.017578 0.50005,0.50005 0 0 1 0.00781,-0.00391 0.50005,0.50005 0 0 1 0.015625,-0.00586 0.50005,0.50005 0 0 1 0.03125,-0.011719 0.50005,0.50005 0 0 1 0.1386719,-0.023437 z"
     id="path2" />
</svg>
