<?xml version="1.0" encoding="UTF-8"?>
<glyph name="question" format="1">
  <advance width="635"/>
  <unicode hex="003F"/>
  <outline>
    <contour>
      <point x="235" y="58" type="line"/>
      <point x="235" y="37" type="line"/>
      <point x="256" y="37" type="line"/>
      <point x="256" y="58" type="line"/>
    </contour>
    <contour>
      <point x="231" y="67" type="line"/>
      <point x="232" y="67" type="line"/>
      <point x="232" y="66" type="line"/>
      <point x="261" y="66" type="line" smooth="yes"/>
      <point x="263" y="66"/>
      <point x="265" y="65"/>
      <point x="265" y="63" type="curve" smooth="yes"/>
      <point x="265" y="33" type="line" smooth="yes"/>
      <point x="265" y="31"/>
      <point x="263" y="29"/>
      <point x="261" y="29" type="curve" smooth="yes"/>
      <point x="232" y="29" type="line" smooth="yes"/>
      <point x="230" y="29"/>
      <point x="228" y="31"/>
      <point x="228" y="33" type="curve" smooth="yes"/>
      <point x="228" y="62" type="line"/>
      <point x="228" y="63" type="line"/>
      <point x="228" y="64" type="line"/>
      <point x="228" y="65" type="line"/>
      <point x="229" y="65" type="line"/>
      <point x="229" y="66" type="line"/>
      <point x="230" y="66" type="line"/>
      <point x="231" y="66" type="line"/>
    </contour>
    <contour>
      <point x="233" y="87" type="line"/>
      <point x="207" y="60" type="line"/>
      <point x="207" y="35" type="line"/>
      <point x="233" y="9" type="line"/>
      <point x="258" y="9" type="line"/>
      <point x="285" y="35" type="line"/>
      <point x="285" y="60" type="line"/>
      <point x="258" y="87" type="line"/>
    </contour>
    <contour>
      <point x="231" y="96" type="line"/>
      <point x="232" y="96" type="line"/>
      <point x="261" y="96" type="line" smooth="yes"/>
      <point x="262" y="96"/>
      <point x="263" y="96"/>
      <point x="264" y="95" type="curve" smooth="yes"/>
      <point x="293" y="65" type="line" smooth="yes"/>
      <point x="294" y="64"/>
      <point x="294" y="64"/>
      <point x="294" y="63" type="curve" smooth="yes"/>
      <point x="294" y="33" type="line" smooth="yes"/>
      <point x="294" y="32"/>
      <point x="294" y="31"/>
      <point x="293" y="30" type="curve" smooth="yes"/>
      <point x="264" y="1" type="line" smooth="yes"/>
      <point x="263" y="0"/>
      <point x="262" y="0"/>
      <point x="261" y="0" type="curve" smooth="yes"/>
      <point x="232" y="0" type="line" smooth="yes"/>
      <point x="231" y="0"/>
      <point x="230" y="0"/>
      <point x="229" y="1" type="curve" smooth="yes"/>
      <point x="199" y="30" type="line" smooth="yes"/>
      <point x="198" y="31"/>
      <point x="198" y="32"/>
      <point x="198" y="33" type="curve" smooth="yes"/>
      <point x="198" y="63" type="line" smooth="yes"/>
      <point x="198" y="64"/>
      <point x="198" y="64"/>
      <point x="199" y="65" type="curve" smooth="yes"/>
      <point x="228" y="94" type="line"/>
      <point x="229" y="95" type="line"/>
      <point x="230" y="95" type="line"/>
      <point x="230" y="96" type="line"/>
    </contour>
    <contour>
      <point x="297" y="307" type="line"/>
      <point x="265" y="292" type="line"/>
      <point x="265" y="239" type="line"/>
      <point x="297" y="222" type="line"/>
      <point x="286" y="233" type="line" smooth="yes"/>
      <point x="285" y="234"/>
      <point x="285" y="234"/>
      <point x="285" y="235" type="curve" smooth="yes"/>
      <point x="285" y="294" type="line" smooth="yes"/>
      <point x="285" y="295"/>
      <point x="285" y="296"/>
      <point x="286" y="297" type="curve" smooth="yes"/>
    </contour>
    <contour>
      <point x="497" y="584" type="line"/>
      <point x="525" y="527" type="line"/>
      <point x="526" y="527"/>
      <point x="526" y="526" type="curve" smooth="yes"/>
      <point x="526" y="468" type="line" smooth="yes"/>
      <point x="526" y="467"/>
      <point x="525" y="465" type="line"/>
      <point x="496" y="408" type="line"/>
      <point x="495" y="407" type="line"/>
      <point x="466" y="377" type="line"/>
      <point x="465" y="376" type="line"/>
      <point x="414" y="351" type="line"/>
      <point x="432" y="355" type="line"/>
      <point x="490" y="384" type="line"/>
      <point x="517" y="412" type="line"/>
      <point x="546" y="469" type="line"/>
      <point x="546" y="525" type="line"/>
      <point x="518" y="580" type="line"/>
    </contour>
    <contour>
      <point x="462" y="591" type="line"/>
      <point x="466" y="586" type="line"/>
      <point x="468" y="585" type="line"/>
      <point x="496" y="527" type="line"/>
      <point x="496" y="526" type="line"/>
      <point x="496" y="468" type="line"/>
      <point x="496" y="465" type="line"/>
      <point x="468" y="408" type="line"/>
      <point x="466" y="407" type="line"/>
      <point x="438" y="377" type="line"/>
      <point x="436" y="376" type="line"/>
      <point x="355" y="337" type="line"/>
      <point x="403" y="349" type="line" smooth="yes"/>
      <point x="402" y="350"/>
      <point x="400" y="351"/>
      <point x="400" y="352" type="curve" smooth="yes"/>
      <point x="400" y="353"/>
      <point x="403" y="354"/>
      <point x="404" y="355" type="curve" smooth="yes"/>
      <point x="461" y="384" type="line"/>
      <point x="488" y="412" type="line"/>
      <point x="517" y="469" type="line"/>
      <point x="517" y="525" type="line"/>
      <point x="488" y="581" type="line"/>
      <point x="487" y="582"/>
      <point x="487" y="583" type="curve" smooth="yes"/>
      <point x="487" y="584"/>
      <point x="488" y="585" type="line"/>
    </contour>
    <contour>
      <point x="450" y="602" type="line"/>
      <point x="451" y="602" type="line"/>
      <point x="453" y="601" type="line"/>
    </contour>
    <contour>
      <point x="420" y="608" type="line"/>
      <point x="436" y="605" type="line"/>
      <point x="432" y="608" type="line"/>
    </contour>
    <contour>
      <point x="434" y="617" type="line"/>
      <point x="436" y="616" type="line"/>
      <point x="522" y="587" type="line"/>
      <point x="524" y="587" type="line"/>
      <point x="524" y="586" type="line"/>
      <point x="525" y="586"/>
      <point x="525" y="585" type="curve" smooth="yes"/>
      <point x="525" y="584" type="line"/>
      <point x="554" y="527" type="line"/>
      <point x="554" y="526" type="line"/>
      <point x="554" y="468" type="line"/>
      <point x="554" y="465" type="line"/>
      <point x="525" y="408" type="line"/>
      <point x="524" y="407" type="line"/>
      <point x="495" y="377" type="line"/>
      <point x="494" y="376" type="line"/>
      <point x="436" y="348" type="line"/>
      <point x="320" y="319" type="line"/>
      <point x="294" y="292" type="line"/>
      <point x="294" y="238" type="line"/>
      <point x="320" y="211" type="line"/>
      <point x="348" y="211" type="line" smooth="yes"/>
      <point x="350" y="211"/>
      <point x="352" y="209"/>
      <point x="352" y="207" type="curve" smooth="yes"/>
      <point x="352" y="205"/>
      <point x="350" y="202"/>
      <point x="348" y="202" type="curve" smooth="yes"/>
      <point x="319" y="202" type="line"/>
      <point x="318" y="202" type="line"/>
      <point x="317" y="202" type="line"/>
      <point x="317" y="204" type="line"/>
      <point x="316" y="204" type="line"/>
      <point x="258" y="232" type="line" smooth="yes"/>
      <point x="257" y="233"/>
      <point x="256" y="234"/>
      <point x="256" y="235" type="curve" smooth="yes"/>
      <point x="256" y="294" type="line" smooth="yes"/>
      <point x="256" y="295"/>
      <point x="257" y="297"/>
      <point x="258" y="298" type="curve" smooth="yes"/>
      <point x="316" y="327" type="line"/>
      <point x="317" y="327" type="line"/>
      <point x="431" y="384" type="line"/>
      <point x="460" y="412" type="line"/>
      <point x="487" y="469" type="line"/>
      <point x="487" y="525" type="line"/>
      <point x="460" y="581" type="line"/>
      <point x="447" y="594" type="line"/>
      <point x="376" y="608" type="line"/>
      <point x="319" y="608" type="line"/>
      <point x="234" y="580" type="line"/>
      <point x="206" y="552" type="line"/>
      <point x="178" y="495" type="line"/>
      <point x="178" y="443" type="line"/>
      <point x="228" y="443" type="line"/>
      <point x="228" y="492" type="line"/>
      <point x="207" y="492" type="line"/>
      <point x="207" y="468" type="line" smooth="yes"/>
      <point x="207" y="466"/>
      <point x="204" y="463"/>
      <point x="202" y="463" type="curve" smooth="yes"/>
      <point x="200" y="463"/>
      <point x="198" y="466"/>
      <point x="198" y="468" type="curve" smooth="yes"/>
      <point x="198" y="496" type="line" smooth="yes"/>
      <point x="198" y="498"/>
      <point x="200" y="500"/>
      <point x="202" y="500" type="curve" smooth="yes"/>
      <point x="232" y="500" type="line" smooth="yes"/>
      <point x="234" y="500"/>
      <point x="235" y="498"/>
      <point x="235" y="496" type="curve" smooth="yes"/>
      <point x="235" y="439" type="line" smooth="yes"/>
      <point x="235" y="437"/>
      <point x="234" y="434"/>
      <point x="232" y="434" type="curve" smooth="yes"/>
      <point x="174" y="434" type="line" smooth="yes"/>
      <point x="172" y="434"/>
      <point x="169" y="437"/>
      <point x="169" y="439" type="curve" smooth="yes"/>
      <point x="169" y="496" type="line"/>
      <point x="169" y="498" type="line"/>
      <point x="199" y="557" type="line"/>
      <point x="199" y="558" type="line"/>
      <point x="229" y="586" type="line"/>
      <point x="230" y="587" type="line"/>
      <point x="317" y="616" type="line"/>
      <point x="318" y="616" type="line"/>
      <point x="376" y="616" type="line"/>
      <point x="433" y="616" type="line"/>
    </contour>
  </outline>
  <lib>
    <dict>
      <key>com.fontlab.hintData</key>
      <dict>
        <key>hhints</key>
        <array>
          <dict>
            <key>position</key>
            <integer>0</integer>
            <key>width</key>
            <integer>9</integer>
          </dict>
          <dict>
            <key>position</key>
            <integer>29</integer>
            <key>width</key>
            <integer>9</integer>
          </dict>
          <dict>
            <key>position</key>
            <integer>58</integer>
            <key>width</key>
            <integer>8</integer>
          </dict>
          <dict>
            <key>position</key>
            <integer>87</integer>
            <key>width</key>
            <integer>9</integer>
          </dict>
          <dict>
            <key>position</key>
            <integer>202</integer>
            <key>width</key>
            <integer>9</integer>
          </dict>
          <dict>
            <key>position</key>
            <integer>435</integer>
            <key>width</key>
            <integer>9</integer>
          </dict>
          <dict>
            <key>position</key>
            <integer>463</integer>
            <key>width</key>
            <integer>37</integer>
          </dict>
          <dict>
            <key>position</key>
            <integer>492</integer>
            <key>width</key>
            <integer>9</integer>
          </dict>
          <dict>
            <key>position</key>
            <integer>608</integer>
            <key>width</key>
            <integer>8</integer>
          </dict>
        </array>
        <key>vhints</key>
        <array>
          <dict>
            <key>position</key>
            <integer>169</integer>
            <key>width</key>
            <integer>9</integer>
          </dict>
          <dict>
            <key>position</key>
            <integer>198</integer>
            <key>width</key>
            <integer>9</integer>
          </dict>
          <dict>
            <key>position</key>
            <integer>228</integer>
            <key>width</key>
            <integer>8</integer>
          </dict>
          <dict>
            <key>position</key>
            <integer>256</integer>
            <key>width</key>
            <integer>9</integer>
          </dict>
          <dict>
            <key>position</key>
            <integer>285</integer>
            <key>width</key>
            <integer>9</integer>
          </dict>
          <dict>
            <key>position</key>
            <integer>487</integer>
            <key>width</key>
            <integer>9</integer>
          </dict>
          <dict>
            <key>position</key>
            <integer>517</integer>
            <key>width</key>
            <integer>9</integer>
          </dict>
          <dict>
            <key>position</key>
            <integer>546</integer>
            <key>width</key>
            <integer>9</integer>
          </dict>
        </array>
      </dict>
    </dict>
  </lib>
</glyph>
