StartFontMetrics 2.0
Comment Generated by FontForge 20170924
Comment Creation Date: Thu Mar 12 10:52:22 2020
FontName Hershey-Noailles-Times-Duplex-Light
FullName Hershey-Noailles-Times-Duplex-Light
FamilyName Hershey-Noailles-Times
Weight Light
Notice (by Luuse (contact@luuse.io), SIL Open Font License)
ItalicAngle 0
IsFixedPitch false
UnderlinePosition 0
UnderlineThickness 26,4
Version 001.000
EncodingScheme ISO10646-1
FontBBox -36 -184 822 768
CapHeight 566
XHeight 382
Ascender 566
Descender -184
StartCharMetrics 159
C 32 ; WX 314 ; N space ; B 0 0 0 0 ;
C 33 ; WX 262 ; N exclam ; B 99 0 166 567 ;
C 34 ; WX 472 ; N quotedbl ; B 99 369 401 567 ;
C 35 ; WX 577 ; N numbersign ; B 71 -184 480 672 ;
C 36 ; WX 525 ; N dollar ; B 71 -106 454 671 ;
C 37 ; WX 630 ; N percent ; B 71 0 560 567 ;
C 38 ; WX 683 ; N ampersand ; B 71 0 587 567 ;
C 39 ; WX 262 ; N quotesingle ; B 99 394 139 567 ;
C 40 ; WX 367 ; N parenleft ; B 99 -184 297 671 ;
C 41 ; WX 367 ; N parenright ; B 71 -184 270 671 ;
C 42 ; WX 420 ; N asterisk ; B 71 79 350 409 ;
C 43 ; WX 683 ; N plus ; B 99 0 587 488 ;
C 44 ; WX 210 ; N comma ; B 71 0 139 146 ;
C 45 ; WX 235 ; N hyphen ; B 19 210 218 224 ;
C 46 ; WX 210 ; N period ; B 71 79 139 146 ;
C 47 ; WX 577 ; N slash ; B 46 -184 533 671 ;
C 48 ; WX 525 ; N zero ; B 71 0 454 567 ;
C 49 ; WX 525 ; N one ; B 150 0 401 567 ;
C 50 ; WX 525 ; N two ; B 71 0 454 567 ;
C 51 ; WX 525 ; N three ; B 71 0 454 567 ;
C 52 ; WX 525 ; N four ; B 46 0 480 567 ;
C 53 ; WX 525 ; N five ; B 71 0 454 567 ;
C 54 ; WX 525 ; N six ; B 71 0 454 567 ;
C 55 ; WX 525 ; N seven ; B 71 0 454 567 ;
C 56 ; WX 525 ; N eight ; B 71 0 454 567 ;
C 57 ; WX 525 ; N nine ; B 71 0 454 567 ;
C 58 ; WX 210 ; N colon ; B 71 79 139 330 ;
C 59 ; WX 210 ; N semicolon ; B 71 0 139 330 ;
C 60 ; WX 630 ; N less ; B 99 0 533 488 ;
C 61 ; WX 683 ; N equal ; B 98 158 587 330 ;
C 62 ; WX 630 ; N greater ; B 99 0 533 488 ;
C 63 ; WX 472 ; N question ; B 71 0 401 567 ;
C 64 ; WX 735 ; N at ; B 71 0 639 567 ;
C 65 ; WX 525 ; N A ; B 20 0 508 567 ;
C 66 ; WX 577 ; N B ; B 46 0 508 567 ;
C 67 ; WX 525 ; N C ; B 71 0 481 567 ;
C 68 ; WX 577 ; N D ; B 46 0 508 567 ;
C 69 ; WX 525 ; N E ; B 46 0 480 567 ;
C 70 ; WX 472 ; N F ; B 46 0 480 567 ;
C 71 ; WX 630 ; N G ; B 71 0 560 567 ;
C 72 ; WX 630 ; N H ; B 46 0 587 567 ;
C 73 ; WX 314 ; N I ; B 46 0 244 567 ;
C 74 ; WX 420 ; N J ; B 46 0 350 567 ;
C 75 ; WX 525 ; N K ; B 46 0 560 567 ;
C 76 ; WX 498 ; N L ; B 46 0 454 567 ;
C 77 ; WX 683 ; N M ; B 46 0 612 567 ;
C 78 ; WX 630 ; N N ; B 46 0 560 567 ;
C 79 ; WX 577 ; N O ; B 71 0 508 567 ;
C 80 ; WX 577 ; N P ; B 46 0 508 567 ;
C 81 ; WX 577 ; N Q ; B 71 -131 508 567 ;
C 82 ; WX 577 ; N R ; B 46 0 533 567 ;
C 83 ; WX 525 ; N S ; B 71 0 454 567 ;
C 84 ; WX 525 ; N T ; B 46 0 454 567 ;
C 85 ; WX 630 ; N U ; B 46 0 587 567 ;
C 86 ; WX 525 ; N V ; B 20 0 508 567 ;
C 87 ; WX 630 ; N W ; B 20 0 612 567 ;
C 88 ; WX 525 ; N X ; B 20 0 508 567 ;
C 89 ; WX 577 ; N Y ; B 20 0 533 567 ;
C 90 ; WX 525 ; N Z ; B 71 0 454 567 ;
C 91 ; WX 367 ; N bracketleft ; B 99 -184 297 671 ;
C 92 ; WX 367 ; N backslash ; B -8 -80 375 567 ;
C 93 ; WX 367 ; N bracketright ; B 71 -184 270 671 ;
C 94 ; WX 577 ; N asciicircum ; B 125 394 454 540 ;
C 95 ; WX 525 ; N underscore ; B -8 -159 533 -143 ;
C 96 ; WX 314 ; N grave ; B 71 394 243 567 ;
C 97 ; WX 551 ; N a ; B 71 0 480 382 ;
C 98 ; WX 525 ; N b ; B 46 0 480 567 ;
C 99 ; WX 472 ; N c ; B 71 0 429 382 ;
C 100 ; WX 577 ; N d ; B 71 0 508 567 ;
C 101 ; WX 446 ; N e ; B 46 0 401 382 ;
C 102 ; WX 314 ; N f ; B 46 0 297 567 ;
C 103 ; WX 525 ; N g ; B 46 -184 429 382 ;
C 104 ; WX 577 ; N h ; B 46 0 533 567 ;
C 105 ; WX 314 ; N i ; B 46 0 244 567 ;
C 106 ; WX 314 ; N j ; B 20 -184 191 567 ;
C 107 ; WX 525 ; N k ; B 46 0 508 567 ;
C 108 ; WX 314 ; N l ; B 46 0 244 567 ;
C 109 ; WX 893 ; N m ; B 46 0 822 382 ;
C 110 ; WX 577 ; N n ; B 46 0 533 382 ;
C 111 ; WX 525 ; N o ; B 71 0 454 382 ;
C 112 ; WX 525 ; N p ; B 46 -184 480 382 ;
C 113 ; WX 525 ; N q ; B 71 -184 508 382 ;
C 114 ; WX 420 ; N r ; B 46 0 401 382 ;
C 115 ; WX 446 ; N s ; B 71 0 375 382 ;
C 116 ; WX 420 ; N t ; B 46 0 350 567 ;
C 117 ; WX 577 ; N u ; B 46 0 533 382 ;
C 118 ; WX 472 ; N v ; B 20 0 454 382 ;
C 119 ; WX 630 ; N w ; B 20 0 612 382 ;
C 120 ; WX 525 ; N x ; B 46 0 480 382 ;
C 121 ; WX 472 ; N y ; B 46 -184 480 382 ;
C 122 ; WX 472 ; N z ; B 71 0 401 382 ;
C 123 ; WX 367 ; N braceleft ; B 99 -184 244 671 ;
C 124 ; WX 210 ; N bar ; B 99 -184 112 671 ;
C 125 ; WX 367 ; N braceright ; B 123 -184 270 671 ;
C 126 ; WX 630 ; N asciitilde ; B 71 158 560 330 ;
C 127 ; WX 420 ; N uni007F ; B -8 0 429 567 ;
C 168 ; WX 393 ; N dieresis ; B 71 448 322 513 ;
C 169 ; WX 630 ; N copyright ; B 20 -80 612 540 ;
C 171 ; WX 367 ; N guillemotleft ; B 20 52 350 382 ;
C 180 ; WX 314 ; N acute ; B 71 394 243 567 ;
C 184 ; WX 130 ; N cedilla ; B 46 -106 112 14 ;
C 187 ; WX 367 ; N guillemotright ; B 20 52 350 382 ;
C 192 ; WX 525 ; N Agrave ; B 18 0 461 746 ;
C 193 ; WX 525 ; N Aacute ; B 18 0 461 746 ;
C 194 ; WX 525 ; N Acircumflex ; B 18 0 461 722 ;
C 195 ; WX 525 ; N Atilde ; B 13 0 461 768 ;
C 196 ; WX 525 ; N Adieresis ; B 18 0 461 645 ;
C 199 ; WX 525 ; N Ccedilla ; B 65 -106 438 515 ;
C 200 ; WX 525 ; N Egrave ; B 41 0 437 746 ;
C 201 ; WX 525 ; N Eacute ; B 41 0 437 746 ;
C 202 ; WX 525 ; N Ecircumflex ; B 41 0 437 722 ;
C 203 ; WX 525 ; N Edieresis ; B 41 0 437 645 ;
C 204 ; WX 314 ; N Igrave ; B -28 0 222 746 ;
C 205 ; WX 314 ; N Iacute ; B 41 0 288 746 ;
C 206 ; WX 314 ; N Icircumflex ; B -31 0 269 722 ;
C 207 ; WX 314 ; N Idieresis ; B 13 0 241 645 ;
C 210 ; WX 577 ; N Ograve ; B 65 0 461 746 ;
C 211 ; WX 577 ; N Oacute ; B 65 0 461 746 ;
C 212 ; WX 577 ; N Ocircumflex ; B 65 0 461 722 ;
C 213 ; WX 577 ; N Otilde ; B 39 0 483 768 ;
C 214 ; WX 577 ; N Odieresis ; B 65 0 461 645 ;
C 217 ; WX 630 ; N Ugrave ; B 41 0 533 746 ;
C 218 ; WX 630 ; N Uacute ; B 41 0 533 746 ;
C 219 ; WX 630 ; N Ucircumflex ; B 41 0 533 722 ;
C 220 ; WX 630 ; N Udieresis ; B 41 0 533 645 ;
C 224 ; WX 551 ; N agrave ; B 65 0 437 566 ;
C 225 ; WX 551 ; N aacute ; B 65 0 437 563 ;
C 226 ; WX 551 ; N acircumflex ; B 60 0 437 538 ;
C 227 ; WX 551 ; N atilde ; B -14 0 437 584 ;
C 231 ; WX 472 ; N ccedilla ; B 65 -106 390 348 ;
C 232 ; WX 446 ; N egrave ; B 41 0 365 562 ;
C 233 ; WX 446 ; N eacute ; B 41 0 365 562 ;
C 234 ; WX 446 ; N ecircumflex ; B 41 0 373 538 ;
C 235 ; WX 446 ; N edieresis ; B 41 0 365 461 ;
C 236 ; WX 314 ; N igrave ; B 14 0 244 620 ;
C 237 ; WX 314 ; N iacute ; B 42 0 244 620 ;
C 238 ; WX 314 ; N icircumflex ; B -36 0 264 596 ;
C 239 ; WX 314 ; N idieresis ; B -1 0 244 519 ;
C 242 ; WX 525 ; N ograve ; B 65 0 413 562 ;
C 243 ; WX 525 ; N oacute ; B 65 0 413 562 ;
C 244 ; WX 525 ; N ocircumflex ; B 65 0 413 538 ;
C 249 ; WX 577 ; N ugrave ; B 41 0 485 562 ;
C 250 ; WX 577 ; N uacute ; B 41 0 485 562 ;
C 251 ; WX 577 ; N ucircumflex ; B 41 0 485 538 ;
C 252 ; WX 577 ; N udieresis ; B 41 0 485 461 ;
C -1 ; WX 788 ; N glyph21 ; B 46 0 718 567 ;
C -1 ; WX 788 ; N glyph10 ; B 46 0 743 382 ;
C -1 ; WX 525 ; N glyph155 ; B 65 -106 413 515 ;
C -1 ; WX 446 ; N glyph156 ; B 65 -106 341 348 ;
C -1 ; WX 104 ; N glyph46 ; B 0 0 0 0 ;
C -1 ; WX 683 ; N glyph39 ; B 98 210 587 224 ;
C -1 ; WX 367 ; N glyph108 ; B 46 210 322 224 ;
C -1 ; WX 525 ; N glyph55 ; B -8 210 533 224 ;
C -1 ; WX 183 ; N glyph98 ; B 71 369 139 514 ;
C -1 ; WX 183 ; N glyph24 ; B 71 369 139 513 ;
C -1 ; WX 393 ; N glyph23 ; B 71 369 322 567 ;
C -1 ; WX 393 ; N glyph38 ; B 71 368 322 567 ;
C -1 ; WX 367 ; N glyph73 ; B 46 79 322 146 ;
C -1 ; WX 500 ; N .notdef ; B 50 0 450 491 ;
EndCharMetrics
EndFontMetrics
