<?xml version="1.0" encoding="UTF-8"?>
<glyph name="u" format="1">
  <advance width="578"/>
  <unicode hex="0075"/>
  <outline>
    <contour>
      <point x="209" y="29" type="line"/>
      <point x="289" y="9" type="line"/>
      <point x="329" y="29" type="line"/>
    </contour>
    <contour>
      <point x="275" y="43" type="line"/>
      <point x="246" y="37" type="line"/>
      <point x="304" y="37" type="line"/>
    </contour>
    <contour>
      <point x="412" y="75" type="line"/>
      <point x="378" y="58" type="line"/>
      <point x="351" y="31" type="line"/>
      <point x="351" y="30" type="line"/>
      <point x="350" y="30" type="line"/>
      <point x="349" y="30" type="line"/>
      <point x="349" y="29" type="line"/>
      <point x="308" y="9" type="line"/>
      <point x="318" y="9" type="line"/>
      <point x="374" y="36" type="line"/>
    </contour>
    <contour>
      <point x="150" y="101" type="line"/>
      <point x="150" y="64" type="line"/>
      <point x="176" y="37" type="line"/>
      <point x="198" y="32" type="line"/>
      <point x="170" y="59" type="line"/>
      <point x="169" y="60" type="line"/>
    </contour>
    <contour>
      <point x="459" y="110" type="line"/>
      <point x="439" y="89" type="line"/>
      <point x="439" y="9" type="line"/>
      <point x="459" y="9" type="line"/>
    </contour>
    <contour>
      <point x="430" y="110" type="line"/>
      <point x="398" y="78" type="line"/>
      <point x="430" y="94" type="line"/>
    </contour>
    <contour>
      <point x="430" y="160" type="line"/>
      <point x="409" y="118" type="line"/>
      <point x="408" y="117" type="line"/>
      <point x="351" y="59" type="line"/>
      <point x="350" y="58"/>
      <point x="349" y="58" type="curve" smooth="yes"/>
      <point x="297" y="47" type="line"/>
      <point x="346" y="37" type="line"/>
      <point x="373" y="65" type="line"/>
      <point x="374" y="66" type="line"/>
      <point x="430" y="122" type="line"/>
    </contour>
    <contour>
      <point x="468" y="405" type="line"/>
      <point x="468" y="121" type="line"/>
      <point x="468" y="120" type="line"/>
      <point x="468" y="9" type="line"/>
      <point x="487" y="9" type="line"/>
      <point x="487" y="405" type="line"/>
    </contour>
    <contour>
      <point x="439" y="405" type="line"/>
      <point x="439" y="178" type="line"/>
      <point x="439" y="121" type="line"/>
      <point x="439" y="120" type="line"/>
      <point x="439" y="101" type="line"/>
      <point x="459" y="122" type="line"/>
      <point x="459" y="405" type="line"/>
    </contour>
    <contour>
      <point x="150" y="405" type="line"/>
      <point x="150" y="121" type="line"/>
      <point x="177" y="65" type="line"/>
      <point x="204" y="37" type="line"/>
      <point x="253" y="47" type="line"/>
      <point x="201" y="58" type="line" smooth="yes"/>
      <point x="200" y="58"/>
      <point x="199" y="59"/>
      <point x="199" y="60" type="curve" smooth="yes"/>
      <point x="169" y="118" type="line"/>
      <point x="169" y="120" type="line"/>
      <point x="169" y="405" type="line"/>
    </contour>
    <contour>
      <point x="120" y="405" type="line"/>
      <point x="120" y="121" type="line"/>
      <point x="148" y="36" type="line"/>
      <point x="204" y="9" type="line"/>
      <point x="254" y="9" type="line"/>
      <point x="173" y="29" type="line" smooth="yes"/>
      <point x="172" y="29"/>
      <point x="170" y="30" type="line"/>
      <point x="142" y="59" type="line" smooth="yes"/>
      <point x="141" y="60"/>
      <point x="141" y="62"/>
      <point x="141" y="63" type="curve" smooth="yes"/>
      <point x="141" y="120" type="line"/>
      <point x="141" y="405" type="line"/>
    </contour>
    <contour>
      <point x="116" y="414" type="line"/>
      <point x="117" y="414" type="line"/>
      <point x="144" y="414" type="line"/>
      <point x="145" y="414" type="line"/>
      <point x="174" y="414" type="line" smooth="yes"/>
      <point x="176" y="414"/>
      <point x="178" y="411"/>
      <point x="178" y="409" type="curve" smooth="yes"/>
      <point x="178" y="121" type="line"/>
      <point x="206" y="66" type="line"/>
      <point x="275" y="52" type="line"/>
      <point x="345" y="66" type="line"/>
      <point x="402" y="122" type="line"/>
      <point x="430" y="179" type="line"/>
      <point x="430" y="409" type="line"/>
      <point x="430" y="411" type="line"/>
      <point x="431" y="412" type="line"/>
      <point x="431" y="414" type="line"/>
      <point x="432" y="414" type="line"/>
      <point x="433" y="414" type="line"/>
      <point x="434" y="414" type="line"/>
      <point x="463" y="414" type="line"/>
      <point x="464" y="414" type="line"/>
      <point x="492" y="414" type="line" smooth="yes"/>
      <point x="494" y="414"/>
      <point x="496" y="411"/>
      <point x="496" y="409" type="curve" smooth="yes"/>
      <point x="496" y="4" type="line"/>
      <point x="496" y="2" type="line"/>
      <point x="496" y="1" type="line"/>
      <point x="495" y="1" type="line"/>
      <point x="494" y="0" type="line"/>
      <point x="493" y="0" type="line"/>
      <point x="492" y="0" type="line"/>
      <point x="464" y="0" type="line"/>
      <point x="463" y="0" type="line"/>
      <point x="462" y="0" type="line"/>
      <point x="434" y="0" type="line" smooth="yes"/>
      <point x="432" y="0"/>
      <point x="430" y="2"/>
      <point x="430" y="4" type="curve" smooth="yes"/>
      <point x="430" y="80" type="line"/>
      <point x="380" y="30" type="line"/>
      <point x="378" y="30" type="line"/>
      <point x="320" y="0" type="line"/>
      <point x="318" y="0" type="line"/>
      <point x="289" y="0" type="line"/>
      <point x="202" y="0" type="line"/>
      <point x="200" y="0" type="line"/>
      <point x="143" y="30" type="line" smooth="yes"/>
      <point x="142" y="30"/>
      <point x="141" y="31"/>
      <point x="141" y="32" type="curve" smooth="yes"/>
      <point x="112" y="119" type="line"/>
      <point x="111" y="120" type="line"/>
      <point x="111" y="409" type="line"/>
      <point x="112" y="411" type="line"/>
      <point x="112" y="412" type="line"/>
      <point x="113" y="412" type="line"/>
      <point x="113" y="414" type="line"/>
      <point x="114" y="414" type="line"/>
    </contour>
  </outline>
  <lib>
    <dict>
      <key>com.fontlab.hintData</key>
      <dict>
        <key>hhints</key>
        <array>
          <dict>
            <key>position</key>
            <integer>0</integer>
            <key>width</key>
            <integer>9</integer>
          </dict>
          <dict>
            <key>position</key>
            <integer>29</integer>
            <key>width</key>
            <integer>9</integer>
          </dict>
          <dict>
            <key>position</key>
            <integer>405</integer>
            <key>width</key>
            <integer>9</integer>
          </dict>
        </array>
        <key>vhints</key>
        <array>
          <dict>
            <key>position</key>
            <integer>111</integer>
            <key>width</key>
            <integer>9</integer>
          </dict>
          <dict>
            <key>position</key>
            <integer>141</integer>
            <key>width</key>
            <integer>9</integer>
          </dict>
          <dict>
            <key>position</key>
            <integer>169</integer>
            <key>width</key>
            <integer>9</integer>
          </dict>
          <dict>
            <key>position</key>
            <integer>430</integer>
            <key>width</key>
            <integer>9</integer>
          </dict>
          <dict>
            <key>position</key>
            <integer>459</integer>
            <key>width</key>
            <integer>9</integer>
          </dict>
          <dict>
            <key>position</key>
            <integer>487</integer>
            <key>width</key>
            <integer>9</integer>
          </dict>
        </array>
      </dict>
    </dict>
  </lib>
</glyph>
