<svg xmlns:dc="http://purl.org/dc/elements/1.1/" xmlns:cc="http://creativecommons.org/ns#" xmlns:rdf="http://www.w3.org/1999/02/22-rdf-syntax-ns#" xmlns:svg="http://www.w3.org/2000/svg" xmlns="http://www.w3.org/2000/svg" xmlns:sodipodi="http://sodipodi.sourceforge.net/DTD/sodipodi-0.dtd" xmlns:inkscape="http://www.inkscape.org/namespaces/inkscape" data-dec="52" id="dec_67" width="17" height="40" version="1.1" sodipodi:docname="52.svg" inkscape:version="0.92.3 (2405546, 2018-03-11)">
  <metadata id="metadata9">
    <rdf:RDF>
      <cc:Work rdf:about="">
        <dc:format>image/svg+xml</dc:format>
        <dc:type rdf:resource="http://purl.org/dc/dcmitype/StillImage"/>
        <dc:title/>
      </cc:Work>
    </rdf:RDF>
  </metadata>
  <defs id="defs7"/>
  <sodipodi:namedview pagecolor="#ffffff" bordercolor="#666666" borderopacity="1" objecttolerance="10" gridtolerance="10" guidetolerance="10" inkscape:pageopacity="0" inkscape:pageshadow="2" inkscape:window-width="1403" inkscape:window-height="872" id="namedview5" showgrid="true" inkscape:zoom="10.1125" inkscape:cx="14.742501" inkscape:cy="30.046891" inkscape:window-x="37" inkscape:window-y="0" inkscape:window-maximized="1" inkscape:current-layer="dec_67" showguides="true" inkscape:guide-bbox="true">
    <inkscape:grid type="xygrid" id="grid7"/>
    <sodipodi:guide position="11,32" orientation="0,1" id="guide869" inkscape:locked="false"/>
    <sodipodi:guide position="2,30" orientation="1,0" id="guide836" inkscape:locked="false"/>
    <sodipodi:guide position="15,25" orientation="1,0" id="guide838" inkscape:locked="false"/>
    <sodipodi:guide position="10,39" orientation="0,1" id="guide840" inkscape:locked="false"/>
    <sodipodi:guide position="11,18" orientation="0,1" id="guide842" inkscape:locked="false"/>
    <sodipodi:guide position="13,25" orientation="0,1" id="guide844" inkscape:locked="false"/>
  </sodipodi:namedview>
  <path id="path856" style="fill:none;fill-rule:evenodd;stroke:#000000;stroke-width:1px;stroke-linecap:round;stroke-linejoin:round;stroke-opacity:1" d="m 11,22 h 1 m 3,-6 V 15 M 12,1 2,16 M 15,15 H 3 m 12,1 H 2 m 9,6 V 3 m 1,19 V 1              " inkscape:connector-curvature="0" sodipodi:nodetypes="cccccccccccccc"/>
</svg>