<?xml version="1.0" encoding="UTF-8"?>
<glyph name="I" format="1">
  <advance width="231"/>
  <unicode hex="0049"/>
  <outline>
    <contour>
      <point x="116" y="696" type="curve" smooth="yes"/>
      <point x="140" y="696"/>
      <point x="160" y="676"/>
      <point x="160" y="652" type="curve" smooth="yes"/>
      <point x="160" y="44" type="line"/>
      <point x="160" y="43" type="line" smooth="yes"/>
      <point x="160" y="19"/>
      <point x="140" y="0"/>
      <point x="116" y="0" type="curve" smooth="yes"/>
      <point x="92" y="0"/>
      <point x="73" y="19"/>
      <point x="73" y="43" type="curve" smooth="yes"/>
      <point x="73" y="44" type="line"/>
      <point x="73" y="652" type="line" smooth="yes"/>
      <point x="73" y="675"/>
      <point x="93" y="696"/>
    </contour>
  </outline>
  <lib>
    <dict>
      <key>com.fontlab.hintData</key>
      <dict>
        <key>hhints</key>
        <array>
          <dict>
            <key>position</key>
            <integer>0</integer>
            <key>width</key>
            <integer>23</integer>
          </dict>
          <dict>
            <key>position</key>
            <integer>674</integer>
            <key>width</key>
            <integer>22</integer>
          </dict>
        </array>
        <key>vhints</key>
        <array>
          <dict>
            <key>position</key>
            <integer>73</integer>
            <key>width</key>
            <integer>87</integer>
          </dict>
        </array>
      </dict>
    </dict>
  </lib>
</glyph>
