<?xml version="1.0" encoding="UTF-8" standalone="no"?>
<svg
   xmlns:dc="http://purl.org/dc/elements/1.1/"
   xmlns:cc="http://creativecommons.org/ns#"
   xmlns:rdf="http://www.w3.org/1999/02/22-rdf-syntax-ns#"
   xmlns:svg="http://www.w3.org/2000/svg"
   xmlns="http://www.w3.org/2000/svg"
   xmlns:sodipodi="http://sodipodi.sourceforge.net/DTD/sodipodi-0.dtd"
   xmlns:inkscape="http://www.inkscape.org/namespaces/inkscape"
   data-dec="97"
   width="19"
   height="40"
   version="1.1"
   id="svg4"
   sodipodi:docname="97.svg"
   inkscape:version="0.92.4 5da689c313, 2019-01-14">
  <metadata
     id="metadata10">
    <rdf:RDF>
      <cc:Work
         rdf:about="">
        <dc:format>image/svg+xml</dc:format>
        <dc:type
           rdf:resource="http://purl.org/dc/dcmitype/StillImage" />
        <dc:title></dc:title>
      </cc:Work>
    </rdf:RDF>
  </metadata>
  <defs
     id="defs8" />
  <sodipodi:namedview
     pagecolor="#ffffff"
     bordercolor="#666666"
     borderopacity="1"
     objecttolerance="10"
     gridtolerance="10"
     guidetolerance="10"
     inkscape:pageopacity="0"
     inkscape:pageshadow="2"
     inkscape:window-width="1920"
     inkscape:window-height="1061"
     id="namedview6"
     showgrid="false"
     inkscape:zoom="5.9"
     inkscape:cx="9.5"
     inkscape:cy="20"
     inkscape:window-x="0"
     inkscape:window-y="19"
     inkscape:window-maximized="0"
     inkscape:current-layer="svg4" />
  <path
     style="color:#000000;font-style:normal;font-variant:normal;font-weight:normal;font-stretch:normal;font-size:medium;line-height:normal;font-family:sans-serif;font-variant-ligatures:normal;font-variant-position:normal;font-variant-caps:normal;font-variant-numeric:normal;font-variant-alternates:normal;font-feature-settings:normal;text-indent:0;text-align:start;text-decoration:none;text-decoration-line:none;text-decoration-style:solid;text-decoration-color:#000000;letter-spacing:normal;word-spacing:normal;text-transform:none;writing-mode:lr-tb;direction:ltr;text-orientation:mixed;dominant-baseline:auto;baseline-shift:baseline;text-anchor:start;white-space:normal;shape-padding:0;clip-rule:nonzero;display:inline;overflow:visible;visibility:visible;opacity:1;isolation:auto;mix-blend-mode:normal;color-interpolation:sRGB;color-interpolation-filters:linearRGB;solid-color:#000000;solid-opacity:1;vector-effect:none;fill:#000000;fill-opacity:1;fill-rule:nonzero;stroke:none;stroke-width:3;stroke-linecap:round;stroke-linejoin:round;stroke-miterlimit:4;stroke-dasharray:none;stroke-dashoffset:0;stroke-opacity:1;color-rendering:auto;image-rendering:auto;shape-rendering:auto;text-rendering:auto;enable-background:accumulate"
     d="M 8.3535156,9.5 6.8886719,10.232422 5.3105469,11.810547 4.5,14.244141 v 1.511718 l 0.8105469,2.433594 1.578125,1.578125 L 8.3535156,20.5 H 10.646484 L 12.111328,19.767578 13.5,18.378906 V 11.621094 L 12.111328,10.232422 10.646484,9.5 Z M 14.976562,6.4785156 A 1.50015,1.50015 0 0 1 16.5,8 v 2.808594 a 1.50015,1.50015 0 0 1 0,0.412109 v 7.564453 a 1.50015,1.50015 0 0 1 0,0.404297 V 22 a 1.50015,1.50015 0 0 1 -2.949219,0.402344 l -1.880859,0.939453 A 1.50015,1.50015 0 0 1 11,23.5 H 8 A 1.50015,1.50015 0 0 1 7.3300781,23.341797 l -2,-1 a 1.50015,1.50015 0 0 1 -0.390625,-0.28125 l -2,-2 A 1.50015,1.50015 0 0 1 2.5761719,19.474609 l -1,-3 A 1.50015,1.50015 0 0 1 1.5,16 v -2 a 1.50015,1.50015 0 0 1 0.076172,-0.474609 l 1,-3 A 1.50015,1.50015 0 0 1 2.9394531,9.9394531 l 2,-2 a 1.50015,1.50015 0 0 1 0.390625,-0.28125 l 2,-1 A 1.50015,1.50015 0 0 1 8,6.5 h 3 a 1.50015,1.50015 0 0 1 0.669922,0.1582031 l 1.878906,0.9394531 a 1.50015,1.50015 0 0 1 1.427734,-1.1191406 z"
     id="path2" />
</svg>
