<?xml version="1.0" encoding="UTF-8" standalone="no"?>
<svg
   xmlns:dc="http://purl.org/dc/elements/1.1/"
   xmlns:cc="http://creativecommons.org/ns#"
   xmlns:rdf="http://www.w3.org/1999/02/22-rdf-syntax-ns#"
   xmlns:svg="http://www.w3.org/2000/svg"
   xmlns="http://www.w3.org/2000/svg"
   xmlns:sodipodi="http://sodipodi.sourceforge.net/DTD/sodipodi-0.dtd"
   xmlns:inkscape="http://www.inkscape.org/namespaces/inkscape"
   data-dec="100"
   width="20"
   height="40"
   version="1.1"
   id="svg4"
   sodipodi:docname="100.svg"
   inkscape:version="0.92.4 (unknown)">
  <metadata
     id="metadata10">
    <rdf:RDF>
      <cc:Work
         rdf:about="">
        <dc:format>image/svg+xml</dc:format>
        <dc:type
           rdf:resource="http://purl.org/dc/dcmitype/StillImage" />
      </cc:Work>
    </rdf:RDF>
  </metadata>
  <defs
     id="defs8" />
  <sodipodi:namedview
     pagecolor="#ffffff"
     bordercolor="#666666"
     borderopacity="1"
     objecttolerance="10"
     gridtolerance="10"
     guidetolerance="10"
     inkscape:pageopacity="0"
     inkscape:pageshadow="2"
     inkscape:window-width="640"
     inkscape:window-height="480"
     id="namedview6"
     showgrid="false"
     inkscape:zoom="5.9"
     inkscape:cx="10"
     inkscape:cy="20"
     inkscape:window-x="0"
     inkscape:window-y="27"
     inkscape:window-maximized="0"
     inkscape:current-layer="svg4" />
  <path
     style="color:#000000;font-style:normal;font-variant:normal;font-weight:normal;font-stretch:normal;font-size:medium;line-height:normal;font-family:sans-serif;font-variant-ligatures:normal;font-variant-position:normal;font-variant-caps:normal;font-variant-numeric:normal;font-variant-alternates:normal;font-feature-settings:normal;text-indent:0;text-align:start;text-decoration:none;text-decoration-line:none;text-decoration-style:solid;text-decoration-color:#000000;letter-spacing:normal;word-spacing:normal;text-transform:none;writing-mode:lr-tb;direction:ltr;text-orientation:mixed;dominant-baseline:auto;baseline-shift:baseline;text-anchor:start;white-space:normal;shape-padding:0;clip-rule:nonzero;display:inline;overflow:visible;visibility:visible;opacity:1;isolation:auto;mix-blend-mode:normal;color-interpolation:sRGB;color-interpolation-filters:linearRGB;solid-color:#000000;solid-opacity:1;vector-effect:none;fill:#000000;fill-opacity:1;fill-rule:nonzero;stroke:none;stroke-width:0.30000001;stroke-linecap:round;stroke-linejoin:round;stroke-miterlimit:4;stroke-dasharray:none;stroke-dashoffset:0;stroke-opacity:1;color-rendering:auto;image-rendering:auto;shape-rendering:auto;text-rendering:auto;enable-background:accumulate"
     d="m 14.242188,19.546875 -3.175782,1.587891 A 0.15001501,0.15001501 0 0 1 11,21.150391 H 10.011719 9.9960938 8 a 0.15001501,0.15001501 0 0 1 -0.066406,-0.01563 l -1.1757813,-0.587891 0.3300781,0.330078 1.9472656,0.972656 h 1.9296878 l 1.947265,-0.972656 z m 1.607421,-0.185547 -0.699218,0.699219 v 1.789062 h 0.699218 z m -1,0 -1.74414,1.744141 a 0.15001501,0.15001501 0 0 1 -0.03906,0.0293 l -1.429687,0.714843 h 0.328125 l 1.947265,-0.972656 0.9375,-0.9375 z m 0,-2.435547 -0.707031,2.121094 a 0.15001501,0.15001501 0 0 1 -0.07617,0.08789 l -3.429687,1.714843 h 0.328125 l 3.884765,-1.943359 z m 0.300782,-6.564453 v 0.617188 a 0.15001501,0.15001501 0 0 1 0,0.0039 0.15001501,0.15001501 0 0 1 0.002,0.01172 0.15001501,0.15001501 0 0 1 0,0.002 0.15001501,0.15001501 0 0 1 -0.002,0.02734 v 2.96875 a 0.15001501,0.15001501 0 0 1 0,0.01562 v 1.980469 a 0.15001501,0.15001501 0 0 1 0,0.01563 v 2.96875 a 0.15001501,0.15001501 0 0 1 0.002,0.02539 0.15001501,0.15001501 0 0 1 0,0.0039 0.15001501,0.15001501 0 0 1 -0.002,0.01172 0.15001501,0.15001501 0 0 1 0,0.0039 v 0.621094 l 0.699218,-0.699219 V 11.060547 Z M 9.9882812,9.1621094 7.0800781,10.130859 6.1308594,11.080078 5.1503906,14.023438 v 1.953124 l 0.9804688,2.94336 0.9492187,0.949219 2.9082031,0.96875 3.8886718,-1.94336 0.972656,-2.917969 v -1.953124 l -0.972656,-2.917969 z m 0.6484378,-0.011719 3.429687,1.7148434 a 0.15001501,0.15001501 0 0 1 0.07617,0.08789 l 0.707031,2.121094 V 11.09375 L 10.964844,9.1503906 Z m -2.6015628,0 -1.9472656,0.9726564 -0.9570312,0.957031 -0.9804688,2.94336 v 1.953124 l 0.9804688,2.94336 0.9570312,0.957031 1.9472656,0.972656 H 9.0742188 L 6.953125,20.142578 a 0.15001501,0.15001501 0 0 1 -0.058594,-0.03711 l -1,-1 a 0.15001501,0.15001501 0 0 1 -0.037109,-0.05859 l -1,-3 A 0.15001501,0.15001501 0 0 1 4.8496094,16 v -2 a 0.15001501,0.15001501 0 0 1 0.00781,-0.04687 l 1,-3 a 0.15001501,0.15001501 0 0 1 0.037109,-0.05859 l 1,-0.9999998 A 0.15001501,0.15001501 0 0 1 6.953125,9.8574219 L 9.0742188,9.1503906 Z m 3.6015628,-1 1.429687,0.7148438 a 0.15001501,0.15001501 0 0 1 0.03906,0.029297 l 1.74414,1.7441408 v -0.578125 l -0.9375,-0.9375001 -1.947265,-0.9726563 z m -2.6015628,0 L 7.0878906,9.1230469 6.7578125,9.453125 7.9335938,8.8652344 A 0.15001501,0.15001501 0 0 1 8,8.8496094 H 9.9941406 10.009766 11 a 0.15001501,0.15001501 0 0 1 0.06641,0.015625 L 14.242188,10.453125 12.912109,9.1230469 10.964844,8.1503906 Z m -1,0 -1.9472656,0.9726563 -1.9570312,1.9570311 -0.9804688,2.94336 v 1.953124 l 0.9804688,2.94336 1.9570312,1.957031 1.9472656,0.972656 h 0.328125 L 6.9335938,21.134766 a 0.15001501,0.15001501 0 0 1 -0.039063,-0.0293 L 5.9042969,20.115234 a 0.15001501,0.15001501 0 0 1 -0.00977,-0.0098 l -1,-1 a 0.15001501,0.15001501 0 0 1 -0.015625,-0.01758 0.15001501,0.15001501 0 0 1 -0.00977,-0.01367 0.15001501,0.15001501 0 0 1 -0.00586,-0.01367 0.15001501,0.15001501 0 0 1 -0.00586,-0.01367 l -1,-3 a 0.15001501,0.15001501 0 0 1 0,-0.002 A 0.15001501,0.15001501 0 0 1 3.8496094,16 v -2 a 0.15001501,0.15001501 0 0 1 0,-0.0039 0.15001501,0.15001501 0 0 1 0.00781,-0.04297 l 1,-3 a 0.15001501,0.15001501 0 0 1 0.00977,-0.02344 0.15001501,0.15001501 0 0 1 0.00781,-0.01172 0.15001501,0.15001501 0 0 1 0.019531,-0.02344 l 1,-0.9999998 a 0.15001501,0.15001501 0 0 1 0.013672,-0.011719 L 6.8945312,8.8945312 a 0.15001501,0.15001501 0 0 1 0.039063,-0.029297 L 8.3632812,8.1503906 Z m 8.1152348,-7 v 9.8320314 a 0.15001501,0.15001501 0 0 1 0,0.0293 v 7.972656 a 0.15001501,0.15001501 0 0 1 0,0.0293 v 2.835937 h 0.699218 V 1.1503906 Z m -1,0 v 8.7890625 l 0.699218,0.6992189 V 1.1503906 Z M 14.998047,0.84765625 a 0.15001501,0.15001501 0 0 1 0.0293,0.001953 h 0.955078 0.002 a 0.15001501,0.15001501 0 0 1 0.04297,0 H 17 A 0.15001501,0.15001501 0 0 1 17.150391,1 v 20.982422 a 0.15001501,0.15001501 0 0 1 -0.0098,0.07227 0.15001501,0.15001501 0 0 1 0,0.002 0.15001501,0.15001501 0 0 1 -0.0059,0.01172 0.15001501,0.15001501 0 0 1 0,0.002 0.15001501,0.15001501 0 0 1 -0.01563,0.02344 0.15001501,0.15001501 0 0 1 0,0.002 0.15001501,0.15001501 0 0 1 -0.0059,0.0039 0.15001501,0.15001501 0 0 1 -0.06836,0.04492 0.15001501,0.15001501 0 0 1 -0.02734,0.0059 0.15001501,0.15001501 0 0 1 -0.002,0 0.15001501,0.15001501 0 0 1 -0.04297,0 h -0.955078 a 0.15001501,0.15001501 0 0 1 -0.002,0 0.15001501,0.15001501 0 0 1 -0.04297,0 H 15 A 0.15001501,0.15001501 0 0 1 14.849609,22 v -1.638672 l -0.74414,0.744141 a 0.15001501,0.15001501 0 0 1 -0.03906,0.0293 l -2,1 A 0.15001501,0.15001501 0 0 1 12,22.150391 H 11 8.9902344 8 a 0.15001501,0.15001501 0 0 1 -0.066406,-0.01563 l -2,-1 a 0.15001501,0.15001501 0 0 1 -0.039063,-0.0293 l -2,-2 a 0.15001501,0.15001501 0 0 1 -0.037109,-0.05859 l -1,-3 A 0.15001501,0.15001501 0 0 1 2.8496094,16 v -2 a 0.15001501,0.15001501 0 0 1 0.00781,-0.04687 l 1,-3 a 0.15001501,0.15001501 0 0 1 0.037109,-0.05859 l 2,-1.9999998 a 0.15001501,0.15001501 0 0 1 0.039063,-0.029297 l 2,-1 A 0.15001501,0.15001501 0 0 1 8,7.8496094 h 1 2 0.0098 H 12 a 0.15001501,0.15001501 0 0 1 0.06641,0.015625 l 2,1 a 0.15001501,0.15001501 0 0 1 0.03906,0.029297 l 0.74414,0.7441407 V 1.0175781 a 0.15001501,0.15001501 0 0 1 0.0098,-0.0722656 0.15001501,0.15001501 0 0 1 0,-0.001953 0.15001501,0.15001501 0 0 1 0.0059,-0.0117188 0.15001501,0.15001501 0 0 1 0,-0.001953 0.15001501,0.15001501 0 0 1 0.0078,-0.0117188 0.15001501,0.15001501 0 0 1 0.0078,-0.0136719 0.15001501,0.15001501 0 0 1 0.0059,-0.003906 0.15001501,0.15001501 0 0 1 0.02734,-0.0253906 0.15001501,0.15001501 0 0 1 0.01172,-0.007813 0.15001501,0.15001501 0 0 1 0.0293,-0.0117188 0.15001501,0.15001501 0 0 1 0.02734,-0.005859 0.15001501,0.15001501 0 0 1 0.002,0 0.15001501,0.15001501 0 0 1 0.01367,-0.001953 z"
     id="path2" />
</svg>
