<?xml version="1.0" encoding="UTF-8"?>
<glyph name="one" format="1">
  <advance width="433"/>
  <unicode hex="0031"/>
  <outline>
    <contour>
      <point x="231" y="652" type="curve" smooth="yes"/>
      <point x="233" y="652"/>
      <point x="238" y="651"/>
      <point x="240" y="650" type="curve" smooth="yes"/>
      <point x="242" y="649" type="line"/>
      <point x="243" y="648" type="line" smooth="yes"/>
      <point x="249" y="645"/>
      <point x="253" y="637"/>
      <point x="253" y="630" type="curve" smooth="yes"/>
      <point x="253" y="627" type="line"/>
      <point x="253" y="575" type="line" smooth="yes"/>
      <point x="253" y="574"/>
      <point x="254" y="573"/>
      <point x="254" y="572" type="curve" smooth="yes"/>
      <point x="254" y="571"/>
      <point x="253" y="570"/>
      <point x="253" y="569" type="curve" smooth="yes"/>
      <point x="253" y="89" type="line"/>
      <point x="287" y="55" type="line"/>
      <point x="322" y="44" type="line"/>
      <point x="376" y="44" type="line" smooth="yes"/>
      <point x="388" y="44"/>
      <point x="398" y="34"/>
      <point x="398" y="22" type="curve" smooth="yes"/>
      <point x="398" y="10"/>
      <point x="388" y="0"/>
      <point x="376" y="0" type="curve" smooth="yes"/>
      <point x="321" y="0" type="line"/>
      <point x="319" y="0" type="line"/>
      <point x="317" y="0" type="line"/>
      <point x="293" y="0" type="line"/>
      <point x="289" y="0" type="line"/>
      <point x="287" y="0" type="line"/>
      <point x="235" y="0" type="line"/>
      <point x="232" y="0" type="line"/>
      <point x="228" y="0" type="line"/>
      <point x="206" y="0" type="line"/>
      <point x="202" y="0" type="line"/>
      <point x="199" y="0" type="line"/>
      <point x="147" y="0" type="line"/>
      <point x="145" y="0" type="line"/>
      <point x="142" y="0" type="line"/>
      <point x="118" y="0" type="line"/>
      <point x="116" y="0" type="line"/>
      <point x="113" y="0" type="line"/>
      <point x="58" y="0" type="line"/>
      <point x="57" y="0" type="line" smooth="yes"/>
      <point x="45" y="0"/>
      <point x="36" y="10"/>
      <point x="36" y="22" type="curve" smooth="yes"/>
      <point x="36" y="34"/>
      <point x="45" y="44"/>
      <point x="57" y="44" type="curve" smooth="yes"/>
      <point x="58" y="44" type="line"/>
      <point x="112" y="44" type="line"/>
      <point x="147" y="55" type="line"/>
      <point x="180" y="89" type="line"/>
      <point x="180" y="534" type="line"/>
      <point x="165" y="550" type="line"/>
      <point x="147" y="550" type="line"/>
      <point x="144" y="550" type="line"/>
      <point x="142" y="550" type="line"/>
      <point x="87" y="550" type="line" smooth="yes"/>
      <point x="75" y="550"/>
      <point x="65" y="560"/>
      <point x="65" y="572" type="curve" smooth="yes"/>
      <point x="65" y="582"/>
      <point x="72" y="591"/>
      <point x="81" y="593" type="curve" smooth="yes"/>
      <point x="170" y="615" type="line"/>
      <point x="217" y="647" type="line" smooth="yes"/>
      <point x="220" y="650"/>
      <point x="227" y="652"/>
    </contour>
  </outline>
  <lib>
    <dict>
      <key>com.fontlab.hintData</key>
      <dict>
        <key>hhints</key>
        <array>
          <dict>
            <key>position</key>
            <integer>0</integer>
            <key>width</key>
            <integer>44</integer>
          </dict>
          <dict>
            <key>position</key>
            <integer>550</integer>
            <key>width</key>
            <integer>43</integer>
          </dict>
          <dict>
            <key>position</key>
            <integer>630</integer>
            <key>width</key>
            <integer>22</integer>
          </dict>
        </array>
        <key>vhints</key>
        <array>
          <dict>
            <key>position</key>
            <integer>180</integer>
            <key>width</key>
            <integer>73</integer>
          </dict>
        </array>
      </dict>
    </dict>
  </lib>
</glyph>
