<?xml version="1.0" encoding="UTF-8" standalone="no"?>
<svg
   xmlns:dc="http://purl.org/dc/elements/1.1/"
   xmlns:cc="http://creativecommons.org/ns#"
   xmlns:rdf="http://www.w3.org/1999/02/22-rdf-syntax-ns#"
   xmlns:svg="http://www.w3.org/2000/svg"
   xmlns="http://www.w3.org/2000/svg"
   xmlns:sodipodi="http://sodipodi.sourceforge.net/DTD/sodipodi-0.dtd"
   xmlns:inkscape="http://www.inkscape.org/namespaces/inkscape"
   data-dec="46"
   width="12"
   height="40"
   version="1.1"
   id="svg4"
   sodipodi:docname="46.svg"
   inkscape:version="0.92.4 (unknown)">
  <metadata
     id="metadata10">
    <rdf:RDF>
      <cc:Work
         rdf:about="">
        <dc:format>image/svg+xml</dc:format>
        <dc:type
           rdf:resource="http://purl.org/dc/dcmitype/StillImage" />
      </cc:Work>
    </rdf:RDF>
  </metadata>
  <defs
     id="defs8" />
  <sodipodi:namedview
     pagecolor="#ffffff"
     bordercolor="#666666"
     borderopacity="1"
     objecttolerance="10"
     gridtolerance="10"
     guidetolerance="10"
     inkscape:pageopacity="0"
     inkscape:pageshadow="2"
     inkscape:window-width="615"
     inkscape:window-height="417"
     id="namedview6"
     showgrid="false"
     inkscape:zoom="5.9"
     inkscape:cx="6"
     inkscape:cy="20"
     inkscape:window-x="0"
     inkscape:window-y="27"
     inkscape:window-maximized="0"
     inkscape:current-layer="svg4" />
  <path
     style="color:#000000;font-style:normal;font-variant:normal;font-weight:normal;font-stretch:normal;font-size:medium;line-height:normal;font-family:sans-serif;font-variant-ligatures:normal;font-variant-position:normal;font-variant-caps:normal;font-variant-numeric:normal;font-variant-alternates:normal;font-feature-settings:normal;text-indent:0;text-align:start;text-decoration:none;text-decoration-line:none;text-decoration-style:solid;text-decoration-color:#000000;letter-spacing:normal;word-spacing:normal;text-transform:none;writing-mode:lr-tb;direction:ltr;text-orientation:mixed;dominant-baseline:auto;baseline-shift:baseline;text-anchor:start;white-space:normal;shape-padding:0;clip-rule:nonzero;display:inline;overflow:visible;visibility:visible;opacity:1;isolation:auto;mix-blend-mode:normal;color-interpolation:sRGB;color-interpolation-filters:linearRGB;solid-color:#000000;solid-opacity:1;vector-effect:none;fill:#013272;fill-opacity:1;fill-rule:nonzero;stroke:none;stroke-width:0.30000001;stroke-linecap:round;stroke-linejoin:round;stroke-miterlimit:4;stroke-dasharray:none;stroke-dashoffset:0;stroke-opacity:1;color-rendering:auto;image-rendering:auto;shape-rendering:auto;text-rendering:auto;enable-background:accumulate"
     d="m 5.1503906,20.150391 v 0.699218 H 5.8496094 V 20.150391 Z M 4.9980469,19.847656 a 0.15001501,0.15001501 0 0 1 0.029297,0.002 H 6 A 0.15001501,0.15001501 0 0 1 6.1503906,20 v 1 A 0.15001501,0.15001501 0 0 1 6,21.150391 H 5 A 0.15001501,0.15001501 0 0 1 4.8496094,21 v -0.982422 a 0.15001501,0.15001501 0 0 1 0.00977,-0.07227 0.15001501,0.15001501 0 0 1 0,-0.002 0.15001501,0.15001501 0 0 1 0.00586,-0.01172 0.15001501,0.15001501 0 0 1 0,-0.002 0.15001501,0.15001501 0 0 1 0.015625,-0.02344 0.15001501,0.15001501 0 0 1 0,-0.002 0.15001501,0.15001501 0 0 1 0.00586,-0.0039 0.15001501,0.15001501 0 0 1 0.068359,-0.04492 0.15001501,0.15001501 0 0 1 0.027344,-0.0059 0.15001501,0.15001501 0 0 1 0.00195,0 0.15001501,0.15001501 0 0 1 0.013672,-0.002 z m 0.0625,-0.697265 -0.9101563,0.912109 v 0.875 L 5.0625,21.849609 h 0.875 L 6.8496094,20.9375 v -0.875 L 5.9375,19.150391 Z m -0.064453,-0.302735 a 0.15001501,0.15001501 0 0 1 0.015625,0.002 H 6 a 0.15001501,0.15001501 0 0 1 0.1054688,0.04492 l 1,1 A 0.15001501,0.15001501 0 0 1 7.1503906,20 v 1 a 0.15001501,0.15001501 0 0 1 -0.044922,0.105469 l -1,1 A 0.15001501,0.15001501 0 0 1 6,22.150391 H 5 a 0.15001501,0.15001501 0 0 1 -0.1054688,-0.04492 l -1,-1 A 0.15001501,0.15001501 0 0 1 3.8496094,21 v -1 a 0.15001501,0.15001501 0 0 1 0.044922,-0.105469 l 0.9785157,-0.976562 a 0.15001501,0.15001501 0 0 1 0.00195,-0.0039 0.15001501,0.15001501 0 0 1 0.017578,-0.01953 0.15001501,0.15001501 0 0 1 0.00977,-0.0078 0.15001501,0.15001501 0 0 1 0.023437,-0.01758 0.15001501,0.15001501 0 0 1 0.00195,-0.002 0.15001501,0.15001501 0 0 1 0.00586,-0.002 0.15001501,0.15001501 0 0 1 0.025391,-0.0098 0.15001501,0.15001501 0 0 1 0.023437,-0.0059 0.15001501,0.15001501 0 0 1 0.00195,0 0.15001501,0.15001501 0 0 1 0.011719,-0.002 z"
     id="path2" />
</svg>
