<?xml version="1.0" encoding="UTF-8" standalone="no"?>
<svg
   xmlns:dc="http://purl.org/dc/elements/1.1/"
   xmlns:cc="http://creativecommons.org/ns#"
   xmlns:rdf="http://www.w3.org/1999/02/22-rdf-syntax-ns#"
   xmlns:svg="http://www.w3.org/2000/svg"
   xmlns="http://www.w3.org/2000/svg"
   xmlns:sodipodi="http://sodipodi.sourceforge.net/DTD/sodipodi-0.dtd"
   xmlns:inkscape="http://www.inkscape.org/namespaces/inkscape"
   data-dec="111"
   width="18"
   height="40"
   version="1.1"
   id="svg4"
   sodipodi:docname="111.svg"
   inkscape:version="0.92.4 (unknown)">
  <metadata
     id="metadata10">
    <rdf:RDF>
      <cc:Work
         rdf:about="">
        <dc:format>image/svg+xml</dc:format>
        <dc:type
           rdf:resource="http://purl.org/dc/dcmitype/StillImage" />
      </cc:Work>
    </rdf:RDF>
  </metadata>
  <defs
     id="defs8" />
  <sodipodi:namedview
     pagecolor="#ffffff"
     bordercolor="#666666"
     borderopacity="1"
     objecttolerance="10"
     gridtolerance="10"
     guidetolerance="10"
     inkscape:pageopacity="0"
     inkscape:pageshadow="2"
     inkscape:window-width="640"
     inkscape:window-height="480"
     id="namedview6"
     showgrid="false"
     inkscape:zoom="5.9"
     inkscape:cx="9"
     inkscape:cy="20"
     inkscape:window-x="0"
     inkscape:window-y="27"
     inkscape:window-maximized="0"
     inkscape:current-layer="svg4" />
  <path
     style="color:#000000;font-style:normal;font-variant:normal;font-weight:normal;font-stretch:normal;font-size:medium;line-height:normal;font-family:sans-serif;font-variant-ligatures:normal;font-variant-position:normal;font-variant-caps:normal;font-variant-numeric:normal;font-variant-alternates:normal;font-feature-settings:normal;text-indent:0;text-align:start;text-decoration:none;text-decoration-line:none;text-decoration-style:solid;text-decoration-color:#000000;letter-spacing:normal;word-spacing:normal;text-transform:none;writing-mode:lr-tb;direction:ltr;text-orientation:mixed;dominant-baseline:auto;baseline-shift:baseline;text-anchor:start;white-space:normal;shape-padding:0;clip-rule:nonzero;display:inline;overflow:visible;visibility:visible;opacity:1;isolation:auto;mix-blend-mode:normal;color-interpolation:sRGB;color-interpolation-filters:linearRGB;solid-color:#000000;solid-opacity:1;vector-effect:none;fill:#013272;fill-opacity:1;fill-rule:nonzero;stroke:none;stroke-width:2;stroke-linecap:round;stroke-linejoin:round;stroke-miterlimit:4;stroke-dasharray:none;stroke-dashoffset:0;stroke-opacity:1;color-rendering:auto;image-rendering:auto;shape-rendering:auto;text-rendering:auto;enable-background:accumulate"
     d="M 8.1640625,9 5.5410156,9.875 3.875,11.541016 3,14.162109 v 1.675782 L 3.875,18.458984 5.5410156,20.125 8.1621094,21 H 9.8378906 L 12.458984,20.125 14.125,18.458984 15,15.837891 V 14.162109 L 14.125,11.541016 12.458984,9.875 9.8378906,9 Z M 8.046875,6.9960938 A 1.0001,1.0001 0 0 1 8.0976562,7 H 10 a 1.0001,1.0001 0 0 1 0.316406,0.050781 l 3,1 a 1.0001,1.0001 0 0 1 0.390625,0.2421876 l 2,2.0000002 a 1.0001,1.0001 0 0 1 0.242188,0.390625 l 1,3 A 1.0001,1.0001 0 0 1 17,14 v 2 a 1.0001,1.0001 0 0 1 -0.05078,0.316406 l -1,3 a 1.0001,1.0001 0 0 1 -0.242188,0.390625 l -2,2 a 1.0001,1.0001 0 0 1 -0.390625,0.242188 l -3,1 A 1.0001,1.0001 0 0 1 10,23 H 8 a 1.0001,1.0001 0 0 1 -0.3164062,-0.05078 l -3,-1 a 1.0001,1.0001 0 0 1 -0.390625,-0.242188 l -2,-2 A 1.0001,1.0001 0 0 1 2.0507812,19.316406 l -1,-3 A 1.0001,1.0001 0 0 1 1,16 v -2 a 1.0001,1.0001 0 0 1 0.050781,-0.316406 l 1,-3 a 1.0001,1.0001 0 0 1 0.2421876,-0.390625 l 2,-2.0000002 A 1.0001,1.0001 0 0 1 4.6835938,8.0507812 L 7.5996094,7.078125 a 1.0001,1.0001 0 0 1 0.00977,-0.00391 1.0001,1.0001 0 0 1 0.2207031,-0.060547 1.0001,1.0001 0 0 1 0.070312,-0.00977 1.0001,1.0001 0 0 1 0.1464844,-0.00781 z"
     id="path2" />
</svg>
