<?xml version="1.0" encoding="UTF-8" standalone="no"?>
<svg
   xmlns:dc="http://purl.org/dc/elements/1.1/"
   xmlns:cc="http://creativecommons.org/ns#"
   xmlns:rdf="http://www.w3.org/1999/02/22-rdf-syntax-ns#"
   xmlns:svg="http://www.w3.org/2000/svg"
   xmlns="http://www.w3.org/2000/svg"
   xmlns:sodipodi="http://sodipodi.sourceforge.net/DTD/sodipodi-0.dtd"
   xmlns:inkscape="http://www.inkscape.org/namespaces/inkscape"
   data-dec="37"
   width="24"
   height="40"
   version="1.1"
   id="svg4"
   sodipodi:docname="37.svg"
   inkscape:version="0.92.4 5da689c313, 2019-01-14">
  <metadata
     id="metadata10">
    <rdf:RDF>
      <cc:Work
         rdf:about="">
        <dc:format>image/svg+xml</dc:format>
        <dc:type
           rdf:resource="http://purl.org/dc/dcmitype/StillImage" />
        <dc:title></dc:title>
      </cc:Work>
    </rdf:RDF>
  </metadata>
  <defs
     id="defs8" />
  <sodipodi:namedview
     pagecolor="#ffffff"
     bordercolor="#666666"
     borderopacity="1"
     objecttolerance="10"
     gridtolerance="10"
     guidetolerance="10"
     inkscape:pageopacity="0"
     inkscape:pageshadow="2"
     inkscape:window-width="1920"
     inkscape:window-height="1043"
     id="namedview6"
     showgrid="false"
     inkscape:zoom="5.9"
     inkscape:cx="12"
     inkscape:cy="20"
     inkscape:window-x="0"
     inkscape:window-y="37"
     inkscape:window-maximized="0"
     inkscape:current-layer="svg4" />
  <path
     style="color:#000000;font-style:normal;font-variant:normal;font-weight:normal;font-stretch:normal;font-size:medium;line-height:normal;font-family:sans-serif;font-variant-ligatures:normal;font-variant-position:normal;font-variant-caps:normal;font-variant-numeric:normal;font-variant-alternates:normal;font-feature-settings:normal;text-indent:0;text-align:start;text-decoration:none;text-decoration-line:none;text-decoration-style:solid;text-decoration-color:#000000;letter-spacing:normal;word-spacing:normal;text-transform:none;writing-mode:lr-tb;direction:ltr;text-orientation:mixed;dominant-baseline:auto;baseline-shift:baseline;text-anchor:start;white-space:normal;shape-padding:0;clip-rule:nonzero;display:inline;overflow:visible;visibility:visible;opacity:1;isolation:auto;mix-blend-mode:normal;color-interpolation:sRGB;color-interpolation-filters:linearRGB;solid-color:#000000;solid-opacity:1;vector-effect:none;fill:#000000;fill-opacity:1;fill-rule:nonzero;stroke:none;stroke-width:1;stroke-linecap:round;stroke-linejoin:round;stroke-miterlimit:4;stroke-dasharray:none;stroke-dashoffset:0;stroke-opacity:1;color-rendering:auto;image-rendering:auto;shape-rendering:auto;text-rendering:auto;enable-background:accumulate"
     d="M 17.117188,15.5 15.373047,16.373047 14.5,18.117188 v 1.675781 L 16.207031,21.5 h 1.675781 L 19.626953,20.626953 20.5,18.882812 V 17.207031 L 18.792969,15.5 Z m -0.115235,-1.003906 a 0.50005,0.50005 0 0 1 0.0625,0.0039 H 19 a 0.50005,0.50005 0 0 1 0.353516,0.146484 l 2,2 A 0.50005,0.50005 0 0 1 21.5,17 v 2 a 0.50005,0.50005 0 0 1 -0.05273,0.222656 l -1,2 a 0.50005,0.50005 0 0 1 -0.22461,0.22461 l -2,1 A 0.50005,0.50005 0 0 1 18,22.5 h -2 a 0.50005,0.50005 0 0 1 -0.353516,-0.146484 l -2,-2 A 0.50005,0.50005 0 0 1 13.5,20 v -2 a 0.50005,0.50005 0 0 1 0.05273,-0.222656 l 1,-2 a 0.50005,0.50005 0 0 1 0.22461,-0.22461 l 1.939453,-0.96875 a 0.50005,0.50005 0 0 1 0.0098,-0.0059 0.50005,0.50005 0 0 1 0.128907,-0.05859 0.50005,0.50005 0 0 1 0.05469,-0.01367 0.50005,0.50005 0 0 1 0.0918,-0.0098 z M 6.1171875,1.5 4.3730469,2.3730469 3.5,4.1171875 V 5.7929688 L 5.2070312,7.5 H 6.8828125 L 8.6269531,6.6269531 9.5,4.8828125 V 3.2070312 L 7.7929688,1.5 Z M 7.9941406,0.49414062 A 0.50005,0.50005 0 0 1 8.2558594,0.5703125 L 10.191406,1.5371094 13.082031,2.5 h 2.835938 l 2.890625,-0.9628906 1.923828,-0.96289065 a 0.50005,0.50005 0 0 1 0.417969,-0.0566406 0.50005,0.50005 0 0 1 0.173828,0.0917969 0.50005,0.50005 0 0 1 0.002,0.001953 0.50005,0.50005 0 0 1 0.03516,0.0332031 0.50005,0.50005 0 0 1 0.03125,0.0351563 0.50005,0.50005 0 0 1 0.002,0.001953 0.50005,0.50005 0 0 1 0.002,0.001953 0.50005,0.50005 0 0 1 0.05273,0.0820313 0.50005,0.50005 0 0 1 0.01953,0.0449219 0.50005,0.50005 0 0 1 0.002,0.001953 0.50005,0.50005 0 0 1 0.01563,0.0449219 0.50005,0.50005 0 0 1 0.002,0.0117187 0.50005,0.50005 0 0 1 0.01563,0.0800781 0.50005,0.50005 0 0 1 0,0.005859 0.50005,0.50005 0 0 1 0,0.001953 0.50005,0.50005 0 0 1 -0.15625,0.40624995 l -0.002,0.00195 L 3.3789062,22.326172 A 0.50005,0.50005 0 1 1 2.6210938,21.673828 L 19.044922,2.5117188 16.158203,3.4746094 A 0.50005,0.50005 0 0 1 16,3.5 H 13 A 0.50005,0.50005 0 0 1 12.841797,3.4746094 L 10.353516,2.6464844 A 0.50005,0.50005 0 0 1 10.5,3 v 2 a 0.50005,0.50005 0 0 1 -0.05273,0.2226562 l -1.0000004,2 A 0.50005,0.50005 0 0 1 9.2226562,7.4472656 l -2,1 A 0.50005,0.50005 0 0 1 7,8.5 H 5 A 0.50005,0.50005 0 0 1 4.6464844,8.3535156 l -2,-2 A 0.50005,0.50005 0 0 1 2.5,6 V 4 a 0.50005,0.50005 0 0 1 0.052734,-0.2226562 l 1,-2 A 0.50005,0.50005 0 0 1 3.7773438,1.5527344 l 2,-1.00000002 A 0.50005,0.50005 0 0 1 6,0.5 h 1.9335938 a 0.50005,0.50005 0 0 1 0.060547,-0.005859 z"
     id="path2" />
</svg>
