<?xml version="1.0" encoding="UTF-8" standalone="no"?>
<svg
   xmlns:dc="http://purl.org/dc/elements/1.1/"
   xmlns:cc="http://creativecommons.org/ns#"
   xmlns:rdf="http://www.w3.org/1999/02/22-rdf-syntax-ns#"
   xmlns:svg="http://www.w3.org/2000/svg"
   xmlns="http://www.w3.org/2000/svg"
   xmlns:sodipodi="http://sodipodi.sourceforge.net/DTD/sodipodi-0.dtd"
   xmlns:inkscape="http://www.inkscape.org/namespaces/inkscape"
   data-dec="187"
   width="14"
   height="40"
   version="1.1"
   id="svg4"
   sodipodi:docname="187.svg"
   inkscape:version="0.92.4 (unknown)">
  <metadata
     id="metadata10">
    <rdf:RDF>
      <cc:Work
         rdf:about="">
        <dc:format>image/svg+xml</dc:format>
        <dc:type
           rdf:resource="http://purl.org/dc/dcmitype/StillImage" />
      </cc:Work>
    </rdf:RDF>
  </metadata>
  <defs
     id="defs8" />
  <sodipodi:namedview
     pagecolor="#ffffff"
     bordercolor="#666666"
     borderopacity="1"
     objecttolerance="10"
     gridtolerance="10"
     guidetolerance="10"
     inkscape:pageopacity="0"
     inkscape:pageshadow="2"
     inkscape:window-width="615"
     inkscape:window-height="417"
     id="namedview6"
     showgrid="false"
     inkscape:zoom="5.9"
     inkscape:cx="7"
     inkscape:cy="20"
     inkscape:window-x="0"
     inkscape:window-y="27"
     inkscape:window-maximized="0"
     inkscape:current-layer="svg4" />
  <path
     style="color:#000000;font-style:normal;font-variant:normal;font-weight:normal;font-stretch:normal;font-size:medium;line-height:normal;font-family:sans-serif;font-variant-ligatures:normal;font-variant-position:normal;font-variant-caps:normal;font-variant-numeric:normal;font-variant-alternates:normal;font-feature-settings:normal;text-indent:0;text-align:start;text-decoration:none;text-decoration-line:none;text-decoration-style:solid;text-decoration-color:#000000;letter-spacing:normal;word-spacing:normal;text-transform:none;writing-mode:lr-tb;direction:ltr;text-orientation:mixed;dominant-baseline:auto;baseline-shift:baseline;text-anchor:start;white-space:normal;shape-padding:0;clip-rule:nonzero;display:inline;overflow:visible;visibility:visible;opacity:1;isolation:auto;mix-blend-mode:normal;color-interpolation:sRGB;color-interpolation-filters:linearRGB;solid-color:#000000;solid-opacity:1;vector-effect:none;fill:#013272;fill-opacity:1;fill-rule:nonzero;stroke:none;stroke-width:2;stroke-linecap:round;stroke-linejoin:round;stroke-miterlimit:4;stroke-dasharray:none;stroke-dashoffset:0;stroke-opacity:1;color-rendering:auto;image-rendering:auto;shape-rendering:auto;text-rendering:auto;enable-background:accumulate"
     d="m 6.9804688,6.9882812 a 1.0001,1.0001 0 0 1 0.099609,0.00391 1.0001,1.0001 0 0 1 0.2910157,0.072266 1.0001,1.0001 0 0 1 0.091797,0.042969 1.0001,1.0001 0 0 1 0.2382813,0.1777343 1.0001,1.0001 0 0 1 0.039063,0.041016 l 5.9667966,5.9667971 a 1.0001,1.0001 0 0 1 0,1.414062 l -5.9609372,5.960938 a 1.0001,1.0001 0 0 1 -0.023438,0.02539 1.0001,1.0001 0 0 1 -0.3242187,0.230469 1.0001,1.0001 0 0 1 -0.083984,0.0332 1.0001,1.0001 0 0 1 -0.00195,0.002 1.0001,1.0001 0 0 1 -0.00586,0.002 1.0001,1.0001 0 0 1 -0.011719,0.002 1.0001,1.0001 0 0 1 -0.1835938,0.04102 1.0001,1.0001 0 0 1 -0.091797,0.0078 1.0001,1.0001 0 0 1 -0.015625,0 1.0001,1.0001 0 0 1 -0.091797,-0.0039 1.0001,1.0001 0 0 1 -0.046875,-0.0059 1.0001,1.0001 0 0 1 -0.044922,-0.0059 1.0001,1.0001 0 0 1 -0.00781,-0.002 1.0001,1.0001 0 0 1 -0.1191406,-0.0293 1.0001,1.0001 0 0 1 -0.072266,-0.02539 1.0001,1.0001 0 0 1 -0.064453,-0.0293 1.0001,1.0001 0 0 1 -0.019531,-0.0078 1.0001,1.0001 0 0 1 -0.00391,-0.002 1.0001,1.0001 0 0 1 -0.050781,-0.0293 1.0001,1.0001 0 0 1 -0.037109,-0.02148 1.0001,1.0001 0 0 1 -0.076172,-0.05664 1.0001,1.0001 0 0 1 -0.00586,-0.0039 1.0001,1.0001 0 0 1 -0.041016,-0.03516 1.0001,1.0001 0 0 1 -0.033203,-0.0293 1.0001,1.0001 0 0 1 -0.017578,-0.01953 1.0001,1.0001 0 0 1 -0.046875,-0.05078 1.0001,1.0001 0 0 1 -0.00391,-0.0059 1.0001,1.0001 0 0 1 -0.056641,-0.07422 1.0001,1.0001 0 0 1 -0.00195,-0.0039 1.0001,1.0001 0 0 1 -0.017578,-0.0293 1.0001,1.0001 0 0 1 -0.019531,-0.03125 1.0001,1.0001 0 0 1 -0.011719,-0.01953 1.0001,1.0001 0 0 1 -0.00195,-0.0059 1.0001,1.0001 0 0 1 -0.00195,-0.002 1.0001,1.0001 0 0 1 -0.042969,-0.08984 1.0001,1.0001 0 0 1 -0.029297,-0.08203 1.0001,1.0001 0 0 1 -0.00195,-0.0039 1.0001,1.0001 0 0 1 0,-0.002 1.0001,1.0001 0 0 1 0,-0.002 1.0001,1.0001 0 0 1 -0.00195,-0.0039 1.0001,1.0001 0 0 1 -0.039063,-0.197266 1.0001,1.0001 0 0 1 -0.00391,-0.0918 1.0001,1.0001 0 0 1 0,-0.0039 1.0001,1.0001 0 0 1 0,-0.01953 1.0001,1.0001 0 0 1 0.00586,-0.08398 1.0001,1.0001 0 0 1 0.013672,-0.08984 1.0001,1.0001 0 0 1 0.00195,-0.0039 1.0001,1.0001 0 0 1 0.00586,-0.0293 1.0001,1.0001 0 0 1 0.021484,-0.07227 1.0001,1.0001 0 0 1 0.078125,-0.183593 1.0001,1.0001 0 0 1 0.052734,-0.08398 1.0001,1.0001 0 0 1 0.027344,-0.03711 L 9.7988281,14 6.1953125,8.59375 A 1.0001,1.0001 0 0 1 6.1875,8.5859375 1.0001,1.0001 0 0 1 6.1855469,8.5839844 1.0001,1.0001 0 0 1 6.1816406,8.578125 1.0001,1.0001 0 0 1 6.046875,8.3222656 1.0001,1.0001 0 0 1 6.0195312,8.2265625 1.0001,1.0001 0 0 1 6,8.1269531 a 1.0001,1.0001 0 0 1 -0.00781,-0.1992187 1.0001,1.0001 0 0 1 0,-0.00781 1.0001,1.0001 0 0 1 0.011719,-0.091797 1.0001,1.0001 0 0 1 0.042969,-0.1640625 1.0001,1.0001 0 0 1 0.011719,-0.035156 1.0001,1.0001 0 0 1 0.037109,-0.083984 1.0001,1.0001 0 0 1 0.023437,-0.042969 1.0001,1.0001 0 0 1 0.025391,-0.044922 1.0001,1.0001 0 0 1 0.00391,-0.00586 1.0001,1.0001 0 0 1 0,-0.00195 1.0001,1.0001 0 0 1 0.00391,-0.00391 1.0001,1.0001 0 0 1 0.054687,-0.076172 1.0001,1.0001 0 0 1 0.060547,-0.070312 1.0001,1.0001 0 0 1 0.00391,-0.00391 1.0001,1.0001 0 0 1 0.00195,-0.00195 1.0001,1.0001 0 0 1 0.066406,-0.0625 1.0001,1.0001 0 0 1 0.00586,-0.00586 1.0001,1.0001 0 0 1 0.070312,-0.052734 1.0001,1.0001 0 0 1 0.00195,-0.00195 1.0001,1.0001 0 0 1 0.00781,-0.00586 1.0001,1.0001 0 0 1 0.033203,-0.021484 1.0001,1.0001 0 0 1 0.050781,-0.03125 1.0001,1.0001 0 0 1 0.082031,-0.039063 1.0001,1.0001 0 0 1 0.00781,-0.00391 1.0001,1.0001 0 0 1 0.046875,-0.017578 1.0001,1.0001 0 0 1 0.039063,-0.013672 A 1.0001,1.0001 0 0 1 6.8535156,7 a 1.0001,1.0001 0 0 1 0.035156,-0.00586 1.0001,1.0001 0 0 1 0.00195,0 1.0001,1.0001 0 0 1 0.089844,-0.00586 z m -6.00000005,0 a 1.0001,1.0001 0 0 1 0.0996093,0.00391 1.0001,1.0001 0 0 1 0.2910157,0.072266 1.0001,1.0001 0 0 1 0.091797,0.042969 1.0001,1.0001 0 0 1 0.2382813,0.1777343 1.0001,1.0001 0 0 1 0.039063,0.041016 l 5.9667968,5.9667971 a 1.0001,1.0001 0 0 1 0,1.414062 l -5.9609374,5.960938 a 1.0001,1.0001 0 0 1 -0.023438,0.02539 1.0001,1.0001 0 0 1 -0.3242187,0.230469 1.0001,1.0001 0 0 1 -0.083984,0.0332 1.0001,1.0001 0 0 1 -0.00195,0.002 1.0001,1.0001 0 0 1 -0.00586,0.002 1.0001,1.0001 0 0 1 -0.011719,0.002 1.0001,1.0001 0 0 1 -0.1835938,0.04102 1.0001,1.0001 0 0 1 -0.091797,0.0078 1.0001,1.0001 0 0 1 -0.015625,0 1.0001,1.0001 0 0 1 -0.0917968,-0.0039 1.0001,1.0001 0 0 1 -0.046875,-0.0059 1.0001,1.0001 0 0 1 -0.0449219,-0.0059 1.0001,1.0001 0 0 1 -0.007813,-0.002 1.0001,1.0001 0 0 1 -0.11914062,-0.0293 1.0001,1.0001 0 0 1 -0.0722656,-0.02539 1.0001,1.0001 0 0 1 -0.0644531,-0.0293 1.0001,1.0001 0 0 1 -0.0195312,-0.0078 1.0001,1.0001 0 0 1 -0.003906,-0.002 1.0001,1.0001 0 0 1 -0.0507812,-0.0293 1.0001,1.0001 0 0 1 -0.0371094,-0.02148 1.0001,1.0001 0 0 1 -0.0761719,-0.05664 1.0001,1.0001 0 0 1 -0.005859,-0.0039 1.0001,1.0001 0 0 1 -0.0410156,-0.03516 1.0001,1.0001 0 0 1 -0.0332031,-0.0293 1.0001,1.0001 0 0 1 -0.0175781,-0.01953 1.0001,1.0001 0 0 1 -0.046875,-0.05078 1.0001,1.0001 0 0 1 -0.003906,-0.0059 1.0001,1.0001 0 0 1 -0.0566406,-0.07422 1.0001,1.0001 0 0 1 -0.001953,-0.0039 1.0001,1.0001 0 0 1 -0.0175781,-0.0293 1.0001,1.0001 0 0 1 -0.0195313,-0.03125 1.0001,1.0001 0 0 1 -0.0117188,-0.01953 1.0001,1.0001 0 0 1 -0.001953,-0.0059 1.0001,1.0001 0 0 1 -0.001953,-0.002 1.0001,1.0001 0 0 1 -0.04296875,-0.08984 1.0001,1.0001 0 0 1 -0.02929688,-0.08203 1.0001,1.0001 0 0 1 -0.0019531,-0.0039 1.0001,1.0001 0 0 1 0,-0.002 1.0001,1.0001 0 0 1 0,-0.002 1.0001,1.0001 0 0 1 -0.0019531,-0.0039 1.0001,1.0001 0 0 1 -0.0390625,-0.197266 1.0001,1.0001 0 0 1 -0.00390625,-0.0918 1.0001,1.0001 0 0 1 0,-0.0039 1.0001,1.0001 0 0 1 0,-0.01953 1.0001,1.0001 0 0 1 0.00585938,-0.08398 1.0001,1.0001 0 0 1 0.01367188,-0.08984 1.0001,1.0001 0 0 1 0.00195312,-0.0039 1.0001,1.0001 0 0 1 0.0058594,-0.0293 1.0001,1.0001 0 0 1 0.02148437,-0.07227 1.0001,1.0001 0 0 1 0.078125,-0.183593 1.0001,1.0001 0 0 1 0.0527344,-0.08398 1.0001,1.0001 0 0 1 0.0273437,-0.03711 L 3.7988281,14 0.1953125,8.59375 A 1.0001,1.0001 0 0 1 0.1875,8.5859375 1.0001,1.0001 0 0 1 0.18554688,8.5839844 1.0001,1.0001 0 0 1 0.18164062,8.578125 1.0001,1.0001 0 0 1 0.046875,8.3222656 1.0001,1.0001 0 0 1 0.01953125,8.2265625 1.0001,1.0001 0 0 1 0,8.1269531 1.0001,1.0001 0 0 1 -0.0078125,7.9277344 a 1.0001,1.0001 0 0 1 0,-0.00781 1.0001,1.0001 0 0 1 0.01171875,-0.091797 1.0001,1.0001 0 0 1 0.04296875,-0.1640625 1.0001,1.0001 0 0 1 0.01171875,-0.035156 1.0001,1.0001 0 0 1 0.0078125,-0.019531 1.0001,1.0001 0 0 1 0.02929687,-0.064453 1.0001,1.0001 0 0 1 0.0234375,-0.042969 1.0001,1.0001 0 0 1 0.0253906,-0.044922 1.0001,1.0001 0 0 1 0.003906,-0.00586 1.0001,1.0001 0 0 1 0,-0.00195 1.0001,1.0001 0 0 1 0.003906,-0.00391 1.0001,1.0001 0 0 1 0.0546875,-0.076172 1.0001,1.0001 0 0 1 0.0253906,-0.029297 1.0001,1.0001 0 0 1 0.0351562,-0.041016 1.0001,1.0001 0 0 1 0.003906,-0.00391 1.0001,1.0001 0 0 1 0.001953,-0.00195 1.0001,1.0001 0 0 1 0.0664063,-0.0625 1.0001,1.0001 0 0 1 0.005859,-0.00586 1.0001,1.0001 0 0 1 0.0703125,-0.052734 1.0001,1.0001 0 0 1 0.001953,-0.00195 1.0001,1.0001 0 0 1 0.007813,-0.00586 1.0001,1.0001 0 0 1 0.0332031,-0.021484 1.0001,1.0001 0 0 1 0.0507812,-0.03125 1.0001,1.0001 0 0 1 0.0820313,-0.039063 1.0001,1.0001 0 0 1 0.007813,-0.00391 1.0001,1.0001 0 0 1 0.046875,-0.017578 1.0001,1.0001 0 0 1 0.0390625,-0.013672 A 1.0001,1.0001 0 0 1 0.85351562,7 a 1.0001,1.0001 0 0 1 0.0351563,-0.00586 1.0001,1.0001 0 0 1 0.001953,0 1.0001,1.0001 0 0 1 0.0898438,-0.00586 z"
     id="path2" />
</svg>
