<?xml version="1.0" encoding="UTF-8" standalone="no"?>
<svg
   xmlns:dc="http://purl.org/dc/elements/1.1/"
   xmlns:cc="http://creativecommons.org/ns#"
   xmlns:rdf="http://www.w3.org/1999/02/22-rdf-syntax-ns#"
   xmlns:svg="http://www.w3.org/2000/svg"
   xmlns="http://www.w3.org/2000/svg"
   xmlns:sodipodi="http://sodipodi.sourceforge.net/DTD/sodipodi-0.dtd"
   xmlns:inkscape="http://www.inkscape.org/namespaces/inkscape"
   data-dec="88"
   width="22"
   height="40"
   version="1.1"
   id="svg4"
   sodipodi:docname="88.svg"
   inkscape:version="0.92.4 (unknown)">
  <metadata
     id="metadata10">
    <rdf:RDF>
      <cc:Work
         rdf:about="">
        <dc:format>image/svg+xml</dc:format>
        <dc:type
           rdf:resource="http://purl.org/dc/dcmitype/StillImage" />
      </cc:Work>
    </rdf:RDF>
  </metadata>
  <defs
     id="defs8" />
  <sodipodi:namedview
     pagecolor="#ffffff"
     bordercolor="#666666"
     borderopacity="1"
     objecttolerance="10"
     gridtolerance="10"
     guidetolerance="10"
     inkscape:pageopacity="0"
     inkscape:pageshadow="2"
     inkscape:window-width="640"
     inkscape:window-height="480"
     id="namedview6"
     showgrid="false"
     inkscape:zoom="5.9"
     inkscape:cx="11"
     inkscape:cy="20"
     inkscape:window-x="0"
     inkscape:window-y="27"
     inkscape:window-maximized="0"
     inkscape:current-layer="svg4" />
  <path
     style="color:#000000;font-style:normal;font-variant:normal;font-weight:normal;font-stretch:normal;font-size:medium;line-height:normal;font-family:sans-serif;font-variant-ligatures:normal;font-variant-position:normal;font-variant-caps:normal;font-variant-numeric:normal;font-variant-alternates:normal;font-feature-settings:normal;text-indent:0;text-align:start;text-decoration:none;text-decoration-line:none;text-decoration-style:solid;text-decoration-color:#000000;letter-spacing:normal;word-spacing:normal;text-transform:none;writing-mode:lr-tb;direction:ltr;text-orientation:mixed;dominant-baseline:auto;baseline-shift:baseline;text-anchor:start;white-space:normal;shape-padding:0;clip-rule:nonzero;display:inline;overflow:visible;visibility:visible;opacity:1;isolation:auto;mix-blend-mode:normal;color-interpolation:sRGB;color-interpolation-filters:linearRGB;solid-color:#000000;solid-opacity:1;vector-effect:none;fill:#013272;fill-opacity:1;fill-rule:nonzero;stroke:none;stroke-width:2.5;stroke-linecap:round;stroke-linejoin:round;stroke-miterlimit:4;stroke-dasharray:none;stroke-dashoffset:0;stroke-opacity:1;color-rendering:auto;image-rendering:auto;shape-rendering:auto;text-rendering:auto;enable-background:accumulate"
     d="M 6.9492188,-0.265625 A 1.250125,1.250125 0 0 1 7.1972656,-0.25 h 0.5957032 a 1.250125,1.250125 0 0 1 0.4042968,0 H 11 a 1.250125,1.250125 0 1 1 0,2.5 H 9.734375 L 11.898438,8.7460938 18.083984,2.25 H 17 a 1.250125,1.250125 0 1 1 0,-2.5 h 3.837891 a 1.250125,1.250125 0 0 1 0.355468,0 H 23 a 1.250125,1.250125 0 1 1 0,2.5 H 21.533203 L 12.792969,11.427734 15.900391,20.75 H 17 a 1.250125,1.250125 0 1 1 0,2.5 h -1.792969 a 1.250125,1.250125 0 0 1 -0.404297,0 h -0.595703 a 1.250125,1.250125 0 0 1 -0.404297,0 H 11 a 1.250125,1.250125 0 1 1 0,-2.5 h 1.265625 L 10.101562,14.253906 3.9160156,20.75 H 5 a 1.250125,1.250125 0 1 1 0,2.5 H 1.1621094 a 1.250125,1.250125 0 0 1 -0.35546878,0 H -1 a 1.250125,1.250125 0 1 1 0,-2.5 H 0.46679688 L 9.2070312,11.572266 6.0996094,2.25 H 5 a 1.250125,1.250125 0 1 1 0,-2.5 h 1.7929688 a 1.250125,1.250125 0 0 1 0.15625,-0.015625 z"
     id="path2" />
</svg>
