<?xml version="1.0" encoding="UTF-8" standalone="no"?>
<svg
   xmlns:dc="http://purl.org/dc/elements/1.1/"
   xmlns:cc="http://creativecommons.org/ns#"
   xmlns:rdf="http://www.w3.org/1999/02/22-rdf-syntax-ns#"
   xmlns:svg="http://www.w3.org/2000/svg"
   xmlns="http://www.w3.org/2000/svg"
   xmlns:sodipodi="http://sodipodi.sourceforge.net/DTD/sodipodi-0.dtd"
   xmlns:inkscape="http://www.inkscape.org/namespaces/inkscape"
   data-dec="184"
   width="5"
   height="40"
   version="1.1"
   id="svg4"
   sodipodi:docname="184.svg"
   inkscape:version="0.92.4 (unknown)">
  <metadata
     id="metadata10">
    <rdf:RDF>
      <cc:Work
         rdf:about="">
        <dc:format>image/svg+xml</dc:format>
        <dc:type
           rdf:resource="http://purl.org/dc/dcmitype/StillImage" />
      </cc:Work>
    </rdf:RDF>
  </metadata>
  <defs
     id="defs8" />
  <sodipodi:namedview
     pagecolor="#ffffff"
     bordercolor="#666666"
     borderopacity="1"
     objecttolerance="10"
     gridtolerance="10"
     guidetolerance="10"
     inkscape:pageopacity="0"
     inkscape:pageshadow="2"
     inkscape:window-width="640"
     inkscape:window-height="480"
     id="namedview6"
     showgrid="false"
     inkscape:zoom="5.9"
     inkscape:cx="2.5"
     inkscape:cy="20"
     inkscape:window-x="0"
     inkscape:window-y="27"
     inkscape:window-maximized="0"
     inkscape:current-layer="svg4" />
  <path
     style="color:#000000;font-style:normal;font-variant:normal;font-weight:normal;font-stretch:normal;font-size:medium;line-height:normal;font-family:sans-serif;font-variant-ligatures:normal;font-variant-position:normal;font-variant-caps:normal;font-variant-numeric:normal;font-variant-alternates:normal;font-feature-settings:normal;text-indent:0;text-align:start;text-decoration:none;text-decoration-line:none;text-decoration-style:solid;text-decoration-color:#000000;letter-spacing:normal;word-spacing:normal;text-transform:none;writing-mode:lr-tb;direction:ltr;text-orientation:mixed;dominant-baseline:auto;baseline-shift:baseline;text-anchor:start;white-space:normal;shape-padding:0;clip-rule:nonzero;display:inline;overflow:visible;visibility:visible;opacity:1;isolation:auto;mix-blend-mode:normal;color-interpolation:sRGB;color-interpolation-filters:linearRGB;solid-color:#000000;solid-opacity:1;vector-effect:none;fill:#000000;fill-opacity:1;fill-rule:nonzero;stroke:none;stroke-width:1;stroke-linecap:round;stroke-linejoin:round;stroke-miterlimit:4;stroke-dasharray:none;stroke-dashoffset:0;stroke-opacity:1;color-rendering:auto;image-rendering:auto;shape-rendering:auto;text-rendering:auto;enable-background:accumulate"
     d="M 2.9902344,21.496094 A 0.50005,0.50005 0 0 1 3.0742188,21.5 H 4 a 0.50005,0.50005 0 0 1 0.3535156,0.853516 l -1.1796875,1.179687 a 0.50005,0.50005 0 0 1 0.1796875,0.113281 l 1,1 a 0.50005,0.50005 0 0 1 -0.1308594,0.800782 l -2,1 A 0.50005,0.50005 0 0 1 2,26.5 H 1.046875 a 0.50005,0.50005 0 0 1 -0.39648438,-0.136719 0.50005,0.50005 0 0 1 -0.0117187,-0.0098 0.50005,0.50005 0 0 1 -0.0234375,-0.02539 0.50005,0.50005 0 0 1 -0.03125,-0.03906 0.50005,0.50005 0 0 1 -0.0253906,-0.04297 0.50005,0.50005 0 0 1 -0.0195313,-0.03906 0.50005,0.50005 0 0 1 -0.005859,-0.01172 0.50005,0.50005 0 0 1 -0.009766,-0.02539 0.50005,0.50005 0 0 1 -0.009766,-0.0293 0.50005,0.50005 0 0 1 -0.0117188,-0.04883 0.50005,0.50005 0 0 1 0.003906,-0.199219 0.50005,0.50005 0 0 1 0.0136719,-0.04687 0.50005,0.50005 0 0 1 0.0175781,-0.04687 0.50005,0.50005 0 0 1 0.1953125,-0.222656 0.50005,0.50005 0 0 1 0.0878906,-0.04492 L 1.8828125,25 0.77734375,24.447266 A 0.50005,0.50005 0 0 1 0.64648438,23.646484 L 2.5957031,21.697266 a 0.50005,0.50005 0 0 1 0.1503907,-0.13086 0.50005,0.50005 0 0 1 0.013672,-0.0078 0.50005,0.50005 0 0 1 0.037109,-0.01758 0.50005,0.50005 0 0 1 0.00781,-0.0039 0.50005,0.50005 0 0 1 0.015625,-0.0059 0.50005,0.50005 0 0 1 0.03125,-0.01172 0.50005,0.50005 0 0 1 0.1386719,-0.02344 z"
     id="path2" />
</svg>
