<?xml version="1.0" encoding="UTF-8" standalone="no"?>
<svg
   xmlns:dc="http://purl.org/dc/elements/1.1/"
   xmlns:cc="http://creativecommons.org/ns#"
   xmlns:rdf="http://www.w3.org/1999/02/22-rdf-syntax-ns#"
   xmlns:svg="http://www.w3.org/2000/svg"
   xmlns="http://www.w3.org/2000/svg"
   xmlns:sodipodi="http://sodipodi.sourceforge.net/DTD/sodipodi-0.dtd"
   xmlns:inkscape="http://www.inkscape.org/namespaces/inkscape"
   data-dec="114"
   width="14"
   height="40"
   version="1.1"
   id="svg4"
   sodipodi:docname="114.svg"
   inkscape:version="0.92.4 5da689c313, 2019-01-14">
  <metadata
     id="metadata10">
    <rdf:RDF>
      <cc:Work
         rdf:about="">
        <dc:format>image/svg+xml</dc:format>
        <dc:type
           rdf:resource="http://purl.org/dc/dcmitype/StillImage" />
        <dc:title></dc:title>
      </cc:Work>
    </rdf:RDF>
  </metadata>
  <defs
     id="defs8" />
  <sodipodi:namedview
     pagecolor="#ffffff"
     bordercolor="#666666"
     borderopacity="1"
     objecttolerance="10"
     gridtolerance="10"
     guidetolerance="10"
     inkscape:pageopacity="0"
     inkscape:pageshadow="2"
     inkscape:window-width="1920"
     inkscape:window-height="1043"
     id="namedview6"
     showgrid="false"
     inkscape:zoom="5.9"
     inkscape:cx="7"
     inkscape:cy="20"
     inkscape:window-x="0"
     inkscape:window-y="37"
     inkscape:window-maximized="0"
     inkscape:current-layer="svg4" />
  <path
     style="color:#000000;font-style:normal;font-variant:normal;font-weight:normal;font-stretch:normal;font-size:medium;line-height:normal;font-family:sans-serif;font-variant-ligatures:normal;font-variant-position:normal;font-variant-caps:normal;font-variant-numeric:normal;font-variant-alternates:normal;font-feature-settings:normal;text-indent:0;text-align:start;text-decoration:none;text-decoration-line:none;text-decoration-style:solid;text-decoration-color:#000000;letter-spacing:normal;word-spacing:normal;text-transform:none;writing-mode:lr-tb;direction:ltr;text-orientation:mixed;dominant-baseline:auto;baseline-shift:baseline;text-anchor:start;white-space:normal;shape-padding:0;clip-rule:nonzero;display:inline;overflow:visible;visibility:visible;opacity:1;isolation:auto;mix-blend-mode:normal;color-interpolation:sRGB;color-interpolation-filters:linearRGB;solid-color:#000000;solid-opacity:1;vector-effect:none;fill:#000000;fill-opacity:1;fill-rule:nonzero;stroke:none;stroke-width:0.5;stroke-linecap:round;stroke-linejoin:round;stroke-miterlimit:4;stroke-dasharray:none;stroke-dashoffset:0;stroke-opacity:1;color-rendering:auto;image-rendering:auto;shape-rendering:auto;text-rendering:auto;enable-background:accumulate"
     d="M 5.25,21.605469 V 21.75 h 0.1445312 z m -1.5,0 L 3.6054688,21.75 H 3.75 Z M 4.75,8.3457031 3.2128906,8.8574219 3.75,9.3945312 V 9 a 0.250025,0.250025 0 1 1 0.5,0 v 0.9707031 a 0.250025,0.250025 0 0 1 0,0.060547 v 10.929688 a 0.250025,0.250025 0 0 1 0,0.07422 V 21.75 h 0.5 v -0.720703 a 0.250025,0.250025 0 0 1 0,-0.06055 v -8.941406 a 0.250025,0.250025 0 0 1 0,-0.05078 z M 10.056641,8.25 11.111328,8.7773438 a 0.250025,0.250025 0 0 1 0.06641,0.044922 L 11.75,9.3945312 V 9.1035156 L 10.896484,8.25 Z M 4.9960938,7.7460938 a 0.250025,0.250025 0 0 1 0.015625,0.00195 0.250025,0.250025 0 0 1 0.070312,0.013672 0.250025,0.250025 0 0 1 0.00391,0 0.250025,0.250025 0 0 1 0.00781,0.00391 0.250025,0.250025 0 0 1 0.015625,0.00586 0.250025,0.250025 0 0 1 0.00781,0.00391 0.250025,0.250025 0 0 1 0.013672,0.00781 0.250025,0.250025 0 0 1 0.00781,0.00391 0.250025,0.250025 0 0 1 0.013672,0.00977 0.250025,0.250025 0 0 1 0.00586,0.00586 0.250025,0.250025 0 0 1 0.011719,0.00977 0.250025,0.250025 0 0 1 0.039063,0.044922 A 0.250025,0.250025 0 0 1 5.25,8.0390625 V 11.171875 L 6.7910156,8.8613281 a 0.250025,0.250025 0 0 1 0.097656,-0.083984 L 8.8476562,7.796875 a 0.250025,0.250025 0 0 1 0.00391,-0.00195 A 0.250025,0.250025 0 0 1 9.015625,7.75 H 11 a 0.250025,0.250025 0 0 1 0.177734,0.072266 l 1,1 A 0.250025,0.250025 0 0 1 12.25,9 v 1 a 0.250025,0.250025 0 0 1 -0.427734,0.177734 L 10.851562,9.2050781 9,8.2792969 7.171875,9.1933594 5.25,12.076172 v 8.818359 L 6.1035156,21.75 H 7 a 0.250025,0.250025 0 0 1 0,0.5 h -1.0214844 -0.9375 a 0.250025,0.250025 0 0 1 -0.087891,0 H 4.0410156 a 0.250025,0.250025 0 0 1 -0.087891,0 H 3 2 a 0.250025,0.250025 0 0 1 0,-0.5 H 2.8964844 L 3.75,20.894531 V 10.105469 L 2.8964844,9.25 H 2 A 0.250025,0.250025 0 0 1 1.921875,8.7636719 l 2.9550781,-0.984375 a 0.250025,0.250025 0 0 1 0.00391,-0.00195 0.250025,0.250025 0 0 1 0.1152344,-0.03125 z"
     id="path2" />
</svg>
