<?xml version="1.0" encoding="UTF-8" standalone="no"?>
<svg
   xmlns:dc="http://purl.org/dc/elements/1.1/"
   xmlns:cc="http://creativecommons.org/ns#"
   xmlns:rdf="http://www.w3.org/1999/02/22-rdf-syntax-ns#"
   xmlns:svg="http://www.w3.org/2000/svg"
   xmlns="http://www.w3.org/2000/svg"
   xmlns:sodipodi="http://sodipodi.sourceforge.net/DTD/sodipodi-0.dtd"
   xmlns:inkscape="http://www.inkscape.org/namespaces/inkscape"
   data-dec="68"
   width="22"
   height="40"
   version="1.1"
   id="svg4"
   sodipodi:docname="68.svg"
   inkscape:version="0.92.4 (unknown)">
  <metadata
     id="metadata10">
    <rdf:RDF>
      <cc:Work
         rdf:about="">
        <dc:format>image/svg+xml</dc:format>
        <dc:type
           rdf:resource="http://purl.org/dc/dcmitype/StillImage" />
      </cc:Work>
    </rdf:RDF>
  </metadata>
  <defs
     id="defs8" />
  <sodipodi:namedview
     pagecolor="#ffffff"
     bordercolor="#666666"
     borderopacity="1"
     objecttolerance="10"
     gridtolerance="10"
     guidetolerance="10"
     inkscape:pageopacity="0"
     inkscape:pageshadow="2"
     inkscape:window-width="640"
     inkscape:window-height="480"
     id="namedview6"
     showgrid="false"
     inkscape:zoom="5.9"
     inkscape:cx="11"
     inkscape:cy="20"
     inkscape:window-x="0"
     inkscape:window-y="27"
     inkscape:window-maximized="0"
     inkscape:current-layer="svg4" />
  <path
     style="color:#000000;font-style:normal;font-variant:normal;font-weight:normal;font-stretch:normal;font-size:medium;line-height:normal;font-family:sans-serif;font-variant-ligatures:normal;font-variant-position:normal;font-variant-caps:normal;font-variant-numeric:normal;font-variant-alternates:normal;font-feature-settings:normal;text-indent:0;text-align:start;text-decoration:none;text-decoration-line:none;text-decoration-style:solid;text-decoration-color:#000000;letter-spacing:normal;word-spacing:normal;text-transform:none;writing-mode:lr-tb;direction:ltr;text-orientation:mixed;dominant-baseline:auto;baseline-shift:baseline;text-anchor:start;white-space:normal;shape-padding:0;clip-rule:nonzero;display:inline;overflow:visible;visibility:visible;opacity:1;isolation:auto;mix-blend-mode:normal;color-interpolation:sRGB;color-interpolation-filters:linearRGB;solid-color:#000000;solid-opacity:1;vector-effect:none;fill:#000000;fill-opacity:1;fill-rule:nonzero;stroke:none;stroke-width:0.30000001;stroke-linecap:round;stroke-linejoin:round;stroke-miterlimit:4;stroke-dasharray:none;stroke-dashoffset:0;stroke-opacity:1;color-rendering:auto;image-rendering:auto;shape-rendering:auto;text-rendering:auto;enable-background:accumulate"
     d="M 6.1503906,3.1503906 V 19.849609 H 12 12.964844 l 1.923828,-0.960937 0.972656,-1.945313 0.988281,-2.966797 V 9.0234375 L 15.861328,6.0566406 14.888672,4.1113281 12.964844,3.1503906 H 11 Z M 5.9980469,2.8476562 a 0.15001501,0.15001501 0 0 1 0.029297,0.00195 H 11 13 a 0.15001501,0.15001501 0 0 1 0.06641,0.015625 l 2,1 a 0.15001501,0.15001501 0 0 1 0.06836,0.068359 l 1,2 a 0.15001501,0.15001501 0 0 1 0.0078,0.019531 l 1,3 A 0.15001501,0.15001501 0 0 1 17.150391,9 v 5 a 0.15001501,0.15001501 0 0 1 -0.0078,0.04687 l -1,3 a 0.15001501,0.15001501 0 0 1 -0.0078,0.01953 l -1,2 a 0.15001501,0.15001501 0 0 1 -0.06836,0.06836 l -1.980468,0.990234 -0.01953,0.0098 a 0.15001501,0.15001501 0 0 1 -0.02539,0.0098 0.15001501,0.15001501 0 0 1 -0.02344,0.0059 0.15001501,0.15001501 0 0 1 -0.002,0 0.15001501,0.15001501 0 0 1 -0.002,0 0.15001501,0.15001501 0 0 1 -0.01367,0 H 12.984375 12 6.0175781 a 0.15001501,0.15001501 0 0 1 -0.072266,-0.0098 0.15001501,0.15001501 0 0 1 -0.00195,0 0.15001501,0.15001501 0 0 1 -0.011719,-0.0059 0.15001501,0.15001501 0 0 1 -0.00195,0 0.15001501,0.15001501 0 0 1 -0.011719,-0.0078 0.15001501,0.15001501 0 0 1 -0.013672,-0.0078 0.15001501,0.15001501 0 0 1 -0.00391,-0.0059 0.15001501,0.15001501 0 0 1 -0.00586,-0.0059 0.15001501,0.15001501 0 0 1 -0.00977,-0.0098 0.15001501,0.15001501 0 0 1 -0.017578,-0.02539 0.15001501,0.15001501 0 0 1 -0.00586,-0.01172 0.15001501,0.15001501 0 0 1 0,-0.002 0.15001501,0.15001501 0 0 1 -0.00586,-0.01172 0.15001501,0.15001501 0 0 1 0,-0.002 0.15001501,0.15001501 0 0 1 -0.00586,-0.02734 0.15001501,0.15001501 0 0 1 0,-0.002 0.15001501,0.15001501 0 0 1 0,-0.04297 V 3.0175781 a 0.15001501,0.15001501 0 0 1 0.00977,-0.072266 0.15001501,0.15001501 0 0 1 0,-0.00195 0.15001501,0.15001501 0 0 1 0.00586,-0.011719 0.15001501,0.15001501 0 0 1 0,-0.00195 0.15001501,0.15001501 0 0 1 0.00781,-0.011719 0.15001501,0.15001501 0 0 1 0.00781,-0.013672 0.15001501,0.15001501 0 0 1 0.00586,-0.00391 0.15001501,0.15001501 0 0 1 0.027344,-0.025391 0.15001501,0.15001501 0 0 1 0.011719,-0.00781 0.15001501,0.15001501 0 0 1 0.029297,-0.011719 0.15001501,0.15001501 0 0 1 0.027344,-0.00586 0.15001501,0.15001501 0 0 1 0.00195,0 0.15001501,0.15001501 0 0 1 0.013672,-0.00195 z M 5.1503906,2.1503906 V 20.849609 H 11 12.953125 l 2.929687,-1.953125 0.978516,-1.953125 0.988281,-2.966797 V 9.0234375 L 16.861328,6.0566406 15.876953,4.0878906 15.875,4.0859375 14.912109,3.1230469 12.964844,2.1503906 Z M 4.9980469,1.8476562 a 0.15001501,0.15001501 0 0 1 0.029297,0.00195 H 13 a 0.15001501,0.15001501 0 0 1 0.06641,0.015625 l 2,1 a 0.15001501,0.15001501 0 0 1 0.03906,0.029297 l 0.980469,0.9824219 a 0.15001501,0.15001501 0 0 1 0.01172,0.00781 l 0.0078,0.00977 a 0.15001501,0.15001501 0 0 1 0.002,0.00195 0.15001501,0.15001501 0 0 1 0.01953,0.023437 0.15001501,0.15001501 0 0 1 0.0078,0.013672 l 1,2 a 0.15001501,0.15001501 0 0 1 0.0078,0.019531 l 1,3 a 0.15001501,0.15001501 0 0 1 0.0039,0.017578 0.15001501,0.15001501 0 0 1 0.002,0.013672 A 0.15001501,0.15001501 0 0 1 18.150391,9 v 5 a 0.15001501,0.15001501 0 0 1 0,0.0039 0.15001501,0.15001501 0 0 1 -0.0078,0.04297 l -1,3 a 0.15001501,0.15001501 0 0 1 -0.002,0.0059 0.15001501,0.15001501 0 0 1 -0.0059,0.01367 l -1,2 a 0.15001501,0.15001501 0 0 1 -0.002,0.0039 0.15001501,0.15001501 0 0 1 -0.0039,0.0059 0.15001501,0.15001501 0 0 1 -0.04492,0.04883 0.15001501,0.15001501 0 0 1 -0.01953,0.01172 l -2.966797,1.978515 a 0.15001501,0.15001501 0 0 1 -0.0039,0.0039 l -0.0098,0.0059 a 0.15001501,0.15001501 0 0 1 -0.0098,0.0059 0.15001501,0.15001501 0 0 1 -0.002,0.002 0.15001501,0.15001501 0 0 1 -0.01172,0.0039 0.15001501,0.15001501 0 0 1 -0.002,0.002 0.15001501,0.15001501 0 0 1 -0.01172,0.0039 0.15001501,0.15001501 0 0 1 -0.0098,0.0039 0.15001501,0.15001501 0 0 1 -0.0039,0 0.15001501,0.15001501 0 0 1 -0.0293,0.0039 0.15001501,0.15001501 0 0 1 -0.0039,0 H 12.988281 11 5.0175781 a 0.15001501,0.15001501 0 0 1 -0.072266,-0.0098 0.15001501,0.15001501 0 0 1 -0.00195,0 0.15001501,0.15001501 0 0 1 -0.011719,-0.0059 0.15001501,0.15001501 0 0 1 -0.00195,0 0.15001501,0.15001501 0 0 1 -0.023437,-0.01563 0.15001501,0.15001501 0 0 1 -0.00195,0 0.15001501,0.15001501 0 0 1 -0.00391,-0.0059 0.15001501,0.15001501 0 0 1 -0.00586,-0.0059 0.15001501,0.15001501 0 0 1 -0.00977,-0.0098 0.15001501,0.15001501 0 0 1 -0.017578,-0.02539 0.15001501,0.15001501 0 0 1 -0.00586,-0.01172 0.15001501,0.15001501 0 0 1 0,-0.002 0.15001501,0.15001501 0 0 1 -0.00586,-0.01172 0.15001501,0.15001501 0 0 1 0,-0.002 0.15001501,0.15001501 0 0 1 -0.00586,-0.02734 0.15001501,0.15001501 0 0 1 0,-0.002 0.15001501,0.15001501 0 0 1 0,-0.04297 V 2.0175781 a 0.15001501,0.15001501 0 0 1 0.00977,-0.072266 0.15001501,0.15001501 0 0 1 0,-0.00195 0.15001501,0.15001501 0 0 1 0.00586,-0.011719 0.15001501,0.15001501 0 0 1 0,-0.00195 0.15001501,0.15001501 0 0 1 0.00781,-0.011719 0.15001501,0.15001501 0 0 1 0.00781,-0.013672 0.15001501,0.15001501 0 0 1 0.00586,-0.00391 0.15001501,0.15001501 0 0 1 0.015625,-0.015625 0.15001501,0.15001501 0 0 1 0.023437,-0.017578 0.15001501,0.15001501 0 0 1 0.029297,-0.011719 0.15001501,0.15001501 0 0 1 0.027344,-0.00586 0.15001501,0.15001501 0 0 1 0.00195,0 0.15001501,0.15001501 0 0 1 0.013672,-0.00195 z M 4.1503906,1.1503906 V 21.849609 h 7.8261714 l 2.94336,-0.980468 1.957031,-1.957032 0.984375,-1.96875 0.988281,-2.966797 V 9.0234375 L 17.861328,6.0566406 16.876953,4.0878906 14.919922,2.1308594 11.976562,1.1503906 H 11 Z M 3.9980469,0.84765625 a 0.15001501,0.15001501 0 0 1 0.029297,0.001953 H 11 12 a 0.15001501,0.15001501 0 0 1 0.04687,0.007813 l 3,1.00000002 a 0.15001501,0.15001501 0 0 1 0.05859,0.037109 l 2,2 a 0.15001501,0.15001501 0 0 1 0.0293,0.039063 l 1,2 a 0.15001501,0.15001501 0 0 1 0.0078,0.019531 l 1,3 A 0.15001501,0.15001501 0 0 1 19.150391,9 v 5 a 0.15001501,0.15001501 0 0 1 -0.0078,0.04687 l -1,3 a 0.15001501,0.15001501 0 0 1 -0.0078,0.01953 l -1,2 a 0.15001501,0.15001501 0 0 1 -0.0293,0.03906 l -2,2 a 0.15001501,0.15001501 0 0 1 -0.05859,0.03711 l -3,1 A 0.15001501,0.15001501 0 0 1 12,22.150391 H 4.0175781 a 0.15001501,0.15001501 0 0 1 -0.072266,-0.0098 0.15001501,0.15001501 0 0 1 -0.00195,0 0.15001501,0.15001501 0 0 1 -0.011719,-0.0059 0.15001501,0.15001501 0 0 1 -0.00195,0 0.15001501,0.15001501 0 0 1 -0.011719,-0.0078 0.15001501,0.15001501 0 0 1 -0.013672,-0.0078 0.15001501,0.15001501 0 0 1 -0.00391,-0.0059 0.15001501,0.15001501 0 0 1 -0.00586,-0.0059 0.15001501,0.15001501 0 0 1 -0.019531,-0.02148 0.15001501,0.15001501 0 0 1 -0.00781,-0.01367 0.15001501,0.15001501 0 0 1 -0.00586,-0.01172 0.15001501,0.15001501 0 0 1 0,-0.002 0.15001501,0.15001501 0 0 1 -0.00586,-0.01172 0.15001501,0.15001501 0 0 1 0,-0.002 0.15001501,0.15001501 0 0 1 -0.00586,-0.02734 0.15001501,0.15001501 0 0 1 0,-0.002 0.15001501,0.15001501 0 0 1 0,-0.04297 V 1.0175781 a 0.15001501,0.15001501 0 0 1 0.00977,-0.0722656 0.15001501,0.15001501 0 0 1 0,-0.001953 0.15001501,0.15001501 0 0 1 0.00586,-0.0117188 0.15001501,0.15001501 0 0 1 0,-0.001953 0.15001501,0.15001501 0 0 1 0.00781,-0.0117188 0.15001501,0.15001501 0 0 1 0.00781,-0.0136719 0.15001501,0.15001501 0 0 1 0.00586,-0.003906 0.15001501,0.15001501 0 0 1 0.015625,-0.015625 0.15001501,0.15001501 0 0 1 0.023437,-0.0175781 0.15001501,0.15001501 0 0 1 0.029297,-0.0117188 0.15001501,0.15001501 0 0 1 0.027344,-0.005859 0.15001501,0.15001501 0 0 1 0.00195,0 0.15001501,0.15001501 0 0 1 0.013672,-0.001953 z"
     id="path2" />
</svg>
