<?xml version="1.0" encoding="UTF-8" standalone="no"?>
<svg
   xmlns:dc="http://purl.org/dc/elements/1.1/"
   xmlns:cc="http://creativecommons.org/ns#"
   xmlns:rdf="http://www.w3.org/1999/02/22-rdf-syntax-ns#"
   xmlns:svg="http://www.w3.org/2000/svg"
   xmlns="http://www.w3.org/2000/svg"
   xmlns:sodipodi="http://sodipodi.sourceforge.net/DTD/sodipodi-0.dtd"
   xmlns:inkscape="http://www.inkscape.org/namespaces/inkscape"
   data-dec="57"
   width="20"
   height="40"
   version="1.1"
   id="svg4"
   sodipodi:docname="57.svg"
   inkscape:version="0.92.2 2405546, 2018-03-11">
  <metadata
     id="metadata10">
    <rdf:RDF>
      <cc:Work
         rdf:about="">
        <dc:format>image/svg+xml</dc:format>
        <dc:type
           rdf:resource="http://purl.org/dc/dcmitype/StillImage" />
        <dc:title></dc:title>
      </cc:Work>
    </rdf:RDF>
  </metadata>
  <defs
     id="defs8" />
  <sodipodi:namedview
     pagecolor="#ffffff"
     bordercolor="#666666"
     borderopacity="1"
     objecttolerance="10"
     gridtolerance="10"
     guidetolerance="10"
     inkscape:pageopacity="0"
     inkscape:pageshadow="2"
     inkscape:window-width="640"
     inkscape:window-height="480"
     id="namedview6"
     showgrid="false"
     inkscape:zoom="5.9"
     inkscape:cx="10"
     inkscape:cy="20"
     inkscape:window-x="0"
     inkscape:window-y="17"
     inkscape:window-maximized="0"
     inkscape:current-layer="svg4" />
  <path
     style="color:#000000;font-style:normal;font-variant:normal;font-weight:normal;font-stretch:normal;font-size:medium;line-height:normal;font-family:sans-serif;font-variant-ligatures:normal;font-variant-position:normal;font-variant-caps:normal;font-variant-numeric:normal;font-variant-alternates:normal;font-feature-settings:normal;text-indent:0;text-align:start;text-decoration:none;text-decoration-line:none;text-decoration-style:solid;text-decoration-color:#000000;letter-spacing:normal;word-spacing:normal;text-transform:none;writing-mode:lr-tb;direction:ltr;text-orientation:mixed;dominant-baseline:auto;baseline-shift:baseline;text-anchor:start;white-space:normal;shape-padding:0;clip-rule:nonzero;display:inline;overflow:visible;visibility:visible;opacity:1;isolation:auto;mix-blend-mode:normal;color-interpolation:sRGB;color-interpolation-filters:linearRGB;solid-color:#000000;solid-opacity:1;vector-effect:none;fill:#013272;fill-opacity:1;fill-rule:nonzero;stroke:none;stroke-width:2;stroke-linecap:round;stroke-linejoin:round;stroke-miterlimit:4;stroke-dasharray:none;stroke-dashoffset:0;stroke-opacity:1;color-rendering:auto;image-rendering:auto;shape-rendering:auto;text-rendering:auto;enable-background:accumulate"
     d="M 9.2363281,4 7.5917969,4.8222656 5.875,6.5410156 5,9.1621094 V 9.8378906 L 5.875,12.458984 7.5917969,14.177734 9.2363281,15 H 10.763672 L 12.408203,14.177734 13.177734,13.408203 14.939453,9.8828125 14.097656,6.5117188 12.408203,4.8222656 10.763672,4 Z M 9,2 h 2 a 1.0001,1.0001 0 0 1 0.447266,0.1054688 l 2,1 a 1.0001,1.0001 0 0 1 0.259765,0.1875 l 2,2 a 1.0001,1.0001 0 0 1 0.263672,0.4648437 L 16.9375,9.6289062 A 1.0001,1.0001 0 0 1 17,10.09375 V 15 a 1.0001,1.0001 0 0 1 -0.05078,0.316406 l -1,3 a 1.0001,1.0001 0 0 1 -0.117188,0.238282 l -2,3 a 1.0001,1.0001 0 0 1 -0.515625,0.394531 l -3,1 A 1.0001,1.0001 0 0 1 10,23 H 8 A 1.0001,1.0001 0 0 1 7.5527344,22.894531 l -2,-1 a 1.0001,1.0001 0 0 1 -0.2597656,-0.1875 l -1,-1 A 1.0001,1.0001 0 1 1 5.7070312,19.292969 L 6.5917969,20.177734 8.2363281,21 H 9.8378906 L 12.357422,20.160156 14.09375,17.556641 15,14.837891 v -0.601563 l -0.105469,0.210938 a 1.0001,1.0001 0 0 1 -0.1875,0.259765 l -1,1 a 1.0001,1.0001 0 0 1 -0.259765,0.1875 l -2,1 A 1.0001,1.0001 0 0 1 11,17 H 9 A 1.0001,1.0001 0 0 1 8.5527344,16.894531 l -2,-1 a 1.0001,1.0001 0 0 1 -0.2597656,-0.1875 l -2,-2 A 1.0001,1.0001 0 0 1 4.0507812,13.316406 l -1,-3 A 1.0001,1.0001 0 0 1 3,10 V 9 a 1.0001,1.0001 0 0 1 0.050781,-0.3164062 l 1,-3 a 1.0001,1.0001 0 0 1 0.2421876,-0.390625 l 2,-2 a 1.0001,1.0001 0 0 1 0.2597656,-0.1875 l 2,-1 A 1.0001,1.0001 0 0 1 9,2 Z"
     id="path2" />
</svg>
