<?xml version="1.0" encoding="UTF-8" standalone="no"?>
<svg
   xmlns:dc="http://purl.org/dc/elements/1.1/"
   xmlns:cc="http://creativecommons.org/ns#"
   xmlns:rdf="http://www.w3.org/1999/02/22-rdf-syntax-ns#"
   xmlns:svg="http://www.w3.org/2000/svg"
   xmlns="http://www.w3.org/2000/svg"
   xmlns:sodipodi="http://sodipodi.sourceforge.net/DTD/sodipodi-0.dtd"
   xmlns:inkscape="http://www.inkscape.org/namespaces/inkscape"
   data-dec="37"
   id="dec_37"
   width="24"
   height="40"
   version="1.1"
   inkscape:version="0.91 r13725"
   sodipodi:docname="37.svg">
  <metadata
     id="metadata9">
    <rdf:RDF>
      <cc:Work
         rdf:about="">
        <dc:format>image/svg+xml</dc:format>
        <dc:type
           rdf:resource="http://purl.org/dc/dcmitype/StillImage" />
      </cc:Work>
    </rdf:RDF>
  </metadata>
  <defs
     id="defs7" />
  <sodipodi:namedview
     pagecolor="#ffffff"
     bordercolor="#666666"
     borderopacity="1"
     objecttolerance="10"
     gridtolerance="10"
     guidetolerance="10"
     inkscape:pageopacity="0"
     inkscape:pageshadow="2"
     inkscape:window-width="640"
     inkscape:window-height="480"
     id="namedview5"
     showgrid="false"
     inkscape:zoom="5.9"
     inkscape:cx="12"
     inkscape:cy="20"
     inkscape:window-x="33"
     inkscape:window-y="24"
     inkscape:window-maximized="0"
     inkscape:current-layer="dec_37" />
  <path
     style="color:#000000;font-style:normal;font-variant:normal;font-weight:normal;font-stretch:normal;font-size:medium;line-height:normal;font-family:sans-serif;text-indent:0;text-align:start;text-decoration:none;text-decoration-line:none;text-decoration-style:solid;text-decoration-color:#000000;letter-spacing:normal;word-spacing:normal;text-transform:none;direction:ltr;block-progression:tb;writing-mode:lr-tb;baseline-shift:baseline;text-anchor:start;white-space:normal;clip-rule:nonzero;display:inline;overflow:visible;visibility:visible;opacity:1;isolation:auto;mix-blend-mode:normal;color-interpolation:sRGB;color-interpolation-filters:linearRGB;solid-color:#000000;solid-opacity:1;fill:#000000;fill-opacity:1;fill-rule:nonzero;stroke:none;stroke-width:1;stroke-linecap:round;stroke-linejoin:round;stroke-miterlimit:4;stroke-dasharray:none;stroke-dashoffset:0;stroke-opacity:1;color-rendering:auto;image-rendering:auto;shape-rendering:auto;text-rendering:auto;enable-background:accumulate"
     d="M 7.9941406 0.49414062 A 0.50005 0.50005 0 0 0 7.9335938 0.5 L 6 0.5 A 0.50005 0.50005 0 0 0 5.7773438 0.55273438 L 3.7773438 1.5527344 A 0.50005 0.50005 0 0 0 3.5527344 1.7773438 L 2.5527344 3.7773438 A 0.50005 0.50005 0 0 0 2.5 4 L 2.5 6 A 0.50005 0.50005 0 0 0 2.6464844 6.3535156 L 4.6464844 8.3535156 A 0.50005 0.50005 0 0 0 5 8.5 L 7 8.5 A 0.50005 0.50005 0 0 0 7.2226562 8.4472656 L 9.2226562 7.4472656 A 0.50005 0.50005 0 0 0 9.4472656 7.2226562 L 10.447266 5.2226562 A 0.50005 0.50005 0 0 0 10.5 5 L 10.5 3 A 0.50005 0.50005 0 0 0 10.353516 2.6464844 L 12.841797 3.4746094 A 0.50005 0.50005 0 0 0 13 3.5 L 16 3.5 A 0.50005 0.50005 0 0 0 16.158203 3.4746094 L 19.044922 2.5117188 L 2.6210938 21.673828 A 0.50005 0.50005 0 1 0 3.3789062 22.326172 L 21.345703 1.3652344 L 21.347656 1.3632812 A 0.50005 0.50005 0 0 0 21.503906 0.95703125 A 0.50005 0.50005 0 0 0 21.503906 0.95507812 A 0.50005 0.50005 0 0 0 21.503906 0.94921875 A 0.50005 0.50005 0 0 0 21.488281 0.86914062 A 0.50005 0.50005 0 0 0 21.486328 0.85742188 A 0.50005 0.50005 0 0 0 21.470703 0.8125 A 0.50005 0.50005 0 0 0 21.46875 0.81054688 A 0.50005 0.50005 0 0 0 21.449219 0.765625 A 0.50005 0.50005 0 0 0 21.396484 0.68359375 A 0.50005 0.50005 0 0 0 21.394531 0.68164062 A 0.50005 0.50005 0 0 0 21.392578 0.6796875 A 0.50005 0.50005 0 0 0 21.361328 0.64453125 A 0.50005 0.50005 0 0 0 21.326172 0.61132812 A 0.50005 0.50005 0 0 0 21.324219 0.609375 A 0.50005 0.50005 0 0 0 21.150391 0.51757812 A 0.50005 0.50005 0 0 0 20.732422 0.57421875 L 18.808594 1.5371094 L 15.917969 2.5 L 13.082031 2.5 L 10.191406 1.5371094 L 8.2558594 0.5703125 A 0.50005 0.50005 0 0 0 7.9941406 0.49414062 z M 6.1171875 1.5 L 7.7929688 1.5 L 9.5 3.2070312 L 9.5 4.8828125 L 8.6269531 6.6269531 L 6.8828125 7.5 L 5.2070312 7.5 L 3.5 5.7929688 L 3.5 4.1171875 L 4.3730469 2.3730469 L 6.1171875 1.5 z M 17.001953 14.496094 A 0.50005 0.50005 0 0 0 16.910156 14.505859 A 0.50005 0.50005 0 0 0 16.855469 14.519531 A 0.50005 0.50005 0 0 0 16.726562 14.578125 A 0.50005 0.50005 0 0 0 16.716797 14.583984 L 14.777344 15.552734 A 0.50005 0.50005 0 0 0 14.552734 15.777344 L 13.552734 17.777344 A 0.50005 0.50005 0 0 0 13.5 18 L 13.5 20 A 0.50005 0.50005 0 0 0 13.646484 20.353516 L 15.646484 22.353516 A 0.50005 0.50005 0 0 0 16 22.5 L 18 22.5 A 0.50005 0.50005 0 0 0 18.222656 22.447266 L 20.222656 21.447266 A 0.50005 0.50005 0 0 0 20.447266 21.222656 L 21.447266 19.222656 A 0.50005 0.50005 0 0 0 21.5 19 L 21.5 17 A 0.50005 0.50005 0 0 0 21.353516 16.646484 L 19.353516 14.646484 A 0.50005 0.50005 0 0 0 19 14.5 L 17.064453 14.5 A 0.50005 0.50005 0 0 0 17.001953 14.496094 z M 17.117188 15.5 L 18.792969 15.5 L 20.5 17.207031 L 20.5 18.882812 L 19.626953 20.626953 L 17.882812 21.5 L 16.207031 21.5 L 14.5 19.792969 L 14.5 18.117188 L 15.373047 16.373047 L 17.117188 15.5 z "
     id="path3" />
</svg>
