<?xml version="1.0" encoding="UTF-8" standalone="no"?>
<svg
   xmlns:dc="http://purl.org/dc/elements/1.1/"
   xmlns:cc="http://creativecommons.org/ns#"
   xmlns:rdf="http://www.w3.org/1999/02/22-rdf-syntax-ns#"
   xmlns:svg="http://www.w3.org/2000/svg"
   xmlns="http://www.w3.org/2000/svg"
   xmlns:sodipodi="http://sodipodi.sourceforge.net/DTD/sodipodi-0.dtd"
   xmlns:inkscape="http://www.inkscape.org/namespaces/inkscape"
   data-dec="64"
   width="28"
   height="40"
   version="1.1"
   id="svg4"
   sodipodi:docname="64.svg"
   inkscape:version="0.92.4 (unknown)">
  <metadata
     id="metadata10">
    <rdf:RDF>
      <cc:Work
         rdf:about="">
        <dc:format>image/svg+xml</dc:format>
        <dc:type
           rdf:resource="http://purl.org/dc/dcmitype/StillImage" />
      </cc:Work>
    </rdf:RDF>
  </metadata>
  <defs
     id="defs8" />
  <sodipodi:namedview
     pagecolor="#ffffff"
     bordercolor="#666666"
     borderopacity="1"
     objecttolerance="10"
     gridtolerance="10"
     guidetolerance="10"
     inkscape:pageopacity="0"
     inkscape:pageshadow="2"
     inkscape:window-width="640"
     inkscape:window-height="480"
     id="namedview6"
     showgrid="false"
     inkscape:zoom="5.9"
     inkscape:cx="14"
     inkscape:cy="20"
     inkscape:window-x="0"
     inkscape:window-y="27"
     inkscape:window-maximized="0"
     inkscape:current-layer="svg4" />
  <path
     style="color:#000000;font-style:normal;font-variant:normal;font-weight:normal;font-stretch:normal;font-size:medium;line-height:normal;font-family:sans-serif;font-variant-ligatures:normal;font-variant-position:normal;font-variant-caps:normal;font-variant-numeric:normal;font-variant-alternates:normal;font-feature-settings:normal;text-indent:0;text-align:start;text-decoration:none;text-decoration-line:none;text-decoration-style:solid;text-decoration-color:#000000;letter-spacing:normal;word-spacing:normal;text-transform:none;writing-mode:lr-tb;direction:ltr;text-orientation:mixed;dominant-baseline:auto;baseline-shift:baseline;text-anchor:start;white-space:normal;shape-padding:0;clip-rule:nonzero;display:inline;overflow:visible;visibility:visible;opacity:1;isolation:auto;mix-blend-mode:normal;color-interpolation:sRGB;color-interpolation-filters:linearRGB;solid-color:#000000;solid-opacity:1;vector-effect:none;fill:#013272;fill-opacity:1;fill-rule:nonzero;stroke:none;stroke-width:0.5;stroke-linecap:round;stroke-linejoin:round;stroke-miterlimit:4;stroke-dasharray:none;stroke-dashoffset:0;stroke-opacity:1;color-rendering:auto;image-rendering:auto;shape-rendering:auto;text-rendering:auto;enable-background:accumulate"
     d="M 10.730469,6.9140625 10.148438,7.2050781 9.21875,8.1347656 8.25,11.041016 v 2.90039 l 0.9355469,1.873047 0.5917969,0.294922 -1,-1.998047 A 0.250025,0.250025 0 0 1 8.75,14 v -3 a 0.250025,0.250025 0 0 1 0.013672,-0.07813 l 1,-3 a 0.250025,0.250025 0 0 1 0.058594,-0.099609 z M 12.105469,6.25 10.21875,8.1347656 9.25,11.041016 v 2.90039 l 0.955078,1.910156 0.900391,0.898438 h 2.835937 L 15.814453,15.814453 16.757812,13.929688 17.443359,8.4414062 16.814453,7.1855469 14.941406,6.25 Z M 12,0.75 h 3 a 0.250025,0.250025 0 0 1 0.07813,0.0136719 l 3,1.00000002 a 0.250025,0.250025 0 0 1 0.0332,0.013672 l 2,1 a 0.250025,0.250025 0 0 1 0.06641,0.044922 l 2,2 a 0.250025,0.250025 0 0 1 0.04492,0.066406 l 1,2 a 0.250025,0.250025 0 0 1 0.01367,0.033203 l 1,3 A 0.250025,0.250025 0 0 1 24.25,10 v 2 a 0.250025,0.250025 0 0 1 -0.01367,0.07813 l -1,3 a 0.250025,0.250025 0 0 1 -0.05859,0.09961 l -2,2 A 0.250025,0.250025 0 0 1 21,17.25 h -1.960938 a 0.250025,0.250025 0 0 1 -0.128906,-0.01563 0.250025,0.250025 0 0 1 -0.0059,-0.002 0.250025,0.250025 0 0 1 -0.04297,-0.02344 L 16.888672,16.222656 A 0.250025,0.250025 0 0 1 16.75,16 v -0.943359 l -0.527344,1.054687 a 0.250025,0.250025 0 0 1 -0.111328,0.111328 l -2,1 A 0.250025,0.250025 0 0 1 14,17.25 h -2.960938 a 0.250025,0.250025 0 0 1 -0.128906,-0.01563 0.250025,0.250025 0 0 1 -0.0059,-0.002 0.250025,0.250025 0 0 1 -0.04297,-0.02344 L 8.8886719,16.222656 A 0.250025,0.250025 0 0 1 8.7773438,16.111328 l -1,-2 A 0.250025,0.250025 0 0 1 7.75,14 v -3 a 0.250025,0.250025 0 0 1 0.013672,-0.07813 l 1,-3 a 0.250025,0.250025 0 0 1 0.058594,-0.099609 l 1,-1 a 0.250025,0.250025 0 0 1 0.066406,-0.044922 L 11.855469,5.7949219 a 0.250025,0.250025 0 0 1 0.0078,-0.00391 0.250025,0.250025 0 0 1 0.03906,-0.021484 0.250025,0.250025 0 0 1 0.02344,-0.00781 A 0.250025,0.250025 0 0 1 12.03125,5.75 H 15 a 0.250025,0.250025 0 0 1 0.111328,0.027344 l 2,1 a 0.250025,0.250025 0 0 1 0.111328,0.1113281 L 17.554688,7.5507812 17.751953,5.96875 a 0.250025,0.250025 0 1 1 0.496094,0.0625 l -0.291016,2.3261719 0.265625,0.53125 A 0.250025,0.250025 0 0 1 17.851562,9.203125 l -0.599609,4.789063 -0.002,0.02344 v 1.830078 l 0.525391,0.263672 A 0.250025,0.250025 0 0 1 17.75,16 v -2 a 0.250025,0.250025 0 0 1 0.002,-0.03125 l 1,-8 a 0.250025,0.250025 0 1 1 0.496094,0.0625 L 18.25,14.015625 v 1.880859 L 19.105469,16.75 h 1.791015 L 22.78125,14.865234 23.75,11.958984 V 10.041016 L 22.767578,7.0957031 21.794922,5.1484375 19.851562,3.2050781 17.904297,2.2324219 14.958984,1.25 H 12.041016 L 9.0957031,2.2324219 7.1484375,3.2050781 5.2050781,5.1484375 4.2324219,7.0957031 3.25,10.041016 v 2.917968 l 0.9824219,2.945313 0.9726562,1.947265 1.9433594,1.94336 1.9472656,0.972656 L 12.041016,21.75 h 2.917968 l 2.945313,-0.982422 1.947265,-0.972656 0.970704,-0.972656 a 0.25135808,0.25135808 0 1 1 0.355468,0.355468 l -1,1 a 0.250025,0.250025 0 0 1 -0.06641,0.04492 l -2,1 a 0.250025,0.250025 0 0 1 -0.0332,0.01367 l -3,1 A 0.250025,0.250025 0 0 1 15,22.25 h -3 a 0.250025,0.250025 0 0 1 -0.07813,-0.01367 l -3,-1 a 0.250025,0.250025 0 0 1 -0.033203,-0.01367 l -2,-1 a 0.250025,0.250025 0 0 1 -0.066406,-0.04492 l -2,-2 a 0.250025,0.250025 0 0 1 -0.044922,-0.06641 l -1,-2 a 0.250025,0.250025 0 0 1 -0.013672,-0.0332 l -1,-3 A 0.250025,0.250025 0 0 1 2.75,13 v -3 a 0.250025,0.250025 0 0 1 0.013672,-0.078125 l 1,-3 a 0.250025,0.250025 0 0 1 0.013672,-0.033203 l 1,-2 a 0.250025,0.250025 0 0 1 0.044922,-0.066406 l 2,-2 a 0.250025,0.250025 0 0 1 0.066406,-0.044922 l 2,-1 a 0.250025,0.250025 0 0 1 0.033203,-0.013672 l 3,-1.00000002 A 0.250025,0.250025 0 0 1 12,0.75 Z"
     id="path2" />
</svg>
