<?xml version="1.0" encoding="UTF-8"?>
<glyph name="plus" format="1">
  <advance width="752"/>
  <unicode hex="002B"/>
  <outline>
    <contour>
      <point x="346" y="565" type="curve" smooth="yes"/>
      <point x="348" y="565" type="line" smooth="yes"/>
      <point x="349" y="565"/>
      <point x="350" y="564"/>
      <point x="351" y="564" type="curve" smooth="yes"/>
      <point x="376" y="564" type="line" smooth="yes"/>
      <point x="388" y="564"/>
      <point x="398" y="555"/>
      <point x="398" y="543" type="curve" smooth="yes"/>
      <point x="398" y="333" type="line"/>
      <point x="608" y="333" type="line" smooth="yes"/>
      <point x="620" y="333"/>
      <point x="629" y="323"/>
      <point x="629" y="311" type="curve" smooth="yes"/>
      <point x="629" y="286" type="line" smooth="yes"/>
      <point x="629" y="285"/>
      <point x="630" y="284"/>
      <point x="630" y="283" type="curve" smooth="yes"/>
      <point x="630" y="279"/>
      <point x="627" y="270"/>
      <point x="624" y="267" type="curve" smooth="yes"/>
      <point x="623" y="266" type="line"/>
      <point x="622" y="265" type="line" smooth="yes"/>
      <point x="619" y="262"/>
      <point x="612" y="261"/>
      <point x="608" y="261" type="curve" smooth="yes"/>
      <point x="604" y="261" type="line"/>
      <point x="398" y="261" type="line"/>
      <point x="398" y="54" type="line"/>
      <point x="398" y="51" type="line" smooth="yes"/>
      <point x="398" y="47"/>
      <point x="396" y="38"/>
      <point x="393" y="35" type="curve" smooth="yes"/>
      <point x="392" y="35" type="line"/>
      <point x="390" y="34" type="line" smooth="yes"/>
      <point x="387" y="31"/>
      <point x="380" y="29"/>
      <point x="376" y="29" type="curve" smooth="yes"/>
      <point x="373" y="29" type="line"/>
      <point x="348" y="29" type="line" smooth="yes"/>
      <point x="336" y="29"/>
      <point x="326" y="39"/>
      <point x="326" y="51" type="curve" smooth="yes"/>
      <point x="326" y="261" type="line"/>
      <point x="116" y="261" type="line" smooth="yes"/>
      <point x="104" y="261"/>
      <point x="95" y="271"/>
      <point x="95" y="283" type="curve" smooth="yes"/>
      <point x="95" y="308" type="line" smooth="yes"/>
      <point x="95" y="309"/>
      <point x="94" y="310"/>
      <point x="94" y="311" type="curve" smooth="yes"/>
      <point x="94" y="315"/>
      <point x="97" y="324"/>
      <point x="100" y="327" type="curve" smooth="yes"/>
      <point x="101" y="328" type="line" smooth="yes"/>
      <point x="104" y="331"/>
      <point x="112" y="333"/>
      <point x="116" y="333" type="curve" smooth="yes"/>
      <point x="120" y="333" type="line"/>
      <point x="326" y="333" type="line"/>
      <point x="326" y="539" type="line"/>
      <point x="326" y="543" type="line" smooth="yes"/>
      <point x="326" y="547"/>
      <point x="328" y="555"/>
      <point x="331" y="558" type="curve" smooth="yes"/>
      <point x="332" y="558" type="line"/>
      <point x="332" y="559" type="line"/>
      <point x="333" y="560" type="line" smooth="yes"/>
      <point x="336" y="563"/>
      <point x="342" y="565"/>
    </contour>
  </outline>
  <lib>
    <dict>
      <key>com.fontlab.hintData</key>
      <dict>
        <key>hhints</key>
        <array>
          <dict>
            <key>position</key>
            <integer>261</integer>
            <key>width</key>
            <integer>73</integer>
          </dict>
        </array>
        <key>vhints</key>
        <array>
          <dict>
            <key>position</key>
            <integer>326</integer>
            <key>width</key>
            <integer>73</integer>
          </dict>
        </array>
      </dict>
    </dict>
  </lib>
</glyph>
