<?xml version="1.0" encoding="UTF-8" standalone="no"?>
<svg
   xmlns:dc="http://purl.org/dc/elements/1.1/"
   xmlns:cc="http://creativecommons.org/ns#"
   xmlns:rdf="http://www.w3.org/1999/02/22-rdf-syntax-ns#"
   xmlns:svg="http://www.w3.org/2000/svg"
   xmlns="http://www.w3.org/2000/svg"
   xmlns:sodipodi="http://sodipodi.sourceforge.net/DTD/sodipodi-0.dtd"
   xmlns:inkscape="http://www.inkscape.org/namespaces/inkscape"
   data-dec="75"
   width="22"
   height="40"
   version="1.1"
   id="svg4"
   sodipodi:docname="75.svg"
   inkscape:version="0.92.4 5da689c313, 2019-01-14">
  <metadata
     id="metadata10">
    <rdf:RDF>
      <cc:Work
         rdf:about="">
        <dc:format>image/svg+xml</dc:format>
        <dc:type
           rdf:resource="http://purl.org/dc/dcmitype/StillImage" />
        <dc:title></dc:title>
      </cc:Work>
    </rdf:RDF>
  </metadata>
  <defs
     id="defs8" />
  <sodipodi:namedview
     pagecolor="#ffffff"
     bordercolor="#666666"
     borderopacity="1"
     objecttolerance="10"
     gridtolerance="10"
     guidetolerance="10"
     inkscape:pageopacity="0"
     inkscape:pageshadow="2"
     inkscape:window-width="1920"
     inkscape:window-height="1043"
     id="namedview6"
     showgrid="false"
     inkscape:zoom="5.9"
     inkscape:cx="11"
     inkscape:cy="20"
     inkscape:window-x="0"
     inkscape:window-y="37"
     inkscape:window-maximized="0"
     inkscape:current-layer="svg4" />
  <path
     style="color:#000000;font-style:normal;font-variant:normal;font-weight:normal;font-stretch:normal;font-size:medium;line-height:normal;font-family:sans-serif;font-variant-ligatures:normal;font-variant-position:normal;font-variant-caps:normal;font-variant-numeric:normal;font-variant-alternates:normal;font-feature-settings:normal;text-indent:0;text-align:start;text-decoration:none;text-decoration-line:none;text-decoration-style:solid;text-decoration-color:#000000;letter-spacing:normal;word-spacing:normal;text-transform:none;writing-mode:lr-tb;direction:ltr;text-orientation:mixed;dominant-baseline:auto;baseline-shift:baseline;text-anchor:start;white-space:normal;shape-padding:0;clip-rule:nonzero;display:inline;overflow:visible;visibility:visible;opacity:1;isolation:auto;mix-blend-mode:normal;color-interpolation:sRGB;color-interpolation-filters:linearRGB;solid-color:#000000;solid-opacity:1;vector-effect:none;fill:#000000;fill-opacity:1;fill-rule:nonzero;stroke:none;stroke-width:1.5;stroke-linecap:round;stroke-linejoin:round;stroke-miterlimit:4;stroke-dasharray:none;stroke-dashoffset:0;stroke-opacity:1;color-rendering:auto;image-rendering:auto;shape-rendering:auto;text-rendering:auto;enable-background:accumulate"
     d="M 3.9882812,0.24023438 A 0.750075,0.750075 0 0 1 4.1230469,0.25 H 5 A 0.750075,0.750075 0 0 1 5.75,1 V 11.1875 L 7.3789062,9.5605469 a 0.750075,0.750075 0 0 1 0.00781,-0.00977 0.750075,0.750075 0 0 1 0.1621093,-0.1621093 L 16.46875,0.46875 A 0.750075,0.750075 0 0 1 17,0.25 h 0.900391 a 0.750075,0.750075 0 0 1 0.763671,0.38085938 0.750075,0.750075 0 0 1 0.002,0.001953 0.750075,0.750075 0 0 1 0.03125,0.0644531 0.750075,0.750075 0 0 1 0,0.001953 0.750075,0.750075 0 0 1 0.02734,0.0683594 0.750075,0.750075 0 0 1 0,0.001953 0.750075,0.750075 0 0 1 -0.253906,0.82226565 L 9.9902344,10.072266 18.537109,21.466797 a 0.750075,0.750075 0 0 1 0.203125,0.699219 0.750075,0.750075 0 0 1 -0.01953,0.07031 0.750075,0.750075 0 0 1 0,0.002 0.750075,0.750075 0 0 1 -0.01563,0.04297 0.750075,0.750075 0 0 1 -0.01172,0.02734 0.750075,0.750075 0 0 1 -0.01953,0.04102 0.750075,0.750075 0 0 1 -0.002,0.0039 0.750075,0.750075 0 0 1 -0.03516,0.06055 0.750075,0.750075 0 0 1 -0.04492,0.06055 A 0.750075,0.750075 0 0 1 17.890625,22.75 H 17 A 0.750075,0.750075 0 0 1 16.400391,22.449219 L 8.3496094,11.712891 5.75,14.3125 v 7.564453 a 0.750075,0.750075 0 0 1 -0.2011719,0.644531 0.750075,0.750075 0 0 1 -0.00391,0.0039 0.750075,0.750075 0 0 1 -0.00391,0.0039 0.750075,0.750075 0 0 1 -0.048828,0.04687 0.750075,0.750075 0 0 1 -0.00586,0.0039 A 0.750075,0.750075 0 0 1 4.8769531,22.75 H 4 A 0.750075,0.750075 0 0 1 3.25,22 V 1.1230469 a 0.750075,0.750075 0 0 1 0.2011719,-0.64453128 0.750075,0.750075 0 0 1 0.00586,-0.005859 0.750075,0.750075 0 0 1 0.00586,-0.005859 0.750075,0.750075 0 0 1 0.050781,-0.046875 0.750075,0.750075 0 0 1 0.4746093,-0.1796875 z"
     id="path2" />
</svg>
