<?xml version="1.0" encoding="UTF-8" standalone="no"?>
<svg
   xmlns:dc="http://purl.org/dc/elements/1.1/"
   xmlns:cc="http://creativecommons.org/ns#"
   xmlns:rdf="http://www.w3.org/1999/02/22-rdf-syntax-ns#"
   xmlns:svg="http://www.w3.org/2000/svg"
   xmlns="http://www.w3.org/2000/svg"
   xmlns:sodipodi="http://sodipodi.sourceforge.net/DTD/sodipodi-0.dtd"
   xmlns:inkscape="http://www.inkscape.org/namespaces/inkscape"
   data-dec="117"
   width="19"
   height="40"
   version="1.1"
   id="svg4"
   sodipodi:docname="117.svg"
   inkscape:version="0.92.4 5da689c313, 2019-01-14">
  <metadata
     id="metadata10">
    <rdf:RDF>
      <cc:Work
         rdf:about="">
        <dc:format>image/svg+xml</dc:format>
        <dc:type
           rdf:resource="http://purl.org/dc/dcmitype/StillImage" />
        <dc:title></dc:title>
      </cc:Work>
    </rdf:RDF>
  </metadata>
  <defs
     id="defs8" />
  <sodipodi:namedview
     pagecolor="#ffffff"
     bordercolor="#666666"
     borderopacity="1"
     objecttolerance="10"
     gridtolerance="10"
     guidetolerance="10"
     inkscape:pageopacity="0"
     inkscape:pageshadow="2"
     inkscape:window-width="1920"
     inkscape:window-height="1043"
     id="namedview6"
     showgrid="false"
     inkscape:zoom="5.9"
     inkscape:cx="9.5"
     inkscape:cy="20"
     inkscape:window-x="0"
     inkscape:window-y="37"
     inkscape:window-maximized="0"
     inkscape:current-layer="svg4" />
  <path
     style="color:#000000;font-style:normal;font-variant:normal;font-weight:normal;font-stretch:normal;font-size:medium;line-height:normal;font-family:sans-serif;font-variant-ligatures:normal;font-variant-position:normal;font-variant-caps:normal;font-variant-numeric:normal;font-variant-alternates:normal;font-feature-settings:normal;text-indent:0;text-align:start;text-decoration:none;text-decoration-line:none;text-decoration-style:solid;text-decoration-color:#000000;letter-spacing:normal;word-spacing:normal;text-transform:none;writing-mode:lr-tb;direction:ltr;text-orientation:mixed;dominant-baseline:auto;baseline-shift:baseline;text-anchor:start;white-space:normal;shape-padding:0;clip-rule:nonzero;display:inline;overflow:visible;visibility:visible;opacity:1;isolation:auto;mix-blend-mode:normal;color-interpolation:sRGB;color-interpolation-filters:linearRGB;solid-color:#000000;solid-opacity:1;vector-effect:none;fill:#000000;fill-opacity:1;fill-rule:nonzero;stroke:none;stroke-width:0.5;stroke-linecap:round;stroke-linejoin:round;stroke-miterlimit:4;stroke-dasharray:none;stroke-dashoffset:0;stroke-opacity:1;color-rendering:auto;image-rendering:auto;shape-rendering:auto;text-rendering:auto;enable-background:accumulate"
     d="M 15.25,8.25 V 8.3945312 L 15.394531,8.25 Z m -1,0 v 0.7207031 a 0.250025,0.250025 0 0 1 0,0.060547 v 8.941406 a 0.250025,0.250025 0 0 1 0,0.05078 v 3.630859 L 15.787109,21.142578 15.25,20.605469 V 21 a 0.250025,0.250025 0 1 1 -0.5,0 v -0.970703 a 0.250025,0.250025 0 0 1 0,-0.06055 V 9.0390625 a 0.250025,0.250025 0 0 1 0,-0.074219 V 8.25 Z m -0.644531,0 L 13.75,8.3945312 V 8.25 Z M 5.25,8.25 V 8.3945312 L 5.3945312,8.25 Z m -1,0 v 0.7207031 a 0.250025,0.250025 0 0 1 0,0.060547 v 9.910156 l 0.9277344,1.853516 0.5292968,0.175781 -0.9296874,-1.859375 A 0.250025,0.250025 0 0 1 4.75,19 V 9.0390625 a 0.250025,0.250025 0 0 1 0,-0.074219 V 8.25 Z M 3.6054688,8.25 3.75,8.3945312 V 8.25 Z M 3.9960938,7.7460938 A 0.250025,0.250025 0 0 1 4.046875,7.75 h 0.9121094 a 0.250025,0.250025 0 0 1 0.087891,0 H 6 7 a 0.250025,0.250025 0 0 1 0,0.5 H 6.1035156 L 5.25,9.1054688 V 18.941406 L 6.1855469,20.814453 8.0566406,21.75 H 9.9414062 L 11.828125,20.806641 13.75,17.923828 V 9.1054688 L 12.896484,8.25 H 12 a 0.250025,0.250025 0 0 1 0,-0.5 h 1.021484 0.9375 a 0.250025,0.250025 0 0 1 0.08789,0 h 0.912109 a 0.250025,0.250025 0 0 1 0.08789,0 H 16 17 a 0.250025,0.250025 0 0 1 0,0.5 H 16.103516 L 15.25,9.1054688 V 19.894531 L 16.103516,20.75 H 17 a 0.250025,0.250025 0 0 1 0.07813,0.486328 l -2.955078,0.984375 a 0.250025,0.250025 0 0 1 -0.0039,0.002 0.250025,0.250025 0 0 1 -0.13086,0.0293 0.250025,0.250025 0 0 1 -0.07031,-0.01367 0.250025,0.250025 0 0 1 -0.0039,0 0.250025,0.250025 0 0 1 -0.0078,-0.0039 0.250025,0.250025 0 0 1 -0.01563,-0.0059 0.250025,0.250025 0 0 1 -0.0059,-0.002 0.250025,0.250025 0 0 1 -0.01563,-0.0098 0.250025,0.250025 0 0 1 -0.0078,-0.0039 0.250025,0.250025 0 0 1 -0.01367,-0.0098 0.250025,0.250025 0 0 1 -0.0059,-0.0059 0.250025,0.250025 0 0 1 -0.01172,-0.0098 0.250025,0.250025 0 0 1 -0.03906,-0.04492 0.250025,0.250025 0 0 1 -0.04102,-0.18164 v -3.132813 l -1.541016,2.310547 a 0.250025,0.250025 0 0 1 -0.09766,0.08398 l -2,1 A 0.250025,0.250025 0 0 1 10,22.25 H 8.0332031 a 0.250025,0.250025 0 0 1 -0.039063,0 0.250025,0.250025 0 0 1 -0.00977,0 0.250025,0.250025 0 0 1 -0.015625,-0.002 0.250025,0.250025 0 0 1 -0.023437,-0.0039 0.250025,0.250025 0 0 1 -0.00977,-0.002 0.250025,0.250025 0 0 1 -0.035156,-0.01367 L 4.921875,21.236328 a 0.250025,0.250025 0 0 1 -0.1445312,-0.125 l -1,-2 A 0.250025,0.250025 0 0 1 3.75,19 V 9.1054688 L 2.8964844,8.25 H 2 a 0.250025,0.250025 0 0 1 0,-0.5 h 1.0214844 0.9375 a 0.250025,0.250025 0 0 1 0.037109,-0.00391 z"
     id="path2" />
</svg>
