<?xml version="1.0" encoding="UTF-8" standalone="no"?>
<svg
   xmlns:dc="http://purl.org/dc/elements/1.1/"
   xmlns:cc="http://creativecommons.org/ns#"
   xmlns:rdf="http://www.w3.org/1999/02/22-rdf-syntax-ns#"
   xmlns:svg="http://www.w3.org/2000/svg"
   xmlns="http://www.w3.org/2000/svg"
   xmlns:sodipodi="http://sodipodi.sourceforge.net/DTD/sodipodi-0.dtd"
   xmlns:inkscape="http://www.inkscape.org/namespaces/inkscape"
   data-dec="54"
   width="17"
   height="40"
   version="1.1"
   id="svg4"
   sodipodi:docname="54.svg"
   inkscape:version="0.92.4 (unknown)">
  <metadata
     id="metadata10">
    <rdf:RDF>
      <cc:Work
         rdf:about="">
        <dc:format>image/svg+xml</dc:format>
        <dc:type
           rdf:resource="http://purl.org/dc/dcmitype/StillImage" />
      </cc:Work>
    </rdf:RDF>
  </metadata>
  <defs
     id="defs8" />
  <sodipodi:namedview
     pagecolor="#ffffff"
     bordercolor="#666666"
     borderopacity="1"
     objecttolerance="10"
     gridtolerance="10"
     guidetolerance="10"
     inkscape:pageopacity="0"
     inkscape:pageshadow="2"
     inkscape:window-width="640"
     inkscape:window-height="480"
     id="namedview6"
     showgrid="false"
     inkscape:zoom="5.9"
     inkscape:cx="8.5"
     inkscape:cy="20"
     inkscape:window-x="0"
     inkscape:window-y="27"
     inkscape:window-maximized="0"
     inkscape:current-layer="svg4" />
  <path
     style="color:#000000;font-style:normal;font-variant:normal;font-weight:normal;font-stretch:normal;font-size:medium;line-height:normal;font-family:sans-serif;font-variant-ligatures:normal;font-variant-position:normal;font-variant-caps:normal;font-variant-numeric:normal;font-variant-alternates:normal;font-feature-settings:normal;text-indent:0;text-align:start;text-decoration:none;text-decoration-line:none;text-decoration-style:solid;text-decoration-color:#000000;letter-spacing:normal;word-spacing:normal;text-transform:none;writing-mode:lr-tb;direction:ltr;text-orientation:mixed;dominant-baseline:auto;baseline-shift:baseline;text-anchor:start;white-space:normal;shape-padding:0;clip-rule:nonzero;display:inline;overflow:visible;visibility:visible;opacity:1;isolation:auto;mix-blend-mode:normal;color-interpolation:sRGB;color-interpolation-filters:linearRGB;solid-color:#000000;solid-opacity:1;vector-effect:none;fill:#000000;fill-opacity:1;fill-rule:nonzero;stroke:none;stroke-width:1.5;stroke-linecap:round;stroke-linejoin:round;stroke-miterlimit:4;stroke-dasharray:none;stroke-dashoffset:0;stroke-opacity:1;color-rendering:auto;image-rendering:auto;shape-rendering:auto;text-rendering:auto;enable-background:accumulate"
     d="M 11.035156,0.24609375 A 0.750075,0.750075 0 0 1 11.236328,1.7109375 L 8.4042969,2.65625 6.53125,4.53125 5.6777344,5.3828125 4.75,9.0917969 V 14 14.908203 l 0.9277344,3.708985 1.765625,1.765624 1.734375,0.867188 h 1.6445316 l 1.61914,-0.808594 v -0.002 L 14.25,16.822266 V 14.121094 L 13.34375,11.404297 12.556641,10.617188 10.822266,9.75 H 9.1757812 L 7.4433594,10.617188 6.53125,11.53125 a 0.75130096,0.75130096 0 1 1 -1.0625,-1.0625 L 6.4277344,9.5097656 A 0.750075,0.750075 0 0 1 6.46875,9.46875 0.750075,0.750075 0 0 1 6.5996094,9.3652344 0.750075,0.750075 0 0 1 6.6640625,9.3300781 L 8.5742188,8.375 A 0.750075,0.750075 0 0 1 8.78125,8.28125 a 0.750075,0.750075 0 0 1 0.035156,-0.00977 0.750075,0.750075 0 0 1 0.035156,-0.00781 0.750075,0.750075 0 0 1 0.076172,-0.013672 0.750075,0.750075 0 0 1 0.1621094,0 h 1.8085942 a 0.750075,0.750075 0 0 1 0.36914,0.048828 0.750075,0.750075 0 0 1 0.06836,0.03125 l 2,1 A 0.750075,0.750075 0 0 1 13.53125,9.46875 l 1,1 1,1 a 0.750075,0.750075 0 0 1 0.138672,0.195312 l 1,2 A 0.750075,0.750075 0 0 1 16.75,14 v 3 a 0.750075,0.750075 0 0 1 -0.08008,0.335938 l -1,2 A 0.750075,0.750075 0 0 1 15.53125,19.53125 l -2,2 a 0.750075,0.750075 0 0 1 -0.01172,0.0098 0.750075,0.750075 0 0 1 -0.183593,0.128906 l -2,1 a 0.750075,0.750075 0 0 1 -0.04297,0.02148 0.750075,0.750075 0 0 1 -0.01172,0.0039 0.750075,0.750075 0 0 1 -0.06055,0.02148 0.750075,0.750075 0 0 1 -0.310547,0.0332 H 9.1015625 a 0.750075,0.750075 0 0 1 -0.3691406,-0.04883 0.750075,0.750075 0 0 1 -0.068359,-0.03125 l -2,-1 a 0.750075,0.750075 0 0 1 -0.013672,-0.0059 0.750075,0.750075 0 0 1 -0.015625,-0.0098 A 0.750075,0.750075 0 0 1 6.5859375,21.625 0.750075,0.750075 0 0 1 6.46875,21.53125 l -0.025391,-0.02344 a 0.750075,0.750075 0 0 1 -0.00977,-0.01172 L 4.5253906,19.587891 a 0.750075,0.750075 0 0 1 -0.21875,-0.298829 L 3.3300781,17.335938 a 0.750075,0.750075 0 0 1 -0.013672,-0.0293 0.750075,0.750075 0 0 1 -0.027344,-0.07031 0.750075,0.750075 0 0 1 -0.015625,-0.04492 L 2.2890625,14.236328 A 0.750075,0.750075 0 0 1 2.25,14 v -4 a 0.750075,0.750075 0 0 1 0.039063,-0.2363281 l 1,-3 a 0.750075,0.750075 0 0 1 0.041016,-0.099609 L 4.3105469,4.7050781 A 0.750075,0.750075 0 0 1 4.3125,4.6972656 0.750075,0.750075 0 0 1 4.5234375,4.4140625 L 4.5371094,4.4023438 5.46875,3.46875 l 2,-2 A 0.750075,0.750075 0 0 1 7.7636719,1.2890625 l 3.0000001,-1 a 0.750075,0.750075 0 0 1 0.271484,-0.0429687 z"
     id="path2" />
</svg>
