<?xml version="1.0" encoding="UTF-8" standalone="no"?>
<svg
   xmlns:dc="http://purl.org/dc/elements/1.1/"
   xmlns:cc="http://creativecommons.org/ns#"
   xmlns:rdf="http://www.w3.org/1999/02/22-rdf-syntax-ns#"
   xmlns:svg="http://www.w3.org/2000/svg"
   xmlns="http://www.w3.org/2000/svg"
   xmlns:sodipodi="http://sodipodi.sourceforge.net/DTD/sodipodi-0.dtd"
   xmlns:inkscape="http://www.inkscape.org/namespaces/inkscape"
   data-dec="83"
   width="20"
   height="40"
   version="1.1"
   id="svg4"
   sodipodi:docname="83.svg"
   inkscape:version="0.92.4 (unknown)">
  <metadata
     id="metadata10">
    <rdf:RDF>
      <cc:Work
         rdf:about="">
        <dc:format>image/svg+xml</dc:format>
        <dc:type
           rdf:resource="http://purl.org/dc/dcmitype/StillImage" />
      </cc:Work>
    </rdf:RDF>
  </metadata>
  <defs
     id="defs8" />
  <sodipodi:namedview
     pagecolor="#ffffff"
     bordercolor="#666666"
     borderopacity="1"
     objecttolerance="10"
     gridtolerance="10"
     guidetolerance="10"
     inkscape:pageopacity="0"
     inkscape:pageshadow="2"
     inkscape:window-width="640"
     inkscape:window-height="480"
     id="namedview6"
     showgrid="false"
     inkscape:zoom="5.9"
     inkscape:cx="10"
     inkscape:cy="20"
     inkscape:window-x="0"
     inkscape:window-y="27"
     inkscape:window-maximized="0"
     inkscape:current-layer="svg4" />
  <path
     style="color:#000000;font-style:normal;font-variant:normal;font-weight:normal;font-stretch:normal;font-size:medium;line-height:normal;font-family:sans-serif;font-variant-ligatures:normal;font-variant-position:normal;font-variant-caps:normal;font-variant-numeric:normal;font-variant-alternates:normal;font-feature-settings:normal;text-indent:0;text-align:start;text-decoration:none;text-decoration-line:none;text-decoration-style:solid;text-decoration-color:#000000;letter-spacing:normal;word-spacing:normal;text-transform:none;writing-mode:lr-tb;direction:ltr;text-orientation:mixed;dominant-baseline:auto;baseline-shift:baseline;text-anchor:start;white-space:normal;shape-padding:0;clip-rule:nonzero;display:inline;overflow:visible;visibility:visible;opacity:1;isolation:auto;mix-blend-mode:normal;color-interpolation:sRGB;color-interpolation-filters:linearRGB;solid-color:#000000;solid-opacity:1;vector-effect:none;fill:#000000;fill-opacity:1;fill-rule:nonzero;stroke:none;stroke-width:0.30000001;stroke-linecap:round;stroke-linejoin:round;stroke-miterlimit:4;stroke-dasharray:none;stroke-dashoffset:0;stroke-opacity:1;color-rendering:auto;image-rendering:auto;shape-rendering:auto;text-rendering:auto;enable-background:accumulate"
     d="M 7.0351562,2.1503906 5.0878906,3.1230469 4.1503906,4.0625 v 2.875 l 1.9335938,1.9355469 4.9726566,1.9882811 a 0.15001501,0.15001501 0 0 1 0.0098,0.0039 l 4,2 a 0.15001501,0.15001501 0 0 1 0.05859,0.05078 l 2,3 A 0.15001501,0.15001501 0 0 1 17.150391,16 v 2 a 0.15001501,0.15001501 0 0 1 -0.01563,0.06641 l -1,2 a 0.15001501,0.15001501 0 0 1 -0.08789,0.07617 l -3,1 A 0.15001501,0.15001501 0 0 1 13,21.150391 H 8 a 0.15001501,0.15001501 0 0 1 -0.046875,-0.0078 l -3,-1 a 0.15001501,0.15001501 0 0 1 -0.058594,-0.03711 l -1,-1 A 0.15001501,0.15001501 0 0 1 3.8496094,19 V 18.150391 H 3.1503906 V 18.9375 l 1.9257813,1.927734 3.9414062,0.984375 h 3.9589839 l 2.94336,-0.980468 1.929687,-1.931641 V 16.035156 L 16.876953,14.087891 14.912109,12.123047 12.939453,11.136719 7.9433594,9.1386719 a 0.15001501,0.15001501 0 0 1 -0.00977,-0.00391 l -2,-1 a 0.15001501,0.15001501 0 0 1 -0.068359,-0.068359 l -1,-2 A 0.15001501,0.15001501 0 0 1 4.8496094,6 V 4 A 0.15001501,0.15001501 0 0 1 4.8945312,3.8945312 L 5.8730469,2.9179688 a 0.15001501,0.15001501 0 0 1 0.00195,-0.00391 0.15001501,0.15001501 0 0 1 0.017578,-0.019531 0.15001501,0.15001501 0 0 1 0.00977,-0.00781 0.15001501,0.15001501 0 0 1 0.023437,-0.017578 0.15001501,0.15001501 0 0 1 0.00195,-0.00195 0.15001501,0.15001501 0 0 1 0.00586,-0.00195 0.15001501,0.15001501 0 0 1 0.025391,-0.00977 0.15001501,0.15001501 0 0 1 0.023437,-0.00586 0.15001501,0.15001501 0 0 1 0.00195,0 0.15001501,0.15001501 0 0 1 0.027344,0 H 13 a 0.15001501,0.15001501 0 0 1 0.06641,0.015625 l 2,1 a 0.15001501,0.15001501 0 0 1 0.03906,0.029297 L 16.0625,4.8496094 h 0.695312 L 15.894531,3.1230469 12.976562,2.1503906 Z m 0.9882813,-1 L 5.0800781,2.1308594 3.1503906,4.0625 v 1.9023438 l 0.9726563,1.9472656 0.9648437,0.9648437 1.9726563,0.9863281 4.9960941,1.9980468 a 0.15001501,0.15001501 0 0 1 0.0098,0.0039 l 2,1 a 0.15001501,0.15001501 0 0 1 0.03906,0.0293 l 1,1 a 0.15001501,0.15001501 0 0 1 0.0293,0.03906 L 16.125,15.914062 a 0.15001501,0.15001501 0 0 1 0.0078,0.01367 l 0.002,0.0059 a 0.15001501,0.15001501 0 0 1 0.0039,0.0078 0.15001501,0.15001501 0 0 1 0,0.002 0.15001501,0.15001501 0 0 1 0.0059,0.01172 0.15001501,0.15001501 0 0 1 0,0.0039 0.15001501,0.15001501 0 0 1 0.0059,0.02344 0.15001501,0.15001501 0 0 1 0,0.002 0.15001501,0.15001501 0 0 1 0,0.03125 V 18 a 0.15001501,0.15001501 0 0 1 -0.04492,0.105469 l -1,1 a 0.15001501,0.15001501 0 0 1 -0.03906,0.0293 l -1.980468,0.990234 -0.01953,0.0098 a 0.15001501,0.15001501 0 0 1 -0.02539,0.0098 0.15001501,0.15001501 0 0 1 -0.02344,0.0059 0.15001501,0.15001501 0 0 1 -0.002,0 0.15001501,0.15001501 0 0 1 -0.002,0 0.15001501,0.15001501 0 0 1 -0.01367,0 H 12.984375 9 7 a 0.15001501,0.15001501 0 0 1 -0.1054688,-0.04492 l -1,-1 L 4.9375,18.150391 H 4.1503906 V 18.9375 l 0.9296875,0.931641 2.9433594,0.980468 h 4.9531245 l 2.917969,-0.972656 0.955078,-1.912109 V 16.044922 L 14.896484,13.117188 10.939453,11.136719 5.9433594,9.1386719 a 0.15001501,0.15001501 0 0 1 -0.048828,-0.033203 l -2,-2 A 0.15001501,0.15001501 0 0 1 3.8496094,7 V 4 a 0.15001501,0.15001501 0 0 1 0.044922,-0.1054688 l 1,-1 a 0.15001501,0.15001501 0 0 1 0.039063,-0.029297 l 2,-1 A 0.15001501,0.15001501 0 0 1 7,1.8496094 h 6 a 0.15001501,0.15001501 0 0 1 0.04687,0.00781 l 3,1 a 0.15001501,0.15001501 0 0 1 0.08789,0.076172 l 0.958984,1.9160156 h 0.755859 V 4.0605469 L 15.919922,2.1308594 12.976562,1.1503906 H 12.015625 12 8.9902344 Z M 7.984375,0.84960938 a 0.15001501,0.15001501 0 0 1 0.015625,0 H 8.984375 12 12.009766 13 a 0.15001501,0.15001501 0 0 1 0.04687,0.007813 l 3,1.00000002 a 0.15001501,0.15001501 0 0 1 0.05859,0.037109 l 1.976562,1.9785157 a 0.15001501,0.15001501 0 0 1 0.0039,0.00195 0.15001501,0.15001501 0 0 1 0.01953,0.017578 v 0.00195 a 0.15001501,0.15001501 0 0 1 0.0078,0.00781 0.15001501,0.15001501 0 0 1 0.01758,0.023437 0.15001501,0.15001501 0 0 1 0.002,0.00195 0.15001501,0.15001501 0 0 1 0.0059,0.011719 0.15001501,0.15001501 0 0 1 0.002,0.00586 0.15001501,0.15001501 0 0 1 0.002,0.00781 0.15001501,0.15001501 0 0 1 0.002,0.00195 0.15001501,0.15001501 0 0 1 0,0.00391 0.15001501,0.15001501 0 0 1 0.0059,0.023437 0.15001501,0.15001501 0 0 1 0,0.00195 0.15001501,0.15001501 0 0 1 0,0.027344 v 0.9707031 a 0.15001501,0.15001501 0 0 1 -0.0098,0.072266 0.15001501,0.15001501 0 0 1 0,0.00195 0.15001501,0.15001501 0 0 1 -0.0059,0.011719 0.15001501,0.15001501 0 0 1 0,0.00195 0.15001501,0.15001501 0 0 1 -0.01563,0.023437 0.15001501,0.15001501 0 0 1 0,0.00195 0.15001501,0.15001501 0 0 1 -0.0059,0.00391 0.15001501,0.15001501 0 0 1 -0.01563,0.015625 0.15001501,0.15001501 0 0 1 -0.01172,0.00977 0.15001501,0.15001501 0 0 1 -0.04102,0.019531 0.15001501,0.15001501 0 0 1 -0.02734,0.00586 0.15001501,0.15001501 0 0 1 -0.002,0 0.15001501,0.15001501 0 0 1 -0.04297,0 h -0.945312 a 0.15001501,0.15001501 0 0 1 -0.04492,0 H 16 A 0.15001501,0.15001501 0 0 1 15.894531,5.1054688 L 14.912109,4.1230469 12.964844,3.1503906 H 6.0605469 L 5.1503906,4.0625 v 1.9023438 l 0.9609375,1.9238281 1.9492188,0.9746093 4.9960941,1.9980468 a 0.15001501,0.15001501 0 0 1 0.0098,0.0039 l 2,1 a 0.15001501,0.15001501 0 0 1 0.03906,0.0293 l 2,2 a 0.15001501,0.15001501 0 0 1 0.0293,0.03906 l 1,2 A 0.15001501,0.15001501 0 0 1 18.150391,16 v 3 a 0.15001501,0.15001501 0 0 1 -0.04492,0.105469 l -2,2 a 0.15001501,0.15001501 0 0 1 -0.05859,0.03711 l -3,1 A 0.15001501,0.15001501 0 0 1 13,22.150391 H 9 a 0.15001501,0.15001501 0 0 1 -0.037109,-0.0039 l -4,-1 a 0.15001501,0.15001501 0 0 1 -0.068359,-0.04102 l -2,-2 A 0.15001501,0.15001501 0 0 1 2.8496094,19 V 18 A 0.15001501,0.15001501 0 0 1 3,17.849609 h 0.9824219 a 0.15001501,0.15001501 0 0 1 0.044922,0 H 5 a 0.15001501,0.15001501 0 0 1 0.1054688,0.04492 l 1,1 L 7.0625,19.849609 H 9 12.964844 l 1.947265,-0.972656 0.9375,-0.939453 V 16.035156 L 14.876953,14.087891 13.912109,13.123047 11.939453,12.136719 6.9433594,10.138672 a 0.15001501,0.15001501 0 0 1 -0.00977,-0.0039 l -2,-1.0000004 a 0.15001501,0.15001501 0 0 1 -0.039063,-0.029297 l -1,-1 a 0.15001501,0.15001501 0 0 1 -0.029297,-0.039063 l -1,-2 A 0.15001501,0.15001501 0 0 1 2.8496094,6 V 4 a 0.15001501,0.15001501 0 0 1 0.044922,-0.1054688 l 2,-2 a 0.15001501,0.15001501 0 0 1 0.058594,-0.037109 l 3,-1.00000002 a 0.15001501,0.15001501 0 0 1 0.03125,-0.007813 z"
     id="path2" />
</svg>
