<?xml version="1.0" encoding="UTF-8" standalone="no"?>
<svg
   xmlns:dc="http://purl.org/dc/elements/1.1/"
   xmlns:cc="http://creativecommons.org/ns#"
   xmlns:rdf="http://www.w3.org/1999/02/22-rdf-syntax-ns#"
   xmlns:svg="http://www.w3.org/2000/svg"
   xmlns="http://www.w3.org/2000/svg"
   xmlns:sodipodi="http://sodipodi.sourceforge.net/DTD/sodipodi-0.dtd"
   xmlns:inkscape="http://www.inkscape.org/namespaces/inkscape"
   data-dec="113"
   width="20"
   height="40"
   version="1.1"
   id="svg4"
   sodipodi:docname="113.svg"
   inkscape:version="0.92.4 (unknown)">
  <metadata
     id="metadata10">
    <rdf:RDF>
      <cc:Work
         rdf:about="">
        <dc:format>image/svg+xml</dc:format>
        <dc:type
           rdf:resource="http://purl.org/dc/dcmitype/StillImage" />
      </cc:Work>
    </rdf:RDF>
  </metadata>
  <defs
     id="defs8" />
  <sodipodi:namedview
     pagecolor="#ffffff"
     bordercolor="#666666"
     borderopacity="1"
     objecttolerance="10"
     gridtolerance="10"
     guidetolerance="10"
     inkscape:pageopacity="0"
     inkscape:pageshadow="2"
     inkscape:window-width="615"
     inkscape:window-height="417"
     id="namedview6"
     showgrid="false"
     inkscape:zoom="5.9"
     inkscape:cx="10"
     inkscape:cy="20"
     inkscape:window-x="0"
     inkscape:window-y="27"
     inkscape:window-maximized="0"
     inkscape:current-layer="svg4" />
  <path
     style="color:#000000;font-style:normal;font-variant:normal;font-weight:normal;font-stretch:normal;font-size:medium;line-height:normal;font-family:sans-serif;font-variant-ligatures:normal;font-variant-position:normal;font-variant-caps:normal;font-variant-numeric:normal;font-variant-alternates:normal;font-feature-settings:normal;text-indent:0;text-align:start;text-decoration:none;text-decoration-line:none;text-decoration-style:solid;text-decoration-color:#000000;letter-spacing:normal;word-spacing:normal;text-transform:none;writing-mode:lr-tb;direction:ltr;text-orientation:mixed;dominant-baseline:auto;baseline-shift:baseline;text-anchor:start;white-space:normal;shape-padding:0;clip-rule:nonzero;display:inline;overflow:visible;visibility:visible;opacity:1;isolation:auto;mix-blend-mode:normal;color-interpolation:sRGB;color-interpolation-filters:linearRGB;solid-color:#000000;solid-opacity:1;vector-effect:none;fill:#013272;fill-opacity:1;fill-rule:nonzero;stroke:none;stroke-width:1.5;stroke-linecap:round;stroke-linejoin:round;stroke-miterlimit:4;stroke-dasharray:none;stroke-dashoffset:0;stroke-opacity:1;color-rendering:auto;image-rendering:auto;shape-rendering:auto;text-rendering:auto;enable-background:accumulate"
     d="M 9.1757812,8.75 7.5136719,9.5820312 5.6796875,12.332031 4.75,15.121094 v 3.701172 L 5.5585938,20.439453 7.1777344,21.25 h 1.6445312 l 1.6640624,-0.832031 1.833984,-2.75 L 13.25,14.880859 V 12.121094 L 12.386719,9.53125 10.822266,8.75 Z M 16.976562,7.2382812 a 0.750075,0.750075 0 0 1 0.744141,0.9667969 L 11.994141,28.25 H 14 a 0.750075,0.750075 0 1 1 0,1.5 h -2.878906 a 0.750075,0.750075 0 0 1 -0.246094,0 H 10.121094 A 0.750075,0.750075 0 0 1 9.875,29.75 H 7 a 0.750075,0.750075 0 1 1 0,-1.5 H 9.4355469 L 11.3125,21.681641 9.3359375,22.669922 A 0.750075,0.750075 0 0 1 9,22.75 H 7 A 0.750075,0.750075 0 0 1 6.6640625,22.669922 L 4.7675781,21.720703 a 0.750075,0.750075 0 0 1 -0.00977,-0.0039 A 0.750075,0.750075 0 0 1 4.46875,21.53125 l -0.013672,-0.01172 a 0.750075,0.750075 0 0 1 -0.00977,-0.01172 L 3.46875,20.53125 A 0.750075,0.750075 0 0 1 3.3300781,20.335938 l -1,-2 A 0.750075,0.750075 0 0 1 2.25,18 v -3 a 0.750075,0.750075 0 0 1 0.039063,-0.236328 l 1,-3 A 0.750075,0.750075 0 0 1 3.375,11.583984 l 2,-2.9999996 A 0.750075,0.750075 0 0 1 5.7636719,8.2890625 L 8.7128906,7.3066406 a 0.750075,0.750075 0 0 1 0.050781,-0.017578 0.750075,0.750075 0 0 1 0.015625,-0.00586 A 0.750075,0.750075 0 0 1 9.0898438,7.25 H 11 a 0.750075,0.750075 0 0 1 0.335938,0.080078 l 2,1 a 0.750075,0.750075 0 0 1 0.375,0.4335938 l 0.695312,2.0859371 0.873047,-3.0546871 a 0.750075,0.750075 0 0 1 0.695312,-0.5546875 0.750075,0.750075 0 0 1 0.527344,0.1894531 0.750075,0.750075 0 0 1 0.474609,-0.1914063 z"
     id="path2" />
</svg>
