<svg xmlns:dc="http://purl.org/dc/elements/1.1/" xmlns:cc="http://creativecommons.org/ns#" xmlns:rdf="http://www.w3.org/1999/02/22-rdf-syntax-ns#" xmlns:svg="http://www.w3.org/2000/svg" xmlns="http://www.w3.org/2000/svg" xmlns:sodipodi="http://sodipodi.sourceforge.net/DTD/sodipodi-0.dtd" xmlns:inkscape="http://www.inkscape.org/namespaces/inkscape" data-dec="114" id="dec_114" width="14" height="40" version="1.1" sodipodi:docname="114.svg" inkscape:version="0.92.2 5c3e80d, 2017-08-06">
  <metadata id="metadata9">
    <rdf:RDF>
      <cc:Work rdf:about="">
        <dc:format>image/svg+xml</dc:format>
        <dc:type rdf:resource="http://purl.org/dc/dcmitype/StillImage"/>
      </cc:Work>
    </rdf:RDF>
  </metadata>
  <defs id="defs7"/>
  <sodipodi:namedview pagecolor="#ffffff" bordercolor="#666666" borderopacity="1" objecttolerance="10" gridtolerance="10" guidetolerance="10" inkscape:pageopacity="0" inkscape:pageshadow="2" inkscape:window-width="1778" inkscape:window-height="1066" id="namedview5" showgrid="true" inkscape:zoom="23.6" inkscape:cx="-4.2288136" inkscape:cy="19.682204" inkscape:window-x="1450" inkscape:window-y="0" inkscape:window-maximized="0" inkscape:current-layer="dec_114">
    <inkscape:grid type="xygrid" id="grid11"/>
  </sodipodi:namedview>
  <path id="path13" style="fill:none;stroke:#000000;stroke-width:1;stroke-linecap:round;stroke-linejoin:round" d="M 5,8 V 22 H 6 M 5,8 H 6 V 22 M 6,14 7,11 9,9 11,8 h 3 m -8,7 1,-2 1,-2 2,-1 h 4 V 8 M 4,8 V 22 H 5 M 4,8 H 5 V 22 M 5,14 6,11 8,9 10,8 h 3 m -8,6 1,-2 2,-2 2,-1 h 3 V 8 "/>
</svg>