<?xml version="1.0" encoding="UTF-8" standalone="no"?>
<svg
   xmlns:dc="http://purl.org/dc/elements/1.1/"
   xmlns:cc="http://creativecommons.org/ns#"
   xmlns:rdf="http://www.w3.org/1999/02/22-rdf-syntax-ns#"
   xmlns:svg="http://www.w3.org/2000/svg"
   xmlns="http://www.w3.org/2000/svg"
   xmlns:sodipodi="http://sodipodi.sourceforge.net/DTD/sodipodi-0.dtd"
   xmlns:inkscape="http://www.inkscape.org/namespaces/inkscape"
   data-dec="56"
   width="20"
   height="40"
   version="1.1"
   id="svg4"
   sodipodi:docname="56.svg"
   inkscape:version="0.92.4 (unknown)">
  <metadata
     id="metadata10">
    <rdf:RDF>
      <cc:Work
         rdf:about="">
        <dc:format>image/svg+xml</dc:format>
        <dc:type
           rdf:resource="http://purl.org/dc/dcmitype/StillImage" />
      </cc:Work>
    </rdf:RDF>
  </metadata>
  <defs
     id="defs8" />
  <sodipodi:namedview
     pagecolor="#ffffff"
     bordercolor="#666666"
     borderopacity="1"
     objecttolerance="10"
     gridtolerance="10"
     guidetolerance="10"
     inkscape:pageopacity="0"
     inkscape:pageshadow="2"
     inkscape:window-width="640"
     inkscape:window-height="480"
     id="namedview6"
     showgrid="false"
     inkscape:zoom="5.9"
     inkscape:cx="10"
     inkscape:cy="20"
     inkscape:window-x="0"
     inkscape:window-y="27"
     inkscape:window-maximized="0"
     inkscape:current-layer="svg4" />
  <path
     style="color:#000000;font-style:normal;font-variant:normal;font-weight:normal;font-stretch:normal;font-size:medium;line-height:normal;font-family:sans-serif;font-variant-ligatures:normal;font-variant-position:normal;font-variant-caps:normal;font-variant-numeric:normal;font-variant-alternates:normal;font-feature-settings:normal;text-indent:0;text-align:start;text-decoration:none;text-decoration-line:none;text-decoration-style:solid;text-decoration-color:#000000;letter-spacing:normal;word-spacing:normal;text-transform:none;writing-mode:lr-tb;direction:ltr;text-orientation:mixed;dominant-baseline:auto;baseline-shift:baseline;text-anchor:start;white-space:normal;shape-padding:0;clip-rule:nonzero;display:inline;overflow:visible;visibility:visible;opacity:1;isolation:auto;mix-blend-mode:normal;color-interpolation:sRGB;color-interpolation-filters:linearRGB;solid-color:#000000;solid-opacity:1;vector-effect:none;fill:#013272;fill-opacity:1;fill-rule:nonzero;stroke:none;stroke-width:0.5;stroke-linecap:round;stroke-linejoin:round;stroke-miterlimit:4;stroke-dasharray:none;stroke-dashoffset:0;stroke-opacity:1;color-rendering:auto;image-rendering:auto;shape-rendering:auto;text-rendering:auto;enable-background:accumulate"
     d="m 14.427734,11.072266 0.75,0.75 a 0.250025,0.250025 0 0 1 0.04492,0.06641 l 1,2 A 0.250025,0.250025 0 0 1 16.25,14 v 4 a 0.250025,0.250025 0 0 1 -0.02734,0.111328 l -1,2 a 0.250025,0.250025 0 0 1 -0.04492,0.06641 L 14.429688,20.925781 14.865234,20.78125 15.794922,19.851562 16.75,17.941406 V 14.058594 L 15.794922,12.148438 14.865234,11.21875 Z m -8.8554684,0 -0.4375,0.146484 L 4.2050781,12.148438 3.25,14.058594 v 3.882812 l 0.9550781,1.910156 0.9296875,0.929688 0.4355469,0.144531 -0.7480469,-0.748047 a 0.250025,0.250025 0 0 1 -0.044922,-0.06641 l -1,-2 A 0.250025,0.250025 0 0 1 3.75,18 v -4 a 0.250025,0.250025 0 0 1 0.027344,-0.111328 l 1,-2 a 0.250025,0.250025 0 0 1 0.044922,-0.06641 z M 8.0566406,10.25 6.1484375,11.205078 5.2050781,12.148438 4.25,14.058594 v 3.882812 l 0.9550781,1.910156 0.9433594,0.94336 L 8.0566406,21.75 h 3.8867184 l 1.908203,-0.955078 0.94336,-0.94336 L 15.75,17.941406 V 14.058594 L 14.794922,12.148438 13.851562,11.205078 11.943359,10.25 Z m 6.2363284,-8.2207031 0.929687,1.859375 A 0.250025,0.250025 0 0 1 15.25,4 v 3 a 0.250025,0.250025 0 0 1 -0.02734,0.1113281 L 14.292969,8.9707031 14.822266,8.7949219 15.75,6.9414062 V 4.0585938 L 14.822266,2.2050781 Z M 5.7070312,2.0273438 5.1777344,2.2050781 4.25,4.0585938 V 6.9414062 L 5.1777344,8.7949219 5.7070312,8.9707031 4.7773438,7.1113281 A 0.250025,0.250025 0 0 1 4.75,7 V 4 A 0.250025,0.250025 0 0 1 4.7773438,3.8886719 Z M 8.0566406,1.25 6.1855469,2.1855469 5.25,4.0585938 V 6.9414062 L 6.1855469,8.8144531 8.0566406,9.75 H 11.943359 L 13.814453,8.8144531 14.75,6.9414062 V 4.0585938 L 13.814453,2.1855469 11.943359,1.25 Z M 8.0019531,0.74804688 A 0.250025,0.250025 0 0 1 8.0234375,0.75 a 0.250025,0.250025 0 0 1 0.00195,0 h 3.9414064 a 0.250025,0.250025 0 0 1 0.03906,0 0.250025,0.250025 0 0 1 0.02539,0.001953 0.250025,0.250025 0 0 1 0.02344,0.003906 0.250025,0.250025 0 0 1 0.0098,0.001953 0.250025,0.250025 0 0 1 0.03516,0.0136719 l 2.978516,0.99218752 a 0.250025,0.250025 0 0 1 0.144531,0.125 l 1,2 A 0.250025,0.250025 0 0 1 16.25,4 v 3 a 0.250025,0.250025 0 0 1 -0.02734,0.1113281 l -1,2 a 0.250025,0.250025 0 0 1 -0.144531,0.125 L 12.787109,10 l 2.291016,0.763672 a 0.250025,0.250025 0 0 1 0.09961,0.05859 l 1,1 a 0.250025,0.250025 0 0 1 0.04492,0.06641 l 1,2 A 0.250025,0.250025 0 0 1 17.25,14 v 4 a 0.250025,0.250025 0 0 1 -0.02734,0.111328 l -1,2 a 0.250025,0.250025 0 0 1 -0.04492,0.06641 l -1,1 a 0.250025,0.250025 0 0 1 -0.09961,0.05859 l -2.982422,0.994141 a 0.250025,0.250025 0 0 1 -0.02148,0.0078 0.250025,0.250025 0 0 1 -0.09961,0.01172 H 8.0332031 a 0.250025,0.250025 0 0 1 -0.039063,0 0.250025,0.250025 0 0 1 -0.00977,0 0.250025,0.250025 0 0 1 -0.015625,-0.002 0.250025,0.250025 0 0 1 -0.023437,-0.0039 0.250025,0.250025 0 0 1 -0.00977,-0.002 0.250025,0.250025 0 0 1 -0.035156,-0.01367 L 4.921875,21.236328 a 0.250025,0.250025 0 0 1 -0.099609,-0.05859 l -1,-1 a 0.250025,0.250025 0 0 1 -0.044922,-0.06641 l -1,-2 A 0.250025,0.250025 0 0 1 2.75,18 v -4 a 0.250025,0.250025 0 0 1 0.027344,-0.111328 l 1,-2 a 0.250025,0.250025 0 0 1 0.044922,-0.06641 l 1,-1 a 0.250025,0.250025 0 0 1 0.099609,-0.05859 L 7.2128906,10 4.921875,9.2363281 a 0.250025,0.250025 0 0 1 -0.1445312,-0.125 l -1,-2 A 0.250025,0.250025 0 0 1 3.75,7 V 4 a 0.250025,0.250025 0 0 1 0.027344,-0.1113281 l 1,-2 a 0.250025,0.250025 0 0 1 0.1445312,-0.125 L 7.8789062,0.77929688 a 0.250025,0.250025 0 0 1 0.00781,-0.003906 0.250025,0.250025 0 0 1 0.039062,-0.015625 0.250025,0.250025 0 0 1 0.011719,-0.001953 0.250025,0.250025 0 0 1 0.013672,-0.003906 0.250025,0.250025 0 0 1 0.023437,-0.003906 0.250025,0.250025 0 0 1 0.00195,0 0.250025,0.250025 0 0 1 0.00977,0 0.250025,0.250025 0 0 1 0.015625,-0.001953 z"
     id="path2" />
</svg>
