<?xml version="1.0" encoding="UTF-8"?>
<glyph name="comma" format="1">
  <advance width="231"/>
  <unicode hex="002C"/>
  <outline>
    <contour>
      <point x="116" y="232" type="curve" smooth="yes"/>
      <point x="126" y="232"/>
      <point x="139" y="226"/>
      <point x="146" y="219" type="curve" smooth="yes"/>
      <point x="170" y="196" type="line" smooth="yes"/>
      <point x="180" y="188"/>
      <point x="188" y="173"/>
      <point x="188" y="161" type="curve" smooth="yes"/>
      <point x="188" y="154" type="line"/>
      <point x="188" y="102" type="line" smooth="yes"/>
      <point x="188" y="92"/>
      <point x="182" y="79"/>
      <point x="175" y="72" type="curve" smooth="yes"/>
      <point x="118" y="13" type="line" smooth="yes"/>
      <point x="111" y="5"/>
      <point x="96" y="0"/>
      <point x="86" y="0" type="curve" smooth="yes"/>
      <point x="62" y="0"/>
      <point x="43" y="19"/>
      <point x="43" y="43" type="curve" smooth="yes"/>
      <point x="43" y="53"/>
      <point x="48" y="68"/>
      <point x="56" y="75" type="curve" smooth="yes"/>
      <point x="84" y="102" type="line"/>
      <point x="56" y="129" type="line" smooth="yes"/>
      <point x="49" y="136"/>
      <point x="43" y="150"/>
      <point x="43" y="160" type="curve" smooth="yes"/>
      <point x="43" y="170"/>
      <point x="49" y="183"/>
      <point x="56" y="190" type="curve" smooth="yes"/>
      <point x="85" y="219" type="line" smooth="yes"/>
      <point x="92" y="226"/>
      <point x="106" y="232"/>
    </contour>
  </outline>
  <lib>
    <dict>
      <key>com.fontlab.hintData</key>
      <dict>
        <key>hhints</key>
        <array>
          <dict>
            <key>position</key>
            <integer>0</integer>
            <key>width</key>
            <integer>232</integer>
          </dict>
        </array>
        <key>vhints</key>
        <array>
          <dict>
            <key>position</key>
            <integer>43</integer>
            <key>width</key>
            <integer>145</integer>
          </dict>
        </array>
      </dict>
    </dict>
  </lib>
</glyph>
