<?xml version="1.0" encoding="UTF-8" standalone="no"?>
<svg
   xmlns:dc="http://purl.org/dc/elements/1.1/"
   xmlns:cc="http://creativecommons.org/ns#"
   xmlns:rdf="http://www.w3.org/1999/02/22-rdf-syntax-ns#"
   xmlns:svg="http://www.w3.org/2000/svg"
   xmlns="http://www.w3.org/2000/svg"
   xmlns:sodipodi="http://sodipodi.sourceforge.net/DTD/sodipodi-0.dtd"
   xmlns:inkscape="http://www.inkscape.org/namespaces/inkscape"
   data-dec="119"
   width="30"
   height="40"
   version="1.1"
   id="svg4"
   sodipodi:docname="119.svg"
   inkscape:version="0.92.4 (unknown)">
  <metadata
     id="metadata10">
    <rdf:RDF>
      <cc:Work
         rdf:about="">
        <dc:format>image/svg+xml</dc:format>
        <dc:type
           rdf:resource="http://purl.org/dc/dcmitype/StillImage" />
      </cc:Work>
    </rdf:RDF>
  </metadata>
  <defs
     id="defs8" />
  <sodipodi:namedview
     pagecolor="#ffffff"
     bordercolor="#666666"
     borderopacity="1"
     objecttolerance="10"
     gridtolerance="10"
     guidetolerance="10"
     inkscape:pageopacity="0"
     inkscape:pageshadow="2"
     inkscape:window-width="640"
     inkscape:window-height="480"
     id="namedview6"
     showgrid="false"
     inkscape:zoom="5.9"
     inkscape:cx="15"
     inkscape:cy="20"
     inkscape:window-x="0"
     inkscape:window-y="27"
     inkscape:window-maximized="0"
     inkscape:current-layer="svg4" />
  <path
     style="color:#000000;font-style:normal;font-variant:normal;font-weight:normal;font-stretch:normal;font-size:medium;line-height:normal;font-family:sans-serif;font-variant-ligatures:normal;font-variant-position:normal;font-variant-caps:normal;font-variant-numeric:normal;font-variant-alternates:normal;font-feature-settings:normal;text-indent:0;text-align:start;text-decoration:none;text-decoration-line:none;text-decoration-style:solid;text-decoration-color:#000000;letter-spacing:normal;word-spacing:normal;text-transform:none;writing-mode:lr-tb;direction:ltr;text-orientation:mixed;dominant-baseline:auto;baseline-shift:baseline;text-anchor:start;white-space:normal;shape-padding:0;clip-rule:nonzero;display:inline;overflow:visible;visibility:visible;opacity:1;isolation:auto;mix-blend-mode:normal;color-interpolation:sRGB;color-interpolation-filters:linearRGB;solid-color:#000000;solid-opacity:1;vector-effect:none;fill:#013272;fill-opacity:1;fill-rule:nonzero;stroke:none;stroke-width:2;stroke-linecap:round;stroke-linejoin:round;stroke-miterlimit:4;stroke-dasharray:none;stroke-dashoffset:0;stroke-opacity:1;color-rendering:auto;image-rendering:auto;shape-rendering:auto;text-rendering:auto;enable-background:accumulate"
     d="M 17.033203,6.9863281 A 1.0001,1.0001 0 0 1 17.166016,7 h 0.667968 a 1.0001,1.0001 0 0 1 0.332032,0 H 19 a 1.0001,1.0001 0 0 1 0.960938,1.2753906 L 17.966797,15.257812 17,19.125 v 1.255859 L 18.236328,21 h 1.527344 l 1.644531,-0.822266 1.814453,-1.814453 1.84961,-2.773437 L 26,11.876953 V 11.236328 L 25.105469,9.4472656 A 1.0001,1.0001 0 0 1 25,9 V 8 a 1.0001,1.0001 0 0 1 1,-1 h 1 a 1.0001,1.0001 0 0 1 1,1 v 2.904297 a 1.0001,1.0001 0 0 1 0,0.214844 V 12 a 1.0001,1.0001 0 0 1 -0.0293,0.242188 l -1,4 a 1.0001,1.0001 0 0 1 -0.138672,0.3125 l -2,3 a 1.0001,1.0001 0 0 1 -0.125,0.152343 l -2,2 a 1.0001,1.0001 0 0 1 -0.259765,0.1875 l -2,1 A 1.0001,1.0001 0 0 1 20,23 h -2 a 1.0001,1.0001 0 0 1 -0.447266,-0.105469 l -1.853515,-0.927734 a 1.0001,1.0001 0 0 1 -0.632813,-0.595703 l -0.673828,-1.34961 -1.685547,1.685547 a 1.0001,1.0001 0 0 1 -0.259765,0.1875 l -2,1 A 1.0001,1.0001 0 0 1 10,23 H 8 A 1.0001,1.0001 0 0 1 7.5527344,22.894531 L 5.6992188,21.966797 A 1.0001,1.0001 0 0 1 5.0664062,21.371094 L 4.1054688,19.447266 A 1.0001,1.0001 0 0 1 4,19 v -3 a 1.0001,1.0001 0 0 1 0.072266,-0.371094 L 6,10.808594 V 9.4140625 L 5.5859375,9 H 4.4140625 L 2.8222656,10.591797 1.8945312,12.447266 A 1.0001165,1.0001165 0 1 1 0.10546875,11.552734 L 1.1054688,9.5527344 a 1.0001,1.0001 0 0 1 0.1875,-0.2597656 l 2,-2 A 1.0001,1.0001 0 0 1 4,7 H 6 A 1.0001,1.0001 0 0 1 6.7070312,7.2929688 L 7.6035156,8.1894531 A 1.0001,1.0001 0 0 1 7.9335938,8.6289062 L 8.8945312,10.552734 A 1.0001,1.0001 0 0 1 9,11 v 3 a 1.0001,1.0001 0 0 1 -0.072266,0.371094 L 7,19.191406 v 1.189453 L 8.2363281,21 H 9.7636719 L 11.408203,20.177734 13.125,18.458984 14.039062,15.71875 15.990234,7.9160156 a 1.0001,1.0001 0 0 1 0,-0.00391 1.0001,1.0001 0 0 1 0.314454,-0.6425782 1.0001,1.0001 0 0 1 0.0059,-0.00586 1.0001,1.0001 0 0 1 0.06836,-0.058594 1.0001,1.0001 0 0 1 0.05469,-0.039063 1.0001,1.0001 0 0 1 0.599609,-0.1796875 z"
     id="path2" />
</svg>
