<?xml version="1.0" encoding="UTF-8"?>
<glyph name="dollar" format="1">
  <advance width="491"/>
  <unicode hex="0024"/>
  <outline>
    <contour>
      <point x="311" y="305" type="line"/>
      <point x="311" y="66" type="line"/>
      <point x="364" y="84" type="line"/>
      <point x="387" y="107" type="line"/>
      <point x="412" y="157" type="line"/>
      <point x="412" y="205" type="line"/>
      <point x="388" y="253" type="line"/>
    </contour>
    <contour>
      <point x="224" y="322" type="line"/>
      <point x="224" y="62" type="line"/>
      <point x="235" y="58" type="line"/>
      <point x="267" y="58" type="line"/>
      <point x="267" y="314" type="line"/>
    </contour>
    <contour>
      <point x="224" y="623" type="line"/>
      <point x="224" y="396" type="line"/>
      <point x="267" y="387" type="line"/>
      <point x="267" y="623" type="line"/>
    </contour>
    <contour>
      <point x="179" y="623" type="line"/>
      <point x="129" y="597" type="line"/>
      <point x="104" y="573" type="line"/>
      <point x="79" y="524" type="line"/>
      <point x="79" y="505" type="line"/>
      <point x="103" y="456" type="line"/>
      <point x="180" y="405" type="line"/>
      <point x="180" y="623" type="line"/>
    </contour>
    <contour>
      <point x="202" y="724" type="curve" smooth="yes"/>
      <point x="214" y="724"/>
      <point x="224" y="714"/>
      <point x="224" y="702" type="curve" smooth="yes"/>
      <point x="224" y="666" type="line"/>
      <point x="267" y="666" type="line"/>
      <point x="267" y="702" type="line" smooth="yes"/>
      <point x="267" y="714"/>
      <point x="277" y="724"/>
      <point x="289" y="724" type="curve" smooth="yes"/>
      <point x="301" y="724"/>
      <point x="311" y="714"/>
      <point x="311" y="702" type="curve" smooth="yes"/>
      <point x="311" y="660" type="line"/>
      <point x="383" y="636" type="line" smooth="yes"/>
      <point x="385" y="635"/>
      <point x="390" y="632"/>
      <point x="392" y="630" type="curve" smooth="yes"/>
      <point x="420" y="602" type="line" smooth="yes"/>
      <point x="423" y="599"/>
      <point x="427" y="590"/>
      <point x="427" y="586" type="curve" smooth="yes"/>
      <point x="427" y="499" type="line" smooth="yes"/>
      <point x="427" y="487"/>
      <point x="417" y="477"/>
      <point x="405" y="477" type="curve" smooth="yes"/>
      <point x="396" y="477"/>
      <point x="387" y="485"/>
      <point x="385" y="493" type="curve" smooth="yes"/>
      <point x="358" y="574" type="line"/>
      <point x="334" y="597" type="line"/>
      <point x="311" y="609" type="line"/>
      <point x="311" y="378" type="line"/>
      <point x="322" y="376" type="line" smooth="yes"/>
      <point x="324" y="376"/>
      <point x="328" y="374"/>
      <point x="330" y="373" type="curve" smooth="yes"/>
      <point x="417" y="315" type="line" smooth="yes"/>
      <point x="419" y="313"/>
      <point x="424" y="310"/>
      <point x="425" y="307" type="curve" smooth="yes"/>
      <point x="453" y="249" type="line" smooth="yes"/>
      <point x="454" y="247"/>
      <point x="455" y="242"/>
      <point x="455" y="239" type="curve" smooth="yes"/>
      <point x="455" y="212" type="line" smooth="yes"/>
      <point x="455" y="211"/>
      <point x="456" y="211"/>
      <point x="456" y="210" type="curve" smooth="yes"/>
      <point x="456" y="209"/>
      <point x="455" y="208"/>
      <point x="455" y="207" type="curve" smooth="yes"/>
      <point x="455" y="152" type="line" smooth="yes"/>
      <point x="455" y="149"/>
      <point x="454" y="144"/>
      <point x="453" y="142" type="curve" smooth="yes"/>
      <point x="425" y="85" type="line" smooth="yes"/>
      <point x="424" y="83"/>
      <point x="421" y="80"/>
      <point x="420" y="79" type="curve" smooth="yes"/>
      <point x="392" y="50" type="line" smooth="yes"/>
      <point x="390" y="48"/>
      <point x="385" y="46"/>
      <point x="383" y="45" type="curve" smooth="yes"/>
      <point x="311" y="21" type="line"/>
      <point x="311" y="-22" type="line" smooth="yes"/>
      <point x="311" y="-34"/>
      <point x="301" y="-44"/>
      <point x="289" y="-44" type="curve" smooth="yes"/>
      <point x="277" y="-44"/>
      <point x="267" y="-34"/>
      <point x="267" y="-22" type="curve" smooth="yes"/>
      <point x="267" y="14" type="line"/>
      <point x="232" y="14" type="line" smooth="yes"/>
      <point x="230" y="14"/>
      <point x="226" y="14"/>
      <point x="224" y="15" type="curve" smooth="yes"/>
      <point x="224" y="-22" type="line" smooth="yes"/>
      <point x="224" y="-34"/>
      <point x="214" y="-44"/>
      <point x="202" y="-44" type="curve" smooth="yes"/>
      <point x="190" y="-44"/>
      <point x="180" y="-34"/>
      <point x="180" y="-22" type="curve" smooth="yes"/>
      <point x="180" y="30" type="line"/>
      <point x="141" y="44" type="line" smooth="yes"/>
      <point x="139" y="44"/>
      <point x="135" y="45"/>
      <point x="133" y="46" type="curve" smooth="yes"/>
      <point x="77" y="75" type="line" smooth="yes"/>
      <point x="75" y="76"/>
      <point x="73" y="78"/>
      <point x="72" y="79" type="curve" smooth="yes"/>
      <point x="43" y="108" type="line" smooth="yes"/>
      <point x="40" y="111"/>
      <point x="36" y="119"/>
      <point x="36" y="123" type="curve" smooth="yes"/>
      <point x="36" y="210" type="line" smooth="yes"/>
      <point x="36" y="222"/>
      <point x="46" y="231"/>
      <point x="58" y="231" type="curve" smooth="yes"/>
      <point x="67" y="231"/>
      <point x="76" y="225"/>
      <point x="78" y="217" type="curve" smooth="yes"/>
      <point x="106" y="134" type="line"/>
      <point x="156" y="84" type="line"/>
      <point x="180" y="76" type="line"/>
      <point x="180" y="331" type="line"/>
      <point x="169" y="333" type="line" smooth="yes"/>
      <point x="167" y="333"/>
      <point x="164" y="336"/>
      <point x="162" y="337" type="curve" smooth="yes"/>
      <point x="75" y="395" type="line" smooth="yes"/>
      <point x="73" y="397"/>
      <point x="68" y="400"/>
      <point x="67" y="403" type="curve" smooth="yes"/>
      <point x="38" y="461" type="line" smooth="yes"/>
      <point x="37" y="463"/>
      <point x="36" y="468"/>
      <point x="36" y="471" type="curve" smooth="yes"/>
      <point x="36" y="497" type="line"/>
      <point x="36" y="499" type="line"/>
      <point x="36" y="502" type="line"/>
      <point x="36" y="528" type="line" smooth="yes"/>
      <point x="36" y="531"/>
      <point x="37" y="536"/>
      <point x="38" y="538" type="curve" smooth="yes"/>
      <point x="67" y="596" type="line" smooth="yes"/>
      <point x="68" y="598"/>
      <point x="71" y="601"/>
      <point x="72" y="602" type="curve" smooth="yes"/>
      <point x="100" y="630" type="line" smooth="yes"/>
      <point x="101" y="631"/>
      <point x="104" y="634"/>
      <point x="106" y="635" type="curve" smooth="yes"/>
      <point x="164" y="663" type="line" smooth="yes"/>
      <point x="166" y="664"/>
      <point x="171" y="666"/>
      <point x="174" y="666" type="curve" smooth="yes"/>
      <point x="180" y="666" type="line"/>
      <point x="180" y="702" type="line" smooth="yes"/>
      <point x="180" y="714"/>
      <point x="190" y="724"/>
    </contour>
  </outline>
  <lib>
    <dict>
      <key>com.fontlab.hintData</key>
      <dict>
        <key>hhints</key>
        <array>
          <dict>
            <key>position</key>
            <integer>14</integer>
            <key>width</key>
            <integer>44</integer>
          </dict>
          <dict>
            <key>position</key>
            <integer>623</integer>
            <key>width</key>
            <integer>43</integer>
          </dict>
        </array>
        <key>vhints</key>
        <array>
          <dict>
            <key>position</key>
            <integer>36</integer>
            <key>width</key>
            <integer>43</integer>
          </dict>
          <dict>
            <key>position</key>
            <integer>180</integer>
            <key>width</key>
            <integer>44</integer>
          </dict>
          <dict>
            <key>position</key>
            <integer>267</integer>
            <key>width</key>
            <integer>44</integer>
          </dict>
          <dict>
            <key>position</key>
            <integer>385</integer>
            <key>width</key>
            <integer>42</integer>
          </dict>
          <dict>
            <key>position</key>
            <integer>413</integer>
            <key>width</key>
            <integer>43</integer>
          </dict>
        </array>
      </dict>
    </dict>
  </lib>
</glyph>
