<?xml version="1.0" encoding="UTF-8" standalone="no"?>
<svg
   xmlns:dc="http://purl.org/dc/elements/1.1/"
   xmlns:cc="http://creativecommons.org/ns#"
   xmlns:rdf="http://www.w3.org/1999/02/22-rdf-syntax-ns#"
   xmlns:svg="http://www.w3.org/2000/svg"
   xmlns="http://www.w3.org/2000/svg"
   xmlns:sodipodi="http://sodipodi.sourceforge.net/DTD/sodipodi-0.dtd"
   xmlns:inkscape="http://www.inkscape.org/namespaces/inkscape"
   data-dec="67"
   width="20"
   height="40"
   version="1.1"
   id="svg4"
   sodipodi:docname="67.svg"
   inkscape:version="0.92.4 (unknown)">
  <metadata
     id="metadata10">
    <rdf:RDF>
      <cc:Work
         rdf:about="">
        <dc:format>image/svg+xml</dc:format>
        <dc:type
           rdf:resource="http://purl.org/dc/dcmitype/StillImage" />
      </cc:Work>
    </rdf:RDF>
  </metadata>
  <defs
     id="defs8" />
  <sodipodi:namedview
     pagecolor="#ffffff"
     bordercolor="#666666"
     borderopacity="1"
     objecttolerance="10"
     gridtolerance="10"
     guidetolerance="10"
     inkscape:pageopacity="0"
     inkscape:pageshadow="2"
     inkscape:window-width="640"
     inkscape:window-height="480"
     id="namedview6"
     showgrid="false"
     inkscape:zoom="5.9"
     inkscape:cx="10"
     inkscape:cy="20"
     inkscape:window-x="0"
     inkscape:window-y="27"
     inkscape:window-maximized="0"
     inkscape:current-layer="svg4" />
  <path
     style="color:#000000;font-style:normal;font-variant:normal;font-weight:normal;font-stretch:normal;font-size:medium;line-height:normal;font-family:sans-serif;font-variant-ligatures:normal;font-variant-position:normal;font-variant-caps:normal;font-variant-numeric:normal;font-variant-alternates:normal;font-feature-settings:normal;text-indent:0;text-align:start;text-decoration:none;text-decoration-line:none;text-decoration-style:solid;text-decoration-color:#000000;letter-spacing:normal;word-spacing:normal;text-transform:none;writing-mode:lr-tb;direction:ltr;text-orientation:mixed;dominant-baseline:auto;baseline-shift:baseline;text-anchor:start;white-space:normal;shape-padding:0;clip-rule:nonzero;display:inline;overflow:visible;visibility:visible;opacity:1;isolation:auto;mix-blend-mode:normal;color-interpolation:sRGB;color-interpolation-filters:linearRGB;solid-color:#000000;solid-opacity:1;vector-effect:none;fill:#013272;fill-opacity:1;fill-rule:nonzero;stroke:none;stroke-width:2.5;stroke-linecap:round;stroke-linejoin:round;stroke-miterlimit:4;stroke-dasharray:none;stroke-dashoffset:0;stroke-opacity:1;color-rendering:auto;image-rendering:auto;shape-rendering:auto;text-rendering:auto;enable-background:accumulate"
     d="M 10.005859,-0.2578125 A 1.250125,1.250125 0 0 1 10.144531,-0.25 H 12 a 1.250125,1.250125 0 0 1 0.394531,0.0644531 l 3,1 a 1.250125,1.250125 0 0 1 0.490235,0.30078128 l 0.570312,0.5703125 0.359375,-1.08007815 A 1.250125,1.250125 0 0 1 19.25,1 V 7 A 1.250125,1.250125 0 0 1 16.814453,7.3945312 L 15.908203,4.6777344 14.324219,3.0917969 11.796875,2.25 H 10.292969 L 8.7402344,3.0273438 7.0273438,4.7402344 6.1582031,6.4804688 5.25,9.203125 v 4.59375 l 0.9082031,2.722656 0.8691407,1.740235 1.7128906,1.71289 L 10.292969,20.75 h 1.503906 l 2.527344,-0.841797 1.648437,-1.648437 0.910156,-1.81836 a 1.250125,1.250125 0 1 1 2.234376,1.117188 l -1,2 a 1.250125,1.250125 0 0 1 -0.232422,0.326172 l -2,2 a 1.250125,1.250125 0 0 1 -0.490235,0.300781 l -3,1 A 1.250125,1.250125 0 0 1 12,23.25 h -1.857422 a 1.250125,1.250125 0 0 1 -0.5878905,-0.08008 1.250125,1.250125 0 0 1 -0.00977,-0.0039 L 6.6054688,22.185547 A 1.250125,1.250125 0 0 1 6.1152344,21.884766 l -2,-2 A 1.250125,1.250125 0 0 1 3.8828125,19.558594 l -1,-2 a 1.250125,1.250125 0 0 1 -0.068359,-0.164063 l -1,-3 A 1.250125,1.250125 0 0 1 1.75,14 V 9 a 1.250125,1.250125 0 0 1 0.064453,-0.3945312 l 1,-3 a 1.250125,1.250125 0 0 1 0.068359,-0.1640626 l 1,-2 A 1.250125,1.250125 0 0 1 4.1152344,3.1152344 l 2,-2 A 1.250125,1.250125 0 0 1 6.6054688,0.81445312 L 9.5195312,-0.15625 a 1.250125,1.250125 0 0 1 0.019531,-0.007813 1.250125,1.250125 0 0 1 0.4667965,-0.09375 z"
     id="path2" />
</svg>
