<?xml version="1.0" encoding="UTF-8" standalone="no"?>
<svg
   xmlns:dc="http://purl.org/dc/elements/1.1/"
   xmlns:cc="http://creativecommons.org/ns#"
   xmlns:rdf="http://www.w3.org/1999/02/22-rdf-syntax-ns#"
   xmlns:svg="http://www.w3.org/2000/svg"
   xmlns="http://www.w3.org/2000/svg"
   xmlns:sodipodi="http://sodipodi.sourceforge.net/DTD/sodipodi-0.dtd"
   xmlns:inkscape="http://www.inkscape.org/namespaces/inkscape"
   data-dec="75"
   width="22"
   height="40"
   version="1.1"
   id="svg4"
   sodipodi:docname="75.svg"
   inkscape:version="0.92.4 (unknown)">
  <metadata
     id="metadata10">
    <rdf:RDF>
      <cc:Work
         rdf:about="">
        <dc:format>image/svg+xml</dc:format>
        <dc:type
           rdf:resource="http://purl.org/dc/dcmitype/StillImage" />
      </cc:Work>
    </rdf:RDF>
  </metadata>
  <defs
     id="defs8" />
  <sodipodi:namedview
     pagecolor="#ffffff"
     bordercolor="#666666"
     borderopacity="1"
     objecttolerance="10"
     gridtolerance="10"
     guidetolerance="10"
     inkscape:pageopacity="0"
     inkscape:pageshadow="2"
     inkscape:window-width="640"
     inkscape:window-height="480"
     id="namedview6"
     showgrid="false"
     inkscape:zoom="5.9"
     inkscape:cx="11"
     inkscape:cy="20"
     inkscape:window-x="0"
     inkscape:window-y="27"
     inkscape:window-maximized="0"
     inkscape:current-layer="svg4" />
  <path
     style="color:#000000;font-style:normal;font-variant:normal;font-weight:normal;font-stretch:normal;font-size:medium;line-height:normal;font-family:sans-serif;font-variant-ligatures:normal;font-variant-position:normal;font-variant-caps:normal;font-variant-numeric:normal;font-variant-alternates:normal;font-feature-settings:normal;text-indent:0;text-align:start;text-decoration:none;text-decoration-line:none;text-decoration-style:solid;text-decoration-color:#000000;letter-spacing:normal;word-spacing:normal;text-transform:none;writing-mode:lr-tb;direction:ltr;text-orientation:mixed;dominant-baseline:auto;baseline-shift:baseline;text-anchor:start;white-space:normal;shape-padding:0;clip-rule:nonzero;display:inline;overflow:visible;visibility:visible;opacity:1;isolation:auto;mix-blend-mode:normal;color-interpolation:sRGB;color-interpolation-filters:linearRGB;solid-color:#000000;solid-opacity:1;vector-effect:none;fill:#000000;fill-opacity:1;fill-rule:nonzero;stroke:none;stroke-width:0.30000001;stroke-linecap:round;stroke-linejoin:round;stroke-miterlimit:4;stroke-dasharray:none;stroke-dashoffset:0;stroke-opacity:1;color-rendering:auto;image-rendering:auto;shape-rendering:auto;text-rendering:auto;enable-background:accumulate"
     d="M 8.9824219,10.228516 8.625,10.585938 8.8730469,10.916016 9.2246094,10.564453 Z m 1.0019531,-0.002 -0.3671875,0.367188 7.5039065,10.318359 a 0.15001501,0.15001501 0 1 1 -0.242188,0.175782 L 9.4023438,10.808594 9.0546875,11.15625 17.074219,21.849609 h 1.626953 z m -2,0 -1.8339844,1.833985 v 1.578125 L 8.6601562,11.128906 8.4121094,10.798828 7.1054688,12.105469 A 0.15001501,0.15001501 0 1 1 6.8945312,11.894531 l 1.3378907,-1.33789 z M 4.9824219,1.8476562 a 0.15001501,0.15001501 0 0 1 0.015625,0 A 0.15001501,0.15001501 0 0 1 5.1503906,2 V 21 A 0.1503906,0.1503906 0 0 1 4.8496094,21 V 2 A 0.15001501,0.15001501 0 0 1 4.9824219,1.8476562 Z M 17.060547,1.1503906 8.1972656,10.013672 8.4453125,10.34375 8.8691406,9.921875 a 0.15001501,0.15001501 0 0 1 0.00781,-0.011719 0.15001501,0.15001501 0 0 1 0.03125,-0.03125 0.15001501,0.15001501 0 0 1 0.00586,-0.00391 l 0.00781,-0.00586 7.972656,-7.9746094 a 0.15001501,0.15001501 0 1 1 0.210938,0.2109376 L 9.1953125,10.015625 9.4394531,10.349609 9.875,9.9160156 a 0.15001501,0.15001501 0 0 1 0.019531,-0.021484 v -0.00195 a 0.15001501,0.15001501 0 0 1 0.023438,-0.019531 L 18.638672,1.1503906 Z m -12.9101564,0 V 21.849609 h 1.6992188 v -7.833984 a 0.15001501,0.15001501 0 0 1 0,-0.0293 V 1.1503906 Z M 3.9980469,0.84765625 a 0.15001501,0.15001501 0 0 1 0.029297,0.001953 H 6 A 0.15001501,0.15001501 0 0 1 6.1503906,1 V 11.638672 L 7.8671875,9.9238281 A 0.15001501,0.15001501 0 0 1 7.875,9.9121094 0.15001501,0.15001501 0 0 1 7.9160156,9.8730469 l 0.00391,-0.00195 8.9531251,-8.95312505 a 0.15001501,0.15001501 0 0 1 0.002,-0.003906 0.15001501,0.15001501 0 0 1 0.01758,-0.0195313 0.15001501,0.15001501 0 0 1 0.01367,-0.0117188 0.15001501,0.15001501 0 0 1 0.06445,-0.0292969 0.15001501,0.15001501 0 0 1 0.0039,0 A 0.15001501,0.15001501 0 0 1 17,0.84960938 h 2 a 0.15001501,0.15001501 0 0 1 0.105469,0.25585942 l -8.908203,8.9082032 8.90625,11.875 a 0.15001501,0.15001501 0 0 1 0.002,0.002 0.15001501,0.15001501 0 0 1 0.01953,0.02344 0.15001501,0.15001501 0 0 1 0.002,0.0039 0.15001501,0.15001501 0 0 1 0.0059,0.0078 0.15001501,0.15001501 0 0 1 0.002,0.0059 0.15001501,0.15001501 0 0 1 0.0039,0.0078 0.15001501,0.15001501 0 0 1 0.002,0.0059 0.15001501,0.15001501 0 0 1 0.0078,0.0293 0.15001501,0.15001501 0 0 1 0.002,0.0078 0.15001501,0.15001501 0 0 1 0,0.0059 0.15001501,0.15001501 0 0 1 -0.002,0.04492 0.15001501,0.15001501 0 0 1 -0.002,0.0098 0.15001501,0.15001501 0 0 1 -0.0039,0.0098 0.15001501,0.15001501 0 0 1 -0.002,0.0039 0.15001501,0.15001501 0 0 1 -0.002,0.0059 0.15001501,0.15001501 0 0 1 -0.0039,0.0078 0.15001501,0.15001501 0 0 1 -0.0098,0.01758 0.15001501,0.15001501 0 0 1 -0.0059,0.0078 0.15001501,0.15001501 0 0 1 -0.0039,0.0039 0.15001501,0.15001501 0 0 1 -0.0078,0.0059 0.15001501,0.15001501 0 0 1 -0.0039,0.0059 0.15001501,0.15001501 0 0 1 -0.0059,0.0039 0.15001501,0.15001501 0 0 1 -0.01172,0.0098 0.15001501,0.15001501 0 0 1 -0.0059,0.0039 0.15001501,0.15001501 0 0 1 -0.0078,0.0039 0.15001501,0.15001501 0 0 1 -0.02734,0.01172 0.15001501,0.15001501 0 0 1 -0.06445,0.0059 H 17 a 0.15001501,0.15001501 0 0 1 -0.119141,-0.06055 L 8.8417969,11.369141 6.1503906,14.060547 V 22 A 0.15001501,0.15001501 0 0 1 6,22.150391 H 4 A 0.15001501,0.15001501 0 0 1 3.8496094,22 V 1.0175781 a 0.15001501,0.15001501 0 0 1 0.00977,-0.0722656 0.15001501,0.15001501 0 0 1 0,-0.001953 0.15001501,0.15001501 0 0 1 0.00586,-0.0117188 0.15001501,0.15001501 0 0 1 0,-0.001953 0.15001501,0.15001501 0 0 1 0.015625,-0.0234375 0.15001501,0.15001501 0 0 1 0,-0.001953 0.15001501,0.15001501 0 0 1 0.00586,-0.003906 0.15001501,0.15001501 0 0 1 0.068359,-0.0449219 0.15001501,0.15001501 0 0 1 0.027344,-0.005859 0.15001501,0.15001501 0 0 1 0.00195,0 0.15001501,0.15001501 0 0 1 0.013672,-0.001953 z"
     id="path2" />
</svg>
