<?xml version="1.0" encoding="UTF-8" standalone="no"?>
<svg
   xmlns:dc="http://purl.org/dc/elements/1.1/"
   xmlns:cc="http://creativecommons.org/ns#"
   xmlns:rdf="http://www.w3.org/1999/02/22-rdf-syntax-ns#"
   xmlns:svg="http://www.w3.org/2000/svg"
   xmlns="http://www.w3.org/2000/svg"
   xmlns:sodipodi="http://sodipodi.sourceforge.net/DTD/sodipodi-0.dtd"
   xmlns:inkscape="http://www.inkscape.org/namespaces/inkscape"
   data-dec="61"
   width="26"
   height="40"
   version="1.1"
   id="svg4"
   sodipodi:docname="61.svg"
   inkscape:version="0.92.4 (unknown)">
  <metadata
     id="metadata10">
    <rdf:RDF>
      <cc:Work
         rdf:about="">
        <dc:format>image/svg+xml</dc:format>
        <dc:type
           rdf:resource="http://purl.org/dc/dcmitype/StillImage" />
      </cc:Work>
    </rdf:RDF>
  </metadata>
  <defs
     id="defs8" />
  <sodipodi:namedview
     pagecolor="#ffffff"
     bordercolor="#666666"
     borderopacity="1"
     objecttolerance="10"
     gridtolerance="10"
     guidetolerance="10"
     inkscape:pageopacity="0"
     inkscape:pageshadow="2"
     inkscape:window-width="640"
     inkscape:window-height="480"
     id="namedview6"
     showgrid="false"
     inkscape:zoom="5.9"
     inkscape:cx="13"
     inkscape:cy="20"
     inkscape:window-x="0"
     inkscape:window-y="27"
     inkscape:window-maximized="0"
     inkscape:current-layer="svg4" />
  <path
     style="color:#000000;font-style:normal;font-variant:normal;font-weight:normal;font-stretch:normal;font-size:medium;line-height:normal;font-family:sans-serif;font-variant-ligatures:normal;font-variant-position:normal;font-variant-caps:normal;font-variant-numeric:normal;font-variant-alternates:normal;font-feature-settings:normal;text-indent:0;text-align:start;text-decoration:none;text-decoration-line:none;text-decoration-style:solid;text-decoration-color:#000000;letter-spacing:normal;word-spacing:normal;text-transform:none;writing-mode:lr-tb;direction:ltr;text-orientation:mixed;dominant-baseline:auto;baseline-shift:baseline;text-anchor:start;white-space:normal;shape-padding:0;clip-rule:nonzero;display:inline;overflow:visible;visibility:visible;opacity:1;isolation:auto;mix-blend-mode:normal;color-interpolation:sRGB;color-interpolation-filters:linearRGB;solid-color:#000000;solid-opacity:1;vector-effect:none;fill:#000000;fill-opacity:1;fill-rule:nonzero;stroke:none;stroke-width:1.5;stroke-linecap:round;stroke-linejoin:round;stroke-miterlimit:4;stroke-dasharray:none;stroke-dashoffset:0;stroke-opacity:1;color-rendering:auto;image-rendering:auto;shape-rendering:auto;text-rendering:auto;enable-background:accumulate"
     d="M 3.9882812,15.240234 A 0.750075,0.750075 0 0 1 4.1230469,15.25 H 21 A 0.750075,0.750075 0 0 1 21.75,16 v 0.876953 a 0.750075,0.750075 0 0 1 -0.201172,0.644531 0.750075,0.750075 0 0 1 -0.0039,0.0039 0.750075,0.750075 0 0 1 -0.0039,0.0039 0.750075,0.750075 0 0 1 -0.04883,0.04687 0.750075,0.750075 0 0 1 -0.0059,0.0039 A 0.750075,0.750075 0 0 1 20.876953,17.75 H 4 A 0.750075,0.750075 0 0 1 3.25,17 v -0.876953 a 0.750075,0.750075 0 0 1 0.2011719,-0.644531 0.750075,0.750075 0 0 1 0.00586,-0.0059 0.750075,0.750075 0 0 1 0.00586,-0.0059 0.750075,0.750075 0 0 1 0.050781,-0.04687 0.750075,0.750075 0 0 1 0.4746093,-0.179688 z m 0,-7.9999996 A 0.750075,0.750075 0 0 1 4.1230469,7.25 H 21 A 0.750075,0.750075 0 0 1 21.75,8 v 0.8769531 a 0.750075,0.750075 0 0 1 -0.201172,0.6445313 0.750075,0.750075 0 0 1 -0.0039,0.00391 0.750075,0.750075 0 0 1 -0.0039,0.00391 0.750075,0.750075 0 0 1 -0.04883,0.046875 0.750075,0.750075 0 0 1 -0.0059,0.00391 A 0.750075,0.750075 0 0 1 20.876953,9.75 H 4 A 0.750075,0.750075 0 0 1 3.25,9 V 8.1230469 a 0.750075,0.750075 0 0 1 0.2011719,-0.6445313 0.750075,0.750075 0 0 1 0.00586,-0.00586 0.750075,0.750075 0 0 1 0.00586,-0.00586 0.750075,0.750075 0 0 1 0.050781,-0.046875 0.750075,0.750075 0 0 1 0.4746093,-0.1796875 z"
     id="path2" />
</svg>
