<?xml version="1.0" encoding="UTF-8" standalone="no"?>
<svg
   xmlns:dc="http://purl.org/dc/elements/1.1/"
   xmlns:cc="http://creativecommons.org/ns#"
   xmlns:rdf="http://www.w3.org/1999/02/22-rdf-syntax-ns#"
   xmlns:svg="http://www.w3.org/2000/svg"
   xmlns="http://www.w3.org/2000/svg"
   xmlns:sodipodi="http://sodipodi.sourceforge.net/DTD/sodipodi-0.dtd"
   xmlns:inkscape="http://www.inkscape.org/namespaces/inkscape"
   data-dec="74"
   width="20"
   height="40"
   version="1.1"
   id="svg4"
   sodipodi:docname="74.svg"
   inkscape:version="0.92.4 (unknown)">
  <metadata
     id="metadata10">
    <rdf:RDF>
      <cc:Work
         rdf:about="">
        <dc:format>image/svg+xml</dc:format>
        <dc:type
           rdf:resource="http://purl.org/dc/dcmitype/StillImage" />
      </cc:Work>
    </rdf:RDF>
  </metadata>
  <defs
     id="defs8" />
  <sodipodi:namedview
     pagecolor="#ffffff"
     bordercolor="#666666"
     borderopacity="1"
     objecttolerance="10"
     gridtolerance="10"
     guidetolerance="10"
     inkscape:pageopacity="0"
     inkscape:pageshadow="2"
     inkscape:window-width="640"
     inkscape:window-height="480"
     id="namedview6"
     showgrid="false"
     inkscape:zoom="5.9"
     inkscape:cx="10"
     inkscape:cy="20"
     inkscape:window-x="0"
     inkscape:window-y="27"
     inkscape:window-maximized="0"
     inkscape:current-layer="svg4" />
  <path
     style="color:#000000;font-style:normal;font-variant:normal;font-weight:normal;font-stretch:normal;font-size:medium;line-height:normal;font-family:sans-serif;font-variant-ligatures:normal;font-variant-position:normal;font-variant-caps:normal;font-variant-numeric:normal;font-variant-alternates:normal;font-feature-settings:normal;text-indent:0;text-align:start;text-decoration:none;text-decoration-line:none;text-decoration-style:solid;text-decoration-color:#000000;letter-spacing:normal;word-spacing:normal;text-transform:none;writing-mode:lr-tb;direction:ltr;text-orientation:mixed;dominant-baseline:auto;baseline-shift:baseline;text-anchor:start;white-space:normal;shape-padding:0;clip-rule:nonzero;display:inline;overflow:visible;visibility:visible;opacity:1;isolation:auto;mix-blend-mode:normal;color-interpolation:sRGB;color-interpolation-filters:linearRGB;solid-color:#000000;solid-opacity:1;vector-effect:none;fill:#013272;fill-opacity:1;fill-rule:nonzero;stroke:none;stroke-width:2;stroke-linecap:round;stroke-linejoin:round;stroke-miterlimit:4;stroke-dasharray:none;stroke-dashoffset:0;stroke-opacity:1;color-rendering:auto;image-rendering:auto;shape-rendering:auto;text-rendering:auto;enable-background:accumulate"
     d="M 13.974609,-0.01367188 A 1.0001,1.0001 0 0 1 14.173828,0 h 0.677734 a 1.0001,1.0001 0 0 1 0.306641,0 h 0.693359 a 1.0001,1.0001 0 0 1 0.306641,0 h 0.710938 a 1.0001,1.0001 0 0 1 0.277343,0 h 0.783204 a 1.0001,1.0001 0 0 1 0.167968,0 H 19 a 1.0001,1.0001 0 1 1 0,2 h -0.835938 l -1.125,0.375 L 16.4375,2.9765625 12.955078,14.294922 a 1.0001,1.0001 0 0 1 -0.02734,0.07617 l -2,5 a 1.0001,1.0001 0 0 1 -0.220703,0.335937 l -1.9999998,2 a 1.0001,1.0001 0 0 1 -0.2597656,0.1875 L 6.5136719,22.861328 A 1.0001,1.0001 0 0 1 5.8535156,23 H 4 A 1.0001,1.0001 0 0 1 3.5527344,22.894531 l -2,-1 A 1.0001,1.0001 0 0 1 1.1054688,21.447266 l -1.00000005,-2 A 1.0001,1.0001 0 0 1 0,19 v -2 a 1.0001,1.0001 0 0 1 0.29296875,-0.707031 l 1.00000005,-1 A 1.0001,1.0001 0 0 1 2,15 h 1 a 1.0001,1.0001 0 0 1 0.7070312,0.292969 l 1,1 A 1.0001,1.0001 0 0 1 5,17 v 1 a 1.0001,1.0001 0 0 1 -0.2929688,0.707031 l -1,1 A 1.0001,1.0001 0 0 1 3,20 H 2.6191406 L 2.7460938,20.253906 4.2363281,21 H 5.5859375 L 7.1777344,19.408203 8.0664062,17.632812 12.560547,2.3554688 12.490234,2.21875 11.835938,2 H 11 a 1.0001,1.0001 0 1 1 0,-2 h 0.90625 a 1.0001,1.0001 0 0 1 0.167969,0 h 0.769531 a 1.0001,1.0001 0 0 1 0.304688,0 h 0.693359 a 1.0001,1.0001 0 0 1 0.132812,-0.01367188 z"
     id="path2" />
</svg>
