<?xml version="1.0" encoding="UTF-8"?>
<glyph name="Edieresis" format="1">
  <advance width="578"/>
  <unicode hex="00CB"/>
  <outline>
    <component base="dieresis" xOffset="72" yOffset="255"/>
    <component base="E"/>
  </outline>
  <lib>
    <dict>
      <key>com.fontlab.hintData</key>
      <dict>
        <key>hhints</key>
        <array>
          <dict>
            <key>position</key>
            <integer>0</integer>
            <key>width</key>
            <integer>101</integer>
          </dict>
          <dict>
            <key>position</key>
            <integer>289</integer>
            <key>width</key>
            <integer>101</integer>
          </dict>
          <dict>
            <key>position</key>
            <integer>300</integer>
            <key>width</key>
            <integer>90</integer>
          </dict>
          <dict>
            <key>position</key>
            <integer>579</integer>
            <key>width</key>
            <integer>101</integer>
          </dict>
          <dict>
            <key>position</key>
            <integer>738</integer>
            <key>width</key>
            <integer>160</integer>
          </dict>
        </array>
        <key>vhints</key>
        <array>
          <dict>
            <key>position</key>
            <integer>-48</integer>
            <key>width</key>
            <integer>160</integer>
          </dict>
          <dict>
            <key>position</key>
            <integer>79</integer>
            <key>width</key>
            <integer>101</integer>
          </dict>
          <dict>
            <key>position</key>
            <integer>125</integer>
            <key>width</key>
            <integer>160</integer>
          </dict>
        </array>
      </dict>
    </dict>
  </lib>
</glyph>
