<?xml version="1.0" encoding="UTF-8" standalone="no"?>
<svg
   xmlns:dc="http://purl.org/dc/elements/1.1/"
   xmlns:cc="http://creativecommons.org/ns#"
   xmlns:rdf="http://www.w3.org/1999/02/22-rdf-syntax-ns#"
   xmlns:svg="http://www.w3.org/2000/svg"
   xmlns="http://www.w3.org/2000/svg"
   xmlns:sodipodi="http://sodipodi.sourceforge.net/DTD/sodipodi-0.dtd"
   xmlns:inkscape="http://www.inkscape.org/namespaces/inkscape"
   data-dec="78"
   width="24"
   height="40"
   version="1.1"
   id="svg4"
   sodipodi:docname="78.svg"
   inkscape:version="0.92.4 (unknown)">
  <metadata
     id="metadata10">
    <rdf:RDF>
      <cc:Work
         rdf:about="">
        <dc:format>image/svg+xml</dc:format>
        <dc:type
           rdf:resource="http://purl.org/dc/dcmitype/StillImage" />
      </cc:Work>
    </rdf:RDF>
  </metadata>
  <defs
     id="defs8" />
  <sodipodi:namedview
     pagecolor="#ffffff"
     bordercolor="#666666"
     borderopacity="1"
     objecttolerance="10"
     gridtolerance="10"
     guidetolerance="10"
     inkscape:pageopacity="0"
     inkscape:pageshadow="2"
     inkscape:window-width="640"
     inkscape:window-height="480"
     id="namedview6"
     showgrid="false"
     inkscape:zoom="5.9"
     inkscape:cx="12"
     inkscape:cy="20"
     inkscape:window-x="0"
     inkscape:window-y="27"
     inkscape:window-maximized="0"
     inkscape:current-layer="svg4" />
  <path
     style="color:#000000;font-style:normal;font-variant:normal;font-weight:normal;font-stretch:normal;font-size:medium;line-height:normal;font-family:sans-serif;font-variant-ligatures:normal;font-variant-position:normal;font-variant-caps:normal;font-variant-numeric:normal;font-variant-alternates:normal;font-feature-settings:normal;text-indent:0;text-align:start;text-decoration:none;text-decoration-line:none;text-decoration-style:solid;text-decoration-color:#000000;letter-spacing:normal;word-spacing:normal;text-transform:none;writing-mode:lr-tb;direction:ltr;text-orientation:mixed;dominant-baseline:auto;baseline-shift:baseline;text-anchor:start;white-space:normal;shape-padding:0;clip-rule:nonzero;display:inline;overflow:visible;visibility:visible;opacity:1;isolation:auto;mix-blend-mode:normal;color-interpolation:sRGB;color-interpolation-filters:linearRGB;solid-color:#000000;solid-opacity:1;vector-effect:none;fill:#013272;fill-opacity:1;fill-rule:nonzero;stroke:none;stroke-width:2;stroke-linecap:round;stroke-linejoin:round;stroke-miterlimit:4;stroke-dasharray:none;stroke-dashoffset:0;stroke-opacity:1;color-rendering:auto;image-rendering:auto;shape-rendering:auto;text-rendering:auto;enable-background:accumulate"
     d="M 4.984375,-0.01367188 A 1.0001,1.0001 0 0 1 5.1679688,0 h 0.6796874 a 1.0001,1.0001 0 0 1 0.2910157,0 h 0.7089843 a 1.0001,1.0001 0 0 1 0.5839844,0.09179687 1.0001,1.0001 0 0 1 0.023437,0.0097656 1.0001,1.0001 0 0 1 0.013672,0.007813 1.0001,1.0001 0 0 1 0.085937,0.0507813 1.0001,1.0001 0 0 1 0.3632813,0.4140625 L 18,15.697266 V 2.6171875 L 16.763672,2 H 16 a 1.0001,1.0001 0 1 1 0,-2 h 0.890625 a 1.0001,1.0001 0 0 1 0.203125,0 h 3.810547 a 1.0001,1.0001 0 0 1 0.214844,0 H 22 a 1.0001,1.0001 0 1 1 0,2 H 21.236328 L 20,2.6171875 V 18.878906 a 1.0001,1.0001 0 0 1 0,0.25 v 2.75 a 1.0001,1.0001 0 0 1 -0.597656,1.050782 1.0001,1.0001 0 0 1 -0.002,0.002 1.0001,1.0001 0 0 1 -0.08984,0.0332 1.0001,1.0001 0 0 1 -0.0039,0.002 1.0001,1.0001 0 0 1 -0.09375,0.02344 1.0001,1.0001 0 0 1 -0.03516,0.0059 1.0001,1.0001 0 0 1 -1.070312,-0.53125 L 6,4.3027344 V 20.382812 L 7.2363281,21 H 8 a 1.0001,1.0001 0 1 1 0,2 H 7.109375 A 1.0001,1.0001 0 0 1 6.90625,23 H 3.0957031 A 1.0001,1.0001 0 0 1 2.8808594,23 H 2 A 1.0001,1.0001 0 1 1 2,21 H 2.7636719 L 4,20.382812 V 2.6171875 L 2.7636719,2 H 2 A 1.0001,1.0001 0 1 1 2,0 H 2.890625 A 1.0001,1.0001 0 0 1 3.09375,0 h 1.7480469 a 1.0001,1.0001 0 0 1 0.00586,0 1.0001,1.0001 0 0 1 0.1367188,-0.01367188 z"
     id="path2" />
</svg>
