<?xml version="1.0" encoding="UTF-8" standalone="no"?>
<svg
   xmlns:dc="http://purl.org/dc/elements/1.1/"
   xmlns:cc="http://creativecommons.org/ns#"
   xmlns:rdf="http://www.w3.org/1999/02/22-rdf-syntax-ns#"
   xmlns:svg="http://www.w3.org/2000/svg"
   xmlns="http://www.w3.org/2000/svg"
   xmlns:sodipodi="http://sodipodi.sourceforge.net/DTD/sodipodi-0.dtd"
   xmlns:inkscape="http://www.inkscape.org/namespaces/inkscape"
   data-dec="98"
   width="18"
   height="40"
   version="1.1"
   id="svg4"
   sodipodi:docname="98.svg"
   inkscape:version="0.92.4 5da689c313, 2019-01-14">
  <metadata
     id="metadata10">
    <rdf:RDF>
      <cc:Work
         rdf:about="">
        <dc:format>image/svg+xml</dc:format>
        <dc:type
           rdf:resource="http://purl.org/dc/dcmitype/StillImage" />
        <dc:title></dc:title>
      </cc:Work>
    </rdf:RDF>
  </metadata>
  <defs
     id="defs8" />
  <sodipodi:namedview
     pagecolor="#ffffff"
     bordercolor="#666666"
     borderopacity="1"
     objecttolerance="10"
     gridtolerance="10"
     guidetolerance="10"
     inkscape:pageopacity="0"
     inkscape:pageshadow="2"
     inkscape:window-width="1920"
     inkscape:window-height="1043"
     id="namedview6"
     showgrid="false"
     inkscape:zoom="5.9"
     inkscape:cx="9"
     inkscape:cy="20"
     inkscape:window-x="0"
     inkscape:window-y="37"
     inkscape:window-maximized="0"
     inkscape:current-layer="svg4" />
  <path
     style="color:#000000;font-style:normal;font-variant:normal;font-weight:normal;font-stretch:normal;font-size:medium;line-height:normal;font-family:sans-serif;font-variant-ligatures:normal;font-variant-position:normal;font-variant-caps:normal;font-variant-numeric:normal;font-variant-alternates:normal;font-feature-settings:normal;text-indent:0;text-align:start;text-decoration:none;text-decoration-line:none;text-decoration-style:solid;text-decoration-color:#000000;letter-spacing:normal;word-spacing:normal;text-transform:none;writing-mode:lr-tb;direction:ltr;text-orientation:mixed;dominant-baseline:auto;baseline-shift:baseline;text-anchor:start;white-space:normal;shape-padding:0;clip-rule:nonzero;display:inline;overflow:visible;visibility:visible;opacity:1;isolation:auto;mix-blend-mode:normal;color-interpolation:sRGB;color-interpolation-filters:linearRGB;solid-color:#000000;solid-opacity:1;vector-effect:none;fill:#000000;fill-opacity:1;fill-rule:nonzero;stroke:none;stroke-width:1.5;stroke-linecap:round;stroke-linejoin:round;stroke-miterlimit:4;stroke-dasharray:none;stroke-dashoffset:0;stroke-opacity:1;color-rendering:auto;image-rendering:auto;shape-rendering:auto;text-rendering:auto;enable-background:accumulate"
     d="M 8.1777344,8.75 6.4433594,9.6171875 5.75,10.3125 v 8.375 L 7.4433594,20.382812 9.1777344,21.25 H 10.822266 L 12.556641,20.382812 13.345703,19.59375 14.25,16.878906 V 13.177734 L 13.382812,11.443359 11.556641,9.6171875 9.8242188,8.75 Z M 4.9882812,0.24023438 A 0.750075,0.750075 0 0 1 5.75,1 V 2 8.2871094 L 7.6640625,7.3300781 A 0.750075,0.750075 0 0 1 8,7.25 h 2 1 a 0.750075,0.750075 0 0 1 0.04687,0.00195 0.750075,0.750075 0 0 1 0.0059,0 0.750075,0.750075 0 0 1 0.07031,0.00781 0.750075,0.750075 0 0 1 0.0039,0 0.750075,0.750075 0 0 1 0.289063,0.1113282 l 1.919922,0.9589843 A 0.750075,0.750075 0 0 1 13.53125,8.46875 l 2,2 a 0.750075,0.750075 0 0 1 0.138672,0.195312 l 1,2 A 0.750075,0.750075 0 0 1 16.75,13 v 4 a 0.750075,0.750075 0 0 1 -0.08008,0.335938 l -1,2 A 0.750075,0.750075 0 0 1 15.53125,19.53125 l -0.949219,0.949219 a 0.750075,0.750075 0 0 1 -0.105469,0.107422 l -0.0078,0.0059 -0.9375,0.9375 a 0.750075,0.750075 0 0 1 -0.195312,0.138672 l -2,1 A 0.750075,0.750075 0 0 1 11,22.75 H 9 a 0.750075,0.750075 0 0 1 -0.3359375,-0.08008 l -2,-1 A 0.750075,0.750075 0 0 1 6.46875,21.53125 L 5.75,20.8125 v 1.064453 a 0.750075,0.750075 0 0 1 -0.2011719,0.644531 0.750075,0.750075 0 0 1 -0.00781,0.0078 0.750075,0.750075 0 0 1 -0.048828,0.04687 0.750075,0.750075 0 0 1 -0.00586,0.0039 A 0.750075,0.750075 0 0 1 4.8769531,22.75 H 4.1230469 a 0.750075,0.750075 0 0 1 -0.2460938,0 H 3 2 a 0.750075,0.750075 0 0 1 0,-1.5 H 2.6894531 L 3.25,20.6875 V 3.3125 L 2.6894531,2.75 H 2 A 0.750075,0.750075 0 0 1 1.7636719,1.2890625 L 4.6464844,0.328125 a 0.750075,0.750075 0 0 1 0.3417968,-0.0878906 z"
     id="path2" />
</svg>
