<?xml version="1.0" encoding="UTF-8" standalone="no"?>
<svg
   xmlns:dc="http://purl.org/dc/elements/1.1/"
   xmlns:cc="http://creativecommons.org/ns#"
   xmlns:rdf="http://www.w3.org/1999/02/22-rdf-syntax-ns#"
   xmlns:svg="http://www.w3.org/2000/svg"
   xmlns="http://www.w3.org/2000/svg"
   xmlns:sodipodi="http://sodipodi.sourceforge.net/DTD/sodipodi-0.dtd"
   xmlns:inkscape="http://www.inkscape.org/namespaces/inkscape"
   data-dec="101"
   width="18"
   height="40"
   version="1.1"
   id="svg4"
   sodipodi:docname="101.svg"
   inkscape:version="0.92.4 (unknown)">
  <metadata
     id="metadata10">
    <rdf:RDF>
      <cc:Work
         rdf:about="">
        <dc:format>image/svg+xml</dc:format>
        <dc:type
           rdf:resource="http://purl.org/dc/dcmitype/StillImage" />
      </cc:Work>
    </rdf:RDF>
  </metadata>
  <defs
     id="defs8" />
  <sodipodi:namedview
     pagecolor="#ffffff"
     bordercolor="#666666"
     borderopacity="1"
     objecttolerance="10"
     gridtolerance="10"
     guidetolerance="10"
     inkscape:pageopacity="0"
     inkscape:pageshadow="2"
     inkscape:window-width="640"
     inkscape:window-height="480"
     id="namedview6"
     showgrid="false"
     inkscape:zoom="5.9"
     inkscape:cx="9"
     inkscape:cy="20"
     inkscape:window-x="0"
     inkscape:window-y="27"
     inkscape:window-maximized="0"
     inkscape:current-layer="svg4" />
  <path
     style="color:#000000;font-style:normal;font-variant:normal;font-weight:normal;font-stretch:normal;font-size:medium;line-height:normal;font-family:sans-serif;font-variant-ligatures:normal;font-variant-position:normal;font-variant-caps:normal;font-variant-numeric:normal;font-variant-alternates:normal;font-feature-settings:normal;text-indent:0;text-align:start;text-decoration:none;text-decoration-line:none;text-decoration-style:solid;text-decoration-color:#000000;letter-spacing:normal;word-spacing:normal;text-transform:none;writing-mode:lr-tb;direction:ltr;text-orientation:mixed;dominant-baseline:auto;baseline-shift:baseline;text-anchor:start;white-space:normal;shape-padding:0;clip-rule:nonzero;display:inline;overflow:visible;visibility:visible;opacity:1;isolation:auto;mix-blend-mode:normal;color-interpolation:sRGB;color-interpolation-filters:linearRGB;solid-color:#000000;solid-opacity:1;vector-effect:none;fill:#013272;fill-opacity:1;fill-rule:nonzero;stroke:none;stroke-width:1;stroke-linecap:round;stroke-linejoin:round;stroke-miterlimit:4;stroke-dasharray:none;stroke-dashoffset:0;stroke-opacity:1;color-rendering:auto;image-rendering:auto;shape-rendering:auto;text-rendering:auto;enable-background:accumulate"
     d="m 5.28125,20.423828 a 0.50005,0.50005 0 0 1 -0.1015625,0.04883 l 0.1171875,0.117188 0.046875,0.02344 z M 7.1484375,9.1445312 6.3203125,9.4199219 6.234375,9.5507812 a 0.50005,0.50005 0 0 1 0.2578125,0.3457032 l 0.060547,-0.1191406 a 0.50005,0.50005 0 0 1 0.09375,-0.1308594 z M 9.2070312,8.5 7.4101562,10.296875 6.4628906,12.191406 5.5,15.082031 v 1.027344 L 7.859375,15.519531 10.779297,14.546875 13.611328,12.658203 14.441406,11 13.626953,9.3730469 11.882812,8.5 Z M 8.9902344,7.4960938 A 0.50005,0.50005 0 0 1 9.0742188,7.5 H 12 a 0.50005,0.50005 0 0 1 0.222656,0.052734 l 2,1 a 0.50005,0.50005 0 0 1 0.22461,0.2246094 l 1,2.0000002 a 0.50005,0.50005 0 0 1 0,0.445312 l -1,2 a 0.50005,0.50005 0 0 1 -0.169922,0.19336 l -3,2 a 0.50005,0.50005 0 0 1 -0.119141,0.05859 l -2.9999999,1 a 0.50005,0.50005 0 0 1 -0.037109,0.0098 L 5.5,17.140625 v 0.777344 l 0.9375,2.8125 L 7.2070312,21.5 h 1.7109376 l 2.8125002,-0.9375 1.916015,-1.916016 a 0.50005,0.50005 0 1 1 0.707032,0.707032 l -2,2 a 0.50005,0.50005 0 0 1 -0.195313,0.121093 l -2.9999999,1 A 0.50005,0.50005 0 0 1 9,22.5 H 7.0664062 A 0.50005,0.50005 0 0 1 6.7441406,22.429688 L 4.7773438,21.447266 a 0.50005,0.50005 0 0 1 -0.1308594,-0.09375 l -1,-1 A 0.50005,0.50005 0 0 1 3.5253906,20.158203 l -1,-3 A 0.50005,0.50005 0 0 1 2.5,17 v -2 a 0.50005,0.50005 0 0 1 0.025391,-0.158203 l 1,-3 a 0.50005,0.50005 0 0 1 0.058594,-0.119141 l 2,-2.9999998 A 0.50005,0.50005 0 0 1 5.8417969,8.5253906 L 8.796875,7.5410156 a 0.50005,0.50005 0 0 1 0.00781,-0.00391 0.50005,0.50005 0 0 1 0.1855469,-0.041016 z"
     id="path2" />
</svg>
