<?xml version="1.0" encoding="UTF-8" standalone="no"?>
<svg
   xmlns:dc="http://purl.org/dc/elements/1.1/"
   xmlns:cc="http://creativecommons.org/ns#"
   xmlns:rdf="http://www.w3.org/1999/02/22-rdf-syntax-ns#"
   xmlns:svg="http://www.w3.org/2000/svg"
   xmlns="http://www.w3.org/2000/svg"
   xmlns:sodipodi="http://sodipodi.sourceforge.net/DTD/sodipodi-0.dtd"
   xmlns:inkscape="http://www.inkscape.org/namespaces/inkscape"
   data-dec="50"
   width="17"
   height="40"
   version="1.1"
   id="svg4"
   sodipodi:docname="50.svg"
   inkscape:version="0.92.4 (unknown)">
  <metadata
     id="metadata10">
    <rdf:RDF>
      <cc:Work
         rdf:about="">
        <dc:format>image/svg+xml</dc:format>
        <dc:type
           rdf:resource="http://purl.org/dc/dcmitype/StillImage" />
      </cc:Work>
    </rdf:RDF>
  </metadata>
  <defs
     id="defs8" />
  <sodipodi:namedview
     pagecolor="#ffffff"
     bordercolor="#666666"
     borderopacity="1"
     objecttolerance="10"
     gridtolerance="10"
     guidetolerance="10"
     inkscape:pageopacity="0"
     inkscape:pageshadow="2"
     inkscape:window-width="640"
     inkscape:window-height="480"
     id="namedview6"
     showgrid="false"
     inkscape:zoom="5.9"
     inkscape:cx="8.5"
     inkscape:cy="20"
     inkscape:window-x="0"
     inkscape:window-y="27"
     inkscape:window-maximized="0"
     inkscape:current-layer="svg4" />
  <path
     style="color:#000000;font-style:normal;font-variant:normal;font-weight:normal;font-stretch:normal;font-size:medium;line-height:normal;font-family:sans-serif;font-variant-ligatures:normal;font-variant-position:normal;font-variant-caps:normal;font-variant-numeric:normal;font-variant-alternates:normal;font-feature-settings:normal;text-indent:0;text-align:start;text-decoration:none;text-decoration-line:none;text-decoration-style:solid;text-decoration-color:#000000;letter-spacing:normal;word-spacing:normal;text-transform:none;writing-mode:lr-tb;direction:ltr;text-orientation:mixed;dominant-baseline:auto;baseline-shift:baseline;text-anchor:start;white-space:normal;shape-padding:0;clip-rule:nonzero;display:inline;overflow:visible;visibility:visible;opacity:1;isolation:auto;mix-blend-mode:normal;color-interpolation:sRGB;color-interpolation-filters:linearRGB;solid-color:#000000;solid-opacity:1;vector-effect:none;fill:#000000;fill-opacity:1;fill-rule:nonzero;stroke:none;stroke-width:1.5;stroke-linecap:round;stroke-linejoin:round;stroke-miterlimit:4;stroke-dasharray:none;stroke-dashoffset:0;stroke-opacity:1;color-rendering:auto;image-rendering:auto;shape-rendering:auto;text-rendering:auto;enable-background:accumulate"
     d="m 8.9746094,0.24609375 a 0.750075,0.750075 0 0 1 0.1894531,0.0214844 0.750075,0.750075 0 0 1 0.072266,0.0214844 0.750075,0.750075 0 0 1 0.03125,0.009766 l 0.00586,0.001953 2.9628905,0.98828125 A 0.750075,0.750075 0 0 1 12.53125,1.46875 l 2,2 a 0.750075,0.750075 0 0 1 0.138672,0.1953125 l 1,2 A 0.750075,0.750075 0 0 1 15.75,6 v 3 a 0.750075,0.750075 0 0 1 -0.125,0.4160156 l -2,3.0000004 a 0.750075,0.750075 0 0 1 -0.289062,0.253906 l -1.955079,0.978516 a 0.750075,0.750075 0 0 1 -0.107421,0.05273 L 9.3769531,14.650391 6.4785156,16.582031 4.6171875,18.443359 3.7128906,20.25 h 9.1113284 l 1.839843,-0.919922 a 0.750075,0.750075 0 0 1 1.00586,1.00586 l -1,2 A 0.750075,0.750075 0 0 1 13.875,22.75 h -1.775391 a 0.750075,0.750075 0 0 1 -0.205078,0 H 5 3.1230469 a 0.750075,0.750075 0 0 1 -0.2460938,0 H 2.1171875 a 0.750075,0.750075 0 0 1 -0.7304687,-0.302734 0.750075,0.750075 0 0 1 -0.00391,-0.0078 0.750075,0.750075 0 0 1 -0.037109,-0.05664 0.750075,0.750075 0 0 1 -0.035156,-0.06641 0.750075,0.750075 0 0 1 0.070312,-0.753906 l 0.9492187,-1.898438 1,-2 A 0.750075,0.750075 0 0 1 3.46875,17.46875 l 2,-2 A 0.750075,0.750075 0 0 1 5.5839844,15.375 l 3,-2 a 0.750075,0.750075 0 0 1 0.080078,-0.04492 L 10.552734,12.384766 12.382812,10.556641 13.25,8.8222656 V 6.1777344 L 12.382812,4.4433594 10.556641,2.6171875 8.8242188,1.75 H 7.1210938 L 4.4042969,2.65625 3.6171875,3.4433594 2.6699219,5.3359375 A 0.750075,0.750075 0 1 1 1.3300781,4.6640625 l 1,-2 A 0.750075,0.750075 0 0 1 2.46875,2.46875 l 1,-1 A 0.750075,0.750075 0 0 1 3.7636719,1.2890625 l 3,-1 A 0.750075,0.750075 0 0 1 7,0.25 h 1.8984375 a 0.750075,0.750075 0 0 1 0.076172,-0.003906 z"
     id="path2" />
</svg>
