<?xml version="1.0" encoding="UTF-8"?>
<glyph name="h" format="1">
  <advance width="548"/>
  <unicode hex="0068"/>
  <outline>
    <contour>
      <point x="116" y="637" type="curve" smooth="yes"/>
      <point x="124" y="637"/>
      <point x="130" y="631"/>
      <point x="130" y="623" type="curve" smooth="yes"/>
      <point x="130" y="339" type="line"/>
      <point x="192" y="400" type="line"/>
      <point x="196" y="404" type="line"/>
      <point x="254" y="432" type="line" smooth="yes"/>
      <point x="256" y="433"/>
      <point x="259" y="433"/>
      <point x="261" y="433" type="curve" smooth="yes"/>
      <point x="348" y="433" type="line" smooth="yes"/>
      <point x="350" y="433"/>
      <point x="352" y="433"/>
      <point x="354" y="432" type="curve" smooth="yes"/>
      <point x="411" y="404" type="line" smooth="yes"/>
      <point x="414" y="403"/>
      <point x="418" y="398"/>
      <point x="419" y="395" type="curve" smooth="yes"/>
      <point x="448" y="308" type="line" smooth="yes"/>
      <point x="448" y="307"/>
      <point x="449" y="305"/>
      <point x="449" y="304" type="curve" smooth="yes"/>
      <point x="449" y="14" type="line" smooth="yes"/>
      <point x="449" y="6"/>
      <point x="442" y="0"/>
      <point x="434" y="0" type="curve" smooth="yes"/>
      <point x="426" y="0"/>
      <point x="420" y="6"/>
      <point x="420" y="14" type="curve" smooth="yes"/>
      <point x="420" y="301" type="line"/>
      <point x="394" y="381" type="line"/>
      <point x="344" y="405" type="line"/>
      <point x="264" y="405" type="line"/>
      <point x="211" y="378" type="line"/>
      <point x="130" y="298" type="line"/>
      <point x="130" y="14" type="line" smooth="yes"/>
      <point x="130" y="6"/>
      <point x="124" y="0"/>
      <point x="116" y="0" type="curve" smooth="yes"/>
      <point x="108" y="0"/>
      <point x="101" y="6"/>
      <point x="101" y="14" type="curve" smooth="yes"/>
      <point x="101" y="301" type="line"/>
      <point x="101" y="304" type="line"/>
      <point x="101" y="306" type="line"/>
      <point x="101" y="623" type="line" smooth="yes"/>
      <point x="101" y="631"/>
      <point x="108" y="637"/>
    </contour>
  </outline>
  <lib>
    <dict>
      <key>com.fontlab.hintData</key>
      <dict>
        <key>hhints</key>
        <array>
          <dict>
            <key>position</key>
            <integer>0</integer>
            <key>width</key>
            <integer>23</integer>
          </dict>
          <dict>
            <key>position</key>
            <integer>405</integer>
            <key>width</key>
            <integer>29</integer>
          </dict>
          <dict>
            <key>position</key>
            <integer>615</integer>
            <key>width</key>
            <integer>22</integer>
          </dict>
        </array>
        <key>vhints</key>
        <array>
          <dict>
            <key>position</key>
            <integer>101</integer>
            <key>width</key>
            <integer>29</integer>
          </dict>
          <dict>
            <key>position</key>
            <integer>420</integer>
            <key>width</key>
            <integer>29</integer>
          </dict>
        </array>
      </dict>
    </dict>
  </lib>
</glyph>
