<?xml version="1.0" encoding="UTF-8" standalone="no"?>
<svg
   xmlns:dc="http://purl.org/dc/elements/1.1/"
   xmlns:cc="http://creativecommons.org/ns#"
   xmlns:rdf="http://www.w3.org/1999/02/22-rdf-syntax-ns#"
   xmlns:svg="http://www.w3.org/2000/svg"
   xmlns="http://www.w3.org/2000/svg"
   xmlns:sodipodi="http://sodipodi.sourceforge.net/DTD/sodipodi-0.dtd"
   xmlns:inkscape="http://www.inkscape.org/namespaces/inkscape"
   data-dec="50"
   width="22"
   height="40"
   version="1.1"
   id="svg4"
   sodipodi:docname="50.svg"
   inkscape:version="0.92.4 (unknown)">
  <metadata
     id="metadata10">
    <rdf:RDF>
      <cc:Work
         rdf:about="">
        <dc:format>image/svg+xml</dc:format>
        <dc:type
           rdf:resource="http://purl.org/dc/dcmitype/StillImage" />
      </cc:Work>
    </rdf:RDF>
  </metadata>
  <defs
     id="defs8" />
  <sodipodi:namedview
     pagecolor="#ffffff"
     bordercolor="#666666"
     borderopacity="1"
     objecttolerance="10"
     gridtolerance="10"
     guidetolerance="10"
     inkscape:pageopacity="0"
     inkscape:pageshadow="2"
     inkscape:window-width="640"
     inkscape:window-height="480"
     id="namedview6"
     showgrid="false"
     inkscape:zoom="5.9"
     inkscape:cx="11"
     inkscape:cy="20"
     inkscape:window-x="0"
     inkscape:window-y="27"
     inkscape:window-maximized="0"
     inkscape:current-layer="svg4" />
  <path
     style="color:#000000;font-style:normal;font-variant:normal;font-weight:normal;font-stretch:normal;font-size:medium;line-height:normal;font-family:sans-serif;font-variant-ligatures:normal;font-variant-position:normal;font-variant-caps:normal;font-variant-numeric:normal;font-variant-alternates:normal;font-feature-settings:normal;text-indent:0;text-align:start;text-decoration:none;text-decoration-line:none;text-decoration-style:solid;text-decoration-color:#000000;letter-spacing:normal;word-spacing:normal;text-transform:none;writing-mode:lr-tb;direction:ltr;text-orientation:mixed;dominant-baseline:auto;baseline-shift:baseline;text-anchor:start;white-space:normal;shape-padding:0;clip-rule:nonzero;display:inline;overflow:visible;visibility:visible;opacity:1;isolation:auto;mix-blend-mode:normal;color-interpolation:sRGB;color-interpolation-filters:linearRGB;solid-color:#000000;solid-opacity:1;vector-effect:none;fill:#013272;fill-opacity:1;fill-rule:nonzero;stroke:none;stroke-width:2.5;stroke-linecap:round;stroke-linejoin:round;stroke-miterlimit:4;stroke-dasharray:none;stroke-dashoffset:0;stroke-opacity:1;color-rendering:auto;image-rendering:auto;shape-rendering:auto;text-rendering:auto;enable-background:accumulate"
     d="m 13.957031,-0.2578125 a 1.250125,1.250125 0 0 1 0.488281,0.0878906 l 0.0098,0.003906 2.939453,0.98046874 a 1.250125,1.250125 0 0 1 0.722657,0.62695308 l 1,2 A 1.250125,1.250125 0 0 1 19.25,4 v 2 a 1.250125,1.250125 0 0 1 -0.132812,0.5585938 l -1,2 a 1.250125,1.250125 0 0 1 -0.232422,0.3261718 l -2,2.0000004 a 1.250125,1.250125 0 0 1 -0.191407,0.15625 l -3,2 a 1.250125,1.250125 0 0 1 -0.134765,0.07617 L 8.6289062,15.083984 5.796875,16.970703 5.0253906,17.742188 a 1.250125,1.250125 0 0 1 0.5078125,0.125 L 10.240234,19.75 h 2.464844 l 1.363281,-0.681641 0.775391,-1.546875 a 1.250125,1.250125 0 0 1 0.0078,-0.01953 1.250125,1.250125 0 0 1 0.07031,-0.138672 1.250125,1.250125 0 0 1 0.06836,-0.105469 1.250125,1.250125 0 0 1 0.164063,-0.1875 1.250125,1.250125 0 0 1 0.0957,-0.08008 1.250125,1.250125 0 0 1 0.103516,-0.07031 1.250125,1.250125 0 0 1 0.109375,-0.06055 1.250125,1.250125 0 0 1 0.115234,-0.04883 1.250125,1.250125 0 0 1 0.117187,-0.03711 1.250125,1.250125 0 0 1 0.0039,0 1.250125,1.250125 0 0 1 0.121093,-0.02539 1.250125,1.250125 0 0 1 0.123047,-0.01172 1.250125,1.250125 0 0 1 0.125,0 1.250125,1.250125 0 0 1 0.111329,0.0098 1.250125,1.250125 0 0 1 0.03125,0.0059 1.250125,1.250125 0 0 1 0.09766,0.01953 1.250125,1.250125 0 0 1 0.01953,0.0059 1.250125,1.250125 0 0 1 0.07813,0.02148 1.250125,1.250125 0 0 1 0.09375,0.03711 1.250125,1.250125 0 0 1 0.105469,0.05273 1.250125,1.250125 0 0 1 0.0059,0.002 1.250125,1.250125 0 0 1 0.0039,0.0039 1.250125,1.250125 0 0 1 0.0918,0.05469 1.250125,1.250125 0 0 1 0.01172,0.0078 1.250125,1.250125 0 0 1 0.0078,0.0059 1.250125,1.250125 0 0 1 0.08984,0.07031 1.250125,1.250125 0 0 1 0.08984,0.08398 1.250125,1.250125 0 0 1 0.002,0.002 1.250125,1.250125 0 0 1 0.002,0.0039 1.250125,1.250125 0 0 1 0.06641,0.07422 1.250125,1.250125 0 0 1 0.01367,0.01563 1.250125,1.250125 0 0 1 0.0098,0.01367 1.250125,1.250125 0 0 1 0.05078,0.07031 1.250125,1.250125 0 0 1 0.01172,0.01758 1.250125,1.250125 0 0 1 0.0059,0.01172 1.250125,1.250125 0 0 1 0.05469,0.09766 1.250125,1.250125 0 0 1 0.04883,0.109375 1.250125,1.250125 0 0 1 0.002,0.0039 1.250125,1.250125 0 0 1 0.002,0.0039 1.250125,1.250125 0 0 1 0.0332,0.09961 1.250125,1.250125 0 0 1 0.0039,0.01563 1.250125,1.250125 0 0 1 0.002,0.01172 1.250125,1.250125 0 0 1 0.02344,0.111328 1.250125,1.250125 0 0 1 0.01563,0.115234 1.250125,1.250125 0 0 1 0,0.0078 1.250125,1.250125 0 0 1 0,0.0059 1.250125,1.250125 0 0 1 0.002,0.113281 1.250125,1.250125 0 0 1 0,0.0059 1.250125,1.250125 0 0 1 0,0.0039 1.250125,1.250125 0 0 1 -0.01172,0.121094 1.250125,1.250125 0 0 1 -0.07422,0.292968 l -0.0039,0.0098 -0.980469,2.939453 a 1.250125,1.250125 0 0 1 -0.626953,0.722657 l -2,1 A 1.250125,1.250125 0 0 1 13,23.25 H 10 A 1.250125,1.250125 0 0 1 9.3574219,23.072266 L 4.6542969,20.25 H 3.5175781 l -0.4921875,0.494141 -0.9082031,1.814453 a 1.250125,1.250125 0 1 1 -2.234375,-1.117188 l 0.94140625,-1.880859 a 1.250125,1.250125 0 0 1 0.1015625,-0.205078 L 1.8828125,17.441406 a 1.250125,1.250125 0 0 1 0.2324219,-0.326172 l 2,-2 a 1.250125,1.250125 0 0 1 0.1914062,-0.15625 l 3,-2 0.025391,-0.01563 L 13.203125,9.0292969 14.972656,7.2597656 15.75,5.7050781 V 4.2949219 L 15.068359,2.9316406 13.707031,2.25 H 11.203125 L 8.6757812,3.0917969 8.0273438,3.7402344 7.8535156,4.0878906 a 1.250125,1.250125 0 0 1 0.03125,0.027344 l 1,1 a 1.250125,1.250125 0 0 1 0,1.7695312 l -1,1 a 1.250125,1.250125 0 0 1 -1.7695312,0 l -1,-1 A 1.250125,1.250125 0 0 1 4.75,6 V 5 A 1.250125,1.250125 0 0 1 4.8828125,4.4414062 l 1,-2 A 1.250125,1.250125 0 0 1 6.1152344,2.1152344 l 1,-1 A 1.250125,1.250125 0 0 1 7.6054688,0.81445312 l 3.0000002,-1 A 1.250125,1.250125 0 0 1 11,-0.25 h 2.857422 a 1.250125,1.250125 0 0 1 0.09961,-0.007813 z"
     id="path2" />
</svg>
