<?xml version="1.0" encoding="UTF-8"?>
<glyph name="less" format="1">
  <advance width="694"/>
  <unicode hex="003C"/>
  <outline>
    <contour>
      <point x="608" y="536" type="curve" smooth="yes"/>
      <point x="612" y="536"/>
      <point x="615" y="533"/>
      <point x="615" y="529" type="curve" smooth="yes"/>
      <point x="615" y="527"/>
      <point x="614" y="523"/>
      <point x="612" y="522" type="curve" smooth="yes"/>
      <point x="131" y="267" type="line"/>
      <point x="553" y="14" type="line" smooth="yes"/>
      <point x="555" y="13"/>
      <point x="558" y="10"/>
      <point x="558" y="8" type="curve" smooth="yes"/>
      <point x="558" y="4"/>
      <point x="554" y="0"/>
      <point x="550" y="0" type="curve" smooth="yes"/>
      <point x="549" y="0"/>
      <point x="548" y="0"/>
      <point x="547" y="1" type="curve" smooth="yes"/>
      <point x="112" y="262" type="line" smooth="yes"/>
      <point x="110" y="263"/>
      <point x="109" y="266"/>
      <point x="109" y="268" type="curve" smooth="yes"/>
      <point x="109" y="270"/>
      <point x="110" y="274"/>
      <point x="112" y="275" type="curve" smooth="yes"/>
      <point x="605" y="535" type="line" smooth="yes"/>
      <point x="606" y="535"/>
      <point x="607" y="536"/>
    </contour>
  </outline>
  <lib>
    <dict>
      <key>com.fontlab.hintData</key>
      <dict>
        <key>hhints</key>
        <array>
          <dict>
            <key>position</key>
            <integer>0</integer>
            <key>width</key>
            <integer>23</integer>
          </dict>
        </array>
      </dict>
    </dict>
  </lib>
</glyph>
