<?xml version="1.0" encoding="UTF-8"?>
<glyph name="A" format="1">
  <advance width="578"/>
  <unicode hex="0041"/>
  <outline>
    <contour>
      <point x="289" y="593" type="line"/>
      <point x="155" y="188" type="line"/>
      <point x="395" y="188" type="line"/>
      <point x="283" y="527" type="line" smooth="yes"/>
      <point x="283" y="528"/>
      <point x="282" y="528"/>
      <point x="282" y="529" type="curve" smooth="yes"/>
      <point x="282" y="533"/>
      <point x="285" y="537"/>
      <point x="289" y="537" type="curve" smooth="yes"/>
      <point x="292" y="537"/>
      <point x="295" y="534"/>
      <point x="296" y="531" type="curve" smooth="yes"/>
      <point x="411" y="185" type="line" smooth="yes"/>
      <point x="411" y="184"/>
      <point x="412" y="184"/>
      <point x="412" y="183" type="curve" smooth="yes"/>
      <point x="469" y="14" type="line"/>
      <point x="482" y="14" type="line"/>
    </contour>
    <contour>
      <point x="289" y="623" type="line"/>
      <point x="290" y="623" type="line"/>
      <point x="292" y="623" type="line"/>
      <point x="293" y="623" type="line"/>
      <point x="293" y="622" type="line"/>
      <point x="294" y="622" type="line"/>
      <point x="295" y="620" type="line"/>
      <point x="296" y="619" type="line" smooth="yes"/>
      <point x="296" y="618"/>
      <point x="297" y="618"/>
      <point x="297" y="617" type="curve" smooth="yes"/>
      <point x="497" y="14" type="line"/>
      <point x="550" y="14" type="line" smooth="yes"/>
      <point x="554" y="14"/>
      <point x="558" y="12"/>
      <point x="558" y="8" type="curve" smooth="yes"/>
      <point x="558" y="4"/>
      <point x="554" y="0"/>
      <point x="550" y="0" type="curve" smooth="yes"/>
      <point x="493" y="0" type="line"/>
      <point x="492" y="0" type="line"/>
      <point x="491" y="0" type="line"/>
      <point x="464" y="0" type="line"/>
      <point x="463" y="0" type="line"/>
      <point x="462" y="0" type="line"/>
      <point x="376" y="0" type="line" smooth="yes"/>
      <point x="372" y="0"/>
      <point x="368" y="4"/>
      <point x="368" y="8" type="curve" smooth="yes"/>
      <point x="368" y="12"/>
      <point x="372" y="14"/>
      <point x="376" y="14" type="curve" smooth="yes"/>
      <point x="453" y="14" type="line"/>
      <point x="400" y="174" type="line"/>
      <point x="150" y="174" type="line"/>
      <point x="97" y="14" type="line"/>
      <point x="202" y="14" type="line" smooth="yes"/>
      <point x="206" y="14"/>
      <point x="210" y="12"/>
      <point x="210" y="8" type="curve" smooth="yes"/>
      <point x="210" y="4"/>
      <point x="206" y="0"/>
      <point x="202" y="0" type="curve" smooth="yes"/>
      <point x="88" y="0" type="line"/>
      <point x="87" y="0" type="line"/>
      <point x="86" y="0" type="line"/>
      <point x="29" y="0" type="line" smooth="yes"/>
      <point x="25" y="0"/>
      <point x="22" y="4"/>
      <point x="22" y="8" type="curve" smooth="yes"/>
      <point x="22" y="12"/>
      <point x="25" y="14"/>
      <point x="29" y="14" type="curve" smooth="yes"/>
      <point x="81" y="14" type="line"/>
      <point x="138" y="183" type="line" smooth="yes"/>
      <point x="138" y="184"/>
      <point x="139" y="184"/>
      <point x="139" y="185" type="curve" smooth="yes"/>
      <point x="283" y="617" type="line" smooth="yes"/>
      <point x="283" y="618"/>
      <point x="284" y="618"/>
      <point x="284" y="619" type="curve" smooth="yes"/>
      <point x="284" y="620" type="line"/>
      <point x="286" y="622" type="line" smooth="yes"/>
      <point x="287" y="622"/>
      <point x="287" y="623"/>
      <point x="288" y="623" type="curve" smooth="yes"/>
    </contour>
  </outline>
  <lib>
    <dict>
      <key>com.fontlab.hintData</key>
      <dict>
        <key>hhints</key>
        <array>
          <dict>
            <key>position</key>
            <integer>0</integer>
            <key>width</key>
            <integer>14</integer>
          </dict>
          <dict>
            <key>position</key>
            <integer>174</integer>
            <key>width</key>
            <integer>14</integer>
          </dict>
          <dict>
            <key>position</key>
            <integer>601</integer>
            <key>width</key>
            <integer>22</integer>
          </dict>
        </array>
        <key>vhints</key>
        <array>
          <dict>
            <key>position</key>
            <integer>284</integer>
            <key>width</key>
            <integer>12</integer>
          </dict>
        </array>
      </dict>
    </dict>
  </lib>
</glyph>
