<?xml version="1.0" encoding="UTF-8" standalone="no"?>
<svg
   xmlns:dc="http://purl.org/dc/elements/1.1/"
   xmlns:cc="http://creativecommons.org/ns#"
   xmlns:rdf="http://www.w3.org/1999/02/22-rdf-syntax-ns#"
   xmlns:svg="http://www.w3.org/2000/svg"
   xmlns="http://www.w3.org/2000/svg"
   xmlns:sodipodi="http://sodipodi.sourceforge.net/DTD/sodipodi-0.dtd"
   xmlns:inkscape="http://www.inkscape.org/namespaces/inkscape"
   data-dec="85"
   width="22"
   height="40"
   version="1.1"
   id="svg4"
   sodipodi:docname="85.svg"
   inkscape:version="0.92.4 (unknown)">
  <metadata
     id="metadata10">
    <rdf:RDF>
      <cc:Work
         rdf:about="">
        <dc:format>image/svg+xml</dc:format>
        <dc:type
           rdf:resource="http://purl.org/dc/dcmitype/StillImage" />
      </cc:Work>
    </rdf:RDF>
  </metadata>
  <defs
     id="defs8" />
  <sodipodi:namedview
     pagecolor="#ffffff"
     bordercolor="#666666"
     borderopacity="1"
     objecttolerance="10"
     gridtolerance="10"
     guidetolerance="10"
     inkscape:pageopacity="0"
     inkscape:pageshadow="2"
     inkscape:window-width="640"
     inkscape:window-height="480"
     id="namedview6"
     showgrid="false"
     inkscape:zoom="5.9"
     inkscape:cx="11"
     inkscape:cy="20"
     inkscape:window-x="0"
     inkscape:window-y="27"
     inkscape:window-maximized="0"
     inkscape:current-layer="svg4" />
  <path
     style="color:#000000;font-style:normal;font-variant:normal;font-weight:normal;font-stretch:normal;font-size:medium;line-height:normal;font-family:sans-serif;font-variant-ligatures:normal;font-variant-position:normal;font-variant-caps:normal;font-variant-numeric:normal;font-variant-alternates:normal;font-feature-settings:normal;text-indent:0;text-align:start;text-decoration:none;text-decoration-line:none;text-decoration-style:solid;text-decoration-color:#000000;letter-spacing:normal;word-spacing:normal;text-transform:none;writing-mode:lr-tb;direction:ltr;text-orientation:mixed;dominant-baseline:auto;baseline-shift:baseline;text-anchor:start;white-space:normal;shape-padding:0;clip-rule:nonzero;display:inline;overflow:visible;visibility:visible;opacity:1;isolation:auto;mix-blend-mode:normal;color-interpolation:sRGB;color-interpolation-filters:linearRGB;solid-color:#000000;solid-opacity:1;vector-effect:none;fill:#000000;fill-opacity:1;fill-rule:nonzero;stroke:none;stroke-width:1.5;stroke-linecap:round;stroke-linejoin:round;stroke-miterlimit:4;stroke-dasharray:none;stroke-dashoffset:0;stroke-opacity:1;color-rendering:auto;image-rendering:auto;shape-rendering:auto;text-rendering:auto;enable-background:accumulate"
     d="M 3.9882812,0.24023438 A 0.750075,0.750075 0 0 1 4.1230469,0.25 h 0.7539062 a 0.750075,0.750075 0 0 1 0.2460938,0 H 6 7 a 0.750075,0.750075 0 0 1 0,1.5 H 6.3105469 L 5.75,2.3125 V 16.878906 L 6.65625,19.595703 7.4433594,20.382812 9.1757812,21.25 H 12.878906 L 15.595703,20.34375 16.34375,19.595703 17.25,16.878906 V 2.3125 L 16.6875,1.75 H 16 v -1.5 h 1 0.876953 a 0.750075,0.750075 0 0 1 0.246094,0 H 19 20 v 1.5 H 19.310547 L 18.75,2.3125 V 17 a 0.750075,0.750075 0 0 1 -0.03906,0.236328 l -1,3 A 0.750075,0.750075 0 0 1 17.53125,20.53125 l -1,1 a 0.750075,0.750075 0 0 1 -0.294922,0.179688 l -3,1 A 0.750075,0.750075 0 0 1 13,22.75 H 9.1015625 a 0.750075,0.750075 0 0 1 -0.265625,-0.01758 0.750075,0.750075 0 0 1 -0.072266,-0.02148 l -0.03125,-0.0098 a 0.750075,0.750075 0 0 1 -0.00586,-0.002 L 5.7636719,21.710938 A 0.750075,0.750075 0 0 1 5.46875,21.53125 l -1,-1 A 0.750075,0.750075 0 0 1 4.2890625,20.236328 l -1,-3 A 0.750075,0.750075 0 0 1 3.25,17 V 2.3125 L 2.6894531,1.75 H 2 a 0.750075,0.750075 0 0 1 0,-1.5 h 1 0.8769531 a 0.750075,0.750075 0 0 1 0.1113281,-0.009766 z"
     id="path2" />
</svg>
