<?xml version="1.0" encoding="UTF-8" standalone="no"?>
<svg
   xmlns:dc="http://purl.org/dc/elements/1.1/"
   xmlns:cc="http://creativecommons.org/ns#"
   xmlns:rdf="http://www.w3.org/1999/02/22-rdf-syntax-ns#"
   xmlns:svg="http://www.w3.org/2000/svg"
   xmlns="http://www.w3.org/2000/svg"
   xmlns:sodipodi="http://sodipodi.sourceforge.net/DTD/sodipodi-0.dtd"
   xmlns:inkscape="http://www.inkscape.org/namespaces/inkscape"
   data-dec="108"
   width="12"
   height="40"
   version="1.1"
   id="svg4"
   sodipodi:docname="108.svg"
   inkscape:version="0.92.4 (unknown)">
  <metadata
     id="metadata10">
    <rdf:RDF>
      <cc:Work
         rdf:about="">
        <dc:format>image/svg+xml</dc:format>
        <dc:type
           rdf:resource="http://purl.org/dc/dcmitype/StillImage" />
      </cc:Work>
    </rdf:RDF>
  </metadata>
  <defs
     id="defs8" />
  <sodipodi:namedview
     pagecolor="#ffffff"
     bordercolor="#666666"
     borderopacity="1"
     objecttolerance="10"
     gridtolerance="10"
     guidetolerance="10"
     inkscape:pageopacity="0"
     inkscape:pageshadow="2"
     inkscape:window-width="640"
     inkscape:window-height="480"
     id="namedview6"
     showgrid="false"
     inkscape:zoom="5.9"
     inkscape:cx="6"
     inkscape:cy="20"
     inkscape:window-x="0"
     inkscape:window-y="27"
     inkscape:window-maximized="0"
     inkscape:current-layer="svg4" />
  <path
     style="color:#000000;font-style:normal;font-variant:normal;font-weight:normal;font-stretch:normal;font-size:medium;line-height:normal;font-family:sans-serif;font-variant-ligatures:normal;font-variant-position:normal;font-variant-caps:normal;font-variant-numeric:normal;font-variant-alternates:normal;font-feature-settings:normal;text-indent:0;text-align:start;text-decoration:none;text-decoration-line:none;text-decoration-style:solid;text-decoration-color:#000000;letter-spacing:normal;word-spacing:normal;text-transform:none;writing-mode:lr-tb;direction:ltr;text-orientation:mixed;dominant-baseline:auto;baseline-shift:baseline;text-anchor:start;white-space:normal;shape-padding:0;clip-rule:nonzero;display:inline;overflow:visible;visibility:visible;opacity:1;isolation:auto;mix-blend-mode:normal;color-interpolation:sRGB;color-interpolation-filters:linearRGB;solid-color:#000000;solid-opacity:1;vector-effect:none;fill:#013272;fill-opacity:1;fill-rule:nonzero;stroke:none;stroke-width:0.30000001;stroke-linecap:round;stroke-linejoin:round;stroke-miterlimit:4;stroke-dasharray:none;stroke-dashoffset:0;stroke-opacity:1;color-rendering:auto;image-rendering:auto;shape-rendering:auto;text-rendering:auto;enable-background:accumulate"
     d="m 7.9355469,1.8027344 -0.1289063,0.4746094 0.328125,0.65625 A 0.15023831,0.15023831 0 0 1 7.8652344,3.0664062 L 7.6875,2.7128906 5.1445312,12.037109 4.1503906,16.017578 v 2.947266 l 0.6992188,1.40039 v -1.357422 a 0.15001501,0.15001501 0 0 1 0,-0.01367 V 16 a 0.15001501,0.15001501 0 0 1 0.00391,-0.03711 l 1,-4 a 0.15001501,0.15001501 0 0 1 0.00195,-0.002 L 8.5683594,2.0136719 Z M 7.4960938,1.65625 7.6054688,1.875 7.6523438,1.7089844 Z M 9.1132812,1.1503906 8.9316406,1.8183594 9.046875,1.8574219 A 0.15008591,0.15008591 0 1 1 8.953125,2.1425781 L 8.8535156,2.109375 6.1445312,12.037109 5.1503906,16.017578 v 1.757813 l 0.703125,-2.8125 a 0.15001501,0.15001501 0 0 1 0.00195,-0.0039 L 9.8007812,1.1503906 Z m -1,0 -0.097656,0.3632813 0.6308594,0.2109375 0.1582031,-0.5742188 z m -0.8710937,0 0.064453,0.1269532 0.4238282,0.140625 0.074219,-0.2675782 z M 6.9863281,0.84765625 a 0.15001501,0.15001501 0 0 1 0.03125,0.001953 h 0.9609375 a 0.15001501,0.15001501 0 0 1 0.044922,0 h 0.9550781 a 0.15001501,0.15001501 0 0 1 0.044922,0 H 10 A 0.15001501,0.15001501 0 0 1 10.144531,1.0410156 L 6.1445312,15.039062 5.1503906,19.021484 v 1.917969 L 6.0625,21.849609 h 1.875 l 1.9394531,-1.9375 0.9882809,-1.978515 a 0.15024103,0.15024103 0 0 1 0.269532,0.132812 l -1,2 a 0.15001501,0.15001501 0 0 1 -0.0293,0.03906 l -2.0000002,2 A 0.15001501,0.15001501 0 0 1 8,22.150391 H 6 A 0.15001501,0.15001501 0 0 1 5.8945312,22.105469 L 4.9179688,21.126953 a 0.15001501,0.15001501 0 0 1 -0.00391,-0.002 0.15001501,0.15001501 0 0 1 -0.019531,-0.01758 0.15001501,0.15001501 0 0 1 0,-0.002 0.15001501,0.15001501 0 0 1 -0.00195,-0.002 0.15001501,0.15001501 0 0 1 -0.019531,-0.02344 0.15001501,0.15001501 0 0 1 -0.00586,-0.0078 0.15001501,0.15001501 0 0 1 -0.00195,-0.0059 l -0.00391,-0.0078 a 0.15001501,0.15001501 0 0 1 -0.00586,-0.01367 L 3.8652344,19.066406 A 0.15001501,0.15001501 0 0 1 3.8496094,19 v -3 a 0.15001501,0.15001501 0 0 1 0.00391,-0.03711 l 1,-4 a 0.15001501,0.15001501 0 0 1 0.00195,-0.002 L 7.4882812,2.3105469 7.09375,1.5234375 5.9765625,1.1503906 H 5 A 0.15039068,0.15039068 0 1 1 5,0.84960938 h 0.9882812 0.015625 0.96875 a 0.15001501,0.15001501 0 0 1 0.013672,-0.001953 z"
     id="path2" />
</svg>
