<?xml version="1.0" encoding="UTF-8" standalone="no"?>
<svg
   xmlns:dc="http://purl.org/dc/elements/1.1/"
   xmlns:cc="http://creativecommons.org/ns#"
   xmlns:rdf="http://www.w3.org/1999/02/22-rdf-syntax-ns#"
   xmlns:svg="http://www.w3.org/2000/svg"
   xmlns="http://www.w3.org/2000/svg"
   xmlns:sodipodi="http://sodipodi.sourceforge.net/DTD/sodipodi-0.dtd"
   xmlns:inkscape="http://www.inkscape.org/namespaces/inkscape"
   data-dec="81"
   width="12"
   height="40"
   version="1.1"
   id="svg4"
   sodipodi:docname="81.svg"
   inkscape:version="0.92.4 5da689c313, 2019-01-14">
  <metadata
     id="metadata10">
    <rdf:RDF>
      <cc:Work
         rdf:about="">
        <dc:format>image/svg+xml</dc:format>
        <dc:type
           rdf:resource="http://purl.org/dc/dcmitype/StillImage" />
        <dc:title></dc:title>
      </cc:Work>
    </rdf:RDF>
  </metadata>
  <defs
     id="defs8" />
  <sodipodi:namedview
     pagecolor="#ffffff"
     bordercolor="#666666"
     borderopacity="1"
     objecttolerance="10"
     gridtolerance="10"
     guidetolerance="10"
     inkscape:pageopacity="0"
     inkscape:pageshadow="2"
     inkscape:window-width="1920"
     inkscape:window-height="1043"
     id="namedview6"
     showgrid="false"
     inkscape:zoom="5.9"
     inkscape:cx="6"
     inkscape:cy="20"
     inkscape:window-x="0"
     inkscape:window-y="37"
     inkscape:window-maximized="0"
     inkscape:current-layer="svg4" />
  <path
     id="path2"
     style="fill:none;stroke:#000000;stroke-width:1.10782337;stroke-linecap:round;stroke-linejoin:round"
     d="M 5.4545455,1 3.8181818,2 2.7272728,4 2.1818182,6 1.6363636,10 v 3 l 0.5454546,4 0.5454546,2 1.090909,2 1.6363637,1 H 6.5454546 L 8.1818182,21 9.2727274,19 9.8181819,17 10.363636,13 V 10 L 9.8181819,6 9.2727274,4 8.1818182,2 6.5454546,1 H 5.4545455 M 3.8181818,21 V 19 L 4.3636364,17 5.4545455,16 H 6 l 1.0909091,1 0.5454546,2 m 0,0 0.5454545,3 0.5454546,2 0.5454546,1 h 0.5454545 l 0.5454541,-1" />
</svg>
