<?xml version="1.0" encoding="UTF-8"?>
<glyph name="Ugrave" format="1">
  <advance width="635"/>
  <unicode hex="00D9"/>
  <outline>
    <contour>
      <point x="230" y="851" type="line"/>
      <point x="212" y="834" type="line"/>
      <point x="319" y="745" type="line"/>
    </contour>
    <contour>
      <point x="229" y="869" type="curve" smooth="yes"/>
      <point x="230" y="869" type="line"/>
      <point x="231" y="869" type="line" smooth="yes"/>
      <point x="233" y="869"/>
      <point x="235" y="868"/>
      <point x="236" y="866" type="curve" smooth="yes"/>
      <point x="380" y="693" type="line"/>
      <point x="381" y="693" type="line"/>
      <point x="381" y="692" type="line"/>
      <point x="382" y="692" type="line"/>
      <point x="382" y="691" type="line"/>
      <point x="382" y="690" type="line"/>
      <point x="382" y="689" type="line"/>
      <point x="382" y="688" type="line"/>
      <point x="382" y="686" type="line"/>
      <point x="382" y="685" type="line"/>
      <point x="381" y="684" type="line"/>
      <point x="381" y="683" type="line"/>
      <point x="380" y="683" type="line"/>
      <point x="380" y="682" type="line"/>
      <point x="378" y="682" type="line"/>
      <point x="377" y="681" type="line"/>
      <point x="375" y="681" type="line"/>
      <point x="374" y="681" type="line"/>
      <point x="373" y="681" type="line"/>
      <point x="372" y="681" type="line"/>
      <point x="372" y="682" type="line"/>
      <point x="371" y="682" type="line"/>
      <point x="371" y="683" type="line"/>
      <point x="370" y="683" type="line"/>
      <point x="197" y="827" type="line" smooth="yes"/>
      <point x="196" y="828"/>
      <point x="194" y="831"/>
      <point x="194" y="833" type="curve" smooth="yes"/>
      <point x="194" y="835"/>
      <point x="195" y="837"/>
      <point x="196" y="838" type="curve" smooth="yes"/>
      <point x="224" y="867" type="line" smooth="yes"/>
      <point x="225" y="868"/>
      <point x="227" y="869"/>
    </contour>
    <contour>
      <point x="123" y="608" type="line"/>
      <point x="123" y="183" type="line"/>
      <point x="151" y="98" type="line"/>
      <point x="207" y="43" type="line"/>
      <point x="290" y="14" type="line"/>
      <point x="346" y="14" type="line"/>
      <point x="430" y="43" type="line"/>
      <point x="486" y="98" type="line"/>
      <point x="514" y="183" type="line"/>
      <point x="514" y="608" type="line"/>
      <point x="499" y="608" type="line"/>
      <point x="499" y="182" type="line"/>
      <point x="499" y="179" type="line"/>
      <point x="470" y="92" type="line" smooth="yes"/>
      <point x="470" y="91"/>
      <point x="470" y="90"/>
      <point x="469" y="89" type="curve" smooth="yes"/>
      <point x="439" y="60" type="line" smooth="yes"/>
      <point x="438" y="59"/>
      <point x="438" y="58"/>
      <point x="437" y="58" type="curve" smooth="yes"/>
      <point x="350" y="30" type="line"/>
      <point x="348" y="30" type="line"/>
      <point x="289" y="30" type="line"/>
      <point x="287" y="30" type="line"/>
      <point x="200" y="58" type="line" smooth="yes"/>
      <point x="199" y="58"/>
      <point x="199" y="59"/>
      <point x="198" y="60" type="curve" smooth="yes"/>
      <point x="168" y="89" type="line" smooth="yes"/>
      <point x="167" y="90"/>
      <point x="167" y="91"/>
      <point x="167" y="92" type="curve" smooth="yes"/>
      <point x="138" y="179" type="line"/>
      <point x="138" y="182" type="line"/>
      <point x="138" y="608" type="line"/>
    </contour>
    <contour>
      <point x="116" y="623" type="curve" smooth="yes"/>
      <point x="117" y="623" type="line"/>
      <point x="145" y="623" type="line" smooth="yes"/>
      <point x="149" y="623"/>
      <point x="152" y="620"/>
      <point x="152" y="616" type="curve" smooth="yes"/>
      <point x="152" y="183" type="line"/>
      <point x="180" y="98" type="line"/>
      <point x="207" y="72" type="line"/>
      <point x="290" y="44" type="line"/>
      <point x="346" y="44" type="line"/>
      <point x="430" y="72" type="line"/>
      <point x="456" y="98" type="line"/>
      <point x="485" y="183" type="line"/>
      <point x="485" y="616" type="line" smooth="yes"/>
      <point x="485" y="620"/>
      <point x="488" y="623"/>
      <point x="492" y="623" type="curve" smooth="yes"/>
      <point x="520" y="623" type="line"/>
      <point x="521" y="623" type="line" smooth="yes"/>
      <point x="522" y="623"/>
      <point x="525" y="623"/>
      <point x="526" y="622" type="curve" smooth="yes"/>
      <point x="526" y="620" type="line"/>
      <point x="527" y="620" type="line"/>
      <point x="527" y="619" type="line" smooth="yes"/>
      <point x="527" y="618"/>
      <point x="528" y="616"/>
      <point x="528" y="615" type="curve" smooth="yes"/>
      <point x="528" y="614" type="line"/>
      <point x="528" y="182" type="line"/>
      <point x="528" y="179" type="line"/>
      <point x="499" y="92" type="line" smooth="yes"/>
      <point x="499" y="91"/>
      <point x="498" y="90"/>
      <point x="497" y="89" type="curve" smooth="yes"/>
      <point x="439" y="32" type="line" smooth="yes"/>
      <point x="438" y="31"/>
      <point x="438" y="30"/>
      <point x="437" y="30" type="curve" smooth="yes"/>
      <point x="350" y="1" type="line" smooth="yes"/>
      <point x="349" y="1"/>
      <point x="349" y="0"/>
      <point x="348" y="0" type="curve" smooth="yes"/>
      <point x="289" y="0" type="line" smooth="yes"/>
      <point x="288" y="0"/>
      <point x="288" y="1"/>
      <point x="287" y="1" type="curve" smooth="yes"/>
      <point x="200" y="30" type="line" smooth="yes"/>
      <point x="199" y="30"/>
      <point x="199" y="31"/>
      <point x="198" y="32" type="curve" smooth="yes"/>
      <point x="140" y="89" type="line" smooth="yes"/>
      <point x="139" y="90"/>
      <point x="138" y="91"/>
      <point x="138" y="92" type="curve" smooth="yes"/>
      <point x="109" y="179" type="line"/>
      <point x="109" y="182" type="line"/>
      <point x="109" y="614" type="line"/>
      <point x="109" y="616" type="line" smooth="yes"/>
      <point x="109" y="617"/>
      <point x="109" y="619"/>
      <point x="110" y="620" type="curve" smooth="yes"/>
      <point x="111" y="622" type="line"/>
      <point x="112" y="622" type="line" smooth="yes"/>
      <point x="113" y="622"/>
      <point x="115" y="623"/>
    </contour>
  </outline>
  <lib>
    <dict>
      <key>com.fontlab.hintData</key>
      <dict>
        <key>hhints</key>
        <array>
          <dict>
            <key>position</key>
            <integer>0</integer>
            <key>width</key>
            <integer>14</integer>
          </dict>
          <dict>
            <key>position</key>
            <integer>30</integer>
            <key>width</key>
            <integer>14</integer>
          </dict>
          <dict>
            <key>position</key>
            <integer>608</integer>
            <key>width</key>
            <integer>14</integer>
          </dict>
          <dict>
            <key>position</key>
            <integer>683</integer>
            <key>width</key>
            <integer>10</integer>
          </dict>
          <dict>
            <key>position</key>
            <integer>847</integer>
            <key>width</key>
            <integer>22</integer>
          </dict>
        </array>
        <key>vhints</key>
        <array>
          <dict>
            <key>position</key>
            <integer>109</integer>
            <key>width</key>
            <integer>14</integer>
          </dict>
          <dict>
            <key>position</key>
            <integer>138</integer>
            <key>width</key>
            <integer>14</integer>
          </dict>
          <dict>
            <key>position</key>
            <integer>371</integer>
            <key>width</key>
            <integer>9</integer>
          </dict>
          <dict>
            <key>position</key>
            <integer>485</integer>
            <key>width</key>
            <integer>14</integer>
          </dict>
          <dict>
            <key>position</key>
            <integer>514</integer>
            <key>width</key>
            <integer>14</integer>
          </dict>
        </array>
      </dict>
    </dict>
  </lib>
</glyph>
