<?xml version="1.0" encoding="UTF-8" standalone="no"?>
<svg
   xmlns:dc="http://purl.org/dc/elements/1.1/"
   xmlns:cc="http://creativecommons.org/ns#"
   xmlns:rdf="http://www.w3.org/1999/02/22-rdf-syntax-ns#"
   xmlns:svg="http://www.w3.org/2000/svg"
   xmlns="http://www.w3.org/2000/svg"
   xmlns:sodipodi="http://sodipodi.sourceforge.net/DTD/sodipodi-0.dtd"
   xmlns:inkscape="http://www.inkscape.org/namespaces/inkscape"
   data-dec="43"
   width="26"
   height="40"
   version="1.1"
   id="svg4"
   sodipodi:docname="43.svg"
   inkscape:version="0.92.4 (unknown)">
  <metadata
     id="metadata10">
    <rdf:RDF>
      <cc:Work
         rdf:about="">
        <dc:format>image/svg+xml</dc:format>
        <dc:type
           rdf:resource="http://purl.org/dc/dcmitype/StillImage" />
      </cc:Work>
    </rdf:RDF>
  </metadata>
  <defs
     id="defs8" />
  <sodipodi:namedview
     pagecolor="#ffffff"
     bordercolor="#666666"
     borderopacity="1"
     objecttolerance="10"
     gridtolerance="10"
     guidetolerance="10"
     inkscape:pageopacity="0"
     inkscape:pageshadow="2"
     inkscape:window-width="615"
     inkscape:window-height="417"
     id="namedview6"
     showgrid="false"
     inkscape:zoom="5.9"
     inkscape:cx="13"
     inkscape:cy="20"
     inkscape:window-x="0"
     inkscape:window-y="27"
     inkscape:window-maximized="0"
     inkscape:current-layer="svg4" />
  <path
     style="color:#000000;font-style:normal;font-variant:normal;font-weight:normal;font-stretch:normal;font-size:medium;line-height:normal;font-family:sans-serif;font-variant-ligatures:normal;font-variant-position:normal;font-variant-caps:normal;font-variant-numeric:normal;font-variant-alternates:normal;font-feature-settings:normal;text-indent:0;text-align:start;text-decoration:none;text-decoration-line:none;text-decoration-style:solid;text-decoration-color:#000000;letter-spacing:normal;word-spacing:normal;text-transform:none;writing-mode:lr-tb;direction:ltr;text-orientation:mixed;dominant-baseline:auto;baseline-shift:baseline;text-anchor:start;white-space:normal;shape-padding:0;clip-rule:nonzero;display:inline;overflow:visible;visibility:visible;opacity:1;isolation:auto;mix-blend-mode:normal;color-interpolation:sRGB;color-interpolation-filters:linearRGB;solid-color:#000000;solid-opacity:1;vector-effect:none;fill:#013272;fill-opacity:1;fill-rule:nonzero;stroke:none;stroke-width:1;stroke-linecap:round;stroke-linejoin:round;stroke-miterlimit:4;stroke-dasharray:none;stroke-dashoffset:0;stroke-opacity:1;color-rendering:auto;image-rendering:auto;shape-rendering:auto;text-rendering:auto;enable-background:accumulate"
     d="M 11.992188,3.4921875 A 0.50005,0.50005 0 0 1 12.080078,3.5 H 13 A 0.50005,0.50005 0 0 1 13.5,4 v 7.5 H 21 a 0.50005,0.50005 0 0 1 0.5,0.5 v 0.917969 a 0.50005,0.50005 0 0 1 -0.103516,0.394531 0.50005,0.50005 0 0 1 -0.002,0.0039 0.50005,0.50005 0 0 1 -0.03125,0.0332 0.50005,0.50005 0 0 1 -0.002,0.0039 0.50005,0.50005 0 0 1 -0.0332,0.03125 0.50005,0.50005 0 0 1 -0.0039,0.002 A 0.50005,0.50005 0 0 1 20.919922,13.5 H 13.5 v 7.417969 a 0.50005,0.50005 0 0 1 -0.103516,0.394531 0.50005,0.50005 0 0 1 -0.002,0.0039 0.50005,0.50005 0 0 1 -0.03125,0.0332 0.50005,0.50005 0 0 1 -0.002,0.0039 0.50005,0.50005 0 0 1 -0.0332,0.03125 0.50005,0.50005 0 0 1 -0.0039,0.002 A 0.50005,0.50005 0 0 1 12.919922,21.5 H 12 A 0.50005,0.50005 0 0 1 11.5,21 V 13.5 H 4 A 0.50005,0.50005 0 0 1 3.5,13 v -0.917969 a 0.50005,0.50005 0 0 1 0.1035156,-0.394531 0.50005,0.50005 0 0 1 0.00195,-0.0039 0.50005,0.50005 0 0 1 0.03125,-0.0332 0.50005,0.50005 0 0 1 0.00195,-0.0039 0.50005,0.50005 0 0 1 0.017578,-0.01758 0.50005,0.50005 0 0 1 0.019531,-0.01563 A 0.50005,0.50005 0 0 1 4.0800781,11.5 H 11.5 V 4.0820312 A 0.50005,0.50005 0 0 1 11.603516,3.6875 a 0.50005,0.50005 0 0 1 0.002,-0.00391 0.50005,0.50005 0 0 1 0.03125,-0.033203 0.50005,0.50005 0 0 1 0.002,-0.00391 0.50005,0.50005 0 0 1 0.01758,-0.017578 0.50005,0.50005 0 0 1 0.01953,-0.015625 0.50005,0.50005 0 0 1 0.316407,-0.1210937 z"
     id="path2" />
</svg>
