<?xml version="1.0" encoding="UTF-8" standalone="no"?>
<svg
   xmlns:dc="http://purl.org/dc/elements/1.1/"
   xmlns:cc="http://creativecommons.org/ns#"
   xmlns:rdf="http://www.w3.org/1999/02/22-rdf-syntax-ns#"
   xmlns:svg="http://www.w3.org/2000/svg"
   xmlns="http://www.w3.org/2000/svg"
   xmlns:sodipodi="http://sodipodi.sourceforge.net/DTD/sodipodi-0.dtd"
   xmlns:inkscape="http://www.inkscape.org/namespaces/inkscape"
   data-dec="43"
   width="26"
   height="40"
   version="1.1"
   id="svg4"
   sodipodi:docname="43.svg"
   inkscape:version="0.92.4 5da689c313, 2019-01-14">
  <metadata
     id="metadata10">
    <rdf:RDF>
      <cc:Work
         rdf:about="">
        <dc:format>image/svg+xml</dc:format>
        <dc:type
           rdf:resource="http://purl.org/dc/dcmitype/StillImage" />
        <dc:title></dc:title>
      </cc:Work>
    </rdf:RDF>
  </metadata>
  <defs
     id="defs8" />
  <sodipodi:namedview
     pagecolor="#ffffff"
     bordercolor="#666666"
     borderopacity="1"
     objecttolerance="10"
     gridtolerance="10"
     guidetolerance="10"
     inkscape:pageopacity="0"
     inkscape:pageshadow="2"
     inkscape:window-width="1920"
     inkscape:window-height="1043"
     id="namedview6"
     showgrid="false"
     inkscape:zoom="5.9"
     inkscape:cx="13"
     inkscape:cy="20"
     inkscape:window-x="0"
     inkscape:window-y="37"
     inkscape:window-maximized="0"
     inkscape:current-layer="svg4" />
  <path
     style="color:#000000;font-style:normal;font-variant:normal;font-weight:normal;font-stretch:normal;font-size:medium;line-height:normal;font-family:sans-serif;font-variant-ligatures:normal;font-variant-position:normal;font-variant-caps:normal;font-variant-numeric:normal;font-variant-alternates:normal;font-feature-settings:normal;text-indent:0;text-align:start;text-decoration:none;text-decoration-line:none;text-decoration-style:solid;text-decoration-color:#000000;letter-spacing:normal;word-spacing:normal;text-transform:none;writing-mode:lr-tb;direction:ltr;text-orientation:mixed;dominant-baseline:auto;baseline-shift:baseline;text-anchor:start;white-space:normal;shape-padding:0;clip-rule:nonzero;display:inline;overflow:visible;visibility:visible;opacity:1;isolation:auto;mix-blend-mode:normal;color-interpolation:sRGB;color-interpolation-filters:linearRGB;solid-color:#000000;solid-opacity:1;vector-effect:none;fill:#000000;fill-opacity:1;fill-rule:nonzero;stroke:none;stroke-width:0.5;stroke-linecap:round;stroke-linejoin:round;stroke-miterlimit:4;stroke-dasharray:none;stroke-dashoffset:0;stroke-opacity:1;color-rendering:auto;image-rendering:auto;shape-rendering:auto;text-rendering:auto;enable-background:accumulate"
     d="m 12.25,13.25 v 7.5 h 0.5 v -7.5 z m 1,-1 v 0.5 h 7.5 v -0.5 z m -1,0 v 0.5 h 0.5 v -0.5 z m -8,0 v 0.5 h 7.5 v -0.5 z m 8,-8 v 7.5 h 0.5 V 4.25 Z M 11.996094,3.7460938 A 0.250025,0.250025 0 0 1 12.046875,3.75 H 13 A 0.250025,0.250025 0 0 1 13.25,4 v 7.75 H 21 A 0.250025,0.250025 0 0 1 21.25,12 v 0.958984 a 0.250025,0.250025 0 0 1 -0.05273,0.197266 0.250025,0.250025 0 0 1 0,0.002 0.250025,0.250025 0 0 1 -0.0078,0.0078 0.250025,0.250025 0 0 1 -0.0098,0.0098 0.250025,0.250025 0 0 1 -0.01563,0.01563 0.250025,0.250025 0 0 1 -0.002,0.002 0.250025,0.250025 0 0 1 -0.01758,0.01367 0.250025,0.250025 0 0 1 -0.002,0.002 0.250025,0.250025 0 0 1 -0.0078,0.0039 0.250025,0.250025 0 0 1 -0.01367,0.0078 0.250025,0.250025 0 0 1 -0.167969,0.0293 H 13.25 v 7.708984 a 0.250025,0.250025 0 0 1 -0.05273,0.197266 0.250025,0.250025 0 0 1 0,0.002 0.250025,0.250025 0 0 1 -0.0078,0.0078 0.250025,0.250025 0 0 1 -0.0098,0.0098 0.250025,0.250025 0 0 1 -0.01563,0.01563 0.250025,0.250025 0 0 1 -0.002,0.002 0.250025,0.250025 0 0 1 -0.01758,0.01367 0.250025,0.250025 0 0 1 -0.002,0.002 0.250025,0.250025 0 0 1 -0.0078,0.0039 0.250025,0.250025 0 0 1 -0.01367,0.0078 0.250025,0.250025 0 0 1 -0.167969,0.0293 H 12 A 0.250025,0.250025 0 0 1 11.75,21 V 13.25 H 4 A 0.250025,0.250025 0 0 1 3.75,13 v -0.958984 a 0.250025,0.250025 0 0 1 0.052734,-0.197266 0.250025,0.250025 0 0 1 0,-0.002 0.250025,0.250025 0 0 1 0.00781,-0.0078 0.250025,0.250025 0 0 1 0.027344,-0.02734 0.250025,0.250025 0 0 1 0.017578,-0.01367 0.250025,0.250025 0 0 1 0.00195,-0.002 0.250025,0.250025 0 0 1 0.00781,-0.0039 0.250025,0.250025 0 0 1 0.013672,-0.0078 A 0.250025,0.250025 0 0 1 4.046875,11.75 H 11.75 V 4.0410156 a 0.250025,0.250025 0 0 1 0.05273,-0.1972656 0.250025,0.250025 0 0 1 0,-0.00195 0.250025,0.250025 0 0 1 0.0078,-0.00781 0.250025,0.250025 0 0 1 0.02734,-0.027344 0.250025,0.250025 0 0 1 0.01758,-0.013672 0.250025,0.250025 0 0 1 0.002,-0.00195 0.250025,0.250025 0 0 1 0.0078,-0.00391 0.250025,0.250025 0 0 1 0.01367,-0.00781 0.250025,0.250025 0 0 1 0.117188,-0.033203 z"
     id="path2" />
</svg>
