<?xml version="1.0" encoding="UTF-8" standalone="no"?>
<svg
   xmlns:dc="http://purl.org/dc/elements/1.1/"
   xmlns:cc="http://creativecommons.org/ns#"
   xmlns:rdf="http://www.w3.org/1999/02/22-rdf-syntax-ns#"
   xmlns:svg="http://www.w3.org/2000/svg"
   xmlns="http://www.w3.org/2000/svg"
   xmlns:sodipodi="http://sodipodi.sourceforge.net/DTD/sodipodi-0.dtd"
   xmlns:inkscape="http://www.inkscape.org/namespaces/inkscape"
   data-dec="8230"
   width="13"
   height="40"
   version="1.1"
   id="svg4"
   sodipodi:docname="8230.svg"
   inkscape:version="0.92.4 (unknown)">
  <metadata
     id="metadata10">
    <rdf:RDF>
      <cc:Work
         rdf:about="">
        <dc:format>image/svg+xml</dc:format>
        <dc:type
           rdf:resource="http://purl.org/dc/dcmitype/StillImage" />
      </cc:Work>
    </rdf:RDF>
  </metadata>
  <defs
     id="defs8" />
  <sodipodi:namedview
     pagecolor="#ffffff"
     bordercolor="#666666"
     borderopacity="1"
     objecttolerance="10"
     gridtolerance="10"
     guidetolerance="10"
     inkscape:pageopacity="0"
     inkscape:pageshadow="2"
     inkscape:window-width="640"
     inkscape:window-height="480"
     id="namedview6"
     showgrid="false"
     inkscape:zoom="5.9"
     inkscape:cx="6.5"
     inkscape:cy="20"
     inkscape:window-x="0"
     inkscape:window-y="27"
     inkscape:window-maximized="0"
     inkscape:current-layer="svg4" />
  <path
     style="color:#000000;font-style:normal;font-variant:normal;font-weight:normal;font-stretch:normal;font-size:medium;line-height:normal;font-family:sans-serif;font-variant-ligatures:normal;font-variant-position:normal;font-variant-caps:normal;font-variant-numeric:normal;font-variant-alternates:normal;font-feature-settings:normal;text-indent:0;text-align:start;text-decoration:none;text-decoration-line:none;text-decoration-style:solid;text-decoration-color:#000000;letter-spacing:normal;word-spacing:normal;text-transform:none;writing-mode:lr-tb;direction:ltr;text-orientation:mixed;dominant-baseline:auto;baseline-shift:baseline;text-anchor:start;white-space:normal;shape-padding:0;clip-rule:nonzero;display:inline;overflow:visible;visibility:visible;opacity:1;isolation:auto;mix-blend-mode:normal;color-interpolation:sRGB;color-interpolation-filters:linearRGB;solid-color:#000000;solid-opacity:1;vector-effect:none;fill:#000000;fill-opacity:1;fill-rule:nonzero;stroke:none;stroke-width:1.5;stroke-linecap:round;stroke-linejoin:round;stroke-miterlimit:4;stroke-dasharray:none;stroke-dashoffset:0;stroke-opacity:1;color-rendering:auto;image-rendering:auto;shape-rendering:auto;text-rendering:auto;enable-background:accumulate"
     d="m 10.988281,19.240234 a 0.750075,0.750075 0 0 1 0.21875,0.0293 0.750075,0.750075 0 0 1 0.0039,0 0.750075,0.750075 0 0 1 0.06836,0.02344 0.750075,0.750075 0 0 1 0.002,0.002 0.750075,0.750075 0 0 1 0.06641,0.0293 0.750075,0.750075 0 0 1 0.002,0.002 0.750075,0.750075 0 0 1 0.0625,0.03516 0.750075,0.750075 0 0 1 0.002,0.002 0.750075,0.750075 0 0 1 0.197266,0.185547 l 0.841797,0.841797 a 0.750075,0.750075 0 0 1 0.210937,0.240234 0.750075,0.750075 0 0 1 0.002,0.002 0.750075,0.750075 0 0 1 0.03125,0.06445 0.750075,0.750075 0 0 1 0,0.002 0.750075,0.750075 0 0 1 0.02734,0.06836 0.750075,0.750075 0 0 1 0,0.002 0.750075,0.750075 0 0 1 0.0059,0.4375 0.750075,0.750075 0 0 1 0,0.0039 0.750075,0.750075 0 0 1 -0.02344,0.06836 0.750075,0.750075 0 0 1 -0.002,0.002 0.750075,0.750075 0 0 1 -0.0293,0.06641 0.750075,0.750075 0 0 1 -0.002,0.002 0.750075,0.750075 0 0 1 -0.03516,0.0625 0.750075,0.750075 0 0 1 -0.002,0.002 0.750075,0.750075 0 0 1 -0.185547,0.197266 l -0.841797,0.841797 a 0.750075,0.750075 0 0 1 -0.240234,0.210937 0.750075,0.750075 0 0 1 -0.002,0.002 0.750075,0.750075 0 0 1 -0.0332,0.01563 0.750075,0.750075 0 0 1 -0.103515,0.04297 0.750075,0.750075 0 0 1 -0.4375,0.0059 0.750075,0.750075 0 0 1 -0.0039,0 0.750075,0.750075 0 0 1 -0.03516,-0.01172 0.750075,0.750075 0 0 1 -0.03516,-0.01367 0.750075,0.750075 0 0 1 -0.06641,-0.0293 0.750075,0.750075 0 0 1 -0.002,-0.002 0.750075,0.750075 0 0 1 -0.0625,-0.03516 0.750075,0.750075 0 0 1 -0.002,-0.002 0.750075,0.750075 0 0 1 -0.197266,-0.185547 L 9.546875,21.609375 a 0.750075,0.750075 0 0 1 -0.2109375,-0.240234 0.750075,0.750075 0 0 1 -0.00195,-0.002 0.750075,0.750075 0 0 1 -0.015625,-0.0332 0.750075,0.750075 0 0 1 -0.015625,-0.0332 0.750075,0.750075 0 0 1 -0.027344,-0.06836 0.750075,0.750075 0 0 1 0,-0.002 0.750075,0.750075 0 0 1 -0.00586,-0.4375 0.750075,0.750075 0 0 1 0,-0.0039 0.750075,0.750075 0 0 1 0.011719,-0.03516 0.750075,0.750075 0 0 1 0.013672,-0.03516 0.750075,0.750075 0 0 1 0.029297,-0.06641 0.750075,0.750075 0 0 1 0.00195,-0.002 0.750075,0.750075 0 0 1 0.035156,-0.0625 0.750075,0.750075 0 0 1 0.00195,-0.002 0.750075,0.750075 0 0 1 0.1855469,-0.197266 l 0.8417969,-0.841797 a 0.750075,0.750075 0 0 1 0.240234,-0.210937 0.750075,0.750075 0 0 1 0.002,-0.002 0.750075,0.750075 0 0 1 0.0332,-0.01563 0.750075,0.750075 0 0 1 0.103515,-0.04297 0.750075,0.750075 0 0 1 0.21875,-0.03516 z m -3.9999998,0 a 0.750075,0.750075 0 0 1 0.21875,0.0293 0.750075,0.750075 0 0 1 0.00391,0 0.750075,0.750075 0 0 1 0.068359,0.02344 0.750075,0.750075 0 0 1 0.00195,0.002 0.750075,0.750075 0 0 1 0.066406,0.0293 0.750075,0.750075 0 0 1 0.00195,0.002 0.750075,0.750075 0 0 1 0.0625,0.03516 0.750075,0.750075 0 0 1 0.00195,0.002 0.750075,0.750075 0 0 1 0.1972656,0.185547 l 0.8417969,0.841797 a 0.750075,0.750075 0 0 1 0.2109375,0.240234 0.750075,0.750075 0 0 1 0.00195,0.002 0.750075,0.750075 0 0 1 0.03125,0.06445 0.750075,0.750075 0 0 1 0,0.002 0.750075,0.750075 0 0 1 0.027344,0.06836 0.750075,0.750075 0 0 1 0,0.002 0.750075,0.750075 0 0 1 0.00586,0.4375 0.750075,0.750075 0 0 1 0,0.0039 0.750075,0.750075 0 0 1 -0.023438,0.06836 0.750075,0.750075 0 0 1 -0.00195,0.002 0.750075,0.750075 0 0 1 -0.029297,0.06641 0.750075,0.750075 0 0 1 -0.00195,0.002 0.750075,0.750075 0 0 1 -0.035156,0.0625 0.750075,0.750075 0 0 1 -0.00195,0.002 0.750075,0.750075 0 0 1 -0.1855469,0.197266 L 7.609375,22.453125 a 0.750075,0.750075 0 0 1 -0.2402344,0.210937 0.750075,0.750075 0 0 1 -0.00195,0.002 0.750075,0.750075 0 0 1 -0.033203,0.01563 0.750075,0.750075 0 0 1 -0.1035156,0.04297 0.750075,0.750075 0 0 1 -0.4375,0.0059 0.750075,0.750075 0 0 1 -0.00391,0 0.750075,0.750075 0 0 1 -0.035156,-0.01172 0.750075,0.750075 0 0 1 -0.035156,-0.01367 0.750075,0.750075 0 0 1 -0.066406,-0.0293 0.750075,0.750075 0 0 1 -0.00195,-0.002 0.750075,0.750075 0 0 1 -0.0625,-0.03516 0.750075,0.750075 0 0 1 -0.00195,-0.002 0.750075,0.750075 0 0 1 -0.1972656,-0.185547 L 5.546875,21.609375 a 0.750075,0.750075 0 0 1 -0.2109375,-0.240234 0.750075,0.750075 0 0 1 -0.00195,-0.002 0.750075,0.750075 0 0 1 -0.015625,-0.0332 0.750075,0.750075 0 0 1 -0.015625,-0.0332 0.750075,0.750075 0 0 1 -0.027344,-0.06836 0.750075,0.750075 0 0 1 0,-0.002 0.750075,0.750075 0 0 1 -0.00586,-0.4375 0.750075,0.750075 0 0 1 0,-0.0039 0.750075,0.750075 0 0 1 0.011719,-0.03516 0.750075,0.750075 0 0 1 0.013672,-0.03516 0.750075,0.750075 0 0 1 0.029297,-0.06641 0.750075,0.750075 0 0 1 0.00195,-0.002 0.750075,0.750075 0 0 1 0.035156,-0.0625 0.750075,0.750075 0 0 1 0.00195,-0.002 0.750075,0.750075 0 0 1 0.1855469,-0.197266 L 6.390625,19.546875 a 0.750075,0.750075 0 0 1 0.2402344,-0.210937 0.750075,0.750075 0 0 1 0.00195,-0.002 0.750075,0.750075 0 0 1 0.033203,-0.01563 0.750075,0.750075 0 0 1 0.1035156,-0.04297 0.750075,0.750075 0 0 1 0.21875,-0.03516 z m -4,0 a 0.750075,0.750075 0 0 1 0.21875,0.0293 0.750075,0.750075 0 0 1 0.00391,0 0.750075,0.750075 0 0 1 0.068359,0.02344 0.750075,0.750075 0 0 1 0.00195,0.002 0.750075,0.750075 0 0 1 0.066406,0.0293 0.750075,0.750075 0 0 1 0.00195,0.002 0.750075,0.750075 0 0 1 0.0625,0.03516 0.750075,0.750075 0 0 1 0.00195,0.002 0.750075,0.750075 0 0 1 0.1972656,0.185547 l 0.8417969,0.841797 a 0.750075,0.750075 0 0 1 0.2109375,0.240234 0.750075,0.750075 0 0 1 0.00195,0.002 0.750075,0.750075 0 0 1 0.03125,0.06445 0.750075,0.750075 0 0 1 0,0.002 0.750075,0.750075 0 0 1 0.027344,0.06836 0.750075,0.750075 0 0 1 0,0.002 0.750075,0.750075 0 0 1 0.00586,0.4375 0.750075,0.750075 0 0 1 0,0.0039 0.750075,0.750075 0 0 1 -0.023438,0.06836 0.750075,0.750075 0 0 1 -0.00195,0.002 0.750075,0.750075 0 0 1 -0.029297,0.06641 0.750075,0.750075 0 0 1 -0.00195,0.002 0.750075,0.750075 0 0 1 -0.035156,0.0625 0.750075,0.750075 0 0 1 -0.00195,0.002 0.750075,0.750075 0 0 1 -0.1855469,0.197266 L 3.609375,22.453125 a 0.750075,0.750075 0 0 1 -0.2402344,0.210937 0.750075,0.750075 0 0 1 -0.00195,0.002 0.750075,0.750075 0 0 1 -0.033203,0.01563 0.750075,0.750075 0 0 1 -0.1035156,0.04297 0.750075,0.750075 0 0 1 -0.4375,0.0059 0.750075,0.750075 0 0 1 -0.00391,0 0.750075,0.750075 0 0 1 -0.035156,-0.01172 0.750075,0.750075 0 0 1 -0.035156,-0.01367 0.750075,0.750075 0 0 1 -0.066406,-0.0293 0.750075,0.750075 0 0 1 -0.00195,-0.002 0.750075,0.750075 0 0 1 -0.0625,-0.03516 0.750075,0.750075 0 0 1 -0.00195,-0.002 0.750075,0.750075 0 0 1 -0.1972656,-0.185547 L 1.546875,21.609375 a 0.750075,0.750075 0 0 1 -0.2109375,-0.240234 0.750075,0.750075 0 0 1 -0.00195,-0.002 0.750075,0.750075 0 0 1 -0.015625,-0.0332 0.750075,0.750075 0 0 1 -0.015625,-0.0332 0.750075,0.750075 0 0 1 -0.027344,-0.06836 0.750075,0.750075 0 0 1 0,-0.002 0.750075,0.750075 0 0 1 -0.00586,-0.4375 0.750075,0.750075 0 0 1 0,-0.0039 0.750075,0.750075 0 0 1 0.011719,-0.03516 0.750075,0.750075 0 0 1 0.013672,-0.03516 0.750075,0.750075 0 0 1 0.029297,-0.06641 0.750075,0.750075 0 0 1 0.00195,-0.002 0.750075,0.750075 0 0 1 0.035156,-0.0625 0.750075,0.750075 0 0 1 0.00195,-0.002 0.750075,0.750075 0 0 1 0.1855469,-0.197266 L 2.390625,19.546875 a 0.750075,0.750075 0 0 1 0.2402344,-0.210937 0.750075,0.750075 0 0 1 0.00195,-0.002 0.750075,0.750075 0 0 1 0.033203,-0.01563 0.750075,0.750075 0 0 1 0.1035156,-0.04297 0.750075,0.750075 0 0 1 0.21875,-0.03516 z"
     id="path2" />
</svg>
