<?xml version="1.0" encoding="UTF-8"?>
<glyph name="Otilde" format="1">
  <advance width="635"/>
  <unicode hex="00D5"/>
  <outline>
    <component base="asciitilde" xOffset="-31" yOffset="530"/>
    <component base="O"/>
  </outline>
  <lib>
    <dict>
      <key>com.fontlab.hintData</key>
      <dict>
        <key>hhints</key>
        <array>
          <dict>
            <key>position</key>
            <integer>0</integer>
            <key>width</key>
            <integer>29</integer>
          </dict>
          <dict>
            <key>position</key>
            <integer>607</integer>
            <key>width</key>
            <integer>30</integer>
          </dict>
          <dict>
            <key>position</key>
            <integer>724</integer>
            <key>width</key>
            <integer>29</integer>
          </dict>
          <dict>
            <key>position</key>
            <integer>869</integer>
            <key>width</key>
            <integer>29</integer>
          </dict>
        </array>
        <key>vhints</key>
        <array>
          <dict>
            <key>position</key>
            <integer>-14</integer>
            <key>width</key>
            <integer>29</integer>
          </dict>
          <dict>
            <key>position</key>
            <integer>73</integer>
            <key>width</key>
            <integer>29</integer>
          </dict>
          <dict>
            <key>position</key>
            <integer>506</integer>
            <key>width</key>
            <integer>30</integer>
          </dict>
          <dict>
            <key>position</key>
            <integer>536</integer>
            <key>width</key>
            <integer>29</integer>
          </dict>
        </array>
      </dict>
    </dict>
  </lib>
</glyph>
