<?xml version="1.0" encoding="UTF-8"?>
<glyph name="atilde" format="1">
  <advance width="635"/>
  <unicode hex="00E3"/>
  <outline>
    <component base="asciitilde" xOffset="77" yOffset="328"/>
    <component base="a"/>
  </outline>
  <lib>
    <dict>
      <key>com.fontlab.hintData</key>
      <dict>
        <key>hhints</key>
        <array>
          <dict>
            <key>position</key>
            <integer>0</integer>
            <key>width</key>
            <integer>29</integer>
          </dict>
          <dict>
            <key>position</key>
            <integer>405</integer>
            <key>width</key>
            <integer>29</integer>
          </dict>
          <dict>
            <key>position</key>
            <integer>493</integer>
            <key>width</key>
            <integer>57</integer>
          </dict>
          <dict>
            <key>position</key>
            <integer>637</integer>
            <key>width</key>
            <integer>58</integer>
          </dict>
        </array>
        <key>vhints</key>
        <array>
          <dict>
            <key>position</key>
            <integer>73</integer>
            <key>width</key>
            <integer>87</integer>
          </dict>
          <dict>
            <key>position</key>
            <integer>257</integer>
            <key>width</key>
            <integer>29</integer>
          </dict>
          <dict>
            <key>position</key>
            <integer>391</integer>
            <key>width</key>
            <integer>58</integer>
          </dict>
          <dict>
            <key>position</key>
            <integer>595</integer>
            <key>width</key>
            <integer>28</integer>
          </dict>
          <dict>
            <key>position</key>
            <integer>778</integer>
            <key>width</key>
            <integer>30</integer>
          </dict>
        </array>
      </dict>
    </dict>
  </lib>
</glyph>
