<?xml version="1.0" encoding="UTF-8"?>
<glyph name="glyph38" format="1">
  <advance width="433"/>
  <unicode hex="201D"/>
  <outline>
    <contour>
      <point x="338" y="499" type="line"/>
      <point x="332" y="476" type="line"/>
      <point x="342" y="495" type="line"/>
    </contour>
    <contour>
      <point x="165" y="499" type="line"/>
      <point x="158" y="476" type="line"/>
      <point x="168" y="495" type="line"/>
    </contour>
    <contour>
      <point x="343" y="519" type="line"/>
      <point x="341" y="509" type="line"/>
      <point x="343" y="507" type="line"/>
    </contour>
    <contour>
      <point x="169" y="519" type="line"/>
      <point x="167" y="509" type="line"/>
      <point x="169" y="507" type="line"/>
    </contour>
    <contour>
      <point x="339" y="540" type="line"/>
      <point x="324" y="526" type="line"/>
      <point x="333" y="517" type="line"/>
    </contour>
    <contour>
      <point x="166" y="540" type="line"/>
      <point x="151" y="526" type="line"/>
      <point x="160" y="517" type="line"/>
    </contour>
    <contour>
      <point x="294" y="579" type="line"/>
      <point x="294" y="559" type="line"/>
      <point x="315" y="559" type="line"/>
      <point x="315" y="579" type="line"/>
    </contour>
    <contour>
      <point x="120" y="579" type="line"/>
      <point x="120" y="559" type="line"/>
      <point x="141" y="559" type="line"/>
      <point x="141" y="579" type="line"/>
    </contour>
    <contour>
      <point x="289" y="587" type="line"/>
      <point x="290" y="587" type="line"/>
      <point x="318" y="587" type="line" smooth="yes"/>
      <point x="320" y="587"/>
      <point x="322" y="585"/>
      <point x="322" y="583" type="curve" smooth="yes"/>
      <point x="322" y="554" type="line" smooth="yes"/>
      <point x="322" y="552"/>
      <point x="320" y="550"/>
      <point x="318" y="550" type="curve" smooth="yes"/>
      <point x="289" y="550" type="line" smooth="yes"/>
      <point x="287" y="550"/>
      <point x="285" y="552"/>
      <point x="285" y="554" type="curve" smooth="yes"/>
      <point x="285" y="583" type="line"/>
      <point x="285" y="585" type="line"/>
      <point x="286" y="585" type="line"/>
      <point x="286" y="586" type="line"/>
      <point x="287" y="586" type="line"/>
      <point x="287" y="587" type="line"/>
      <point x="288" y="587" type="line"/>
    </contour>
    <contour>
      <point x="116" y="587" type="line"/>
      <point x="117" y="587" type="line"/>
      <point x="145" y="587" type="line" smooth="yes"/>
      <point x="147" y="587"/>
      <point x="150" y="585"/>
      <point x="150" y="583" type="curve" smooth="yes"/>
      <point x="150" y="554" type="line" smooth="yes"/>
      <point x="150" y="552"/>
      <point x="147" y="550"/>
      <point x="145" y="550" type="curve" smooth="yes"/>
      <point x="116" y="550" type="line" smooth="yes"/>
      <point x="114" y="550"/>
      <point x="111" y="552"/>
      <point x="111" y="554" type="curve" smooth="yes"/>
      <point x="111" y="583" type="line"/>
      <point x="112" y="585" type="line"/>
      <point x="112" y="586" type="line"/>
      <point x="113" y="586" type="line"/>
      <point x="113" y="587" type="line"/>
      <point x="114" y="587" type="line"/>
    </contour>
    <contour>
      <point x="292" y="608" type="line"/>
      <point x="265" y="582" type="line"/>
      <point x="265" y="557" type="line"/>
      <point x="292" y="530" type="line"/>
      <point x="317" y="530" type="line"/>
      <point x="343" y="556" type="line"/>
      <point x="343" y="582" type="line"/>
      <point x="317" y="608" type="line"/>
    </contour>
    <contour>
      <point x="118" y="608" type="line"/>
      <point x="91" y="582" type="line"/>
      <point x="91" y="557" type="line"/>
      <point x="118" y="530" type="line"/>
      <point x="143" y="530" type="line"/>
      <point x="169" y="556" type="line"/>
      <point x="169" y="582" type="line"/>
      <point x="143" y="608" type="line"/>
    </contour>
    <contour>
      <point x="289" y="616" type="curve" smooth="yes"/>
      <point x="318" y="616" type="line" smooth="yes"/>
      <point x="319" y="616"/>
      <point x="320" y="616"/>
      <point x="321" y="615" type="curve" smooth="yes"/>
      <point x="351" y="586" type="line" smooth="yes"/>
      <point x="352" y="585"/>
      <point x="352" y="584"/>
      <point x="352" y="583" type="curve" smooth="yes"/>
      <point x="352" y="554" type="line"/>
      <point x="352" y="497" type="line"/>
      <point x="352" y="496" type="line"/>
      <point x="351" y="494" type="line"/>
      <point x="322" y="437" type="line"/>
      <point x="321" y="436" type="line"/>
      <point x="320" y="434" type="line"/>
      <point x="263" y="406" type="line"/>
      <point x="262" y="405"/>
      <point x="261" y="405" type="curve" smooth="yes"/>
      <point x="259" y="405"/>
      <point x="256" y="407"/>
      <point x="256" y="409" type="curve" smooth="yes"/>
      <point x="256" y="410"/>
      <point x="257" y="413"/>
      <point x="258" y="414" type="curve" smooth="yes"/>
      <point x="315" y="441" type="line"/>
      <point x="331" y="507" type="line"/>
      <point x="317" y="521" type="line"/>
      <point x="289" y="521" type="line" smooth="yes"/>
      <point x="288" y="521"/>
      <point x="287" y="521"/>
      <point x="286" y="522" type="curve" smooth="yes"/>
      <point x="257" y="551" type="line" smooth="yes"/>
      <point x="256" y="552"/>
      <point x="256" y="553"/>
      <point x="256" y="554" type="curve" smooth="yes"/>
      <point x="256" y="583" type="line" smooth="yes"/>
      <point x="256" y="584"/>
      <point x="256" y="585"/>
      <point x="257" y="586" type="curve" smooth="yes"/>
      <point x="286" y="615" type="line" smooth="yes"/>
      <point x="287" y="616"/>
      <point x="288" y="616"/>
    </contour>
    <contour>
      <point x="116" y="616" type="curve" smooth="yes"/>
      <point x="145" y="616" type="line" smooth="yes"/>
      <point x="146" y="616"/>
      <point x="146" y="616"/>
      <point x="147" y="615" type="curve" smooth="yes"/>
      <point x="177" y="586" type="line" smooth="yes"/>
      <point x="178" y="585"/>
      <point x="178" y="584"/>
      <point x="178" y="583" type="curve" smooth="yes"/>
      <point x="178" y="554" type="line"/>
      <point x="178" y="497" type="line"/>
      <point x="178" y="496" type="line"/>
      <point x="177" y="494" type="line"/>
      <point x="148" y="437" type="line"/>
      <point x="148" y="436" type="line"/>
      <point x="147" y="436" type="line"/>
      <point x="146" y="434" type="line"/>
      <point x="89" y="406" type="line"/>
      <point x="88" y="405"/>
      <point x="87" y="405" type="curve" smooth="yes"/>
      <point x="85" y="405"/>
      <point x="82" y="407"/>
      <point x="82" y="409" type="curve" smooth="yes"/>
      <point x="82" y="410"/>
      <point x="84" y="413"/>
      <point x="85" y="414" type="curve" smooth="yes"/>
      <point x="141" y="441" type="line"/>
      <point x="157" y="507" type="line"/>
      <point x="143" y="521" type="line"/>
      <point x="116" y="521" type="line" smooth="yes"/>
      <point x="115" y="521"/>
      <point x="113" y="521"/>
      <point x="112" y="522" type="curve" smooth="yes"/>
      <point x="84" y="551" type="line" smooth="yes"/>
      <point x="83" y="552"/>
      <point x="82" y="553"/>
      <point x="82" y="554" type="curve" smooth="yes"/>
      <point x="82" y="583" type="line" smooth="yes"/>
      <point x="82" y="584"/>
      <point x="83" y="585"/>
      <point x="84" y="586" type="curve" smooth="yes"/>
      <point x="112" y="615" type="line" smooth="yes"/>
      <point x="113" y="616"/>
      <point x="115" y="616"/>
    </contour>
  </outline>
  <lib>
    <dict>
      <key>com.fontlab.hintData</key>
      <dict>
        <key>hhints</key>
        <array>
          <dict>
            <key>position</key>
            <integer>405</integer>
            <key>width</key>
            <integer>9</integer>
          </dict>
          <dict>
            <key>position</key>
            <integer>521</integer>
            <key>width</key>
            <integer>9</integer>
          </dict>
          <dict>
            <key>position</key>
            <integer>550</integer>
            <key>width</key>
            <integer>9</integer>
          </dict>
          <dict>
            <key>position</key>
            <integer>579</integer>
            <key>width</key>
            <integer>9</integer>
          </dict>
          <dict>
            <key>position</key>
            <integer>608</integer>
            <key>width</key>
            <integer>8</integer>
          </dict>
        </array>
        <key>vhints</key>
        <array>
          <dict>
            <key>position</key>
            <integer>82</integer>
            <key>width</key>
            <integer>9</integer>
          </dict>
          <dict>
            <key>position</key>
            <integer>111</integer>
            <key>width</key>
            <integer>9</integer>
          </dict>
          <dict>
            <key>position</key>
            <integer>141</integer>
            <key>width</key>
            <integer>9</integer>
          </dict>
          <dict>
            <key>position</key>
            <integer>169</integer>
            <key>width</key>
            <integer>9</integer>
          </dict>
          <dict>
            <key>position</key>
            <integer>256</integer>
            <key>width</key>
            <integer>9</integer>
          </dict>
          <dict>
            <key>position</key>
            <integer>285</integer>
            <key>width</key>
            <integer>9</integer>
          </dict>
          <dict>
            <key>position</key>
            <integer>315</integer>
            <key>width</key>
            <integer>8</integer>
          </dict>
          <dict>
            <key>position</key>
            <integer>343</integer>
            <key>width</key>
            <integer>9</integer>
          </dict>
        </array>
      </dict>
    </dict>
  </lib>
</glyph>
