<?xml version="1.0" encoding="UTF-8" standalone="no"?>
<svg
   xmlns:dc="http://purl.org/dc/elements/1.1/"
   xmlns:cc="http://creativecommons.org/ns#"
   xmlns:rdf="http://www.w3.org/1999/02/22-rdf-syntax-ns#"
   xmlns:svg="http://www.w3.org/2000/svg"
   xmlns="http://www.w3.org/2000/svg"
   xmlns:sodipodi="http://sodipodi.sourceforge.net/DTD/sodipodi-0.dtd"
   xmlns:inkscape="http://www.inkscape.org/namespaces/inkscape"
   data-dec="117"
   width="22"
   height="40"
   version="1.1"
   id="svg4"
   sodipodi:docname="117.svg"
   inkscape:version="0.92.4 (unknown)">
  <metadata
     id="metadata10">
    <rdf:RDF>
      <cc:Work
         rdf:about="">
        <dc:format>image/svg+xml</dc:format>
        <dc:type
           rdf:resource="http://purl.org/dc/dcmitype/StillImage" />
      </cc:Work>
    </rdf:RDF>
  </metadata>
  <defs
     id="defs8" />
  <sodipodi:namedview
     pagecolor="#ffffff"
     bordercolor="#666666"
     borderopacity="1"
     objecttolerance="10"
     gridtolerance="10"
     guidetolerance="10"
     inkscape:pageopacity="0"
     inkscape:pageshadow="2"
     inkscape:window-width="615"
     inkscape:window-height="417"
     id="namedview6"
     showgrid="false"
     inkscape:zoom="5.9"
     inkscape:cx="11"
     inkscape:cy="20"
     inkscape:window-x="0"
     inkscape:window-y="27"
     inkscape:window-maximized="0"
     inkscape:current-layer="svg4" />
  <path
     style="color:#000000;font-style:normal;font-variant:normal;font-weight:normal;font-stretch:normal;font-size:medium;line-height:normal;font-family:sans-serif;font-variant-ligatures:normal;font-variant-position:normal;font-variant-caps:normal;font-variant-numeric:normal;font-variant-alternates:normal;font-feature-settings:normal;text-indent:0;text-align:start;text-decoration:none;text-decoration-line:none;text-decoration-style:solid;text-decoration-color:#000000;letter-spacing:normal;word-spacing:normal;text-transform:none;writing-mode:lr-tb;direction:ltr;text-orientation:mixed;dominant-baseline:auto;baseline-shift:baseline;text-anchor:start;white-space:normal;shape-padding:0;clip-rule:nonzero;display:inline;overflow:visible;visibility:visible;opacity:1;isolation:auto;mix-blend-mode:normal;color-interpolation:sRGB;color-interpolation-filters:linearRGB;solid-color:#000000;solid-opacity:1;vector-effect:none;fill:#013272;fill-opacity:1;fill-rule:nonzero;stroke:none;stroke-width:0.5;stroke-linecap:round;stroke-linejoin:round;stroke-miterlimit:4;stroke-dasharray:none;stroke-dashoffset:0;stroke-opacity:1;color-rendering:auto;image-rendering:auto;shape-rendering:auto;text-rendering:auto;enable-background:accumulate"
     d="m 16.25,8.25 v 10.710938 a 0.250025,0.250025 0 0 1 0,0.07422 V 21.75 h 0.5 V 8.25 Z m -11,0 v 10.691406 l 0.9277344,1.853516 0.5292968,0.175781 -0.9296874,-1.859375 A 0.250025,0.250025 0 0 1 5.75,19 V 8.25 Z M 4.9960938,7.7460938 A 0.250025,0.250025 0 0 1 5.046875,7.75 h 0.9121094 a 0.250025,0.250025 0 0 1 0.1972656,0.052734 0.250025,0.250025 0 0 1 0.00195,0 0.250025,0.250025 0 0 1 0.017578,0.015625 0.250025,0.250025 0 0 1 0,0.00195 0.250025,0.250025 0 0 1 0.015625,0.015625 0.250025,0.250025 0 0 1 0.00195,0.00195 0.250025,0.250025 0 0 1 0.013672,0.017578 0.250025,0.250025 0 0 1 0.00195,0.00195 0.250025,0.250025 0 0 1 0.011719,0.019531 0.250025,0.250025 0 0 1 0,0.00195 A 0.250025,0.250025 0 0 1 6.25,8.046875 V 18.941406 L 7.1855469,20.814453 9.0566406,21.75 H 10.958984 L 13.865234,20.78125 15.75,18.894531 V 8.25 H 13 a 0.250025,0.250025 0 1 1 0,-0.5 h 2.958984 a 0.250025,0.250025 0 0 1 0.08789,0 h 0.912109 a 0.250025,0.250025 0 0 1 0.197266,0.052734 0.250025,0.250025 0 0 1 0.002,0 0.250025,0.250025 0 0 1 0.01758,0.015625 0.250025,0.250025 0 0 1 0,0.00195 0.250025,0.250025 0 0 1 0.01563,0.015625 0.250025,0.250025 0 0 1 0.002,0.00195 0.250025,0.250025 0 0 1 0.01367,0.017578 0.250025,0.250025 0 0 1 0.002,0.00195 0.250025,0.250025 0 0 1 0.01172,0.019531 0.250025,0.250025 0 0 1 0,0.00195 A 0.250025,0.250025 0 0 1 17.25,8.046875 V 21.75 H 20 a 0.250025,0.250025 0 1 1 0,0.5 h -2.958984 a 0.250025,0.250025 0 0 1 -0.08789,0 h -0.912109 a 0.250025,0.250025 0 0 1 -0.197266,-0.05273 0.250025,0.250025 0 0 1 -0.002,0 0.250025,0.250025 0 0 1 -0.0078,-0.0078 0.250025,0.250025 0 0 1 -0.0098,-0.0098 0.250025,0.250025 0 0 1 -0.01563,-0.01563 0.250025,0.250025 0 0 1 -0.002,-0.002 0.250025,0.250025 0 0 1 -0.01367,-0.01758 0.250025,0.250025 0 0 1 -0.002,-0.002 0.250025,0.250025 0 0 1 -0.0039,-0.0078 0.250025,0.250025 0 0 1 -0.0078,-0.01367 0.250025,0.250025 0 0 1 -0.0293,-0.167969 v -2.347656 l -1.572266,1.572265 a 0.250025,0.250025 0 0 1 -0.09961,0.05859 l -3,1 A 0.250025,0.250025 0 0 1 11,22.25 H 9.0332031 a 0.250025,0.250025 0 0 1 -0.039063,0 0.250025,0.250025 0 0 1 -0.00977,0 0.250025,0.250025 0 0 1 -0.015625,-0.002 0.250025,0.250025 0 0 1 -0.023437,-0.0039 0.250025,0.250025 0 0 1 -0.00977,-0.002 0.250025,0.250025 0 0 1 -0.035156,-0.01367 L 5.921875,21.236328 a 0.250025,0.250025 0 0 1 -0.1445312,-0.125 l -1,-2 A 0.250025,0.250025 0 0 1 4.75,19 V 8.25 H 2 a 0.250025,0.250025 0 1 1 0,-0.5 h 2.9589844 a 0.250025,0.250025 0 0 1 0.037109,-0.00391 z"
     id="path2" />
</svg>
