<?xml version="1.0" encoding="UTF-8" standalone="no"?>
<svg
   xmlns:dc="http://purl.org/dc/elements/1.1/"
   xmlns:cc="http://creativecommons.org/ns#"
   xmlns:rdf="http://www.w3.org/1999/02/22-rdf-syntax-ns#"
   xmlns:svg="http://www.w3.org/2000/svg"
   xmlns="http://www.w3.org/2000/svg"
   xmlns:sodipodi="http://sodipodi.sourceforge.net/DTD/sodipodi-0.dtd"
   xmlns:inkscape="http://www.inkscape.org/namespaces/inkscape"
   data-dec="338"
   width="30"
   height="40"
   version="1.1"
   id="svg4"
   sodipodi:docname="338.svg"
   inkscape:version="0.92.4 (unknown)">
  <metadata
     id="metadata10">
    <rdf:RDF>
      <cc:Work
         rdf:about="">
        <dc:format>image/svg+xml</dc:format>
        <dc:type
           rdf:resource="http://purl.org/dc/dcmitype/StillImage" />
      </cc:Work>
    </rdf:RDF>
  </metadata>
  <defs
     id="defs8" />
  <sodipodi:namedview
     pagecolor="#ffffff"
     bordercolor="#666666"
     borderopacity="1"
     objecttolerance="10"
     gridtolerance="10"
     guidetolerance="10"
     inkscape:pageopacity="0"
     inkscape:pageshadow="2"
     inkscape:window-width="640"
     inkscape:window-height="480"
     id="namedview6"
     showgrid="false"
     inkscape:zoom="5.9"
     inkscape:cx="15"
     inkscape:cy="20"
     inkscape:window-x="0"
     inkscape:window-y="27"
     inkscape:window-maximized="0"
     inkscape:current-layer="svg4" />
  <path
     style="color:#000000;font-style:normal;font-variant:normal;font-weight:normal;font-stretch:normal;font-size:medium;line-height:normal;font-family:sans-serif;font-variant-ligatures:normal;font-variant-position:normal;font-variant-caps:normal;font-variant-numeric:normal;font-variant-alternates:normal;font-feature-settings:normal;text-indent:0;text-align:start;text-decoration:none;text-decoration-line:none;text-decoration-style:solid;text-decoration-color:#000000;letter-spacing:normal;word-spacing:normal;text-transform:none;writing-mode:lr-tb;direction:ltr;text-orientation:mixed;dominant-baseline:auto;baseline-shift:baseline;text-anchor:start;white-space:normal;shape-padding:0;clip-rule:nonzero;display:inline;overflow:visible;visibility:visible;opacity:1;isolation:auto;mix-blend-mode:normal;color-interpolation:sRGB;color-interpolation-filters:linearRGB;solid-color:#000000;solid-opacity:1;vector-effect:none;fill:#013272;fill-opacity:1;fill-rule:nonzero;stroke:none;stroke-width:2.5;stroke-linecap:round;stroke-linejoin:round;stroke-miterlimit:4;stroke-dasharray:none;stroke-dashoffset:0;stroke-opacity:1;color-rendering:auto;image-rendering:auto;shape-rendering:auto;text-rendering:auto;enable-background:accumulate"
     d="M 11.292969,2.25 9.7402344,3.0273438 7.9707031,4.796875 6.1328125,7.5546875 5.2011719,10.349609 4.25,14.154297 v 2.642578 L 5.0917969,19.324219 6.5195312,20.75 H 8 9 12.058594 L 17.34375,2.25 H 14 13 Z m 18.6875,-2.51757812 A 1.250125,1.250125 0 0 1 30.203125,-0.25 H 31 a 1.250125,1.250125 0 0 1 1.232422,1.4550781 l -1,6 A 1.250125,1.250125 0 0 1 28.75,7 V 2.25 h -7.808594 l -2.142578,7.5 h 3.22461 l 0.763671,-3.0527344 a 1.250125,1.250125 0 1 1 2.425782,0.6054688 l -0.949219,3.7968746 a 1.250125,1.250125 0 0 1 -0.09766,0.388672 l -0.953125,3.814453 A 1.250125,1.250125 0 1 1 20.787109,14.697266 L 21.398438,12.25 h -3.3125 l -2.429688,8.5 h 7.636719 l 2.634765,-4.392578 a 1.250125,1.250125 0 0 1 2.232422,1.107422 l -2,5 A 1.250125,1.250125 0 0 1 25,23.25 h -0.822266 a 1.250125,1.250125 0 0 1 -0.376953,0 h -9.603515 a 1.250125,1.250125 0 0 1 -0.40625,0 h -0.59375 a 1.250125,1.250125 0 0 1 -0.40625,0 H 9 8 6.1796875 A 1.250125,1.250125 0 0 1 5.3554688,23.074219 L 3.4414062,22.117188 A 1.250125,1.250125 0 0 1 3.1152344,21.884766 l -1,-1 A 1.250125,1.250125 0 0 1 1.8144531,20.394531 l -0.99999998,-3 A 1.250125,1.250125 0 0 1 0.75,17 v -3 a 1.250125,1.250125 0 0 1 0.0371094,-0.302734 L 1.7871094,9.6972656 a 1.250125,1.250125 0 0 1 0.027344,-0.091797 l 1,-3 A 1.250125,1.250125 0 0 1 2.9589844,6.3066406 l 2,-3 a 1.250125,1.250125 0 0 1 0.15625,-0.1914062 l 2,-2 A 1.250125,1.250125 0 0 1 7.6054688,0.81445312 l 2.8769532,-0.95898437 a 1.250125,1.250125 0 0 1 0.248047,-0.078125 1.250125,1.250125 0 0 1 0.02148,-0.005859 1.250125,1.250125 0 0 1 0.0059,-0.001953 1.250125,1.250125 0 0 1 0.05274,-0.007813 1.250125,1.250125 0 0 1 0.113281,-0.0136719 1.250125,1.250125 0 0 1 0.02344,-0.001953 1.250125,1.250125 0 0 1 0.103515,-0.001953 1.250125,1.250125 0 0 1 0.0078,0 1.250125,1.250125 0 0 1 0.01172,0.001953 1.250125,1.250125 0 0 1 0.07422,0.003906 H 13 h 1 4.802734 a 1.250125,1.250125 0 0 1 0.40625,0 h 0.59375 a 1.250125,1.250125 0 0 1 0.40625,0 h 9.591797 a 1.250125,1.250125 0 0 1 0.179688,-0.0175781 z"
     id="path2" />
</svg>
