<?xml version="1.0" encoding="UTF-8" standalone="no"?>
<svg
   xmlns:dc="http://purl.org/dc/elements/1.1/"
   xmlns:cc="http://creativecommons.org/ns#"
   xmlns:rdf="http://www.w3.org/1999/02/22-rdf-syntax-ns#"
   xmlns:svg="http://www.w3.org/2000/svg"
   xmlns="http://www.w3.org/2000/svg"
   xmlns:sodipodi="http://sodipodi.sourceforge.net/DTD/sodipodi-0.dtd"
   xmlns:inkscape="http://www.inkscape.org/namespaces/inkscape"
   data-dec="63"
   width="15"
   height="40"
   version="1.1"
   id="svg4"
   sodipodi:docname="63.svg"
   inkscape:version="0.92.4 5da689c313, 2019-01-14">
  <metadata
     id="metadata10">
    <rdf:RDF>
      <cc:Work
         rdf:about="">
        <dc:format>image/svg+xml</dc:format>
        <dc:type
           rdf:resource="http://purl.org/dc/dcmitype/StillImage" />
        <dc:title></dc:title>
      </cc:Work>
    </rdf:RDF>
  </metadata>
  <defs
     id="defs8" />
  <sodipodi:namedview
     pagecolor="#ffffff"
     bordercolor="#666666"
     borderopacity="1"
     objecttolerance="10"
     gridtolerance="10"
     guidetolerance="10"
     inkscape:pageopacity="0"
     inkscape:pageshadow="2"
     inkscape:window-width="1920"
     inkscape:window-height="1043"
     id="namedview6"
     showgrid="false"
     inkscape:zoom="5.9"
     inkscape:cx="7.5"
     inkscape:cy="20"
     inkscape:window-x="0"
     inkscape:window-y="37"
     inkscape:window-maximized="0"
     inkscape:current-layer="svg4" />
  <path
     style="color:#000000;font-style:normal;font-variant:normal;font-weight:normal;font-stretch:normal;font-size:medium;line-height:normal;font-family:sans-serif;font-variant-ligatures:normal;font-variant-position:normal;font-variant-caps:normal;font-variant-numeric:normal;font-variant-alternates:normal;font-feature-settings:normal;text-indent:0;text-align:start;text-decoration:none;text-decoration-line:none;text-decoration-style:solid;text-decoration-color:#000000;letter-spacing:normal;word-spacing:normal;text-transform:none;writing-mode:lr-tb;direction:ltr;text-orientation:mixed;dominant-baseline:auto;baseline-shift:baseline;text-anchor:start;white-space:normal;shape-padding:0;clip-rule:nonzero;display:inline;overflow:visible;visibility:visible;opacity:1;isolation:auto;mix-blend-mode:normal;color-interpolation:sRGB;color-interpolation-filters:linearRGB;solid-color:#000000;solid-opacity:1;vector-effect:none;fill:#000000;fill-opacity:1;fill-rule:nonzero;stroke:none;stroke-width:1.5;stroke-linecap:round;stroke-linejoin:round;stroke-miterlimit:4;stroke-dasharray:none;stroke-dashoffset:0;stroke-opacity:1;color-rendering:auto;image-rendering:auto;shape-rendering:auto;text-rendering:auto;enable-background:accumulate"
     d="m 6.9882812,19.240234 a 0.750075,0.750075 0 0 1 0.21875,0.0293 0.750075,0.750075 0 0 1 0.00391,0 0.750075,0.750075 0 0 1 0.068359,0.02344 0.750075,0.750075 0 0 1 0.00195,0.002 0.750075,0.750075 0 0 1 0.066406,0.0293 0.750075,0.750075 0 0 1 0.00195,0.002 0.750075,0.750075 0 0 1 0.0625,0.03516 0.750075,0.750075 0 0 1 0.00195,0.002 0.750075,0.750075 0 0 1 0.1972656,0.185547 l 0.8417969,0.841797 a 0.750075,0.750075 0 0 1 0.2109375,0.240234 0.750075,0.750075 0 0 1 0.00195,0.002 0.750075,0.750075 0 0 1 0.03125,0.06445 0.750075,0.750075 0 0 1 0,0.002 0.750075,0.750075 0 0 1 0.027344,0.06836 0.750075,0.750075 0 0 1 0,0.002 0.750075,0.750075 0 0 1 0.00586,0.4375 0.750075,0.750075 0 0 1 0,0.0039 0.750075,0.750075 0 0 1 -0.023438,0.06836 0.750075,0.750075 0 0 1 -0.00195,0.002 0.750075,0.750075 0 0 1 -0.029297,0.06641 0.750075,0.750075 0 0 1 -0.00195,0.002 0.750075,0.750075 0 0 1 -0.035156,0.0625 0.750075,0.750075 0 0 1 -0.00195,0.002 0.750075,0.750075 0 0 1 -0.1855469,0.197266 L 7.609375,22.453125 a 0.750075,0.750075 0 0 1 -0.2402344,0.210937 0.750075,0.750075 0 0 1 -0.00195,0.002 0.750075,0.750075 0 0 1 -0.033203,0.01563 0.750075,0.750075 0 0 1 -0.1035156,0.04297 0.750075,0.750075 0 0 1 -0.4375,0.0059 0.750075,0.750075 0 0 1 -0.00391,0 0.750075,0.750075 0 0 1 -0.035156,-0.01172 0.750075,0.750075 0 0 1 -0.035156,-0.01367 0.750075,0.750075 0 0 1 -0.066406,-0.0293 0.750075,0.750075 0 0 1 -0.00195,-0.002 0.750075,0.750075 0 0 1 -0.0625,-0.03516 0.750075,0.750075 0 0 1 -0.00195,-0.002 0.750075,0.750075 0 0 1 -0.1972656,-0.185547 L 5.546875,21.609375 a 0.750075,0.750075 0 0 1 -0.2109375,-0.240234 0.750075,0.750075 0 0 1 -0.00195,-0.002 0.750075,0.750075 0 0 1 -0.015625,-0.0332 0.750075,0.750075 0 0 1 -0.015625,-0.0332 0.750075,0.750075 0 0 1 -0.027344,-0.06836 0.750075,0.750075 0 0 1 0,-0.002 0.750075,0.750075 0 0 1 -0.00586,-0.4375 0.750075,0.750075 0 0 1 0,-0.0039 0.750075,0.750075 0 0 1 0.011719,-0.03516 0.750075,0.750075 0 0 1 0.013672,-0.03516 0.750075,0.750075 0 0 1 0.029297,-0.06641 0.750075,0.750075 0 0 1 0.00195,-0.002 0.750075,0.750075 0 0 1 0.035156,-0.0625 0.750075,0.750075 0 0 1 0.00195,-0.002 0.750075,0.750075 0 0 1 0.1855469,-0.197266 L 6.390625,19.546875 a 0.750075,0.750075 0 0 1 0.2402344,-0.210937 0.750075,0.750075 0 0 1 0.00195,-0.002 0.750075,0.750075 0 0 1 0.033203,-0.01563 0.750075,0.750075 0 0 1 0.1035156,-0.04297 0.750075,0.750075 0 0 1 0.21875,-0.03516 z M 7.9746094,0.24609375 a 0.750075,0.750075 0 0 1 0.1894531,0.0214844 0.750075,0.750075 0 0 1 0.072266,0.0214844 0.750075,0.750075 0 0 1 0.03125,0.009766 l 0.00586,0.001953 2.9628905,0.98828125 A 0.750075,0.750075 0 0 1 11.53125,1.46875 l 1,1 a 0.750075,0.750075 0 0 1 0.138672,0.1953125 l 1,2 A 0.750075,0.750075 0 0 1 13.75,5 v 2 a 0.750075,0.750075 0 0 1 -0.08008,0.3359375 l -1,2 A 0.750075,0.750075 0 0 1 12.53125,9.53125 l -1,1 A 0.750075,0.750075 0 0 1 11.416016,10.625 L 8.5800781,12.515625 7.75,14.177734 v 0.511719 l 0.7011719,0.699219 a 0.750075,0.750075 0 0 1 0.3007812,0.521484 0.750075,0.750075 0 0 1 0.00391,0.05859 0.750075,0.750075 0 0 1 0.00195,0.01563 0.750075,0.750075 0 0 1 0,0.0078 0.750075,0.750075 0 0 1 0,0.0078 0.750075,0.750075 0 0 1 -0.3066406,0.611328 L 7.53125,17.53125 a 0.750075,0.750075 0 0 1 -1.0625,0 l -1,-1 A 0.750075,0.750075 0 0 1 5.25,16 v -1 a 0.750075,0.750075 0 0 1 0.080078,-0.335938 l 1,-2 A 0.750075,0.750075 0 0 1 6.46875,12.46875 l 0.9648438,-0.962891 a 0.750075,0.750075 0 0 1 0.015625,-0.01758 0.750075,0.750075 0 0 1 0.019531,-0.01953 0.750075,0.750075 0 0 1 0.00391,-0.0039 0.750075,0.750075 0 0 1 0.00781,-0.0078 l 0.011719,-0.01367 a 0.750075,0.750075 0 0 1 0.011719,-0.0098 L 9.46875,9.46875 10.382812,8.5566406 11.25,6.8222656 V 5.1777344 L 10.382812,3.4433594 9.5566406,2.6171875 7.8242188,1.75 H 6.1777344 L 4.5585938,2.5605469 3.75,4.1777344 V 4.6894531 L 4.53125,5.46875 a 0.750075,0.750075 0 0 1 0,1.0625 l -1,1 a 0.750075,0.750075 0 0 1 -1.0625,0 l -1,-1 A 0.750075,0.750075 0 0 1 1.25,6 V 5 a 0.750075,0.750075 0 0 1 0.080078,-0.3359375 l 1,-2 A 0.750075,0.750075 0 0 1 2.46875,2.46875 L 3.4414062,1.4960938 A 0.750075,0.750075 0 0 1 3.46875,1.46875 0.750075,0.750075 0 0 1 3.7578125,1.2832031 l 1.90625,-0.95312498 A 0.750075,0.750075 0 0 1 6,0.25 h 1.8984375 a 0.750075,0.750075 0 0 1 0.076172,-0.003906 z"
     id="path2" />
</svg>
