<?xml version="1.0" encoding="UTF-8"?>
<glyph name="Acircumflex" format="1">
  <advance width="520"/>
  <unicode hex="00C2"/>
  <outline>
    <component base="asciicircum" xOffset="29" yOffset="385"/>
    <component base="A"/>
  </outline>
  <lib>
    <dict>
      <key>com.fontlab.hintData</key>
      <dict>
        <key>hhints</key>
        <array>
          <dict>
            <key>position</key>
            <integer>-1</integer>
            <key>width</key>
            <integer>23</integer>
          </dict>
          <dict>
            <key>position</key>
            <integer>202</integer>
            <key>width</key>
            <integer>29</integer>
          </dict>
          <dict>
            <key>position</key>
            <integer>615</integer>
            <key>width</key>
            <integer>22</integer>
          </dict>
          <dict>
            <key>position</key>
            <integer>694</integer>
            <key>width</key>
            <integer>202</integer>
          </dict>
        </array>
        <key>vhints</key>
        <array>
          <dict>
            <key>position</key>
            <integer>14</integer>
            <key>width</key>
            <integer>29</integer>
          </dict>
          <dict>
            <key>position</key>
            <integer>479</integer>
            <key>width</key>
            <integer>29</integer>
          </dict>
        </array>
      </dict>
    </dict>
  </lib>
</glyph>
