<?xml version="1.0" encoding="UTF-8" standalone="no"?>
<svg
   xmlns:dc="http://purl.org/dc/elements/1.1/"
   xmlns:cc="http://creativecommons.org/ns#"
   xmlns:rdf="http://www.w3.org/1999/02/22-rdf-syntax-ns#"
   xmlns:svg="http://www.w3.org/2000/svg"
   xmlns="http://www.w3.org/2000/svg"
   xmlns:sodipodi="http://sodipodi.sourceforge.net/DTD/sodipodi-0.dtd"
   xmlns:inkscape="http://www.inkscape.org/namespaces/inkscape"
   data-dec="85"
   width="24"
   height="40"
   version="1.1"
   id="svg4"
   sodipodi:docname="85.svg"
   inkscape:version="0.92.4 (unknown)">
  <metadata
     id="metadata10">
    <rdf:RDF>
      <cc:Work
         rdf:about="">
        <dc:format>image/svg+xml</dc:format>
        <dc:type
           rdf:resource="http://purl.org/dc/dcmitype/StillImage" />
      </cc:Work>
    </rdf:RDF>
  </metadata>
  <defs
     id="defs8" />
  <sodipodi:namedview
     pagecolor="#ffffff"
     bordercolor="#666666"
     borderopacity="1"
     objecttolerance="10"
     gridtolerance="10"
     guidetolerance="10"
     inkscape:pageopacity="0"
     inkscape:pageshadow="2"
     inkscape:window-width="640"
     inkscape:window-height="480"
     id="namedview6"
     showgrid="false"
     inkscape:zoom="5.9"
     inkscape:cx="12"
     inkscape:cy="20"
     inkscape:window-x="0"
     inkscape:window-y="27"
     inkscape:window-maximized="0"
     inkscape:current-layer="svg4" />
  <path
     style="color:#000000;font-style:normal;font-variant:normal;font-weight:normal;font-stretch:normal;font-size:medium;line-height:normal;font-family:sans-serif;font-variant-ligatures:normal;font-variant-position:normal;font-variant-caps:normal;font-variant-numeric:normal;font-variant-alternates:normal;font-feature-settings:normal;text-indent:0;text-align:start;text-decoration:none;text-decoration-line:none;text-decoration-style:solid;text-decoration-color:#000000;letter-spacing:normal;word-spacing:normal;text-transform:none;writing-mode:lr-tb;direction:ltr;text-orientation:mixed;dominant-baseline:auto;baseline-shift:baseline;text-anchor:start;white-space:normal;shape-padding:0;clip-rule:nonzero;display:inline;overflow:visible;visibility:visible;opacity:1;isolation:auto;mix-blend-mode:normal;color-interpolation:sRGB;color-interpolation-filters:linearRGB;solid-color:#000000;solid-opacity:1;vector-effect:none;fill:#013272;fill-opacity:1;fill-rule:nonzero;stroke:none;stroke-width:0.5;stroke-linecap:round;stroke-linejoin:round;stroke-miterlimit:4;stroke-dasharray:none;stroke-dashoffset:0;stroke-opacity:1;color-rendering:auto;image-rendering:auto;shape-rendering:auto;text-rendering:auto;enable-background:accumulate"
     d="m 5.25,1.25 v 14.708984 l 0.96875,2.90625 1.9160156,1.916016 0.4355469,0.144531 -1.7480469,-1.748047 a 0.250025,0.250025 0 0 1 -0.058594,-0.09961 l -1,-3 A 0.250025,0.250025 0 0 1 5.75,16 V 1.25 Z M 4.9960938,0.74609375 A 0.250025,0.250025 0 0 1 5.046875,0.75 h 0.9121094 a 0.250025,0.250025 0 0 1 0.087891,0 H 9 a 0.250025,0.250025 0 1 1 0,0.5 H 6.25 v 14.708984 l 0.96875,2.90625 1.9296875,1.929688 L 11.056641,21.75 h 1.902343 l 2.90625,-0.96875 1.916016,-1.916016 0.96875,-2.90625 V 1.25 H 16 a 0.250025,0.250025 0 1 1 0,-0.5 h 2.958984 a 0.250025,0.250025 0 0 1 0.08789,0 H 22 a 0.250025,0.250025 0 1 1 0,0.5 H 19.25 V 16 a 0.250025,0.250025 0 0 1 -0.01367,0.07813 l -1,3 a 0.250025,0.250025 0 0 1 -0.05859,0.09961 l -2,2 a 0.250025,0.250025 0 0 1 -0.09961,0.05859 l -3,1 A 0.250025,0.250025 0 0 1 13,22.25 h -1.966797 a 0.250025,0.250025 0 0 1 -0.03906,0 0.250025,0.250025 0 0 1 -0.0098,0 0.250025,0.250025 0 0 1 -0.01563,-0.002 0.250025,0.250025 0 0 1 -0.02344,-0.0039 0.250025,0.250025 0 0 1 -0.0098,-0.002 0.250025,0.250025 0 0 1 -0.03516,-0.01367 L 7.921875,21.236328 a 0.250025,0.250025 0 0 1 -0.099609,-0.05859 l -2,-2 a 0.250025,0.250025 0 0 1 -0.058594,-0.09961 l -1,-3 A 0.250025,0.250025 0 0 1 4.75,16 V 1.25 H 2 a 0.250025,0.250025 0 1 1 0,-0.5 h 2.9589844 a 0.250025,0.250025 0 0 1 0.037109,-0.003906 z"
     id="path2" />
</svg>
