<?xml version="1.0" encoding="UTF-8"?>
<glyph name="Icircumflex" format="1">
  <advance width="231"/>
  <unicode hex="00CE"/>
  <outline>
    <component base="asciicircum" xOffset="-116" yOffset="414"/>
    <component base="I"/>
  </outline>
  <lib>
    <dict>
      <key>com.fontlab.hintData</key>
      <dict>
        <key>hhints</key>
        <array>
          <dict>
            <key>position</key>
            <integer>-1</integer>
            <key>width</key>
            <integer>23</integer>
          </dict>
          <dict>
            <key>position</key>
            <integer>644</integer>
            <key>width</key>
            <integer>22</integer>
          </dict>
          <dict>
            <key>position</key>
            <integer>724</integer>
            <key>width</key>
            <integer>232</integer>
          </dict>
        </array>
        <key>vhints</key>
        <array>
          <dict>
            <key>position</key>
            <integer>87</integer>
            <key>width</key>
            <integer>58</integer>
          </dict>
        </array>
      </dict>
    </dict>
  </lib>
</glyph>
