<svg xmlns:dc="http://purl.org/dc/elements/1.1/" xmlns:cc="http://creativecommons.org/ns#" xmlns:rdf="http://www.w3.org/1999/02/22-rdf-syntax-ns#" xmlns:svg="http://www.w3.org/2000/svg" xmlns="http://www.w3.org/2000/svg" xmlns:sodipodi="http://sodipodi.sourceforge.net/DTD/sodipodi-0.dtd" xmlns:inkscape="http://www.inkscape.org/namespaces/inkscape" data-dec="42" id="dec_42" width="16" height="40" version="1.1" sodipodi:docname="42.svg" inkscape:version="0.92.2 5c3e80d, 2017-08-06">
  <metadata id="metadata9">
    <rdf:RDF>
      <cc:Work rdf:about="">
        <dc:format>image/svg+xml</dc:format>
        <dc:type rdf:resource="http://purl.org/dc/dcmitype/StillImage"/>
      </cc:Work>
    </rdf:RDF>
  </metadata>
  <defs id="defs7"/>
  <sodipodi:namedview pagecolor="#ffffff" bordercolor="#666666" borderopacity="1" objecttolerance="10" gridtolerance="10" guidetolerance="10" inkscape:pageopacity="0" inkscape:pageshadow="2" inkscape:window-width="1428" inkscape:window-height="849" id="namedview5" showgrid="true" inkscape:zoom="11.8" inkscape:cx="3.5508475" inkscape:cy="29.206532" inkscape:window-x="0" inkscape:window-y="841" inkscape:window-maximized="0" inkscape:current-layer="dec_42">
    <inkscape:grid type="xygrid" id="grid17"/>
  </sodipodi:namedview>
  <path id="path15" style="fill:none;stroke:#000000;stroke-width:1;stroke-linecap:round;stroke-linejoin:round" d="M 9,1 H 8 l 2,11 -1,1 M 9,1 V 13 M 9,1 10,2 8,13 H 9 M 4,4 h 1 l 8,6 h 1 M 4,4 14,10 M 4,4 v 2 l 10,2 v 2 M 14,4 H 13 L 5,10 H 4 M 14,4 4,10 M 14,4 V 6 L 4,8 V 10 M 8,1 7,2 9,12 8,13 M 8,1 V 13 M 8,1 9,2 7,12 8,13 M 3,4 h 1 l 8,6 h 1 M 3,4 13,10 M 3,4 v 2 l 10,2 v 2 M 13,4 H 12 L 4,10 H 3 M 13,4 3,10 M 13,4 V 6 L 3,8 V 10 "/>
</svg>