<?xml version="1.0" encoding="UTF-8" standalone="no"?>
<svg
   xmlns:dc="http://purl.org/dc/elements/1.1/"
   xmlns:cc="http://creativecommons.org/ns#"
   xmlns:rdf="http://www.w3.org/1999/02/22-rdf-syntax-ns#"
   xmlns:svg="http://www.w3.org/2000/svg"
   xmlns="http://www.w3.org/2000/svg"
   xmlns:sodipodi="http://sodipodi.sourceforge.net/DTD/sodipodi-0.dtd"
   xmlns:inkscape="http://www.inkscape.org/namespaces/inkscape"
   data-dec="107"
   width="18"
   height="40"
   version="1.1"
   id="svg4"
   sodipodi:docname="107.svg"
   inkscape:version="0.92.4 (unknown)">
  <metadata
     id="metadata10">
    <rdf:RDF>
      <cc:Work
         rdf:about="">
        <dc:format>image/svg+xml</dc:format>
        <dc:type
           rdf:resource="http://purl.org/dc/dcmitype/StillImage" />
      </cc:Work>
    </rdf:RDF>
  </metadata>
  <defs
     id="defs8" />
  <sodipodi:namedview
     pagecolor="#ffffff"
     bordercolor="#666666"
     borderopacity="1"
     objecttolerance="10"
     gridtolerance="10"
     guidetolerance="10"
     inkscape:pageopacity="0"
     inkscape:pageshadow="2"
     inkscape:window-width="640"
     inkscape:window-height="480"
     id="namedview6"
     showgrid="false"
     inkscape:zoom="5.9"
     inkscape:cx="9"
     inkscape:cy="20"
     inkscape:window-x="0"
     inkscape:window-y="27"
     inkscape:window-maximized="0"
     inkscape:current-layer="svg4" />
  <path
     style="color:#000000;font-style:normal;font-variant:normal;font-weight:normal;font-stretch:normal;font-size:medium;line-height:normal;font-family:sans-serif;font-variant-ligatures:normal;font-variant-position:normal;font-variant-caps:normal;font-variant-numeric:normal;font-variant-alternates:normal;font-feature-settings:normal;text-indent:0;text-align:start;text-decoration:none;text-decoration-line:none;text-decoration-style:solid;text-decoration-color:#000000;letter-spacing:normal;word-spacing:normal;text-transform:none;writing-mode:lr-tb;direction:ltr;text-orientation:mixed;dominant-baseline:auto;baseline-shift:baseline;text-anchor:start;white-space:normal;shape-padding:0;clip-rule:nonzero;display:inline;overflow:visible;visibility:visible;opacity:1;isolation:auto;mix-blend-mode:normal;color-interpolation:sRGB;color-interpolation-filters:linearRGB;solid-color:#000000;solid-opacity:1;vector-effect:none;fill:#000000;fill-opacity:1;fill-rule:nonzero;stroke:none;stroke-width:0.30000001;stroke-linecap:round;stroke-linejoin:round;stroke-miterlimit:4;stroke-dasharray:none;stroke-dashoffset:0;stroke-opacity:1;color-rendering:auto;image-rendering:auto;shape-rendering:auto;text-rendering:auto;enable-background:accumulate"
     d="m 5.8496094,18.361328 -0.6992188,0.699219 v 2.789062 h 0.6992188 v -2.833984 a 0.15001501,0.15001501 0 0 1 0,-0.0293 z m 0,-1 -0.6992188,0.699219 v 0.578125 l 0.6992188,-0.699219 z m 3.6035156,-1.603516 -0.3261719,0.326172 4.9414059,5.765625 h 0.605469 z m -1,0 -2.3027344,2.302735 v 0.578125 L 8.71875,16.070312 Z m 0.5390625,-0.537109 -0.3261719,0.326172 0.265625,0.310547 0.3261719,-0.326172 z m -1,0 -1.8417969,1.839844 v 0.578125 L 8.2578125,15.53125 Z m 2,-0.002 -0.328125,0.328125 5.4042965,6.302734 h 0.605469 z M 16.0625,8.1503906 9.203125,15.007812 9.4707031,15.318359 9.8710938,14.919922 a 0.15001501,0.15001501 0 0 1 0.00781,-0.01172 0.15001501,0.15001501 0 0 1 0.03125,-0.03125 0.15001501,0.15001501 0 0 1 0.00391,-0.002 L 16.638672,8.1503906 Z m -1,0 -6.859375,6.8574214 0.2675781,0.310547 0.4003907,-0.398437 a 0.15001501,0.15001501 0 0 1 0.00781,-0.01172 0.15001501,0.15001501 0 0 1 0.03125,-0.03125 0.15001501,0.15001501 0 0 1 0.00391,-0.002 L 15.638672,8.1503906 Z m -9.9121094,-7 V 17.638672 L 5.8496094,16.939453 V 1.1503906 Z m -1,0 V 21.849609 h 0.6992188 v -2.833984 a 0.15001501,0.15001501 0 0 1 0,-0.0293 v -0.970703 a 0.15001501,0.15001501 0 0 1 0,-0.0293 V 1.1503906 Z M 3.9980469,0.84765625 a 0.15001501,0.15001501 0 0 1 0.029297,0.001953 h 0.9550781 0.00195 a 0.15001501,0.15001501 0 0 1 0.042969,0 H 6 A 0.15001501,0.15001501 0 0 1 6.1503906,1 v 15.638672 l 1.7207032,-1.71875 a 0.15001501,0.15001501 0 0 1 0.00781,-0.01172 0.15001501,0.15001501 0 0 1 0.03125,-0.03125 0.15001501,0.15001501 0 0 1 0.00391,-0.002 L 14.894531,7.8945312 A 0.15001501,0.15001501 0 0 1 15,7.8496094 h 0.982422 a 0.15001501,0.15001501 0 0 1 0.02734,0 0.15001501,0.15001501 0 0 1 0.002,0 h 0.970703 a 0.15001501,0.15001501 0 0 1 0.02734,0 0.15001501,0.15001501 0 0 1 0.002,0 0.15001501,0.15001501 0 0 1 0.01367,0.00195 0.15001501,0.15001501 0 0 1 0.002,0 0.15001501,0.15001501 0 0 1 0.02734,0.00781 0.15001501,0.15001501 0 0 1 0.002,0 0.15001501,0.15001501 0 0 1 0.01172,0.00586 0.15001501,0.15001501 0 0 1 0.002,0 0.15001501,0.15001501 0 0 1 0.03516,0.025391 0.15001501,0.15001501 0 0 1 0.0098,0.011719 0.15001501,0.15001501 0 0 1 0.0098,0.011719 0.15001501,0.15001501 0 0 1 0.0078,0.011719 0.15001501,0.15001501 0 0 1 0.0059,0.013672 0.15001501,0.15001501 0 0 1 0.0059,0.013672 0.15001501,0.15001501 0 0 1 0.0059,0.029297 0.15001501,0.15001501 0 0 1 0,0.00195 0.15001501,0.15001501 0 0 1 0.002,0.013672 0.15001501,0.15001501 0 0 1 -0.01172,0.058594 0.15001501,0.15001501 0 0 1 -0.01367,0.025391 0.15001501,0.15001501 0 0 1 -0.002,0.00195 0.15001501,0.15001501 0 0 1 -0.0078,0.011719 0.15001501,0.15001501 0 0 1 -0.01172,0.00977 0.15001501,0.15001501 0 0 1 -0.01953,0.019531 l -6.882813,6.882812 5.865234,6.841797 h 0.605469 l -5.787109,-6.751953 a 0.15001501,0.15001501 0 1 1 0.226562,-0.195312 l 5.980469,6.978515 a 0.15001501,0.15001501 0 0 1 0.0039,0.0039 0.15001501,0.15001501 0 0 1 0.01758,0.01758 0.15001501,0.15001501 0 0 1 0.0059,0.0078 0.15001501,0.15001501 0 0 1 0.0039,0.0039 0.15001501,0.15001501 0 0 1 0.0039,0.0078 0.15001501,0.15001501 0 0 1 0.0078,0.01367 0.15001501,0.15001501 0 0 1 0.002,0.0039 0.15001501,0.15001501 0 0 1 0.0039,0.0098 0.15001501,0.15001501 0 0 1 0.002,0.0039 0.15001501,0.15001501 0 0 1 0.002,0.01172 0.15001501,0.15001501 0 0 1 0.002,0.0039 0.15001501,0.15001501 0 0 1 0.002,0.0098 0.15001501,0.15001501 0 0 1 0,0.0039 0.15001501,0.15001501 0 0 1 0,0.04102 0.15001501,0.15001501 0 0 1 0,0.0039 0.15001501,0.15001501 0 0 1 -0.0039,0.01172 0.15001501,0.15001501 0 0 1 0,0.0039 0.15001501,0.15001501 0 0 1 -0.0039,0.0098 0.15001501,0.15001501 0 0 1 -0.002,0.0039 0.15001501,0.15001501 0 0 1 -0.0039,0.0098 0.15001501,0.15001501 0 0 1 -0.002,0.0039 0.15001501,0.15001501 0 0 1 -0.0059,0.0098 0.15001501,0.15001501 0 0 1 -0.0059,0.0098 0.15001501,0.15001501 0 0 1 -0.002,0.002 0.15001501,0.15001501 0 0 1 -0.002,0.0039 0.15001501,0.15001501 0 0 1 -0.0078,0.0078 0.15001501,0.15001501 0 0 1 -0.0039,0.002 0.15001501,0.15001501 0 0 1 -0.0059,0.0078 0.15001501,0.15001501 0 0 1 -0.0039,0.002 0.15001501,0.15001501 0 0 1 -0.0078,0.0078 0.15001501,0.15001501 0 0 1 -0.0039,0.002 0.15001501,0.15001501 0 0 1 -0.0098,0.0059 0.15001501,0.15001501 0 0 1 -0.0039,0.002 0.15001501,0.15001501 0 0 1 -0.02734,0.01172 0.15001501,0.15001501 0 0 1 -0.02539,0.0059 0.15001501,0.15001501 0 0 1 -0.0039,0 0.15001501,0.15001501 0 0 1 -0.02539,0 h -0.970703 a 0.15001501,0.15001501 0 0 1 -0.0293,0 h -0.970703 a 0.15001501,0.15001501 0 0 1 -0.0293,0 H 14 a 0.15001501,0.15001501 0 0 1 -0.113281,-0.05273 L 8.9140625,16.296875 6.1503906,19.060547 v 2.921875 a 0.15001501,0.15001501 0 0 1 -0.00977,0.07227 0.15001501,0.15001501 0 0 1 0,0.002 0.15001501,0.15001501 0 0 1 -0.00586,0.01172 0.15001501,0.15001501 0 0 1 -0.00781,0.01367 0.15001501,0.15001501 0 0 1 -0.00781,0.01172 0.15001501,0.15001501 0 0 1 0,0.002 0.15001501,0.15001501 0 0 1 -0.00586,0.0039 0.15001501,0.15001501 0 0 1 -0.068359,0.04492 0.15001501,0.15001501 0 0 1 -0.027344,0.0059 0.15001501,0.15001501 0 0 1 -0.00195,0 0.15001501,0.15001501 0 0 1 -0.042969,0 H 5.0175781 a 0.15001501,0.15001501 0 0 1 -0.00195,0 0.15001501,0.15001501 0 0 1 -0.042969,0 H 4 A 0.15001501,0.15001501 0 0 1 3.8496094,22 V 1.0175781 a 0.15001501,0.15001501 0 0 1 0.00977,-0.0722656 0.15001501,0.15001501 0 0 1 0,-0.001953 0.15001501,0.15001501 0 0 1 0.00586,-0.0117188 0.15001501,0.15001501 0 0 1 0,-0.001953 0.15001501,0.15001501 0 0 1 0.015625,-0.0234375 0.15001501,0.15001501 0 0 1 0,-0.001953 0.15001501,0.15001501 0 0 1 0.00586,-0.003906 0.15001501,0.15001501 0 0 1 0.015625,-0.015625 0.15001501,0.15001501 0 0 1 0.011719,-0.009766 0.15001501,0.15001501 0 0 1 0.041016,-0.0195313 0.15001501,0.15001501 0 0 1 0.027344,-0.005859 0.15001501,0.15001501 0 0 1 0.00195,0 0.15001501,0.15001501 0 0 1 0.013672,-0.001953 z"
     id="path2" />
</svg>
