<svg xmlns:dc="http://purl.org/dc/elements/1.1/" xmlns:cc="http://creativecommons.org/ns#" xmlns:rdf="http://www.w3.org/1999/02/22-rdf-syntax-ns#" xmlns:svg="http://www.w3.org/2000/svg" xmlns="http://www.w3.org/2000/svg" xmlns:sodipodi="http://sodipodi.sourceforge.net/DTD/sodipodi-0.dtd" xmlns:inkscape="http://www.inkscape.org/namespaces/inkscape" data-dec="125" id="dec_125" width="14" height="40" version="1.1" sodipodi:docname="125.svg" inkscape:version="0.92.2 5c3e80d, 2017-08-06">
  <metadata id="metadata9">
    <rdf:RDF>
      <cc:Work rdf:about="">
        <dc:format>image/svg+xml</dc:format>
        <dc:type rdf:resource="http://purl.org/dc/dcmitype/StillImage"/>
      </cc:Work>
    </rdf:RDF>
  </metadata>
  <defs id="defs7"/>
  <sodipodi:namedview pagecolor="#ffffff" bordercolor="#666666" borderopacity="1" objecttolerance="10" gridtolerance="10" guidetolerance="10" inkscape:pageopacity="0" inkscape:pageshadow="2" inkscape:window-width="1364" inkscape:window-height="730" id="namedview5" showgrid="true" showguides="false" inkscape:zoom="47.476562" inkscape:cx="4.3237319" inkscape:cy="24.331021" inkscape:window-x="1920" inkscape:window-y="18" inkscape:window-maximized="0" inkscape:current-layer="dec_125">
    <inkscape:grid type="xygrid" id="grid819"/>
  </sodipodi:namedview>
  <path d="m 5,-3 2,1 1,1 1,2 V 3 L 8,5 7,6 6,8 v 2 l 2,2 m 0,0 2,1 -2,1 m 0,0 -2,2 v 2 l 1,2 1,1 1,2 v 2 l -1,2 -1,1 -2,1 " style="fill:none;stroke:#000000;stroke-width:1;stroke-linecap:round;stroke-linejoin:round" id="path2" inkscape:connector-curvature="0" sodipodi:nodetypes="ccccccccccccccccccccccc"/>
</svg>