<?xml version="1.0" encoding="UTF-8"?>
<glyph name="Agrave" format="1">
  <advance width="520"/>
  <unicode hex="00C0"/>
  <outline>
    <component base="grave" xOffset="80" yOffset="328"/>
    <component base="A"/>
  </outline>
  <lib>
    <dict>
      <key>com.fontlab.hintData</key>
      <dict>
        <key>hhints</key>
        <array>
          <dict>
            <key>position</key>
            <integer>0</integer>
            <key>width</key>
            <integer>23</integer>
          </dict>
          <dict>
            <key>position</key>
            <integer>204</integer>
            <key>width</key>
            <integer>87</integer>
          </dict>
          <dict>
            <key>position</key>
            <integer>674</integer>
            <key>width</key>
            <integer>22</integer>
          </dict>
          <dict>
            <key>position</key>
            <integer>754</integer>
            <key>width</key>
            <integer>232</integer>
          </dict>
        </array>
        <key>vhints</key>
        <array>
          <dict>
            <key>position</key>
            <integer>304</integer>
            <key>width</key>
            <integer>261</integer>
          </dict>
        </array>
      </dict>
    </dict>
  </lib>
</glyph>
