<?xml version="1.0" encoding="UTF-8" standalone="no"?>
<svg
   xmlns:dc="http://purl.org/dc/elements/1.1/"
   xmlns:cc="http://creativecommons.org/ns#"
   xmlns:rdf="http://www.w3.org/1999/02/22-rdf-syntax-ns#"
   xmlns:svg="http://www.w3.org/2000/svg"
   xmlns="http://www.w3.org/2000/svg"
   xmlns:sodipodi="http://sodipodi.sourceforge.net/DTD/sodipodi-0.dtd"
   xmlns:inkscape="http://www.inkscape.org/namespaces/inkscape"
   data-dec="187"
   width="13"
   height="40"
   version="1.1"
   id="svg4"
   sodipodi:docname="187.svg"
   inkscape:version="0.92.4 (unknown)">
  <metadata
     id="metadata10">
    <rdf:RDF>
      <cc:Work
         rdf:about="">
        <dc:format>image/svg+xml</dc:format>
        <dc:type
           rdf:resource="http://purl.org/dc/dcmitype/StillImage" />
      </cc:Work>
    </rdf:RDF>
  </metadata>
  <defs
     id="defs8" />
  <sodipodi:namedview
     pagecolor="#ffffff"
     bordercolor="#666666"
     borderopacity="1"
     objecttolerance="10"
     gridtolerance="10"
     guidetolerance="10"
     inkscape:pageopacity="0"
     inkscape:pageshadow="2"
     inkscape:window-width="640"
     inkscape:window-height="480"
     id="namedview6"
     showgrid="false"
     inkscape:zoom="5.9"
     inkscape:cx="6.5"
     inkscape:cy="20"
     inkscape:window-x="0"
     inkscape:window-y="27"
     inkscape:window-maximized="0"
     inkscape:current-layer="svg4" />
  <path
     style="color:#000000;font-style:normal;font-variant:normal;font-weight:normal;font-stretch:normal;font-size:medium;line-height:normal;font-family:sans-serif;font-variant-ligatures:normal;font-variant-position:normal;font-variant-caps:normal;font-variant-numeric:normal;font-variant-alternates:normal;font-feature-settings:normal;text-indent:0;text-align:start;text-decoration:none;text-decoration-line:none;text-decoration-style:solid;text-decoration-color:#000000;letter-spacing:normal;word-spacing:normal;text-transform:none;writing-mode:lr-tb;direction:ltr;text-orientation:mixed;dominant-baseline:auto;baseline-shift:baseline;text-anchor:start;white-space:normal;shape-padding:0;clip-rule:nonzero;display:inline;overflow:visible;visibility:visible;opacity:1;isolation:auto;mix-blend-mode:normal;color-interpolation:sRGB;color-interpolation-filters:linearRGB;solid-color:#000000;solid-opacity:1;vector-effect:none;fill:#013272;fill-opacity:1;fill-rule:nonzero;stroke:none;stroke-width:0.5;stroke-linecap:round;stroke-linejoin:round;stroke-miterlimit:4;stroke-dasharray:none;stroke-dashoffset:0;stroke-opacity:1;color-rendering:auto;image-rendering:auto;shape-rendering:auto;text-rendering:auto;enable-background:accumulate"
     d="m 9.8066406,11.759766 1.4023434,2.101562 a 0.250025,0.250025 0 0 1 -0.03125,0.316406 l -1.3886715,1.388672 1.8613285,-1.595703 z m -5,0 1.4023438,2.101562 a 0.250025,0.250025 0 0 1 -0.03125,0.316406 L 4.7890625,15.566406 6.6503906,13.970703 Z M 6.9980469,7.7460938 a 0.250025,0.250025 0 0 1 0.021484,0.00195 0.250025,0.250025 0 0 1 0.00195,0 0.250025,0.250025 0 0 1 0.023437,0.00391 0.250025,0.250025 0 0 1 0.00195,0 0.250025,0.250025 0 0 1 0.023437,0.00586 0.250025,0.250025 0 0 1 0.023437,0.00781 0.250025,0.250025 0 0 1 0.042969,0.023437 0.250025,0.250025 0 0 1 0.00586,0.00391 0.250025,0.250025 0 0 1 0.013672,0.011719 0.250025,0.250025 0 0 1 0.00195,0 0.250025,0.250025 0 0 1 0.017578,0.017578 0.250025,0.250025 0 0 1 0.015625,0.017578 l 0.00977,0.011719 a 0.250025,0.250025 0 0 1 0.00781,0.00977 l 4.9824216,5.9785159 a 0.250025,0.250025 0 0 1 -0.0293,0.349609 l -6.9726559,5.976563 -0.011719,0.01172 -0.015625,0.01172 a 0.250025,0.250025 0 0 1 -0.013672,0.01172 0.250025,0.250025 0 0 1 -0.019531,0.01367 0.250025,0.250025 0 0 1 -0.00586,0.0039 0.250025,0.250025 0 0 1 -0.015625,0.0078 0.250025,0.250025 0 0 1 -0.023437,0.0098 0.250025,0.250025 0 0 1 -0.00586,0.002 0.250025,0.250025 0 0 1 -0.017578,0.0059 0.250025,0.250025 0 0 1 -0.00586,0.002 0.250025,0.250025 0 0 1 -0.019531,0.0039 0.250025,0.250025 0 0 1 -0.00586,0 0.250025,0.250025 0 0 1 -0.042969,0.002 0.250025,0.250025 0 0 1 -0.025391,-0.002 0.250025,0.250025 0 0 1 -0.00586,-0.002 0.250025,0.250025 0 0 1 -0.00977,-0.002 0.250025,0.250025 0 0 1 -0.039063,-0.0098 0.250025,0.250025 0 0 1 -0.00391,-0.002 0.250025,0.250025 0 0 1 -0.039063,-0.02148 0.250025,0.250025 0 0 1 -0.035156,-0.02734 0.250025,0.250025 0 0 1 -0.00391,-0.0039 0.250025,0.250025 0 0 1 -0.013672,-0.01367 0.250025,0.250025 0 0 1 -0.00391,-0.0039 0.250025,0.250025 0 0 1 -0.011719,-0.01562 0.250025,0.250025 0 0 1 -0.00391,-0.0039 0.250025,0.250025 0 0 1 -0.00977,-0.01758 0.250025,0.250025 0 0 1 -0.00977,-0.01758 0.250025,0.250025 0 0 1 -0.00391,-0.0098 0.250025,0.250025 0 0 1 -0.00781,-0.01758 0.250025,0.250025 0 0 1 0,-0.0039 0.250025,0.250025 0 0 1 -0.00586,-0.01953 0.250025,0.250025 0 0 1 -0.00195,-0.0059 0.250025,0.250025 0 0 1 -0.00195,-0.01953 0.250025,0.250025 0 0 1 -0.00195,-0.02539 0.250025,0.250025 0 0 1 0,-0.0059 0.250025,0.250025 0 0 1 0,-0.01953 0.250025,0.250025 0 0 1 0,-0.0039 0.250025,0.250025 0 0 1 0.00391,-0.01953 0.250025,0.250025 0 0 1 0,-0.0059 0.250025,0.250025 0 0 1 0.00195,-0.0098 0.250025,0.250025 0 0 1 0.00391,-0.01367 0.250025,0.250025 0 0 1 0.00781,-0.01953 0.250025,0.250025 0 0 1 0.00195,-0.0059 0.250025,0.250025 0 0 1 0.00586,-0.01367 0.250025,0.250025 0 0 1 0.00391,-0.0059 0.250025,0.250025 0 0 1 0.00195,-0.0039 0.250025,0.250025 0 0 1 0.011719,-0.01953 0.250025,0.250025 0 0 1 0.011719,-0.01563 0.250025,0.250025 0 0 1 0.00391,-0.0039 0.250025,0.250025 0 0 1 0.011719,-0.01563 0.250025,0.250025 0 0 1 0.00195,-0.002 0.250025,0.250025 0 0 1 0.00195,-0.002 L 10.677734,13.96875 6.796875,8.1464844 a 0.250025,0.250025 0 0 1 -0.00586,-0.00781 0.250025,0.250025 0 0 1 -0.00391,-0.00586 0.250025,0.250025 0 0 1 -0.00391,-0.00977 0.250025,0.250025 0 0 1 -0.011719,-0.019531 0.250025,0.250025 0 0 1 0,-0.00195 0.250025,0.250025 0 0 1 -0.00977,-0.021484 0.250025,0.250025 0 0 1 0,-0.00195 0.250025,0.250025 0 0 1 -0.00781,-0.021484 0.250025,0.250025 0 0 1 0,-0.00195 A 0.250025,0.250025 0 0 1 6.75,8.03125 a 0.250025,0.250025 0 0 1 0,-0.00195 0.250025,0.250025 0 0 1 -0.00195,-0.021484 0.250025,0.250025 0 0 1 0,-0.00195 0.250025,0.250025 0 0 1 0,-0.023437 0.250025,0.250025 0 0 1 0,-0.00195 0.250025,0.250025 0 0 1 0,-0.00195 0.250025,0.250025 0 0 1 0.017578,-0.072266 0.250025,0.250025 0 0 1 0.00781,-0.019531 0.250025,0.250025 0 0 1 0.00195,-0.00195 0.250025,0.250025 0 0 1 0.00977,-0.019531 0.250025,0.250025 0 0 1 0.00195,-0.00195 0.250025,0.250025 0 0 1 0.013672,-0.019531 0.250025,0.250025 0 0 1 0.035156,-0.037109 0.250025,0.250025 0 0 1 0.039063,-0.027344 0.250025,0.250025 0 0 1 0.033203,-0.015625 0.250025,0.250025 0 0 1 0.013672,-0.00391 0.250025,0.250025 0 0 1 0.050781,-0.011719 0.250025,0.250025 0 0 1 0.025391,-0.00195 z m -5,0 a 0.250025,0.250025 0 0 1 0.021484,0.00195 0.250025,0.250025 0 0 1 0.00195,0 0.250025,0.250025 0 0 1 0.023437,0.00391 0.250025,0.250025 0 0 1 0.00195,0 0.250025,0.250025 0 0 1 0.089844,0.037109 0.250025,0.250025 0 0 1 0.00586,0.00391 0.250025,0.250025 0 0 1 0.013672,0.011719 0.250025,0.250025 0 0 1 0.00195,0 0.250025,0.250025 0 0 1 0.017578,0.017578 0.250025,0.250025 0 0 1 0.015625,0.017578 l 0.00977,0.011719 a 0.250025,0.250025 0 0 1 0.00781,0.00977 l 4.9824218,5.9785159 a 0.250025,0.250025 0 0 1 -0.029297,0.349609 l -6.97265628,5.976563 -0.0117187,0.01172 -0.015625,0.01172 a 0.250025,0.250025 0 0 1 -0.0136719,0.01172 0.250025,0.250025 0 0 1 -0.003906,0.0039 0.250025,0.250025 0 0 1 -0.015625,0.0098 0.250025,0.250025 0 0 1 -0.005859,0.0039 0.250025,0.250025 0 0 1 -0.015625,0.0078 0.250025,0.250025 0 0 1 -0.02343751,0.0098 0.250025,0.250025 0 0 1 -0.0234375,0.0078 0.250025,0.250025 0 0 1 -0.0058594,0.002 0.250025,0.250025 0 0 1 -0.0078125,0.002 0.250025,0.250025 0 0 1 -0.01171875,0.002 0.250025,0.250025 0 0 1 -0.0058594,0 0.250025,0.250025 0 0 1 -0.04296876,0.002 0.250025,0.250025 0 0 1 -0.03124999,-0.0039 0.250025,0.250025 0 0 1 -0.01953125,-0.0039 0.250025,0.250025 0 0 1 -0.0039063,0 0.250025,0.250025 0 0 1 -0.02929688,-0.0098 0.250025,0.250025 0 0 1 -0.0390625,-0.02148 0.250025,0.250025 0 0 1 -0.0175781,-0.01172 0.250025,0.250025 0 0 1 -0.003906,-0.002 0.250025,0.250025 0 0 1 -0.0136719,-0.01367 0.250025,0.250025 0 0 1 -0.003906,-0.0039 0.250025,0.250025 0 0 1 -0.0136719,-0.01367 0.250025,0.250025 0 0 1 -0.003906,-0.0039 0.250025,0.250025 0 0 1 -0.0117187,-0.01562 0.250025,0.250025 0 0 1 -0.003906,-0.0039 0.250025,0.250025 0 0 1 -0.009766,-0.01758 0.250025,0.250025 0 0 1 -0.009766,-0.01758 0.250025,0.250025 0 0 1 -0.003906,-0.0098 0.250025,0.250025 0 0 1 -0.007813,-0.01758 0.250025,0.250025 0 0 1 0,-0.0039 0.250025,0.250025 0 0 1 -0.005859,-0.01953 0.250025,0.250025 0 0 1 -0.001953,-0.0059 0.250025,0.250025 0 0 1 -0.001953,-0.01953 0.250025,0.250025 0 0 1 -0.001953,-0.02539 0.250025,0.250025 0 0 1 0,-0.0059 0.250025,0.250025 0 0 1 0,-0.01953 0.250025,0.250025 0 0 1 0,-0.0039 0.250025,0.250025 0 0 1 0.003906,-0.01953 0.250025,0.250025 0 0 1 0,-0.0059 0.250025,0.250025 0 0 1 0.001953,-0.0098 0.250025,0.250025 0 0 1 0.003906,-0.01367 0.250025,0.250025 0 0 1 0.007813,-0.01953 0.250025,0.250025 0 0 1 0.001953,-0.0059 0.250025,0.250025 0 0 1 0.005859,-0.01367 0.250025,0.250025 0 0 1 0.003906,-0.0059 0.250025,0.250025 0 0 1 0.001953,-0.0039 0.250025,0.250025 0 0 1 0.0117187,-0.01953 0.250025,0.250025 0 0 1 0.0117188,-0.01563 0.250025,0.250025 0 0 1 0.003906,-0.0039 0.250025,0.250025 0 0 1 0.0117188,-0.01563 0.250025,0.250025 0 0 1 0.001953,-0.002 0.250025,0.250025 0 0 1 0.001953,-0.002 L 5.6777344,13.96875 1.796875,8.1464844 a 0.250025,0.250025 0 0 1 -0.00586,-0.00781 0.250025,0.250025 0 0 1 -0.00391,-0.00586 0.250025,0.250025 0 0 1 -0.00391,-0.00977 0.250025,0.250025 0 0 1 -0.011719,-0.019531 0.250025,0.250025 0 0 1 0,-0.00195 0.250025,0.250025 0 0 1 -0.00977,-0.021484 0.250025,0.250025 0 0 1 0,-0.00195 0.250025,0.250025 0 0 1 -0.00781,-0.021484 0.250025,0.250025 0 0 1 0,-0.00195 A 0.250025,0.250025 0 0 1 1.75,8.03125 a 0.250025,0.250025 0 0 1 0,-0.00195 0.250025,0.250025 0 0 1 -0.00195,-0.021484 0.250025,0.250025 0 0 1 0,-0.00195 0.250025,0.250025 0 0 1 0,-0.023437 0.250025,0.250025 0 0 1 0,-0.00195 0.250025,0.250025 0 0 1 0,-0.00195 0.250025,0.250025 0 0 1 0.017578,-0.072266 0.250025,0.250025 0 0 1 0.00781,-0.019531 0.250025,0.250025 0 0 1 0.00195,-0.00195 0.250025,0.250025 0 0 1 0.00977,-0.019531 0.250025,0.250025 0 0 1 0.00195,-0.00195 0.250025,0.250025 0 0 1 0.013672,-0.019531 0.250025,0.250025 0 0 1 0,-0.00195 0.250025,0.250025 0 0 1 0.00781,-0.00781 0.250025,0.250025 0 0 1 0.027344,-0.027344 0.250025,0.250025 0 0 1 0.039063,-0.027344 0.250025,0.250025 0 0 1 0.00195,-0.00195 0.250025,0.250025 0 0 1 0.011719,-0.00391 0.250025,0.250025 0 0 1 0.019531,-0.00977 0.250025,0.250025 0 0 1 0.013672,-0.00391 0.250025,0.250025 0 0 1 0.00195,-0.00195 0.250025,0.250025 0 0 1 0.015625,-0.00391 0.250025,0.250025 0 0 1 0.033203,-0.00586 0.250025,0.250025 0 0 1 0.025391,-0.00195 z"
     id="path2" />
</svg>
