<?xml version="1.0" encoding="UTF-8" standalone="no"?>
<svg
   xmlns:dc="http://purl.org/dc/elements/1.1/"
   xmlns:cc="http://creativecommons.org/ns#"
   xmlns:rdf="http://www.w3.org/1999/02/22-rdf-syntax-ns#"
   xmlns:svg="http://www.w3.org/2000/svg"
   xmlns="http://www.w3.org/2000/svg"
   xmlns:sodipodi="http://sodipodi.sourceforge.net/DTD/sodipodi-0.dtd"
   xmlns:inkscape="http://www.inkscape.org/namespaces/inkscape"
   data-dec="96"
   width="12"
   height="40"
   version="1.1"
   id="svg4"
   sodipodi:docname="96.svg"
   inkscape:version="0.92.4 5da689c313, 2019-01-14">
  <metadata
     id="metadata10">
    <rdf:RDF>
      <cc:Work
         rdf:about="">
        <dc:format>image/svg+xml</dc:format>
        <dc:type
           rdf:resource="http://purl.org/dc/dcmitype/StillImage" />
        <dc:title></dc:title>
      </cc:Work>
    </rdf:RDF>
  </metadata>
  <defs
     id="defs8" />
  <sodipodi:namedview
     pagecolor="#ffffff"
     bordercolor="#666666"
     borderopacity="1"
     objecttolerance="10"
     gridtolerance="10"
     guidetolerance="10"
     inkscape:pageopacity="0"
     inkscape:pageshadow="2"
     inkscape:window-width="1920"
     inkscape:window-height="1043"
     id="namedview6"
     showgrid="false"
     inkscape:zoom="5.9"
     inkscape:cx="6"
     inkscape:cy="20"
     inkscape:window-x="0"
     inkscape:window-y="37"
     inkscape:window-maximized="0"
     inkscape:current-layer="svg4" />
  <path
     style="color:#000000;font-style:normal;font-variant:normal;font-weight:normal;font-stretch:normal;font-size:medium;line-height:normal;font-family:sans-serif;font-variant-ligatures:normal;font-variant-position:normal;font-variant-caps:normal;font-variant-numeric:normal;font-variant-alternates:normal;font-feature-settings:normal;text-indent:0;text-align:start;text-decoration:none;text-decoration-line:none;text-decoration-style:solid;text-decoration-color:#000000;letter-spacing:normal;word-spacing:normal;text-transform:none;writing-mode:lr-tb;direction:ltr;text-orientation:mixed;dominant-baseline:auto;baseline-shift:baseline;text-anchor:start;white-space:normal;shape-padding:0;clip-rule:nonzero;display:inline;overflow:visible;visibility:visible;opacity:1;isolation:auto;mix-blend-mode:normal;color-interpolation:sRGB;color-interpolation-filters:linearRGB;solid-color:#000000;solid-opacity:1;vector-effect:none;fill:#000000;fill-opacity:1;fill-rule:nonzero;stroke:none;stroke-width:1.5;stroke-linecap:round;stroke-linejoin:round;stroke-miterlimit:4;stroke-dasharray:none;stroke-dashoffset:0;stroke-opacity:1;color-rendering:auto;image-rendering:auto;shape-rendering:auto;text-rendering:auto;enable-background:accumulate"
     d="m 3.9804688,0.2421875 a 0.750075,0.750075 0 0 1 0.080078,0.001953 0.750075,0.750075 0 0 1 0.59375,0.36914063 L 9.5566406,6.4960938 a 0.750075,0.750075 0 0 1 0.09375,0.1269531 0.750075,0.750075 0 0 1 0.064453,0.1347656 0.750075,0.750075 0 0 1 0.021484,0.072266 0.750075,0.750075 0 0 1 0.013672,0.074219 0.750075,0.750075 0 0 1 0.00195,0.011719 0.750075,0.750075 0 0 1 0.00391,0.0625 0.750075,0.750075 0 0 1 0,0.076172 0.750075,0.750075 0 0 1 -0.00586,0.058594 0.750075,0.750075 0 0 1 -0.00195,0.015625 0.750075,0.750075 0 0 1 -0.00195,0.011719 0.750075,0.750075 0 0 1 -0.013672,0.060547 0.750075,0.750075 0 0 1 -0.00391,0.011719 0.750075,0.750075 0 0 1 -0.019531,0.060547 0.750075,0.750075 0 0 1 -0.060547,0.1210937 0.750075,0.750075 0 0 1 -0.00586,0.011719 0.750075,0.750075 0 0 1 -0.00781,0.011719 0.750075,0.750075 0 0 1 -0.035156,0.050781 0.750075,0.750075 0 0 1 -0.00781,0.00977 0.750075,0.750075 0 0 1 -0.00781,0.00977 0.750075,0.750075 0 0 1 -0.042969,0.044922 0.750075,0.750075 0 0 1 -0.054687,0.050781 0.750075,0.750075 0 0 1 -0.050781,0.039063 0.750075,0.750075 0 0 1 -0.074219,0.044922 0.750075,0.750075 0 0 1 -0.056641,0.027344 0.750075,0.750075 0 0 1 -0.035156,0.013672 0.750075,0.750075 0 0 1 -0.1074218,0.033203 0.750075,0.750075 0 0 1 -0.011719,0.00195 0.750075,0.750075 0 0 1 -0.00195,0 0.750075,0.750075 0 0 1 -0.072266,0.00977 A 0.750075,0.750075 0 0 1 8.8535156,7.7402344 0.750075,0.750075 0 0 1 8.7792969,7.7207031 0.750075,0.750075 0 0 1 8.7089844,7.6953125 0.750075,0.750075 0 0 1 8.6425781,7.6621094 0.750075,0.750075 0 0 1 8.5195312,7.5761719 L 8.5117188,7.5703125 2.5195312,2.5761719 A 0.750075,0.750075 0 0 1 2.46875,1.46875 L 3.3867188,0.55078125 a 0.750075,0.750075 0 0 1 0.59375,-0.30859375 z"
     id="path2" />
</svg>
