<svg xmlns:dc="http://purl.org/dc/elements/1.1/" xmlns:cc="http://creativecommons.org/ns#" xmlns:rdf="http://www.w3.org/1999/02/22-rdf-syntax-ns#" xmlns:svg="http://www.w3.org/2000/svg" xmlns="http://www.w3.org/2000/svg" xmlns:sodipodi="http://sodipodi.sourceforge.net/DTD/sodipodi-0.dtd" xmlns:inkscape="http://www.inkscape.org/namespaces/inkscape" data-dec="145" id="dec_67" width="24" height="40" version="1.1" sodipodi:docname="145.svg" inkscape:version="0.92.3 (2405546, 2018-03-11)">
  <metadata id="metadata9">
    <rdf:RDF>
      <cc:Work rdf:about="">
        <dc:format>image/svg+xml</dc:format>
        <dc:type rdf:resource="http://purl.org/dc/dcmitype/StillImage"/>
        <dc:title/>
      </cc:Work>
    </rdf:RDF>
  </metadata>
  <defs id="defs7"/>
  <sodipodi:namedview pagecolor="#ffffff" bordercolor="#666666" borderopacity="1" objecttolerance="10" gridtolerance="10" guidetolerance="10" inkscape:pageopacity="0" inkscape:pageshadow="2" inkscape:window-width="1360" inkscape:window-height="730" id="namedview5" showgrid="true" showguides="true" inkscape:zoom="8.1414506" inkscape:cx="-7.4023746" inkscape:cy="30.140245" inkscape:window-x="80" inkscape:window-y="18" inkscape:window-maximized="0" inkscape:current-layer="dec_67" inkscape:guide-bbox="true">
    <inkscape:grid type="xygrid" id="grid819"/>
    <sodipodi:guide position="-24,2" orientation="0.98287219,0.18428854" id="guide816" inkscape:locked="false"/>
  </sodipodi:namedview>
  <path id="path2-6" style="fill:none;stroke:#000000;stroke-width:1;stroke-linecap:round;stroke-linejoin:round" d="m 13,6 2,1 2,2 1,2 v 4 l -1,2 -2,2 -2,1 h -3 l -2,-1 -1,-1 m 5,2 2,-1 2,-2 1,-2 v -4 l -1,-3 -1,-1 -2,-1 h -2 l -2,1 -1,1 v 1 h 1 l 1,-2 1,-1 h 2 M 7,3 5,4 3,6 2,8 1,12 v 3 l 1,4 1,2 3,3 4,1 h 4 l 4,-1 3,-3 1,-2 1,-4 V 12 L 22,8 21,6 19,4 17,3 14,2 H 10 L 7,3              "/>
</svg>