<?xml version="1.0" encoding="UTF-8" standalone="no"?>
<svg
   xmlns:dc="http://purl.org/dc/elements/1.1/"
   xmlns:cc="http://creativecommons.org/ns#"
   xmlns:rdf="http://www.w3.org/1999/02/22-rdf-syntax-ns#"
   xmlns:svg="http://www.w3.org/2000/svg"
   xmlns="http://www.w3.org/2000/svg"
   xmlns:sodipodi="http://sodipodi.sourceforge.net/DTD/sodipodi-0.dtd"
   xmlns:inkscape="http://www.inkscape.org/namespaces/inkscape"
   data-dec="85"
   width="26"
   height="40"
   version="1.1"
   id="svg4"
   sodipodi:docname="85.svg"
   inkscape:version="0.92.4 (unknown)">
  <metadata
     id="metadata10">
    <rdf:RDF>
      <cc:Work
         rdf:about="">
        <dc:format>image/svg+xml</dc:format>
        <dc:type
           rdf:resource="http://purl.org/dc/dcmitype/StillImage" />
      </cc:Work>
    </rdf:RDF>
  </metadata>
  <defs
     id="defs8" />
  <sodipodi:namedview
     pagecolor="#ffffff"
     bordercolor="#666666"
     borderopacity="1"
     objecttolerance="10"
     gridtolerance="10"
     guidetolerance="10"
     inkscape:pageopacity="0"
     inkscape:pageshadow="2"
     inkscape:window-width="640"
     inkscape:window-height="480"
     id="namedview6"
     showgrid="false"
     inkscape:zoom="5.9"
     inkscape:cx="13"
     inkscape:cy="20"
     inkscape:window-x="0"
     inkscape:window-y="27"
     inkscape:window-maximized="0"
     inkscape:current-layer="svg4" />
  <path
     style="color:#000000;font-style:normal;font-variant:normal;font-weight:normal;font-stretch:normal;font-size:medium;line-height:normal;font-family:sans-serif;font-variant-ligatures:normal;font-variant-position:normal;font-variant-caps:normal;font-variant-numeric:normal;font-variant-alternates:normal;font-feature-settings:normal;text-indent:0;text-align:start;text-decoration:none;text-decoration-line:none;text-decoration-style:solid;text-decoration-color:#000000;letter-spacing:normal;word-spacing:normal;text-transform:none;writing-mode:lr-tb;direction:ltr;text-orientation:mixed;dominant-baseline:auto;baseline-shift:baseline;text-anchor:start;white-space:normal;shape-padding:0;clip-rule:nonzero;display:inline;overflow:visible;visibility:visible;opacity:1;isolation:auto;mix-blend-mode:normal;color-interpolation:sRGB;color-interpolation-filters:linearRGB;solid-color:#000000;solid-opacity:1;vector-effect:none;fill:#013272;fill-opacity:1;fill-rule:nonzero;stroke:none;stroke-width:0.5;stroke-linecap:round;stroke-linejoin:round;stroke-miterlimit:4;stroke-dasharray:none;stroke-dashoffset:0;stroke-opacity:1;color-rendering:auto;image-rendering:auto;shape-rendering:auto;text-rendering:auto;enable-background:accumulate"
     d="M 8.1894531,1.25 5.2421875,12.0625 4.25,16.03125 v 2.910156 l 0.9277344,1.853516 0.5292968,0.175781 -0.9296874,-1.859375 A 0.250025,0.250025 0 0 1 4.75,19 v -3 a 0.250025,0.250025 0 0 1 0.00781,-0.06055 l 1,-4 a 0.250025,0.250025 0 0 1 0.00195,-0.0059 L 8.6738281,1.25 Z M 7.9882812,0.74609375 A 0.250025,0.250025 0 0 1 8.0390625,0.75 h 0.9238281 a 0.250025,0.250025 0 0 1 0.076172,0 H 12 a 0.250025,0.250025 0 1 1 0,0.5 H 9.1894531 L 6.2421875,12.0625 5.25,16.03125 v 2.910156 L 6.1855469,20.814453 8.0566406,21.75 h 3.9023434 l 2.90625,-0.96875 1.916016,-1.916016 0.978516,-2.9375 L 21.673828,1.25 H 19 a 0.250025,0.250025 0 1 1 0,-0.5 h 2.962891 a 0.250025,0.250025 0 0 1 0.07422,0 H 25 a 0.250025,0.250025 0 1 1 0,0.5 h -2.806641 l -3.951171,14.814453 a 0.250025,0.250025 0 0 1 -0.0059,0.01367 l -1,3 a 0.250025,0.250025 0 0 1 -0.05859,0.09961 l -2,2 a 0.250025,0.250025 0 0 1 -0.09961,0.05859 l -3,1 A 0.250025,0.250025 0 0 1 12,22.25 H 8.0332031 a 0.250025,0.250025 0 0 1 -0.039063,0 0.250025,0.250025 0 0 1 -0.00977,0 0.250025,0.250025 0 0 1 -0.015625,-0.002 0.250025,0.250025 0 0 1 -0.023437,-0.0039 0.250025,0.250025 0 0 1 -0.00977,-0.002 0.250025,0.250025 0 0 1 -0.035156,-0.01367 L 4.921875,21.236328 a 0.250025,0.250025 0 0 1 -0.1445312,-0.125 l -1,-2 A 0.250025,0.250025 0 0 1 3.75,19 v -3 a 0.250025,0.250025 0 0 1 0.00781,-0.06055 l 1,-4 a 0.250025,0.250025 0 0 1 0.00195,-0.0059 L 7.6738281,1.25 H 5 a 0.250025,0.250025 0 1 1 0,-0.5 h 2.9628906 a 0.250025,0.250025 0 0 1 0.025391,-0.003906 z"
     id="path2" />
</svg>
