<?xml version="1.0" encoding="UTF-8" standalone="no"?>
<svg
   xmlns:dc="http://purl.org/dc/elements/1.1/"
   xmlns:cc="http://creativecommons.org/ns#"
   xmlns:rdf="http://www.w3.org/1999/02/22-rdf-syntax-ns#"
   xmlns:svg="http://www.w3.org/2000/svg"
   xmlns="http://www.w3.org/2000/svg"
   xmlns:sodipodi="http://sodipodi.sourceforge.net/DTD/sodipodi-0.dtd"
   xmlns:inkscape="http://www.inkscape.org/namespaces/inkscape"
   data-dec="36"
   width="22"
   height="40"
   version="1.1"
   id="svg4"
   sodipodi:docname="36.svg"
   inkscape:version="0.92.4 (unknown)">
  <metadata
     id="metadata10">
    <rdf:RDF>
      <cc:Work
         rdf:about="">
        <dc:format>image/svg+xml</dc:format>
        <dc:type
           rdf:resource="http://purl.org/dc/dcmitype/StillImage" />
      </cc:Work>
    </rdf:RDF>
  </metadata>
  <defs
     id="defs8" />
  <sodipodi:namedview
     pagecolor="#ffffff"
     bordercolor="#666666"
     borderopacity="1"
     objecttolerance="10"
     gridtolerance="10"
     guidetolerance="10"
     inkscape:pageopacity="0"
     inkscape:pageshadow="2"
     inkscape:window-width="640"
     inkscape:window-height="480"
     id="namedview6"
     showgrid="false"
     inkscape:zoom="5.9"
     inkscape:cx="11"
     inkscape:cy="20"
     inkscape:window-x="0"
     inkscape:window-y="27"
     inkscape:window-maximized="0"
     inkscape:current-layer="svg4" />
  <path
     style="color:#000000;font-style:normal;font-variant:normal;font-weight:normal;font-stretch:normal;font-size:medium;line-height:normal;font-family:sans-serif;font-variant-ligatures:normal;font-variant-position:normal;font-variant-caps:normal;font-variant-numeric:normal;font-variant-alternates:normal;font-feature-settings:normal;text-indent:0;text-align:start;text-decoration:none;text-decoration-line:none;text-decoration-style:solid;text-decoration-color:#000000;letter-spacing:normal;word-spacing:normal;text-transform:none;writing-mode:lr-tb;direction:ltr;text-orientation:mixed;dominant-baseline:auto;baseline-shift:baseline;text-anchor:start;white-space:normal;shape-padding:0;clip-rule:nonzero;display:inline;overflow:visible;visibility:visible;opacity:1;isolation:auto;mix-blend-mode:normal;color-interpolation:sRGB;color-interpolation-filters:linearRGB;solid-color:#000000;solid-opacity:1;vector-effect:none;fill:#013272;fill-opacity:1;fill-rule:nonzero;stroke:none;stroke-width:0.5;stroke-linecap:round;stroke-linejoin:round;stroke-miterlimit:4;stroke-dasharray:none;stroke-dashoffset:0;stroke-opacity:1;color-rendering:auto;image-rendering:auto;shape-rendering:auto;text-rendering:auto;enable-background:accumulate"
     d="M 12.933594,12.679688 10.431641,21.75 h 0.527343 l 2.90625,-0.96875 0.929688,-0.929688 L 15.75,17.941406 v -2.835937 l -1.902344,-1.904297 z m 0.238281,-0.865235 -0.101563,0.367188 1.054688,0.601562 a 0.250025,0.250025 0 0 1 0.05273,0.03906 l 0.908204,0.908203 -0.291016,-0.582031 -0.947266,-0.947266 z M 8.6132812,10.210938 5.5664062,21.257812 7.0410156,21.75 H 9.9140625 L 12.486328,12.423828 Z M 8.8515625,9.3476562 8.7519531,9.7128906 12.625,11.925781 12.724609,11.560547 Z M 5.9140625,7.2695312 6.2050781,7.8515625 7.1523438,8.7988281 8.3046875,9.4570312 8.40625,9.0917969 6.875,8.2167969 A 0.250025,0.250025 0 0 1 6.8222656,8.1777344 Z M 11.085938,1.25 8.9902344,8.8496094 12.863281,11.0625 15.433594,1.7421875 13.958984,1.25 Z m -1.044922,0 L 7.1347656,2.21875 5.25,4.1035156 V 5.8945312 L 7.1523438,7.7988281 8.5429688,8.59375 10.568359,1.25 Z m 6.96875,-4.5195312 a 0.250025,0.250025 0 0 1 0.230468,0.3359374 l -1.201172,4.3515626 1.039063,0.3457031 a 0.250025,0.250025 0 0 1 0.09961,0.058594 l 1,1 a 0.250025,0.250025 0 0 1 0.04492,0.066406 l 1,2 A 0.250025,0.250025 0 0 1 19.25,5 v 1 a 0.250025,0.250025 0 0 1 -0.07227,0.1777344 l -1,1 a 0.250025,0.250025 0 0 1 -0.355468,0 l -1,-1 a 0.250025,0.250025 0 0 1 0,-0.3554688 l 1,-1 a 0.25135412,0.25135412 0 1 1 0.355468,0.3554688 L 17.355469,6 18,6.6445312 18.75,5.8964844 V 5.0585938 L 17.794922,3.1484375 16.865234,2.21875 15.90625,1.8984375 13.308594,11.316406 14.125,11.783203 a 0.250025,0.250025 0 0 1 0.05273,0.03906 l 1,1 a 0.250025,0.250025 0 0 1 0.04492,0.06641 l 0.982422,1.966797 a 0.250025,0.250025 0 0 1 0.0039,0.0078 0.250025,0.250025 0 0 1 0.02148,0.03906 0.250025,0.250025 0 0 1 0.0078,0.01953 0.250025,0.250025 0 0 1 0,0.0039 A 0.250025,0.250025 0 0 1 16.25,15.03125 V 18 a 0.250025,0.250025 0 0 1 -0.02734,0.111328 l -1,2 a 0.250025,0.250025 0 0 1 -0.04492,0.06641 l -1,1 a 0.250025,0.250025 0 0 1 -0.09961,0.05859 l -3,1 A 0.250025,0.250025 0 0 1 11,22.25 H 10.292969 L 9.2402344,26.066406 A 0.250025,0.250025 0 1 1 8.7597656,25.933594 L 9.7753906,22.25 H 7 A 0.250025,0.250025 0 0 1 6.921875,22.236328 L 5.4335938,21.740234 4.2402344,26.066406 A 0.250025,0.250025 0 1 1 3.7597656,25.933594 L 4.9609375,21.582031 3.921875,21.236328 a 0.250025,0.250025 0 0 1 -0.099609,-0.05859 l -1,-1 a 0.250025,0.250025 0 0 1 -0.044922,-0.06641 l -1,-2 A 0.250025,0.250025 0 0 1 1.75,18 v -1 a 0.250025,0.250025 0 0 1 0.072266,-0.177734 l 1,-1 a 0.250025,0.250025 0 0 1 0.3554688,0 l 1,1 a 0.250025,0.250025 0 0 1 0,0.355468 l -1,1 A 0.25135412,0.25135412 0 1 1 2.8222656,17.822266 L 3.6445312,17 3,16.355469 2.25,17.103516 v 0.83789 L 3.2050781,19.851562 4.1347656,20.78125 5.09375,21.101562 8.1679688,9.9550781 6.875,9.2167969 a 0.250025,0.250025 0 0 1 -0.052734,-0.039063 l -1,-1 A 0.250025,0.250025 0 0 1 5.7773438,8.1113281 L 4.7949219,6.1445312 a 0.250025,0.250025 0 0 1 -0.00391,-0.00781 0.250025,0.250025 0 0 1 -0.021484,-0.039063 0.250025,0.250025 0 0 1 -0.00781,-0.019531 0.250025,0.250025 0 0 1 0,-0.00391 A 0.250025,0.250025 0 0 1 4.75,5.96875 V 4 a 0.250025,0.250025 0 0 1 0.072266,-0.1777344 l 2,-2 a 0.250025,0.250025 0 0 1 0.099609,-0.058594 l 3,-1.00000002 A 0.250025,0.250025 0 0 1 10,0.75 h 0.707031 l 1.052735,-3.8164062 a 0.250025,0.250025 0 0 1 0.230468,-0.1875 0.250025,0.250025 0 0 1 0.25,0.3203124 L 11.224609,0.75 H 14 a 0.250025,0.250025 0 0 1 0.07813,0.0136719 l 1.488281,0.49609372 1.19336,-4.3261718 a 0.250025,0.250025 0 0 1 0.25,-0.203125 z"
     id="path2" />
</svg>
