<?xml version="1.0" encoding="UTF-8" standalone="no"?>
<svg
   xmlns:dc="http://purl.org/dc/elements/1.1/"
   xmlns:cc="http://creativecommons.org/ns#"
   xmlns:rdf="http://www.w3.org/1999/02/22-rdf-syntax-ns#"
   xmlns:svg="http://www.w3.org/2000/svg"
   xmlns="http://www.w3.org/2000/svg"
   xmlns:sodipodi="http://sodipodi.sourceforge.net/DTD/sodipodi-0.dtd"
   xmlns:inkscape="http://www.inkscape.org/namespaces/inkscape"
   data-dec="117"
   width="24"
   height="40"
   version="1.1"
   id="svg4"
   sodipodi:docname="117.svg"
   inkscape:version="0.92.4 (unknown)">
  <metadata
     id="metadata10">
    <rdf:RDF>
      <cc:Work
         rdf:about="">
        <dc:format>image/svg+xml</dc:format>
        <dc:type
           rdf:resource="http://purl.org/dc/dcmitype/StillImage" />
      </cc:Work>
    </rdf:RDF>
  </metadata>
  <defs
     id="defs8" />
  <sodipodi:namedview
     pagecolor="#ffffff"
     bordercolor="#666666"
     borderopacity="1"
     objecttolerance="10"
     gridtolerance="10"
     guidetolerance="10"
     inkscape:pageopacity="0"
     inkscape:pageshadow="2"
     inkscape:window-width="640"
     inkscape:window-height="480"
     id="namedview6"
     showgrid="false"
     inkscape:zoom="5.9"
     inkscape:cx="12"
     inkscape:cy="20"
     inkscape:window-x="0"
     inkscape:window-y="27"
     inkscape:window-maximized="0"
     inkscape:current-layer="svg4" />
  <path
     style="color:#000000;font-style:normal;font-variant:normal;font-weight:normal;font-stretch:normal;font-size:medium;line-height:normal;font-family:sans-serif;font-variant-ligatures:normal;font-variant-position:normal;font-variant-caps:normal;font-variant-numeric:normal;font-variant-alternates:normal;font-feature-settings:normal;text-indent:0;text-align:start;text-decoration:none;text-decoration-line:none;text-decoration-style:solid;text-decoration-color:#000000;letter-spacing:normal;word-spacing:normal;text-transform:none;writing-mode:lr-tb;direction:ltr;text-orientation:mixed;dominant-baseline:auto;baseline-shift:baseline;text-anchor:start;white-space:normal;shape-padding:0;clip-rule:nonzero;display:inline;overflow:visible;visibility:visible;opacity:1;isolation:auto;mix-blend-mode:normal;color-interpolation:sRGB;color-interpolation-filters:linearRGB;solid-color:#000000;solid-opacity:1;vector-effect:none;fill:#013272;fill-opacity:1;fill-rule:nonzero;stroke:none;stroke-width:2;stroke-linecap:round;stroke-linejoin:round;stroke-miterlimit:4;stroke-dasharray:none;stroke-dashoffset:0;stroke-opacity:1;color-rendering:auto;image-rendering:auto;shape-rendering:auto;text-rendering:auto;enable-background:accumulate"
     d="M 4.984375,6.9863281 A 1.0001,1.0001 0 0 1 5.1679688,7 H 7 a 1.0001,1.0001 0 0 1 1,1 v 9.837891 L 8.875,20.458984 9.4140625,21 H 11.763672 L 13.408203,20.177734 14.177734,19.408203 15,17.763672 V 9 h -2 a 1.0001,1.0001 0 1 1 0,-2 h 2.841797 a 1.0001,1.0001 0 0 1 0.326172,0 H 18 a 1.0001,1.0001 0 0 1 1,1 V 19.763672 L 19.412109,20.587891 20.236328,21 H 21 a 1.0001,1.0001 0 1 1 0,2 h -0.890625 a 1.0001,1.0001 0 0 1 -0.203125,0 h -0.75 a 1.0001,1.0001 0 0 1 -0.304688,0 h -0.693359 a 1.0001,1.0001 0 0 1 -0.326172,0 H 16 a 1.0001,1.0001 0 0 1 -1,-1 v -0.585938 l -0.292969,0.292969 a 1.0001,1.0001 0 0 1 -0.259765,0.1875 l -2,1 A 1.0001,1.0001 0 0 1 12,23 H 9.1464844 A 1.0001,1.0001 0 0 1 8.4882812,22.863281 l -1.9355468,-0.96875 a 1.0001,1.0001 0 0 1 -0.2597656,-0.1875 l -1,-1 A 1.0001,1.0001 0 0 1 5.0507812,20.316406 l -1,-3 A 1.0001,1.0001 0 0 1 4,17 V 10.236328 L 3.5878906,9.4121094 2.7636719,9 H 2 A 1.0001,1.0001 0 1 1 2,7 H 2.890625 A 1.0001,1.0001 0 0 1 3.09375,7 h 0.75 A 1.0001,1.0001 0 0 1 4.1484375,7 H 4.8417969 A 1.0001,1.0001 0 0 1 4.984375,6.9863281 Z"
     id="path2" />
</svg>
