<?xml version="1.0" encoding="UTF-8" standalone="no"?>
<svg
   xmlns:dc="http://purl.org/dc/elements/1.1/"
   xmlns:cc="http://creativecommons.org/ns#"
   xmlns:rdf="http://www.w3.org/1999/02/22-rdf-syntax-ns#"
   xmlns:svg="http://www.w3.org/2000/svg"
   xmlns="http://www.w3.org/2000/svg"
   xmlns:sodipodi="http://sodipodi.sourceforge.net/DTD/sodipodi-0.dtd"
   xmlns:inkscape="http://www.inkscape.org/namespaces/inkscape"
   data-dec="112"
   width="20"
   height="40"
   version="1.1"
   id="svg4"
   sodipodi:docname="112.svg"
   inkscape:version="0.92.4 (unknown)">
  <metadata
     id="metadata10">
    <rdf:RDF>
      <cc:Work
         rdf:about="">
        <dc:format>image/svg+xml</dc:format>
        <dc:type
           rdf:resource="http://purl.org/dc/dcmitype/StillImage" />
      </cc:Work>
    </rdf:RDF>
  </metadata>
  <defs
     id="defs8" />
  <sodipodi:namedview
     pagecolor="#ffffff"
     bordercolor="#666666"
     borderopacity="1"
     objecttolerance="10"
     gridtolerance="10"
     guidetolerance="10"
     inkscape:pageopacity="0"
     inkscape:pageshadow="2"
     inkscape:window-width="640"
     inkscape:window-height="480"
     id="namedview6"
     showgrid="false"
     inkscape:zoom="5.9"
     inkscape:cx="10"
     inkscape:cy="20"
     inkscape:window-x="0"
     inkscape:window-y="27"
     inkscape:window-maximized="0"
     inkscape:current-layer="svg4" />
  <path
     style="color:#000000;font-style:normal;font-variant:normal;font-weight:normal;font-stretch:normal;font-size:medium;line-height:normal;font-family:sans-serif;font-variant-ligatures:normal;font-variant-position:normal;font-variant-caps:normal;font-variant-numeric:normal;font-variant-alternates:normal;font-feature-settings:normal;text-indent:0;text-align:start;text-decoration:none;text-decoration-line:none;text-decoration-style:solid;text-decoration-color:#000000;letter-spacing:normal;word-spacing:normal;text-transform:none;writing-mode:lr-tb;direction:ltr;text-orientation:mixed;dominant-baseline:auto;baseline-shift:baseline;text-anchor:start;white-space:normal;shape-padding:0;clip-rule:nonzero;display:inline;overflow:visible;visibility:visible;opacity:1;isolation:auto;mix-blend-mode:normal;color-interpolation:sRGB;color-interpolation-filters:linearRGB;solid-color:#000000;solid-opacity:1;vector-effect:none;fill:#013272;fill-opacity:1;fill-rule:nonzero;stroke:none;stroke-width:1.5;stroke-linecap:round;stroke-linejoin:round;stroke-miterlimit:4;stroke-dasharray:none;stroke-dashoffset:0;stroke-opacity:1;color-rendering:auto;image-rendering:auto;shape-rendering:auto;text-rendering:auto;enable-background:accumulate"
     d="M 12.177734,8.75 10.513672,9.5820312 8.6796875,12.332031 7.75,15.119141 v 2.759765 L 8.6132812,20.46875 10.177734,21.25 h 1.646485 l 1.662109,-0.832031 1.833984,-2.75 L 16.25,14.878906 V 11.177734 L 15.441406,9.5605469 13.822266,8.75 Z M 5.9921875,7.2421875 A 0.750075,0.750075 0 0 1 6.0917969,7.25 H 7 a 0.750075,0.750075 0 0 1 0.53125,0.21875 l 1,1 A 0.750075,0.750075 0 0 1 8.75,9 v 0.5214844 l 0.625,-0.9375 A 0.750075,0.750075 0 0 1 9.6640625,8.3300781 l 1.9999995,-1 A 0.750075,0.750075 0 0 1 12,7.25 h 2 a 0.750075,0.750075 0 0 1 0.335938,0.080078 l 1.896484,0.9492188 a 0.750075,0.750075 0 0 1 0.0098,0.00391 0.750075,0.750075 0 0 1 0.289062,0.1855469 0.750075,0.750075 0 0 1 0.01367,0.011719 l 0.0098,0.011719 0.976562,0.9765625 a 0.750075,0.750075 0 0 1 0.138672,0.1953125 l 1,1.9999995 A 0.750075,0.750075 0 0 1 18.75,12 v 3 a 0.750075,0.750075 0 0 1 -0.03906,0.236328 l -1,3 A 0.750075,0.750075 0 0 1 17.625,18.416016 l -2,3 a 0.750075,0.750075 0 0 1 -0.388672,0.294922 l -2.949219,0.982421 a 0.750075,0.750075 0 0 1 -0.01758,0.0059 l -0.0332,0.01172 a 0.750075,0.750075 0 0 1 -0.01563,0.0059 0.750075,0.750075 0 0 1 -0.310547,0.0332 H 10 a 0.750075,0.750075 0 0 1 -0.3359375,-0.08008 l -2,-1 a 0.750075,0.750075 0 0 1 -0.375,-0.433594 L 6.59375,19.150391 3.9941406,28.25 H 6 a 0.750075,0.750075 0 1 1 0,1.5 H 3.1210938 A 0.750075,0.750075 0 0 1 2.875,29.75 H 2.1210938 A 0.750075,0.750075 0 0 1 1.875,29.75 H -1 a 0.750075,0.750075 0 1 1 0,-1.5 H 1.4355469 L 5.2753906,14.806641 6.25,10.908203 V 9.3105469 L 5.6875,8.75 H 4.3105469 L 2.6171875,10.443359 1.6699219,12.335938 A 0.750075,0.750075 0 1 1 0.33007812,11.664062 L 1.3300781,9.6640625 A 0.750075,0.750075 0 0 1 1.46875,9.46875 l 2,-2 A 0.750075,0.750075 0 0 1 4,7.25 h 1.8925781 a 0.750075,0.750075 0 0 1 0.099609,-0.00781 z"
     id="path2" />
</svg>
