<?xml version="1.0" encoding="UTF-8"?>
<glyph name="u" format="1">
  <advance width="635"/>
  <unicode hex="0075"/>
  <outline>
    <contour>
      <point x="471" y="406" type="line"/>
      <point x="471" y="96" type="line"/>
      <point x="471" y="95" type="line"/>
      <point x="471" y="94" type="line"/>
      <point x="471" y="14" type="line"/>
      <point x="485" y="14" type="line"/>
      <point x="485" y="406" type="line"/>
    </contour>
    <contour>
      <point x="152" y="406" type="line"/>
      <point x="152" y="96" type="line"/>
      <point x="179" y="43" type="line"/>
      <point x="195" y="37" type="line"/>
      <point x="167" y="91" type="line" smooth="yes"/>
      <point x="167" y="92"/>
      <point x="166" y="94"/>
      <point x="166" y="95" type="curve" smooth="yes"/>
      <point x="166" y="406" type="line"/>
    </contour>
    <contour>
      <point x="144" y="420" type="line"/>
      <point x="145" y="420" type="line"/>
      <point x="146" y="420" type="line"/>
      <point x="173" y="420" type="line"/>
      <point x="174" y="420" type="line" smooth="yes"/>
      <point x="175" y="420"/>
      <point x="177" y="420"/>
      <point x="178" y="419" type="curve" smooth="yes"/>
      <point x="179" y="418" type="line"/>
      <point x="179" y="417" type="line"/>
      <point x="180" y="417" type="line" smooth="yes"/>
      <point x="180" y="416"/>
      <point x="182" y="413"/>
      <point x="182" y="412" type="curve" smooth="yes"/>
      <point x="180" y="411" type="line"/>
      <point x="180" y="96" type="line"/>
      <point x="208" y="42" type="line"/>
      <point x="262" y="14" type="line"/>
      <point x="317" y="14" type="line"/>
      <point x="402" y="43" type="line"/>
      <point x="455" y="98" type="line"/>
      <point x="455" y="406" type="line"/>
      <point x="376" y="406" type="line" smooth="yes"/>
      <point x="372" y="406"/>
      <point x="368" y="408"/>
      <point x="368" y="412" type="curve" smooth="yes"/>
      <point x="368" y="416"/>
      <point x="372" y="420"/>
      <point x="376" y="420" type="curve" smooth="yes"/>
      <point x="462" y="420" type="line"/>
      <point x="463" y="420" type="line"/>
      <point x="464" y="420" type="line"/>
      <point x="491" y="420" type="line"/>
      <point x="492" y="420" type="line" smooth="yes"/>
      <point x="493" y="420"/>
      <point x="495" y="420"/>
      <point x="496" y="419" type="curve" smooth="yes"/>
      <point x="497" y="419" type="line"/>
      <point x="497" y="418" type="line"/>
      <point x="498" y="417" type="line" smooth="yes"/>
      <point x="498" y="416"/>
      <point x="499" y="413"/>
      <point x="499" y="412" type="curve" smooth="yes"/>
      <point x="499" y="411" type="line"/>
      <point x="499" y="14" type="line"/>
      <point x="579" y="14" type="line" smooth="yes"/>
      <point x="583" y="14"/>
      <point x="586" y="12"/>
      <point x="586" y="8" type="curve" smooth="yes"/>
      <point x="586" y="4"/>
      <point x="583" y="0"/>
      <point x="579" y="0" type="curve" smooth="yes"/>
      <point x="493" y="0" type="line"/>
      <point x="492" y="0" type="line"/>
      <point x="491" y="0" type="line"/>
      <point x="464" y="0" type="line"/>
      <point x="463" y="0" type="line" smooth="yes"/>
      <point x="462" y="0"/>
      <point x="460" y="1"/>
      <point x="459" y="2" type="curve" smooth="yes"/>
      <point x="458" y="2" type="line"/>
      <point x="458" y="3" type="line"/>
      <point x="456" y="3" type="line"/>
      <point x="456" y="4" type="line" smooth="yes"/>
      <point x="456" y="5"/>
      <point x="455" y="7"/>
      <point x="455" y="8" type="curve" smooth="yes"/>
      <point x="455" y="9" type="line"/>
      <point x="455" y="77" type="line"/>
      <point x="410" y="32" type="line" smooth="yes"/>
      <point x="409" y="31"/>
      <point x="408" y="30"/>
      <point x="407" y="30" type="curve" smooth="yes"/>
      <point x="321" y="1" type="line" smooth="yes"/>
      <point x="320" y="1"/>
      <point x="319" y="0"/>
      <point x="318" y="0" type="curve" smooth="yes"/>
      <point x="262" y="0" type="line"/>
      <point x="261" y="0" type="line"/>
      <point x="260" y="0" type="line"/>
      <point x="258" y="0" type="line"/>
      <point x="258" y="1" type="line"/>
      <point x="257" y="1" type="line"/>
      <point x="172" y="30" type="line" smooth="yes"/>
      <point x="171" y="30"/>
      <point x="168" y="32"/>
      <point x="167" y="33" type="curve" smooth="yes"/>
      <point x="139" y="91" type="line" smooth="yes"/>
      <point x="139" y="92"/>
      <point x="138" y="94"/>
      <point x="138" y="95" type="curve" smooth="yes"/>
      <point x="138" y="406" type="line"/>
      <point x="58" y="406" type="line" smooth="yes"/>
      <point x="54" y="406"/>
      <point x="51" y="408"/>
      <point x="51" y="412" type="curve" smooth="yes"/>
      <point x="51" y="416"/>
      <point x="54" y="420"/>
      <point x="58" y="420" type="curve" smooth="yes"/>
      <point x="143" y="420" type="line"/>
    </contour>
  </outline>
  <lib>
    <dict>
      <key>com.fontlab.hintData</key>
      <dict>
        <key>hhints</key>
        <array>
          <dict>
            <key>position</key>
            <integer>0</integer>
            <key>width</key>
            <integer>14</integer>
          </dict>
          <dict>
            <key>position</key>
            <integer>406</integer>
            <key>width</key>
            <integer>14</integer>
          </dict>
        </array>
        <key>vhints</key>
        <array>
          <dict>
            <key>position</key>
            <integer>138</integer>
            <key>width</key>
            <integer>14</integer>
          </dict>
          <dict>
            <key>position</key>
            <integer>166</integer>
            <key>width</key>
            <integer>14</integer>
          </dict>
          <dict>
            <key>position</key>
            <integer>455</integer>
            <key>width</key>
            <integer>15</integer>
          </dict>
          <dict>
            <key>position</key>
            <integer>485</integer>
            <key>width</key>
            <integer>14</integer>
          </dict>
        </array>
      </dict>
    </dict>
  </lib>
</glyph>
