<?xml version="1.0" encoding="UTF-8" standalone="no"?>
<svg
   xmlns:dc="http://purl.org/dc/elements/1.1/"
   xmlns:cc="http://creativecommons.org/ns#"
   xmlns:rdf="http://www.w3.org/1999/02/22-rdf-syntax-ns#"
   xmlns:svg="http://www.w3.org/2000/svg"
   xmlns="http://www.w3.org/2000/svg"
   xmlns:sodipodi="http://sodipodi.sourceforge.net/DTD/sodipodi-0.dtd"
   xmlns:inkscape="http://www.inkscape.org/namespaces/inkscape"
   data-dec="86"
   width="20"
   height="40"
   version="1.1"
   id="svg4"
   sodipodi:docname="86.svg"
   inkscape:version="0.92.4 (unknown)">
  <metadata
     id="metadata10">
    <rdf:RDF>
      <cc:Work
         rdf:about="">
        <dc:format>image/svg+xml</dc:format>
        <dc:type
           rdf:resource="http://purl.org/dc/dcmitype/StillImage" />
      </cc:Work>
    </rdf:RDF>
  </metadata>
  <defs
     id="defs8" />
  <sodipodi:namedview
     pagecolor="#ffffff"
     bordercolor="#666666"
     borderopacity="1"
     objecttolerance="10"
     gridtolerance="10"
     guidetolerance="10"
     inkscape:pageopacity="0"
     inkscape:pageshadow="2"
     inkscape:window-width="640"
     inkscape:window-height="480"
     id="namedview6"
     showgrid="false"
     inkscape:zoom="5.9"
     inkscape:cx="10"
     inkscape:cy="20"
     inkscape:window-x="0"
     inkscape:window-y="27"
     inkscape:window-maximized="0"
     inkscape:current-layer="svg4" />
  <path
     style="color:#000000;font-style:normal;font-variant:normal;font-weight:normal;font-stretch:normal;font-size:medium;line-height:normal;font-family:sans-serif;font-variant-ligatures:normal;font-variant-position:normal;font-variant-caps:normal;font-variant-numeric:normal;font-variant-alternates:normal;font-feature-settings:normal;text-indent:0;text-align:start;text-decoration:none;text-decoration-line:none;text-decoration-style:solid;text-decoration-color:#000000;letter-spacing:normal;word-spacing:normal;text-transform:none;writing-mode:lr-tb;direction:ltr;text-orientation:mixed;dominant-baseline:auto;baseline-shift:baseline;text-anchor:start;white-space:normal;shape-padding:0;clip-rule:nonzero;display:inline;overflow:visible;visibility:visible;opacity:1;isolation:auto;mix-blend-mode:normal;color-interpolation:sRGB;color-interpolation-filters:linearRGB;solid-color:#000000;solid-opacity:1;vector-effect:none;fill:#013272;fill-opacity:1;fill-rule:nonzero;stroke:none;stroke-width:0.30000001;stroke-linecap:round;stroke-linejoin:round;stroke-miterlimit:4;stroke-dasharray:none;stroke-dashoffset:0;stroke-opacity:1;color-rendering:auto;image-rendering:auto;shape-rendering:auto;text-rendering:auto;enable-background:accumulate"
     d="M 8.5039062,1.65625 8.1953125,1.7597656 8.2226562,2.21875 Z M 17.636719,1.1503906 19,1.8320312 20.363281,1.1503906 Z m -9.4765628,0 0.017578,0.2988282 0.515625,-0.171875 0.064453,-0.1269532 z m -2.9179687,0 0.6074219,1.2128906 V 1.1503906 Z M 4.9863281,0.84765625 a 0.15001501,0.15001501 0 0 1 0.03125,0.001953 h 0.9648438 a 0.15001501,0.15001501 0 0 1 0.044922,0 h 1.9472656 a 0.15001501,0.15001501 0 0 1 0.044922,0 h 0.9589844 a 0.15001501,0.15001501 0 0 1 0.044922,0 h 0.96875 0.015624 H 11 A 0.15039061,0.15039061 0 1 1 11,1.1503906 H 10.023438 L 8.90625,1.5234375 8.2578125,2.8203125 9.1503906,17.990234 a 0.15070736,0.15070736 0 1 1 -0.3007812,0.01953 L 7.9765625,3.1503906 a 0.15001501,0.15001501 0 0 1 -0.00195,0 0.15001501,0.15001501 0 0 1 -0.109375,-0.2167968 L 7.953125,2.7597656 7.9003906,1.8574219 7.15625,2.1054688 8.1503906,18.990234 a 0.15070736,0.15070736 0 1 1 -0.3007812,0.01953 L 6.8515625,2.0351562 a 0.15001501,0.15001501 0 0 1 -0.00195,-0.013672 0.15001501,0.15001501 0 0 1 0,-0.039062 0.15001501,0.15001501 0 0 1 0.00391,-0.021484 0.15001501,0.15001501 0 0 1 0.00195,-0.00586 0.15001501,0.15001501 0 0 1 0,-0.00391 0.15001501,0.15001501 0 0 1 0.00586,-0.011719 0.15001501,0.15001501 0 0 1 0.00195,-0.00586 0.15001501,0.15001501 0 0 1 0.00195,-0.00391 0.15001501,0.15001501 0 0 1 0.00586,-0.00977 0.15001501,0.15001501 0 0 1 0.00391,-0.00586 0.15001501,0.15001501 0 0 1 0.00391,-0.00586 0.15001501,0.15001501 0 0 1 0.00586,-0.00586 0.15001501,0.15001501 0 0 1 0.00391,-0.00586 0.15001501,0.15001501 0 0 1 0.00391,-0.00195 0.15001501,0.15001501 0 0 1 0.00781,-0.00781 0.15001501,0.15001501 0 0 1 0.00586,-0.00586 0.15001501,0.15001501 0 0 1 0.00586,-0.00391 0.15001501,0.15001501 0 0 1 0.013672,-0.00781 0.15001501,0.15001501 0 0 1 0.00586,-0.00391 0.15001501,0.15001501 0 0 1 0.042969,-0.015625 h 0.00391 L 7.8808594,1.5488281 7.8574219,1.1503906 H 6.1503906 v 1.8359375 0.00977 a 0.15001501,0.15001501 0 0 1 0,0.00391 l 1,16.990234 a 0.15001501,0.15001501 0 0 1 0,0.0098 v 1.457031 L 18.787109,2.0625 16.964844,1.1503906 H 16 a 0.15039061,0.15039061 0 1 1 0,-0.30078122 h 0.980469 0.0293 3.976562 0.0293 H 22 A 0.15039061,0.15039061 0 1 1 22,1.1503906 H 21.035156 L 19.107422,2.1152344 7.1347656,22.068359 l -0.00586,0.0098 a 0.15001501,0.15001501 0 0 1 -0.00195,0.0039 0.15001501,0.15001501 0 0 1 -0.00391,0.0039 0.15001501,0.15001501 0 0 1 -0.019531,0.02344 0.15001501,0.15001501 0 0 1 -0.011719,0.0098 0.15001501,0.15001501 0 0 1 -0.023437,0.01563 0.15001501,0.15001501 0 0 1 -0.029297,0.01172 0.15001501,0.15001501 0 0 1 -0.044922,0.0059 0.15001501,0.15001501 0 0 1 -0.00781,0 0.15001501,0.15001501 0 0 1 -0.00586,-0.002 0.15001501,0.15001501 0 0 1 -0.00781,0 0.15001501,0.15001501 0 0 1 -0.00781,-0.002 0.15001501,0.15001501 0 0 1 -0.021484,-0.0078 0.15001501,0.15001501 0 0 1 -0.00586,-0.002 0.15001501,0.15001501 0 0 1 -0.00391,-0.002 0.15001501,0.15001501 0 0 1 -0.00977,-0.0059 0.15001501,0.15001501 0 0 1 -0.00586,-0.0039 0.15001501,0.15001501 0 0 1 -0.00781,-0.0039 0.15001501,0.15001501 0 0 1 -0.00195,-0.002 0.15001501,0.15001501 0 0 1 -0.00586,-0.0059 0.15001501,0.15001501 0 0 1 -0.00781,-0.0078 0.15001501,0.15001501 0 0 1 -0.00586,-0.0039 0.15001501,0.15001501 0 0 1 -0.00391,-0.0059 0.15001501,0.15001501 0 0 1 -0.00586,-0.0059 0.15001501,0.15001501 0 0 1 -0.00391,-0.0059 0.15001501,0.15001501 0 0 1 -0.00391,-0.0059 0.15001501,0.15001501 0 0 1 -0.00391,-0.0078 0.15001501,0.15001501 0 0 1 -0.00391,-0.0059 0.15001501,0.15001501 0 0 1 -0.00195,-0.0078 0.15001501,0.15001501 0 0 1 -0.00391,-0.0059 0.15001501,0.15001501 0 0 1 -0.00195,-0.0078 0.15001501,0.15001501 0 0 1 -0.00586,-0.0293 0.15001501,0.15001501 0 0 1 0,-0.0078 0.15001501,0.15001501 0 0 1 0,-0.0078 v -0.0059 -1.990235 L 5.8515625,3.0390625 4.90625,1.1503906 H 4 A 0.15039068,0.15039068 0 1 1 4,0.84960938 h 0.9726562 a 0.15001501,0.15001501 0 0 1 0.013672,-0.001953 z"
     id="path2" />
</svg>
