<?xml version="1.0" encoding="UTF-8" standalone="no"?>
<svg
   xmlns:dc="http://purl.org/dc/elements/1.1/"
   xmlns:cc="http://creativecommons.org/ns#"
   xmlns:rdf="http://www.w3.org/1999/02/22-rdf-syntax-ns#"
   xmlns:svg="http://www.w3.org/2000/svg"
   xmlns="http://www.w3.org/2000/svg"
   xmlns:sodipodi="http://sodipodi.sourceforge.net/DTD/sodipodi-0.dtd"
   xmlns:inkscape="http://www.inkscape.org/namespaces/inkscape"
   data-dec="94"
   width="22"
   height="40"
   version="1.1"
   id="svg4"
   sodipodi:docname="94.svg"
   inkscape:version="0.92.4 (unknown)">
  <metadata
     id="metadata10">
    <rdf:RDF>
      <cc:Work
         rdf:about="">
        <dc:format>image/svg+xml</dc:format>
        <dc:type
           rdf:resource="http://purl.org/dc/dcmitype/StillImage" />
      </cc:Work>
    </rdf:RDF>
  </metadata>
  <defs
     id="defs8" />
  <sodipodi:namedview
     pagecolor="#ffffff"
     bordercolor="#666666"
     borderopacity="1"
     objecttolerance="10"
     gridtolerance="10"
     guidetolerance="10"
     inkscape:pageopacity="0"
     inkscape:pageshadow="2"
     inkscape:window-width="615"
     inkscape:window-height="417"
     id="namedview6"
     showgrid="false"
     inkscape:zoom="5.9"
     inkscape:cx="11"
     inkscape:cy="20"
     inkscape:window-x="0"
     inkscape:window-y="27"
     inkscape:window-maximized="0"
     inkscape:current-layer="svg4" />
  <path
     style="color:#000000;font-style:normal;font-variant:normal;font-weight:normal;font-stretch:normal;font-size:medium;line-height:normal;font-family:sans-serif;font-variant-ligatures:normal;font-variant-position:normal;font-variant-caps:normal;font-variant-numeric:normal;font-variant-alternates:normal;font-feature-settings:normal;text-indent:0;text-align:start;text-decoration:none;text-decoration-line:none;text-decoration-style:solid;text-decoration-color:#000000;letter-spacing:normal;word-spacing:normal;text-transform:none;writing-mode:lr-tb;direction:ltr;text-orientation:mixed;dominant-baseline:auto;baseline-shift:baseline;text-anchor:start;white-space:normal;shape-padding:0;clip-rule:nonzero;display:inline;overflow:visible;visibility:visible;opacity:1;isolation:auto;mix-blend-mode:normal;color-interpolation:sRGB;color-interpolation-filters:linearRGB;solid-color:#000000;solid-opacity:1;vector-effect:none;fill:#013272;fill-opacity:1;fill-rule:nonzero;stroke:none;stroke-width:1.5;stroke-linecap:round;stroke-linejoin:round;stroke-miterlimit:4;stroke-dasharray:none;stroke-dashoffset:0;stroke-opacity:1;color-rendering:auto;image-rendering:auto;shape-rendering:auto;text-rendering:auto;enable-background:accumulate"
     d="m 10.96875,9.25 a 0.750075,0.750075 0 0 1 0.429688,0.1132812 l 7.982421,4.9902348 0.01758,0.0098 a 0.750075,0.750075 0 0 1 0.03125,0.02149 0.750075,0.750075 0 0 1 0.01172,0.0078 0.750075,0.750075 0 0 1 0.0039,0.002 0.750075,0.750075 0 0 1 0.05469,0.04492 0.750075,0.750075 0 0 1 0.0039,0.002 0.750075,0.750075 0 0 1 0.05078,0.04883 0.750075,0.750075 0 0 1 0.002,0.002 0.750075,0.750075 0 0 1 0.04687,0.05469 0.750075,0.750075 0 0 1 0.02539,0.03711 0.750075,0.750075 0 0 1 0.01758,0.02539 0.750075,0.750075 0 0 1 0.002,0.002 0.750075,0.750075 0 0 1 0.0332,0.06445 0.750075,0.750075 0 0 1 0.002,0.002 0.750075,0.750075 0 0 1 0.0293,0.06641 0.750075,0.750075 0 0 1 0.0098,0.0332 0.750075,0.750075 0 0 1 0.01172,0.03711 0.750075,0.750075 0 0 1 0.002,0.0039 0.750075,0.750075 0 0 1 0.01367,0.07031 0.750075,0.750075 0 0 1 0.0059,0.0625 0.750075,0.750075 0 0 1 0.002,0.01172 0.750075,0.750075 0 0 1 0,0.0039 0.750075,0.750075 0 0 1 0,0.07226 0.750075,0.750075 0 0 1 0,0.002 0.750075,0.750075 0 0 1 -0.0059,0.07226 0.750075,0.750075 0 0 1 0,0.002 0.750075,0.750075 0 0 1 -0.01563,0.07031 0.750075,0.750075 0 0 1 0,0.0039 0.750075,0.750075 0 0 1 -0.02148,0.06836 0.750075,0.750075 0 0 1 -0.0293,0.07031 0.750075,0.750075 0 0 1 0,0.002 0.750075,0.750075 0 0 1 -0.06836,0.115234 0.750075,0.750075 0 0 1 -0.0078,0.0098 0.750075,0.750075 0 0 1 -0.002,0.002 0.750075,0.750075 0 0 1 -0.04687,0.05664 0.750075,0.750075 0 0 1 -0.002,0.002 0.750075,0.750075 0 0 1 -0.05078,0.05078 0.750075,0.750075 0 0 1 -0.002,0.002 0.750075,0.750075 0 0 1 -0.01172,0.0098 0.750075,0.750075 0 0 1 -0.04687,0.03516 0.750075,0.750075 0 0 1 -0.126954,0.07422 0.750075,0.750075 0 0 1 -0.0039,0.002 0.750075,0.750075 0 0 1 -0.01172,0.0039 0.750075,0.750075 0 0 1 -0.05859,0.02344 0.750075,0.750075 0 0 1 -0.144532,0.0332 0.750075,0.750075 0 0 1 -0.224609,-0.0078 0.750075,0.750075 0 0 1 -0.07227,-0.01563 0.750075,0.750075 0 0 1 -0.169922,-0.07031 L 11,11.837891 l -7.6484375,3.824218 -0.015625,0.0078 a 0.750075,0.750075 0 0 1 -0.048828,0.02344 0.750075,0.750075 0 0 1 -0.00195,0.002 0.750075,0.750075 0 0 1 -0.066406,0.02344 0.750075,0.750075 0 0 1 -0.00391,0.002 0.750075,0.750075 0 0 1 -0.2929688,0.03125 0.750075,0.750075 0 0 1 -0.00391,0 0.750075,0.750075 0 0 1 -0.070313,-0.01172 0.750075,0.750075 0 0 1 -0.00391,0 0.750075,0.750075 0 0 1 -0.068359,-0.01758 0.750075,0.750075 0 0 1 -0.072266,-0.02539 0.750075,0.750075 0 0 1 -0.00195,0 0.750075,0.750075 0 0 1 -0.060547,-0.0293 0.750075,0.750075 0 0 1 -0.00391,-0.002 0.750075,0.750075 0 0 1 -0.064453,-0.03906 0.750075,0.750075 0 0 1 -0.00391,-0.002 0.750075,0.750075 0 0 1 -0.039063,-0.0293 0.750075,0.750075 0 0 1 -0.019531,-0.01563 0.750075,0.750075 0 0 1 -0.052734,-0.04883 0.750075,0.750075 0 0 1 -0.00195,-0.002 0.750075,0.750075 0 0 1 -0.00391,-0.0039 0.750075,0.750075 0 0 1 -0.046875,-0.05274 0.750075,0.750075 0 0 1 -0.041016,-0.05859 0.750075,0.750075 0 0 1 -0.00195,-0.002 0.750075,0.750075 0 0 1 -0.013672,-0.02539 0.750075,0.750075 0 0 1 -0.023437,-0.03906 0.750075,0.750075 0 0 1 -0.03125,-0.06641 0.750075,0.750075 0 0 1 0,-0.002 0.750075,0.750075 0 0 1 -0.023438,-0.06836 0.750075,0.750075 0 0 1 0,-0.002 0.750075,0.750075 0 0 1 -0.017578,-0.07031 0.750075,0.750075 0 0 1 0,-0.0039 0.750075,0.750075 0 0 1 -0.00977,-0.07031 0.750075,0.750075 0 0 1 0,-0.0039 0.750075,0.750075 0 0 1 0.00391,-0.146485 0.750075,0.750075 0 0 1 0,-0.0039 0.750075,0.750075 0 0 1 0.00391,-0.01953 0.750075,0.750075 0 0 1 0.03125,-0.125 0.750075,0.750075 0 0 1 0.025391,-0.06836 0.750075,0.750075 0 0 1 0.00195,-0.002 0.750075,0.750075 0 0 1 0.03125,-0.06445 0.750075,0.750075 0 0 1 0.00195,-0.002 0.750075,0.750075 0 0 1 0.039063,-0.06055 0.750075,0.750075 0 0 1 0.00195,-0.002 0.750075,0.750075 0 0 1 0.044922,-0.05664 0.750075,0.750075 0 0 1 0.00195,-0.002 0.750075,0.750075 0 0 1 0.064453,-0.06445 0.750075,0.750075 0 0 1 0.046875,-0.03711 0.750075,0.750075 0 0 1 0.058594,-0.04102 0.750075,0.750075 0 0 1 0.00195,-0.002 L 10.601562,9.3632812 A 0.750075,0.750075 0 0 1 10.96875,9.25 Z"
     id="path2" />
</svg>
