<?xml version="1.0" encoding="UTF-8" standalone="no"?>
<svg
   xmlns:dc="http://purl.org/dc/elements/1.1/"
   xmlns:cc="http://creativecommons.org/ns#"
   xmlns:rdf="http://www.w3.org/1999/02/22-rdf-syntax-ns#"
   xmlns:svg="http://www.w3.org/2000/svg"
   xmlns="http://www.w3.org/2000/svg"
   xmlns:sodipodi="http://sodipodi.sourceforge.net/DTD/sodipodi-0.dtd"
   xmlns:inkscape="http://www.inkscape.org/namespaces/inkscape"
   data-dec="80"
   width="12"
   height="40"
   version="1.1"
   id="svg4"
   sodipodi:docname="80.svg"
   inkscape:version="0.92.4 5da689c313, 2019-01-14">
  <metadata
     id="metadata10">
    <rdf:RDF>
      <cc:Work
         rdf:about="">
        <dc:format>image/svg+xml</dc:format>
        <dc:type
           rdf:resource="http://purl.org/dc/dcmitype/StillImage" />
        <dc:title></dc:title>
      </cc:Work>
    </rdf:RDF>
  </metadata>
  <defs
     id="defs8" />
  <sodipodi:namedview
     pagecolor="#ffffff"
     bordercolor="#666666"
     borderopacity="1"
     objecttolerance="10"
     gridtolerance="10"
     guidetolerance="10"
     inkscape:pageopacity="0"
     inkscape:pageshadow="2"
     inkscape:window-width="1920"
     inkscape:window-height="1043"
     id="namedview6"
     showgrid="false"
     inkscape:zoom="5.9"
     inkscape:cx="6"
     inkscape:cy="20"
     inkscape:window-x="0"
     inkscape:window-y="37"
     inkscape:window-maximized="0"
     inkscape:current-layer="svg4" />
  <path
     style="color:#000000;font-style:normal;font-variant:normal;font-weight:normal;font-stretch:normal;font-size:medium;line-height:normal;font-family:sans-serif;font-variant-ligatures:normal;font-variant-position:normal;font-variant-caps:normal;font-variant-numeric:normal;font-variant-alternates:normal;font-feature-settings:normal;text-indent:0;text-align:start;text-decoration:none;text-decoration-line:none;text-decoration-style:solid;text-decoration-color:#000000;letter-spacing:normal;word-spacing:normal;text-transform:none;writing-mode:lr-tb;direction:ltr;text-orientation:mixed;dominant-baseline:auto;baseline-shift:baseline;text-anchor:start;white-space:normal;shape-padding:0;clip-rule:nonzero;display:inline;overflow:visible;visibility:visible;opacity:1;isolation:auto;mix-blend-mode:normal;color-interpolation:sRGB;color-interpolation-filters:linearRGB;solid-color:#000000;solid-opacity:1;vector-effect:none;fill:#000000;fill-opacity:1;fill-rule:nonzero;stroke:none;stroke-width:1.5;stroke-linecap:round;stroke-linejoin:round;stroke-miterlimit:4;stroke-dasharray:none;stroke-dashoffset:0;stroke-opacity:1;color-rendering:auto;image-rendering:auto;shape-rendering:auto;text-rendering:auto;enable-background:accumulate"
     d="m 3.75,1.75 v 9.5 H 7.0058594 L 8.4609375,10.441406 8.9082031,9.6953125 9.4492188,7.890625 V 5.109375 L 8.9082031,3.3046875 8.4609375,2.5585938 7.0058594,1.75 Z M 2.9882812,0.24023438 A 0.750075,0.750075 0 0 1 3.1230469,0.25 h 4.0761719 a 0.750075,0.750075 0 0 1 0.3652343,0.09375 l 1.7988281,1 a 0.750075,0.750075 0 0 1 0.2792969,0.2695312 l 0.5996099,1 a 0.750075,0.750075 0 0 1 0.07617,0.171875 l 0.59961,2 A 0.750075,0.750075 0 0 1 10.949219,5 v 3 a 0.750075,0.750075 0 0 1 -0.03125,0.2148438 l -0.59961,2.0000002 a 0.750075,0.750075 0 0 1 -0.07617,0.171875 l -0.5996099,1 A 0.750075,0.750075 0 0 1 9.3632812,11.65625 l -1.7988281,1 A 0.750075,0.750075 0 0 1 7.1992188,12.75 H 3.75 v 8.5 h 1.0507812 a 0.750075,0.750075 0 1 1 0,1.5 H 3.1230469 a 0.750075,0.750075 0 0 1 -0.2460938,0 H 1.1992188 a 0.750075,0.750075 0 1 1 0,-1.5 H 2.25 v -9.126953 a 0.750075,0.750075 0 0 1 0,-0.246094 V 1.75 H 1.1992188 a 0.750075,0.750075 0 1 1 0,-1.5 h 1.6777343 a 0.750075,0.750075 0 0 1 0.1113281,-0.009766 z"
     id="path2" />
</svg>
