<?xml version="1.0" encoding="UTF-8" standalone="no"?>
<svg
   xmlns:dc="http://purl.org/dc/elements/1.1/"
   xmlns:cc="http://creativecommons.org/ns#"
   xmlns:rdf="http://www.w3.org/1999/02/22-rdf-syntax-ns#"
   xmlns:svg="http://www.w3.org/2000/svg"
   xmlns="http://www.w3.org/2000/svg"
   xmlns:sodipodi="http://sodipodi.sourceforge.net/DTD/sodipodi-0.dtd"
   xmlns:inkscape="http://www.inkscape.org/namespaces/inkscape"
   data-dec="107"
   width="22"
   height="40"
   version="1.1"
   id="svg4"
   sodipodi:docname="107.svg"
   inkscape:version="0.92.4 (unknown)">
  <metadata
     id="metadata10">
    <rdf:RDF>
      <cc:Work
         rdf:about="">
        <dc:format>image/svg+xml</dc:format>
        <dc:type
           rdf:resource="http://purl.org/dc/dcmitype/StillImage" />
      </cc:Work>
    </rdf:RDF>
  </metadata>
  <defs
     id="defs8" />
  <sodipodi:namedview
     pagecolor="#ffffff"
     bordercolor="#666666"
     borderopacity="1"
     objecttolerance="10"
     gridtolerance="10"
     guidetolerance="10"
     inkscape:pageopacity="0"
     inkscape:pageshadow="2"
     inkscape:window-width="640"
     inkscape:window-height="480"
     id="namedview6"
     showgrid="false"
     inkscape:zoom="5.9"
     inkscape:cx="11"
     inkscape:cy="20"
     inkscape:window-x="0"
     inkscape:window-y="27"
     inkscape:window-maximized="0"
     inkscape:current-layer="svg4" />
  <path
     style="color:#000000;font-style:normal;font-variant:normal;font-weight:normal;font-stretch:normal;font-size:medium;line-height:normal;font-family:sans-serif;font-variant-ligatures:normal;font-variant-position:normal;font-variant-caps:normal;font-variant-numeric:normal;font-variant-alternates:normal;font-feature-settings:normal;text-indent:0;text-align:start;text-decoration:none;text-decoration-line:none;text-decoration-style:solid;text-decoration-color:#000000;letter-spacing:normal;word-spacing:normal;text-transform:none;writing-mode:lr-tb;direction:ltr;text-orientation:mixed;dominant-baseline:auto;baseline-shift:baseline;text-anchor:start;white-space:normal;shape-padding:0;clip-rule:nonzero;display:inline;overflow:visible;visibility:visible;opacity:1;isolation:auto;mix-blend-mode:normal;color-interpolation:sRGB;color-interpolation-filters:linearRGB;solid-color:#000000;solid-opacity:1;vector-effect:none;fill:#013272;fill-opacity:1;fill-rule:nonzero;stroke:none;stroke-width:0.30000001;stroke-linecap:round;stroke-linejoin:round;stroke-miterlimit:4;stroke-dasharray:none;stroke-dashoffset:0;stroke-opacity:1;color-rendering:auto;image-rendering:auto;shape-rendering:auto;text-rendering:auto;enable-background:accumulate"
     d="m 8.0019531,21.669922 0.091797,0.179687 h 0.2695312 z m -4.0039062,0 -0.3613281,0.179687 H 3.90625 Z m 13.8417971,-0.08203 0.228515,0.261718 h 0.294922 z M 7.1503906,21.242188 v 0.607421 h 0.6074219 l -0.203125,-0.404297 z m -2.3007812,0 -0.4042969,0.203124 -0.203125,0.404297 h 0.6074219 z m 10.2187496,-0.09961 -0.707031,0.707031 h 1.3125 z m 1.029297,-0.425781 0.970703,1.132812 h 0.59961 l -0.541016,-0.617187 z m -8.9472654,-0.08008 v 0.269531 l 0.1796875,0.0918 z m -2.3007812,0 -0.1796875,0.361328 0.1796875,-0.0918 z m 10.7578126,-0.0332 -0.326172,0.326172 0.787109,0.919921 h 0.605469 z M 16.125,20.085938 a 0.15001501,0.15001501 0 0 1 -0.01953,0.01953 l -0.185547,0.185547 0.685547,0.34375 z m -5.132812,-5.867188 -0.789063,0.789062 4.882813,5.695313 0.326171,-0.326172 -0.0059,-0.0059 -0.472656,-0.236328 a 0.15001501,0.15001501 0 0 1 0.0293,-0.28125 l -4.076172,-4.75586 a 0.15001501,0.15001501 0 1 1 0.226562,-0.195312 l 4.480469,5.226562 0.04492,0.02148 0.255859,-0.25586 a 0.15001501,0.15001501 0 0 1 0.03711,-0.0293 z m 3.644531,-6.0683594 1.375,0.6875 2.0625,-0.6875 z M 4.6699219,2.0019531 4.8496094,2.3632812 V 2.09375 Z m 1.3125,-0.1542969 a 0.15001501,0.15001501 0 0 1 0.015625,0 A 0.15001501,0.15001501 0 0 1 6.1503906,2 V 21 A 0.1503906,0.1503906 0 0 1 5.8496094,21 V 2 A 0.15001501,0.15001501 0 0 1 5.9824219,1.8476562 Z M 5.1503906,1.1503906 v 0.828125 a 0.15001501,0.15001501 0 0 1 0,0.044922 v 0.9628906 a 0.15001501,0.15001501 0 0 1 0,0.029297 v 16.964844 a 0.15001501,0.15001501 0 0 1 0,0.0293 v 0.96289 a 0.15001501,0.15001501 0 0 1 0,0.04492 v 0.832031 h 1.6992188 v -0.828125 a 0.15001501,0.15001501 0 0 1 0,-0.04492 v -0.96289 a 0.15001501,0.15001501 0 0 1 0,-0.0293 v -1.96875 a 0.15001501,0.15001501 0 0 1 0,-0.0293 V 1.1503906 Z m -0.9082031,0 0.203125,0.4042969 0.4042969,0.203125 V 1.1503906 Z m -0.6054687,0 L 3.9980469,1.3300781 3.90625,1.1503906 Z M 3.9863281,0.84765625 a 0.15001501,0.15001501 0 0 1 0.03125,0.001953 h 0.9648438 a 0.15001501,0.15001501 0 0 1 0.044922,0 H 7 A 0.15001501,0.15001501 0 0 1 7.1503906,1 v 16.638672 l 2.7207032,-2.71875 a 0.15001501,0.15001501 0 0 1 0.00781,-0.01172 0.15001501,0.15001501 0 0 1 0.03125,-0.03125 0.15001501,0.15001501 0 0 1 0.00391,-0.002 l 0.9550785,-0.953125 a 0.15001501,0.15001501 0 0 1 0.0098,-0.01172 0.15001501,0.15001501 0 0 1 0.03125,-0.0332 0.15001501,0.15001501 0 0 1 0.0059,-0.0039 l 0.0059,-0.0039 4.826172,-4.8281254 -1.783203,-0.890625 H 13 a 0.1503906,0.1503906 0 1 1 0,-0.3007812 h 0.980469 0.0293 4.982422 0.01562 H 20 a 0.1503906,0.1503906 0 0 1 0,0.3007812 h -0.976562 l -2.945313,0.9824219 -4.873047,4.8730465 6.111328,6.984375 1.71875,0.859375 H 20 a 0.150391,0.150391 0 0 1 0,0.300782 h -0.980469 -0.0293 -0.96875 a 0.15001501,0.15001501 0 0 1 -0.0293,0 h -0.01563 -0.957031 a 0.15001501,0.15001501 0 0 1 -0.0293,0 h -0.970703 a 0.15001501,0.15001501 0 0 1 -0.0293,0 h -1.972656 a 0.15001501,0.15001501 0 0 1 -0.0293,0 H 13 a 0.150391,0.150391 0 1 1 0,-0.300782 h 0.939453 L 14.873047,20.916016 9.9921875,15.21875 7.1503906,18.060547 v 1.904297 l 0.6289063,1.255859 1.2558593,0.628906 H 10 a 0.150391,0.150391 0 1 1 0,0.300782 H 9.0195312 8.9902344 8.0273438 a 0.15001501,0.15001501 0 0 1 -0.044922,0 H 7.0175781 a 0.15001501,0.15001501 0 0 1 -0.044922,0 H 5.0175781 a 0.15001501,0.15001501 0 0 1 -0.044922,0 H 4.0214844 a 0.15001501,0.15001501 0 0 1 -0.044922,0 H 3.0136719 2.984375 2 A 0.150391,0.150391 0 0 1 2,21.849609 H 2.9648438 L 4.2207031,21.220703 4.8496094,19.964844 V 3.0351562 L 4.2207031,1.7792969 2.9648438,1.1503906 H 2 A 0.15039068,0.15039068 0 1 1 2,0.84960938 h 0.9804688 0.029297 0.9628906 a 0.15001501,0.15001501 0 0 1 0.013672,-0.001953 z"
     id="path2" />
</svg>
