<?xml version="1.0" encoding="UTF-8" standalone="no"?>
<svg
   xmlns:dc="http://purl.org/dc/elements/1.1/"
   xmlns:cc="http://creativecommons.org/ns#"
   xmlns:rdf="http://www.w3.org/1999/02/22-rdf-syntax-ns#"
   xmlns:svg="http://www.w3.org/2000/svg"
   xmlns="http://www.w3.org/2000/svg"
   xmlns:sodipodi="http://sodipodi.sourceforge.net/DTD/sodipodi-0.dtd"
   xmlns:inkscape="http://www.inkscape.org/namespaces/inkscape"
   data-dec="111"
   width="20"
   height="40"
   version="1.1"
   id="svg4"
   sodipodi:docname="111.svg"
   inkscape:version="0.92.4 (unknown)">
  <metadata
     id="metadata10">
    <rdf:RDF>
      <cc:Work
         rdf:about="">
        <dc:format>image/svg+xml</dc:format>
        <dc:type
           rdf:resource="http://purl.org/dc/dcmitype/StillImage" />
      </cc:Work>
    </rdf:RDF>
  </metadata>
  <defs
     id="defs8" />
  <sodipodi:namedview
     pagecolor="#ffffff"
     bordercolor="#666666"
     borderopacity="1"
     objecttolerance="10"
     gridtolerance="10"
     guidetolerance="10"
     inkscape:pageopacity="0"
     inkscape:pageshadow="2"
     inkscape:window-width="615"
     inkscape:window-height="417"
     id="namedview6"
     showgrid="false"
     inkscape:zoom="5.9"
     inkscape:cx="10"
     inkscape:cy="20"
     inkscape:window-x="0"
     inkscape:window-y="27"
     inkscape:window-maximized="0"
     inkscape:current-layer="svg4" />
  <path
     style="color:#000000;font-style:normal;font-variant:normal;font-weight:normal;font-stretch:normal;font-size:medium;line-height:normal;font-family:sans-serif;font-variant-ligatures:normal;font-variant-position:normal;font-variant-caps:normal;font-variant-numeric:normal;font-variant-alternates:normal;font-feature-settings:normal;text-indent:0;text-align:start;text-decoration:none;text-decoration-line:none;text-decoration-style:solid;text-decoration-color:#000000;letter-spacing:normal;word-spacing:normal;text-transform:none;writing-mode:lr-tb;direction:ltr;text-orientation:mixed;dominant-baseline:auto;baseline-shift:baseline;text-anchor:start;white-space:normal;shape-padding:0;clip-rule:nonzero;display:inline;overflow:visible;visibility:visible;opacity:1;isolation:auto;mix-blend-mode:normal;color-interpolation:sRGB;color-interpolation-filters:linearRGB;solid-color:#000000;solid-opacity:1;vector-effect:none;fill:#013272;fill-opacity:1;fill-rule:nonzero;stroke:none;stroke-width:2;stroke-linecap:round;stroke-linejoin:round;stroke-miterlimit:4;stroke-dasharray:none;stroke-dashoffset:0;stroke-opacity:1;color-rendering:auto;image-rendering:auto;shape-rendering:auto;text-rendering:auto;enable-background:accumulate"
     d="M 9.2363281,9 7.5917969,9.8222656 6.875,10.541016 6,13.162109 v 3.675782 l 0.875,2.621093 0.7167969,0.71875 L 9.2363281,21 H 10.763672 L 12.408203,20.177734 13.125,19.458984 14,16.837891 V 13.162109 L 13.125,10.541016 12.408203,9.8222656 10.763672,9 Z M 9.0039062,6.9941406 A 1.0001,1.0001 0 0 1 9.046875,6.9960938 1.0001,1.0001 0 0 1 9.1191406,7 h 1.7714844 a 1.0001,1.0001 0 0 1 0.425781,0.050781 l 0.0078,0.00195 a 1.0001,1.0001 0 0 1 0.03125,0.011719 l 2.960937,0.9863281 a 1.0001,1.0001 0 0 1 0.390625,0.2421876 l 2,2.0000002 a 1.0001,1.0001 0 0 1 0.242188,0.390625 l 1,3 A 1.0001,1.0001 0 0 1 18,14 v 2 a 1.0001,1.0001 0 0 1 -0.05078,0.316406 l -1,3 a 1.0001,1.0001 0 0 1 -0.242188,0.390625 l -2,2 a 1.0001,1.0001 0 0 1 -0.390625,0.242188 l -2.99414,0.998047 -0.0059,0.002 A 1.0001,1.0001 0 0 1 10.880859,23 H 9.109375 a 1.0001,1.0001 0 0 1 -0.4257812,-0.05078 l -0.039063,-0.01367 -2.9609374,-0.986328 a 1.0001,1.0001 0 0 1 -0.390625,-0.242188 l -2,-2 A 1.0001,1.0001 0 0 1 3.0507812,19.316406 l -1,-3 A 1.0001,1.0001 0 0 1 2,16 v -2 a 1.0001,1.0001 0 0 1 0.050781,-0.316406 l 1,-3 a 1.0001,1.0001 0 0 1 0.2421876,-0.390625 l 2,-2.0000002 A 1.0001,1.0001 0 0 1 5.6835938,8.0507812 L 8.5996094,7.078125 a 1.0001,1.0001 0 0 1 0.00977,-0.00391 1.0001,1.0001 0 0 1 0.1699219,-0.050781 1.0001,1.0001 0 0 1 0.021484,-0.00586 1.0001,1.0001 0 0 1 0.046875,-0.00781 1.0001,1.0001 0 0 1 0.099609,-0.011719 1.0001,1.0001 0 0 1 0.056641,-0.00391 z"
     id="path2" />
</svg>
