<?xml version="1.0" encoding="UTF-8" standalone="no"?>
<svg
   xmlns:dc="http://purl.org/dc/elements/1.1/"
   xmlns:cc="http://creativecommons.org/ns#"
   xmlns:rdf="http://www.w3.org/1999/02/22-rdf-syntax-ns#"
   xmlns:svg="http://www.w3.org/2000/svg"
   xmlns="http://www.w3.org/2000/svg"
   xmlns:sodipodi="http://sodipodi.sourceforge.net/DTD/sodipodi-0.dtd"
   xmlns:inkscape="http://www.inkscape.org/namespaces/inkscape"
   data-dec="109"
   width="32"
   height="40"
   version="1.1"
   id="svg4"
   sodipodi:docname="109.svg"
   inkscape:version="0.92.4 5da689c313, 2019-01-14">
  <metadata
     id="metadata10">
    <rdf:RDF>
      <cc:Work
         rdf:about="">
        <dc:format>image/svg+xml</dc:format>
        <dc:type
           rdf:resource="http://purl.org/dc/dcmitype/StillImage" />
        <dc:title></dc:title>
      </cc:Work>
    </rdf:RDF>
  </metadata>
  <defs
     id="defs8" />
  <sodipodi:namedview
     pagecolor="#ffffff"
     bordercolor="#666666"
     borderopacity="1"
     objecttolerance="10"
     gridtolerance="10"
     guidetolerance="10"
     inkscape:pageopacity="0"
     inkscape:pageshadow="2"
     inkscape:window-width="1920"
     inkscape:window-height="1043"
     id="namedview6"
     showgrid="false"
     inkscape:zoom="5.9"
     inkscape:cx="16"
     inkscape:cy="20"
     inkscape:window-x="0"
     inkscape:window-y="37"
     inkscape:window-maximized="0"
     inkscape:current-layer="svg4" />
  <path
     style="color:#000000;font-style:normal;font-variant:normal;font-weight:normal;font-stretch:normal;font-size:medium;line-height:normal;font-family:sans-serif;font-variant-ligatures:normal;font-variant-position:normal;font-variant-caps:normal;font-variant-numeric:normal;font-variant-alternates:normal;font-feature-settings:normal;text-indent:0;text-align:start;text-decoration:none;text-decoration-line:none;text-decoration-style:solid;text-decoration-color:#000000;letter-spacing:normal;word-spacing:normal;text-transform:none;writing-mode:lr-tb;direction:ltr;text-orientation:mixed;dominant-baseline:auto;baseline-shift:baseline;text-anchor:start;white-space:normal;shape-padding:0;clip-rule:nonzero;display:inline;overflow:visible;visibility:visible;opacity:1;isolation:auto;mix-blend-mode:normal;color-interpolation:sRGB;color-interpolation-filters:linearRGB;solid-color:#000000;solid-opacity:1;vector-effect:none;fill:#000000;fill-opacity:1;fill-rule:nonzero;stroke:none;stroke-width:1.5;stroke-linecap:round;stroke-linejoin:round;stroke-miterlimit:4;stroke-dasharray:none;stroke-dashoffset:0;stroke-opacity:1;color-rendering:auto;image-rendering:auto;shape-rendering:auto;text-rendering:auto;enable-background:accumulate"
     d="M 3.9882812,7.2402344 A 0.750075,0.750075 0 0 1 4.1230469,7.25 H 5 A 0.750075,0.750075 0 0 1 5.75,8 v 2.1875 L 7.46875,8.46875 A 0.750075,0.750075 0 0 1 7.6640625,8.3300781 l 2,-1 A 0.750075,0.750075 0 0 1 10,7.25 h 3 a 0.750075,0.750075 0 0 1 0.335938,0.080078 l 2,1 a 0.750075,0.750075 0 0 1 0.375,0.4335938 L 16.326172,10.611328 18.46875,8.46875 a 0.750075,0.750075 0 0 1 0.195312,-0.1386719 l 2,-1 A 0.750075,0.750075 0 0 1 21,7.25 h 3 a 0.750075,0.750075 0 0 1 0.335938,0.080078 l 2,1 a 0.750075,0.750075 0 0 1 0.375,0.4335938 l 1,3.0000001 A 0.750075,0.750075 0 0 1 27.75,12 v 9.876953 a 0.750075,0.750075 0 0 1 -0.201172,0.644531 0.750075,0.750075 0 0 1 -0.0039,0.0039 0.750075,0.750075 0 0 1 -0.0039,0.0039 0.750075,0.750075 0 0 1 -0.04883,0.04687 0.750075,0.750075 0 0 1 -0.0059,0.0039 A 0.750075,0.750075 0 0 1 26.876953,22.75 H 26 A 0.750075,0.750075 0 0 1 25.25,22 V 12.177734 L 24.441406,10.558594 22.822266,9.75 H 21.177734 L 19.376953,10.650391 16.75,12.402344 v 9.474609 a 0.750075,0.750075 0 0 1 -0.201172,0.644531 0.750075,0.750075 0 0 1 -0.0039,0.0039 0.750075,0.750075 0 0 1 -0.0039,0.0039 0.750075,0.750075 0 0 1 -0.04883,0.04687 0.750075,0.750075 0 0 1 -0.0059,0.0039 A 0.750075,0.750075 0 0 1 15.876953,22.75 H 15 A 0.750075,0.750075 0 0 1 14.25,22 V 12.177734 L 13.441406,10.558594 11.822266,9.75 H 10.177734 L 8.3769531,10.650391 5.75,12.402344 v 9.474609 a 0.750075,0.750075 0 0 1 -0.2011719,0.644531 0.750075,0.750075 0 0 1 -0.00391,0.0039 0.750075,0.750075 0 0 1 -0.00391,0.0039 0.750075,0.750075 0 0 1 -0.048828,0.04687 0.750075,0.750075 0 0 1 -0.00586,0.0039 A 0.750075,0.750075 0 0 1 4.8769531,22.75 H 4 A 0.750075,0.750075 0 0 1 3.25,22 V 8.1230469 a 0.750075,0.750075 0 0 1 0.2011719,-0.6445313 0.750075,0.750075 0 0 1 0.00586,-0.00586 0.750075,0.750075 0 0 1 0.00586,-0.00586 0.750075,0.750075 0 0 1 0.050781,-0.046875 0.750075,0.750075 0 0 1 0.4746093,-0.1796875 z"
     id="path2" />
</svg>
