<?xml version="1.0" encoding="UTF-8"?>
<glyph name="period" format="2">
  <advance width="231"/>
  <unicode hex="002E"/>
  <outline>
    <contour>
      <point x="114" y="202" type="curve" smooth="yes"/>
      <point x="116" y="202" type="line"/>
      <point x="119" y="202" type="line" smooth="yes"/>
      <point x="127" y="201"/>
      <point x="136" y="196"/>
      <point x="140" y="190" type="curve" smooth="yes"/>
      <point x="165" y="165" type="line" smooth="yes"/>
      <point x="169" y="161"/>
      <point x="174" y="151"/>
      <point x="174" y="144" type="curve" smooth="yes"/>
      <point x="174" y="137"/>
      <point x="169" y="128"/>
      <point x="165" y="124" type="curve" smooth="yes"/>
      <point x="136" y="95" type="line" smooth="yes"/>
      <point x="132" y="91"/>
      <point x="123" y="87"/>
      <point x="116" y="87" type="curve" smooth="yes"/>
      <point x="109" y="87"/>
      <point x="100" y="91"/>
      <point x="96" y="95" type="curve" smooth="yes"/>
      <point x="66" y="124" type="line" smooth="yes"/>
      <point x="62" y="128"/>
      <point x="58" y="137"/>
      <point x="58" y="144" type="curve" smooth="yes"/>
      <point x="58" y="151"/>
      <point x="62" y="161"/>
      <point x="66" y="165" type="curve" smooth="yes"/>
      <point x="92" y="190" type="line" smooth="yes"/>
      <point x="96" y="197"/>
      <point x="106" y="202"/>
    </contour>
  </outline>
  <lib>
    <dict>
      <key>com.fontlab.hintData</key>
      <dict>
        <key>hhints</key>
        <array>
          <dict>
            <key>position</key>
            <integer>87</integer>
            <key>width</key>
            <integer>116</integer>
          </dict>
        </array>
        <key>vhints</key>
        <array>
          <dict>
            <key>position</key>
            <integer>58</integer>
            <key>width</key>
            <integer>116</integer>
          </dict>
        </array>
      </dict>
    </dict>
  </lib>
</glyph>
