<svg xmlns:dc="http://purl.org/dc/elements/1.1/" xmlns:cc="http://creativecommons.org/ns#" xmlns:rdf="http://www.w3.org/1999/02/22-rdf-syntax-ns#" xmlns:svg="http://www.w3.org/2000/svg" xmlns="http://www.w3.org/2000/svg" xmlns:sodipodi="http://sodipodi.sourceforge.net/DTD/sodipodi-0.dtd" xmlns:inkscape="http://www.inkscape.org/namespaces/inkscape" data-dec="8220" id="dec_39" width="14" height="40" version="1.1" sodipodi:docname="8220.svg" inkscape:version="0.92.2 5c3e80d, 2017-08-06">
  <metadata id="metadata9">
    <rdf:RDF>
      <cc:Work rdf:about="">
        <dc:format>image/svg+xml</dc:format>
        <dc:type rdf:resource="http://purl.org/dc/dcmitype/StillImage"/>
        <dc:title/>
      </cc:Work>
    </rdf:RDF>
  </metadata>
  <defs id="defs7"/>
  <sodipodi:namedview pagecolor="#ffffff" bordercolor="#666666" borderopacity="1" objecttolerance="10" gridtolerance="10" guidetolerance="10" inkscape:pageopacity="0" inkscape:pageshadow="2" inkscape:window-width="1364" inkscape:window-height="730" id="namedview5" showgrid="true" showguides="true" inkscape:zoom="11.51375" inkscape:cx="-10.130231" inkscape:cy="29.6285" inkscape:window-x="1920" inkscape:window-y="18" inkscape:window-maximized="0" inkscape:current-layer="dec_39">
    <inkscape:grid type="xygrid" id="grid836"/>
  </sodipodi:namedview>
  <path inkscape:connector-curvature="0" d="M 8,6 9,5 h 1 l 1,1 V 7 L 10,8 H 9 L 8,7 V 4 L 9,2 11,1 M 10,7 V 6 H 9 v 1 h 1 M 9,5 8,4 M 8,6 9,2 M 3,6 4,5 H 5 L 6,6 V 7 L 5,8 H 4 L 3,7 V 4 L 4,2 6,1 M 5,7 V 6 H 4 V 7 H 5 M 4,5 3,4 M 3,6 4,2 " style="fill:none;stroke:#000000;stroke-width:1;stroke-linecap:round;stroke-linejoin:round;stroke-miterlimit:4;stroke-dasharray:none" id="path2-7" sodipodi:nodetypes="cccccccccccccccccccc"/>
</svg>