<?xml version="1.0" encoding="UTF-8" standalone="no"?>
<svg
   xmlns:dc="http://purl.org/dc/elements/1.1/"
   xmlns:cc="http://creativecommons.org/ns#"
   xmlns:rdf="http://www.w3.org/1999/02/22-rdf-syntax-ns#"
   xmlns:svg="http://www.w3.org/2000/svg"
   xmlns="http://www.w3.org/2000/svg"
   xmlns:sodipodi="http://sodipodi.sourceforge.net/DTD/sodipodi-0.dtd"
   xmlns:inkscape="http://www.inkscape.org/namespaces/inkscape"
   data-dec="42"
   width="16"
   height="40"
   version="1.1"
   id="svg4"
   sodipodi:docname="42.svg"
   inkscape:version="0.92.4 (unknown)">
  <metadata
     id="metadata10">
    <rdf:RDF>
      <cc:Work
         rdf:about="">
        <dc:format>image/svg+xml</dc:format>
        <dc:type
           rdf:resource="http://purl.org/dc/dcmitype/StillImage" />
      </cc:Work>
    </rdf:RDF>
  </metadata>
  <defs
     id="defs8" />
  <sodipodi:namedview
     pagecolor="#ffffff"
     bordercolor="#666666"
     borderopacity="1"
     objecttolerance="10"
     gridtolerance="10"
     guidetolerance="10"
     inkscape:pageopacity="0"
     inkscape:pageshadow="2"
     inkscape:window-width="640"
     inkscape:window-height="480"
     id="namedview6"
     showgrid="false"
     inkscape:zoom="5.9"
     inkscape:cx="8"
     inkscape:cy="20"
     inkscape:window-x="0"
     inkscape:window-y="27"
     inkscape:window-maximized="0"
     inkscape:current-layer="svg4" />
  <path
     style="color:#000000;font-style:normal;font-variant:normal;font-weight:normal;font-stretch:normal;font-size:medium;line-height:normal;font-family:sans-serif;font-variant-ligatures:normal;font-variant-position:normal;font-variant-caps:normal;font-variant-numeric:normal;font-variant-alternates:normal;font-feature-settings:normal;text-indent:0;text-align:start;text-decoration:none;text-decoration-line:none;text-decoration-style:solid;text-decoration-color:#000000;letter-spacing:normal;word-spacing:normal;text-transform:none;writing-mode:lr-tb;direction:ltr;text-orientation:mixed;dominant-baseline:auto;baseline-shift:baseline;text-anchor:start;white-space:normal;shape-padding:0;clip-rule:nonzero;display:inline;overflow:visible;visibility:visible;opacity:1;isolation:auto;mix-blend-mode:normal;color-interpolation:sRGB;color-interpolation-filters:linearRGB;solid-color:#000000;solid-opacity:1;vector-effect:none;fill:#000000;fill-opacity:1;fill-rule:nonzero;stroke:none;stroke-width:1.5;stroke-linecap:round;stroke-linejoin:round;stroke-miterlimit:4;stroke-dasharray:none;stroke-dashoffset:0;stroke-opacity:1;color-rendering:auto;image-rendering:auto;shape-rendering:auto;text-rendering:auto;enable-background:accumulate"
     d="m 7.9882812,0.24023438 a 0.750075,0.750075 0 0 1 0.21875,0.0292969 0.750075,0.750075 0 0 1 0.00391,0 0.750075,0.750075 0 0 1 0.068359,0.0234375 0.750075,0.750075 0 0 1 0.00195,0.001953 0.750075,0.750075 0 0 1 0.066406,0.0292969 0.750075,0.750075 0 0 1 0.00195,0.001953 0.750075,0.750075 0 0 1 0.0625,0.0351562 0.750075,0.750075 0 0 1 0.00195,0.001953 0.750075,0.750075 0 0 1 0.1972656,0.18554687 L 9.53125,1.46875 A 0.750075,0.750075 0 0 1 9.7363281,2.1464844 L 9.1210938,5.2226562 11.550781,3.4003906 A 0.750075,0.750075 0 0 1 12,3.25 h 0.876953 a 0.750075,0.750075 0 0 1 0.365235,0.03125 0.750075,0.750075 0 0 1 0.06055,0.023437 0.750075,0.750075 0 0 1 0.0098,0.00391 0.750075,0.750075 0 0 1 0.01367,0.00781 0.750075,0.750075 0 0 1 0.05273,0.025391 0.750075,0.750075 0 0 1 0.01563,0.00977 0.750075,0.750075 0 0 1 0.04687,0.03125 0.750075,0.750075 0 0 1 0.0332,0.025391 0.750075,0.750075 0 0 1 0.148438,0.1582031 0.750075,0.750075 0 0 1 0.04101,0.064453 0.750075,0.750075 0 0 1 0.0332,0.066406 0.750075,0.750075 0 0 1 0.01563,0.037109 0.750075,0.750075 0 0 1 0.0039,0.013672 0.750075,0.750075 0 0 1 0.01758,0.056641 0.750075,0.750075 0 0 1 0.01563,0.074219 0.750075,0.750075 0 0 1 0.0078,0.074219 0.750075,0.750075 0 0 1 0,0.074219 0.750075,0.750075 0 0 1 -0.0059,0.076172 0.750075,0.750075 0 0 1 -0.002,0.019531 V 5 A 0.750075,0.750075 0 0 1 13.279297,5.6972656 L 10.021484,7 13.279297,8.3027344 A 0.750075,0.750075 0 0 1 13.75,9 v 0.8769531 a 0.750075,0.750075 0 0 1 0.0078,0.070312 0.750075,0.750075 0 0 1 0,0.00195 0.750075,0.750075 0 0 1 0.002,0.039062 0.750075,0.750075 0 0 1 0,0.03711 0.750075,0.750075 0 0 1 -0.002,0.01758 0.750075,0.750075 0 0 1 -0.002,0.04297 0.750075,0.750075 0 0 1 -0.002,0.01367 0.750075,0.750075 0 0 1 -0.002,0.01367 0.750075,0.750075 0 0 1 -0.0098,0.04883 0.750075,0.750075 0 0 1 -0.002,0.01172 0.750075,0.750075 0 0 1 -0.0098,0.03711 0.750075,0.750075 0 0 1 -0.002,0.002 0.750075,0.750075 0 0 1 -0.02344,0.06836 0.750075,0.750075 0 0 1 -0.03125,0.06836 0.750075,0.750075 0 0 1 -0.03711,0.06445 0.750075,0.750075 0 0 1 -0.203125,0.208985 0.750075,0.750075 0 0 1 -0.03516,0.02344 0.750075,0.750075 0 0 1 -0.0098,0.0059 0.750075,0.750075 0 0 1 -0.05664,0.0293 A 0.750075,0.750075 0 0 1 12.876953,10.75 H 12 A 0.750075,0.750075 0 0 1 11.550781,10.599609 L 9.1210938,8.7773438 9.7363281,11.853516 A 0.750075,0.750075 0 0 1 9.53125,12.53125 l -0.921875,0.921875 a 0.750075,0.750075 0 0 1 -0.2402344,0.210937 0.750075,0.750075 0 0 1 -0.00195,0.002 0.750075,0.750075 0 0 1 -0.033203,0.01563 0.750075,0.750075 0 0 1 -0.1035156,0.04297 0.750075,0.750075 0 0 1 -0.4375,0.0059 0.750075,0.750075 0 0 1 -0.00391,0 0.750075,0.750075 0 0 1 -0.035156,-0.01172 0.750075,0.750075 0 0 1 -0.035156,-0.01367 0.750075,0.750075 0 0 1 -0.066406,-0.0293 0.750075,0.750075 0 0 1 -0.00195,-0.002 0.750075,0.750075 0 0 1 -0.0625,-0.03516 0.750075,0.750075 0 0 1 -0.00195,-0.002 0.750075,0.750075 0 0 1 -0.1972656,-0.185547 L 6.46875,12.53125 A 0.750075,0.750075 0 0 1 6.2636719,11.853516 L 6.8789062,8.7773438 4.4492188,10.599609 A 0.750075,0.750075 0 0 1 4,10.75 H 3.1230469 a 0.750075,0.750075 0 0 1 -0.3652344,-0.03125 0.750075,0.750075 0 0 1 -0.060547,-0.02344 0.750075,0.750075 0 0 1 -0.023437,-0.01172 0.750075,0.750075 0 0 1 -0.037109,-0.01758 0.750075,0.750075 0 0 1 -0.03125,-0.01758 0.750075,0.750075 0 0 1 -0.037109,-0.02539 0.750075,0.750075 0 0 1 -0.042969,-0.03125 0.750075,0.750075 0 0 1 -0.1484375,-0.158203 0.750075,0.750075 0 0 1 -0.041016,-0.06445 0.750075,0.750075 0 0 1 -0.033203,-0.06641 0.750075,0.750075 0 0 1 -0.015625,-0.03711 0.750075,0.750075 0 0 1 -0.00391,-0.01367 0.750075,0.750075 0 0 1 -0.017578,-0.05664 0.750075,0.750075 0 0 1 -0.015625,-0.07422 0.750075,0.750075 0 0 1 -0.00781,-0.07422 0.750075,0.750075 0 0 1 0,-0.074219 0.750075,0.750075 0 0 1 0.00586,-0.076172 A 0.750075,0.750075 0 0 1 2.25,9.8769531 V 9 A 0.750075,0.750075 0 0 1 2.7207031,8.3027344 L 5.9785156,7 2.7207031,5.6972656 A 0.750075,0.750075 0 0 1 2.25,5 V 4.1230469 a 0.750075,0.750075 0 0 1 -0.00781,-0.070312 0.750075,0.750075 0 0 1 0,-0.00586 0.750075,0.750075 0 0 1 -0.00195,-0.054687 0.750075,0.750075 0 0 1 0.00195,-0.035156 0.750075,0.750075 0 0 1 0.00195,-0.042969 0.750075,0.750075 0 0 1 0.00391,-0.027344 0.750075,0.750075 0 0 1 0.00977,-0.048828 0.750075,0.750075 0 0 1 0.00977,-0.039063 0.750075,0.750075 0 0 1 0.00391,-0.011719 0.750075,0.750075 0 0 1 0.023437,-0.068359 0.750075,0.750075 0 0 1 0.03125,-0.068359 0.750075,0.750075 0 0 1 0.037109,-0.064453 0.750075,0.750075 0 0 1 0.203125,-0.2089844 0.750075,0.750075 0 0 1 0.035156,-0.023437 0.750075,0.750075 0 0 1 0.00977,-0.00586 0.750075,0.750075 0 0 1 0.056641,-0.029297 A 0.750075,0.750075 0 0 1 3.1230469,3.25 H 4 A 0.750075,0.750075 0 0 1 4.4492188,3.4003906 L 6.8789062,5.2226562 6.2636719,2.1464844 A 0.750075,0.750075 0 0 1 6.46875,1.46875 L 7.390625,0.546875 a 0.750075,0.750075 0 0 1 0.2402344,-0.2109375 0.750075,0.750075 0 0 1 0.00195,-0.001953 0.750075,0.750075 0 0 1 0.033203,-0.015625 0.750075,0.750075 0 0 1 0.1035156,-0.0429688 0.750075,0.750075 0 0 1 0.21875,-0.0351562 z"
     id="path2" />
</svg>
