{
  "data-date": "la date", 
  "fontname": "futural-mono-14-2", 
  "chars": [
    {
      "width": "14", 
      "dec": "53", 
      "d": "m 10.5,1 h -7 L 2.8,10 3.5,9 5.6,8 h 2.1 l 2.1,1 1.4,2 0.7,3 v 2 l -0.7,3 -1.4,2 -2.1,1 H 5.6 L 3.5,21 2.8,20 2.1,18"
    }, 
    {
      "width": "14", 
      "dec": "35", 
      "d": "M 7,-3 2.5454546,29 M 10.818182,-3 6.3636364,29 M 2.5454546,10 h 8.9090914 m -9.5454551,6 h 8.9090911"
    }, 
    {
      "width": "14", 
      "dec": "102", 
      "d": "M 11.666667,1 H 9.3333336 L 7.0000002,2 5.8333335,5 V 22 M 2.3333334,8 H 10.5"
    }, 
    {
      "width": "14", 
      "dec": "34", 
      "d": "m 3.5,1 v 7 m 7,-7 v 7"
    }, 
    {
      "width": "14", 
      "dec": "39", 
      "d": "M 7,3 5.6,2 7,1 8.4,2 V 4 L 7,6 5.6,7"
    }, 
    {
      "width": "14", 
      "dec": "123", 
      "d": "m 9,-131 -3,1 -1,1 v 0 l 3,19 2,30 1,30 L 8,2 7,8 6,11 m 0,0 -2,2 2,2 m 0,0 1,3 1,9 3,49 -1,30 -2,30 -3,19 1,1 3,1"
    }, 
    {
      "width": "14", 
      "dec": "59", 
      "d": "M 7,10 5.25,11 7,12 8.75,11 7,10 M 8.75,18 7,19 5.25,18 7,17 8.75,18 v 2 l -3.5,2"
    }, 
    {
      "width": "14", 
      "dec": "52", 
      "d": "m 9.1,1 -7,14 H 12.6 M 9.1,1 v 21"
    }, 
    {
      "width": "14", 
      "dec": "98", 
      "d": "m 3.1111111,1 v 21 m 0,-11 1.5555556,-2 1.5555555,-1 h 2.3333334 l 1.5555554,1 1.555556,2 0.777777,3 v 2 l -0.777777,3 -1.555556,2 -1.5555554,1 H 6.2222222 L 4.6666667,21 3.1111111,19"
    }, 
    {
      "width": "14", 
      "dec": "339", 
      "d": "M 3.7333334,8 2.8,9 1.8666667,11 1.4,14 v 2 L 1.8666667,19 2.8,21 3.7333334,22 h 1.4 L 6.0666667,21 7,19 7.4666667,16 V 14 L 7,11 6.0666667,9 5.1333334,8 h -1.4 m 3.7333333,6 H 13.066667 V 12 L 12.6,10 12.133333,9 11.2,8 H 9.8000001 L 8.8666667,9 7.9333334,11 7.4666667,14 v 2 l 0.4666667,3 0.9333333,2 0.9333334,1 H 11.2 l 0.933333,-1 0.933334,-2"
    }, 
    {
      "width": "14", 
      "dec": "123", 
      "d": "m 9,-35 -3,1 -1,1 v 0 l 2,11 1,6 1,9 -1,9 -1,6 -1,3 m 0,0 -2,2 2,2 m 0,0 1,3 1,6 1,9 -1,9 -1,6 -2,11 1,1 3,1"
    }, 
    {
      "width": "14", 
      "dec": "8221", 
      "d": "M 11,4 10,5 9,4 10,3 11,4 V 6 L 9,8 M 5,4 4,5 3,4 4,3 5,4 V 6 L 3,8"
    }, 
    {
      "width": "14", 
      "dec": "41", 
      "d": "m 3,-3 2,2 2,3 2,4 1,5 v 4 l -1,5 -2,4 -2,3 -2,2"
    }, 
    {
      "width": "14", 
      "dec": "36", 
      "d": "M 5.6,-3 V 26 M 8.4,-3 V 26 M 11.9,4 10.5,2 8.4,1 H 5.6 L 3.5,2 2.1,4 v 2 l 0.7,2 0.7,1 1.4,1 4.2,2 1.4,1 0.7,1 0.7,2 v 3 l -1.4,2 -2.1,1 H 5.6 L 3.5,21 2.1,19"
    }, 
    {
      "width": "14", 
      "dec": "117", 
      "d": "m 2.8,8 v 10 l 0.7,3 1.4,1 H 7 l 1.4,-1 2.1,-3 m 0,-10 v 14"
    }, 
    {
      "width": "14", 
      "dec": "180", 
      "d": "M 10.5,2 3.5000001,7"
    }, 
    {
      "width": "14", 
      "dec": "110", 
      "d": "M 2.8,8 V 22 M 2.8,12 4.9,9 6.3,8 h 2.1 l 1.4,1 0.7,3 v 10"
    }, 
    {
      "width": "14", 
      "dec": "71", 
      "d": "M 11.454546,6 10.818182,4 9.5454546,2 8.2727273,1 H 5.7272728 L 4.4545455,2 3.1818182,4 2.5454546,6 1.9090909,9 v 5 l 0.6363637,3 0.6363636,2 1.2727273,2 1.2727273,1 h 2.5454545 l 1.2727273,-1 1.2727274,-2 0.636364,-2 v -3 m -3.1818187,0 h 3.1818187"
    }, 
    {
      "width": "14", 
      "dec": "630", 
      "d": "M 4.2,1 3.2666667,2 2.3333334,4 1.8666667,6 1.4,9 v 5 l 0.4666667,3 0.4666667,2 0.9333333,2 L 4.2,22 h 2.3333334 m 0,-21 H 4.2 m 2.3333334,0 v 21 m 0,-21 H 12.6 M 6.5333334,11 H 10.266667 M 6.5333334,22 H 12.6"
    }, 
    {
      "width": "14", 
      "dec": "81", 
      "d": "M 5.7272728,1 4.4545455,2 3.1818182,4 2.5454546,6 1.9090909,9 v 5 l 0.6363637,3 0.6363636,2 1.2727273,2 1.2727273,1 h 2.5454545 l 1.2727273,-1 1.2727274,-2 0.636364,-2 0.636363,-3 V 9 L 11.454546,6 10.818182,4 9.5454546,2 8.2727273,1 H 5.7272728 m 1.9090909,17 3.8181823,6"
    }, 
    {
      "width": "14", 
      "dec": "76", 
      "d": "m 2.4705882,1 v 21 m 0,0 h 9.8823528"
    }, 
    {
      "width": "14", 
      "dec": "74", 
      "d": "M 10.5,1 V 17 L 9.625,20 8.75,21 7,22 H 5.25 L 3.5,21 2.625,20 1.75,17 v -2"
    }, 
    {
      "width": "14", 
      "dec": "56", 
      "d": "M 5.6,1 3.5,2 2.8,4 v 2 l 0.7,2 1.4,1 2.8,1 2.1,1 1.4,2 0.7,2 v 3 l -0.7,2 -0.7,1 -2.1,1 H 5.6 L 3.5,21 2.8,20 2.1,18 V 15 L 2.8,13 4.2,11 6.3,10 9.1,9 10.5,8 11.2,6 V 4 L 10.5,2 8.4,1 H 5.6"
    }, 
    {
      "width": "14", 
      "dec": "104", 
      "d": "m 2.9473684,1 v 21 m 0,-10 L 5.1578948,9 6.631579,8 h 2.2105263 l 1.4736847,1 0.736842,3 v 10"
    }, 
    {
      "width": "14", 
      "dec": "127", 
      "d": "M 0,1 V 22 H 0.875 V 1 H 1.75 V 22 H 2.625 V 1 H 3.5 V 22 H 4.375 V 1 H 5.25 V 22 H 6.125 V 1 H 7 V 22 H 7.875 V 1 H 8.75 V 22 H 9.625 V 1 H 10.5 v 21 h 0.875 V 1 h 0.875 v 21 h 0.875 V 1 H 14 v 21"
    }, 
    {
      "width": "14", 
      "dec": "105", 
      "d": "M 3,8 H 7 M 5.25,1 7,2 8.75,1 7,0 5.25,1 M 7,8 v 14 m -4,0 h 8"
    }, 
    {
      "width": "14", 
      "dec": "78", 
      "d": "m 2.5454546,1 v 21 m 0,-21 8.9090914,21 m 0,-21 v 21"
    }, 
    {
      "width": "14", 
      "dec": "123", 
      "d": "m 4,157 3,-1 1,-1 v 0 L 5,136 3,106 2,75.999998 5,24 6,18 7,15 M 7,15 9,13 7,11 M 7,11 6,8 5,-1 2,-50 l 1,-30 2,-30 3,-19 -1,-1 -3,-1"
    }, 
    {
      "width": "14", 
      "dec": "99", 
      "d": "M 11.666667,11 10.111111,9 8.5555556,8 H 6.2222222 L 4.6666667,9 3.1111111,11 2.3333333,14 v 2 l 0.7777778,3 1.5555556,2 1.5555555,1 h 2.3333334 l 1.5555554,-1 1.555556,-2"
    }, 
    {
      "width": "14", 
      "dec": "89", 
      "d": "M 0.77777778,1 7,11 V 22 M 13.222222,1 7,11"
    }, 
    {
      "width": "14", 
      "dec": "57", 
      "d": "M 11.2,8 10.5,11 9.1,13 7,14 H 6.3 L 4.2,13 2.8,11 2.1,8 V 7 L 2.8,4 4.2,2 6.3,1 H 7 l 2.1,1 1.4,2 0.7,4 v 5 L 10.5,18 9.1,21 7,22 H 5.6 L 3.5,21 2.8,19"
    }, 
    {
      "width": "14", 
      "dec": "83", 
      "d": "M 11.9,4 10.5,2 8.4,1 H 5.6 L 3.5,2 2.1,4 v 2 l 0.7,2 0.7,1 1.4,1 4.2,2 1.4,1 0.7,1 0.7,2 v 3 l -1.4,2 -2.1,1 H 5.6 L 3.5,21 2.1,19"
    }, 
    {
      "width": "14", 
      "dec": "40", 
      "d": "M 11,-3 9,-1 7,2 5,6 4,11 v 4 l 1,5 2,4 2,3 2,2"
    }, 
    {
      "width": "14", 
      "dec": "123", 
      "d": "M 9,-3 7,-2 6,-1 5,1 v 2 l 1,2 1,1 1,2 v 2 l -2,2 m 0,0 -2,1 2,1 m 0,0 2,2 v 2 l -1,2 -1,1 -1,2 v 2 l 1,2 1,1 2,1"
    }, 
    {
      "width": "14", 
      "dec": "67", 
      "d": "M 11.454546,6 10.818182,4 9.5454546,2 8.2727273,1 H 5.7272728 L 4.4545455,2 3.1818182,4 2.5454546,6 1.9090909,9 v 5 l 0.6363637,3 0.6363636,2 1.2727273,2 1.2727273,1 h 2.5454545 l 1.2727273,-1 1.2727274,-2 0.636364,-2"
    }, 
    {
      "width": "14", 
      "dec": "119", 
      "d": "M 1.9090909,8 4.4545455,22 M 7,8 4.4545455,22 M 7,8 9.5454546,22 M 12.090909,8 9.5454546,22"
    }, 
    {
      "width": "14", 
      "dec": "115", 
      "d": "M 10.888889,11 10.111111,9 7.7777778,8 H 5.4444445 l -2.3333334,1 -0.7777778,2 0.7777778,2 1.5555556,1 3.8888889,1 1.5555554,1 0.777778,2 v 1 l -0.777778,2 -2.3333332,1 H 5.4444445 L 3.1111111,21 2.3333333,19"
    }, 
    {
      "width": "14", 
      "dec": "46", 
      "d": "M 7,17 5.25,18 7,19 8.75,18 7,17"
    }, 
    {
      "width": "14", 
      "dec": "60", 
      "d": "m 11.666667,4 -9.3333337,9 9.3333337,9"
    }, 
    {
      "width": "14", 
      "dec": "82", 
      "d": "m 2.8,1 v 21 m 0,-21 h 6.3 l 2.1,1 0.7,1 0.7,2 v 2 l -0.7,2 -0.7,1 -2.1,1 H 2.8 m 4.9,0 4.9,11"
    }, 
    {
      "width": "14", 
      "dec": "54", 
      "d": "M 11.2,4 10.5,2 8.4,1 H 7 L 4.9,2 3.5,5 2.8,10 v 5 l 0.7,4 1.4,2 2.1,1 h 0.7 l 2.1,-1 1.4,-2 0.7,-3 V 15 L 11.2,12 9.8,10 7.7,9 H 7 l -2.1,1 -1.4,2 -0.7,3"
    }, 
    {
      "width": "14", 
      "dec": "45", 
      "d": "M 2.1538462,13 H 11.846154"
    }, 
    {
      "width": "14", 
      "dec": "65", 
      "d": "M 7,1 0.77777778,22 M 7,1 13.222222,22 M 3.1111111,15 h 7.7777779"
    }, 
    {
      "width": "14", 
      "dec": "48", 
      "d": "M 6.3,1 4.2,2 2.8,5 2.1,10 v 3 l 0.7,5 1.4,3 2.1,1 h 1.4 l 2.1,-1 1.4,-3 0.7,-5 V 10 L 11.2,5 9.8,2 7.7,1 H 6.3"
    }, 
    {
      "width": "14", 
      "dec": "77", 
      "d": "m 2.3333333,1 v 21 m 0,-21 L 7,22 M 11.666667,1 7,22 M 11.666667,1 v 21"
    }, 
    {
      "width": "14", 
      "dec": "111", 
      "d": "M 5.6,8 4.2,9 2.8,11 2.1,14 v 2 l 0.7,3 1.4,2 1.4,1 h 2.1 l 1.4,-1 1.4,-2 0.7,-3 V 14 L 10.5,11 9.1,9 7.7,8 H 5.6"
    }, 
    {
      "width": "14", 
      "dec": "92", 
      "d": "M 0,1 14,25"
    }, 
    {
      "width": "14", 
      "dec": "184", 
      "d": "M 4.6666666,26 H 6.9999999 L 9.3333332,25 6.9999999,24 H 4.6666666 l 4.6666666,-2"
    }, 
    {
      "width": "14", 
      "dec": "80", 
      "d": "m 2.8,1 v 21 m 0,-21 h 6.3 l 2.1,1 0.7,1 0.7,2 v 3 l -0.7,2 -0.7,1 -2.1,1 H 2.8"
    }, 
    {
      "width": "14", 
      "dec": "44", 
      "d": "M 8.75,18 7,19 5.25,18 7,17 8.75,18 v 2 l -3.5,2"
    }, 
    {
      "width": "14", 
      "dec": "91", 
      "d": "M 4,-3 V 29 M 4,-3 h 7 M 4,29 h 7"
    }, 
    {
      "width": "14", 
      "dec": "109", 
      "d": "m 1.8666667,8 v 14 m 0,-10 1.4,-3 L 4.2,8 H 5.6 L 6.5333334,9 7,12 V 22 M 7,12 8.4000001,9 9.3333334,8 h 1.3999996 l 0.933334,1 0.466666,3 v 10"
    }, 
    {
      "width": "14", 
      "dec": "97", 
      "d": "m 11.052632,8 v 14 m 0,-11 L 9.5789474,9 8.1052632,8 H 5.8947369 L 4.4210527,9 2.9473684,11 2.2105263,14 v 2 l 0.7368421,3 1.4736843,2 1.4736842,1 h 2.2105263 l 1.4736842,-1 1.4736846,-2"
    }, 
    {
      "width": "14", 
      "dec": "73", 
      "d": "M 10.5,1 H 3.5000001 M 10.5,22 H 3.5000001 M 7,1 v 21"
    }, 
    {
      "width": "14", 
      "dec": "43", 
      "d": "M 7,4 V 22 M 2.1538462,13 h 9.6923078"
    }, 
    {
      "width": "14", 
      "dec": "168", 
      "d": "M 3.7333333,3 2.8,4 3.7333333,5 4.6666666,4 Z M 10.266667,3 9.3333333,4 10.266667,5 11.2,4 Z"
    }, 
    {
      "width": "14", 
      "dec": "55", 
      "d": "m 11.9,1 -7,21 M 2.1,1 h 9.8"
    }, 
    {
      "width": "14", 
      "dec": "106", 
      "d": "M 8,1 9.4,2 10.8,1 9.4,0 8,1 M 9.4,8 V 25 L 8,28 5.2,29 H 2.4"
    }, 
    {
      "width": "14", 
      "dec": "93", 
      "d": "M 10,-3 V 29 M 3,-3 h 7 M 3,29 h 7"
    }, 
    {
      "width": "14", 
      "dec": "96", 
      "d": "M 3.5000001,2 10.5,7"
    }, 
    {
      "width": "14", 
      "dec": "103", 
      "d": "M 10.5,8.0346662 V 24.034666 l -0.7,3 -0.7,1 -1.4,1 H 5.6 l -1.4,-1 m 6.3,-17 -1.4,-1.9999998 -1.4,-1 H 5.6 l -1.4,1 -1.4,1.9999998 -0.7,3 v 2 l 0.7,3 1.4,2 1.4,1 h 2.1 l 1.4,-1 1.4,-2"
    }, 
    {
      "width": "14", 
      "dec": "87", 
      "d": "M 1.1666667,1 4.0833333,22 M 7,1 4.0833333,22 M 7,1 9.9166666,22 M 12.833333,1 9.9166666,22"
    }, 
    {
      "width": "14", 
      "dec": "123", 
      "d": "m 4,61 3,-1 1,-1 v 0 L 6,48 5,42 4,33 5,24 6,18 7,15 M 7,15 9,13 7,11 M 7,11 6,8 5,2 4,-7 l 1,-9 1,-6 2,-11 -1,-1 -3,-1"
    }, 
    {
      "width": "14", 
      "dec": "171", 
      "d": "M 8.1666669,20 1.1666667,14 8.1666669,8 M 12.833334,20 5.8333335,14 12.833334,8"
    }, 
    {
      "width": "14", 
      "dec": "94", 
      "d": "M 7,-1 0,13 m 7,-14 7,14"
    }, 
    {
      "width": "14", 
      "dec": "123", 
      "d": "m 8,-3 -2,1 -1,1 1,2 1,3 v 2 0 0 2 l -1,3 m 0,0 -2,2 2,2 m 0,0 1,3 v 0 2 2 l -1,3 -1,2 1,1 2,1"
    }, 
    {
      "width": "14", 
      "dec": "124", 
      "d": "M 7,-3 V 29"
    }, 
    {
      "width": "14", 
      "dec": "90", 
      "d": "M 11.9,1 2.1,22 m 0,-21 h 9.8 M 2.1,22 h 9.8"
    }, 
    {
      "width": "14", 
      "dec": "84", 
      "d": "M 7,1 V 22 M 0.875,1 h 12.25"
    }, 
    {
      "width": "14", 
      "dec": "61", 
      "d": "M 2.1538462,10 H 11.846154 M 2.1538462,16 H 11.846154"
    }, 
    {
      "width": "14", 
      "dec": "95", 
      "d": "M 0,28 H 14"
    }, 
    {
      "width": "14", 
      "dec": "69", 
      "d": "m 3.1111111,1 v 21 m 0,-21 H 13.222222 M 3.1111111,11 H 9.3333334 M 3.1111111,22 H 13.222222"
    }, 
    {
      "width": "14", 
      "dec": "107", 
      "d": "M 3.5,1 V 22 M 12.25,8 3.5,18 m 3.5,-4 6.125,8"
    }, 
    {
      "width": "14", 
      "dec": "112", 
      "d": "m 3.1111111,8 v 21 m 0,-18 1.5555556,-2 1.5555555,-1 h 2.3333334 l 1.5555554,1 1.555556,2 0.777777,3 v 2 l -0.777777,3 -1.555556,2 -1.5555554,1 H 6.2222222 L 4.6666667,21 3.1111111,19"
    }, 
    {
      "width": "14", 
      "dec": "72", 
      "d": "M 2.5454546,1 V 22 M 11.454546,1 V 22 M 2.5454546,11 h 8.9090914"
    }, 
    {
      "width": "14", 
      "dec": "33", 
      "d": "M 7,1 V 15 M 7,20 5.6,21 7,22 8.4,21 7,20"
    }, 
    {
      "width": "14", 
      "dec": "49", 
      "d": "M 4.2,5 5.6,4 7.7,1 v 21"
    }, 
    {
      "width": "14", 
      "dec": "58", 
      "d": "M 7,10 5.25,11 7,12 8.75,11 7,10 M 7,17 5.25,18 7,19 8.75,18 7,17"
    }, 
    {
      "width": "14", 
      "dec": "88", 
      "d": "m 2.1,1 9.8,21 m 0,-21 -9.8,21"
    }, 
    {
      "width": "14", 
      "dec": "85", 
      "d": "m 2.5454546,1 v 15 l 0.6363636,3 1.2727273,2 1.9090909,1 h 1.2727273 l 1.9090909,-1 1.2727274,-2 0.636364,-3 V 1"
    }, 
    {
      "width": "14", 
      "dec": "108", 
      "d": "M 3,1 C 4.8343333,0.999 5.1676667,0.999 7,1 m 0,0 v 21 m -4,0 c 1.8343333,-0.001 6.1676667,-0.001 8,0"
    }, 
    {
      "width": "14", 
      "dec": "50", 
      "d": "M 2.8,6 V 5 L 3.5,3 4.2,2 5.6,1 h 2.8 l 1.4,1 0.7,1 0.7,2 v 2 l -0.7,2 -1.4,3 -7,10 h 9.8"
    }, 
    {
      "width": "14", 
      "dec": "47", 
      "d": "M 12.727273,-3 1.2727273,29"
    }, 
    {
      "width": "14", 
      "dec": "121", 
      "d": "M 1.75,8 7,22 M 12.25,8 7,22 5.25,26 3.5,28 1.75,29 H 0.875"
    }, 
    {
      "width": "14", 
      "dec": "100", 
      "d": "M 10.5,1 V 22 M 10.5,11 9.1,9 7.7,8 H 5.6 L 4.2,9 2.8,11 2.1,14 v 2 l 0.7,3 1.4,2 1.4,1 h 2.1 l 1.4,-1 1.4,-2"
    }, 
    {
      "width": "14", 
      "dec": "120", 
      "d": "m 2.3333333,8 8.5555557,14 m 0,-14 -8.5555557,14"
    }, 
    {
      "width": "14", 
      "dec": "125", 
      "d": "m 5,-3 2,1 1,1 1,2 V 3 L 8,5 7,6 6,8 v 2 l 2,2 m 0,0 2,1 -2,1 m 0,0 -2,2 v 2 l 1,2 1,1 1,2 v 2 l -1,2 -1,1 -2,1"
    }, 
    {
      "width": "14", 
      "dec": "116", 
      "d": "m 5,1 v 17 l 1,3 2,1 h 2 M 2,8 h 7"
    }, 
    {
      "width": "14", 
      "dec": "75", 
      "d": "M 2.8,1 V 22 M 12.6,1 2.8,15 m 3.5,-5 6.3,12"
    }, 
    {
      "width": "14", 
      "dec": "113", 
      "d": "M 10.5,8 V 29 M 10.5,11 9.1,9 7.7,8 H 5.6 L 4.2,9 2.8,11 2.1,14 v 2 l 0.7,3 1.4,2 1.4,1 h 2.1 l 1.4,-1 1.4,-2"
    }, 
    {
      "width": "14", 
      "dec": "64", 
      "d": "M 9.3333334,10 8.8148148,7 7.7777778,6 H 6.2222222 L 5.1851852,7 4.6666667,8 4.1481482,11 v 3 l 0.5185185,2 1.037037,1 h 1.0370371 l 1.037037,-1 1.037037,-2 m 1.0370371,-8 -1.0370371,8 1.0370371,3 h 1.0370371 l 1.037037,-2 0.518518,-3 V 10 L 11.925926,7 11.407407,5 10.37037,3 9.3333334,2 7.7777778,1 H 6.2222222 L 4.6666667,2 3.6296296,3 2.5925926,5 2.0740741,7 1.5555556,10 v 3 l 0.5185185,3 0.5185185,2 1.037037,2 1.0370371,1 1.5555555,1 h 1.5555556 l 1.5555556,-1 1.0370366,-1 0.518519,-1"
    }, 
    {
      "width": "14", 
      "dec": "8212", 
      "d": "M 0,13 H 14"
    }, 
    {
      "width": "14", 
      "dec": "63", 
      "d": "M 2.3333333,6 V 5 L 3.1111111,3 3.8888889,2 5.4444445,1 h 3.1111111 l 1.5555554,1 0.777778,1 0.777778,2 V 7 L 10.888889,9 10.111111,10 7,12 v 3 M 7,20 6.2222222,21 7,22 7.7777778,21 7,20"
    }, 
    {
      "width": "14", 
      "dec": "114", 
      "d": "m 4.6666668,8 v 14 m 0,-8 L 5.8333335,11 8.1666669,9 10.5,8 H 13"
    }, 
    {
      "width": "14", 
      "dec": "126", 
      "d": "M 1.75,16 V 14 L 2.3333333,11 3.5,10 h 1.1666666 l 1.1666667,1 2.3333333,3 1.1666667,1 H 10.5 L 11.666667,14 12.25,12 m 0,0 v -2"
    }, 
    {
      "width": "14", 
      "dec": "68", 
      "d": "m 2.8,1 v 21 m 0,-21 h 4.9 l 2.1,1 1.4,2 0.7,2 0.7,3 v 5 l -0.7,3 -0.7,2 -1.4,2 -2.1,1 H 2.8"
    }, 
    {
      "width": "14", 
      "dec": "51", 
      "d": "m 3.5,1 h 7.7 L 7,9 h 2.1 l 1.4,1 0.7,1 0.7,3 v 2 l -0.7,3 -1.4,2 -2.1,1 H 5.6 L 3.5,21 2.8,20 2.1,18"
    }, 
    {
      "width": "14", 
      "dec": "62", 
      "d": "m 2.3333333,4 9.3333337,9 -9.3333337,9"
    }, 
    {
      "width": "14", 
      "dec": "37", 
      "d": "M 12.25,1 1.75,22 M 4.6666666,1 5.8333333,3 V 5 L 5.25,7 4.0833333,8 H 2.9166667 L 1.75,6 V 4 L 2.3333333,2 3.5,1 h 1.1666666 l 1.1666667,1 1.75,1 h 1.75 L 11.083333,2 12.25,1 M 9.9166666,15 8.75,16 8.1666666,18 v 2 l 1.1666667,2 H 10.5 L 11.666667,21 12.25,19 V 17 L 11.083333,15 H 9.9166666"
    }, 
    {
      "width": "14", 
      "dec": "8220", 
      "d": "M 3,7 4,6 5,7 4,8 3,7 V 5 L 5,3 M 9,7 10,6 11,7 10,8 9,7 V 5 l 2,-2"
    }, 
    {
      "width": "14", 
      "dec": "8208", 
      "d": "M 2.1538462,13 H 11.846154"
    }, 
    {
      "width": "14", 
      "dec": "79", 
      "d": "M 5.7272728,1 4.4545455,2 3.1818182,4 2.5454546,6 1.9090909,9 v 5 l 0.6363637,3 0.6363636,2 1.2727273,2 1.2727273,1 h 2.5454545 l 1.2727273,-1 1.2727274,-2 0.636364,-2 0.636363,-3 V 9 L 11.454546,6 10.818182,4 9.5454546,2 8.2727273,1 H 5.7272728"
    }, 
    {
      "width": "14", 
      "dec": "70", 
      "d": "M 3.5,1 V 22 M 3.5,1 H 14.875 M 3.5,11 h 7"
    }, 
    {
      "width": "14", 
      "dec": "187", 
      "d": "M 5.8333335,20 12.833334,14 5.8333335,8 M 1.1666667,20 8.1666669,14 1.1666667,8"
    }, 
    {
      "width": "14", 
      "dec": "118", 
      "d": "M 1.75,8 7,22 M 12.25,8 7,22"
    }, 
    {
      "width": "14", 
      "dec": "66", 
      "d": "m 2.8,1 v 21 m 0,-21 h 6.3 l 2.1,1 0.7,1 0.7,2 v 2 l -0.7,2 -0.7,1 -2.1,1 m -6.3,0 h 6.3 l 2.1,1 0.7,1 0.7,2 v 3 l -0.7,2 -0.7,1 -2.1,1 H 2.8"
    }, 
    {
      "width": "14", 
      "dec": "101", 
      "d": "M 1.6470588,14 H 11.529412 V 12 L 10.705882,10 9.8823529,9 8.2352941,8 H 5.7647059 L 4.1176471,9 2.4705882,11 1.6470588,14 v 2 l 0.8235294,3 1.6470589,2 1.6470588,1 h 2.4705882 l 1.6470588,-1 1.6470591,-2"
    }, 
    {
      "width": "14", 
      "dec": "86", 
      "d": "M 0.77777778,1 7,22 M 13.222222,1 7,22"
    }, 
    {
      "width": "14", 
      "dec": "122", 
      "d": "M 10.888889,8 2.3333333,22 m 0,-14 H 10.888889 M 2.3333333,22 h 8.5555557"
    }, 
    {
      "width": "14", 
      "dec": "125", 
      "d": "M 5,29 7,28 8,27 7,25 6,22 v -2 0 0 -2 L 7,15 M 7,15 9,13 7,11 M 7,11 6,7.9999997 v 0 -2 -2 l 1,-3 1,-2 -1,-1 -2,-1"
    }, 
    {
      "width": "14", 
      "dec": "38", 
      "d": "M 12.384615,10 V 9 L 11.846154,8 H 11.307692 L 10.769231,9 10.230769,11 9.1538462,16 8.0769231,19 7,21 5.9230769,22 H 3.7692308 L 2.6923077,21 2.1538462,20 1.6153846,18 V 16 L 2.1538462,14 2.6923077,13 6.4615385,9 7,8 7.5384616,6 V 4 L 7,2 5.9230769,1 4.8461539,2 4.3076923,4 v 2 l 0.5384616,3 1.076923,3 2.6923077,7 1.0769231,2 1.0769233,1 h 1.076923 l 0.538461,-1 v -1"
    }, 
    {
      "width": "14", 
      "dec": "42", 
      "d": "m 7,7 v 12 m -4.375,-9 8.75,6 m 0,-6 -8.75,6"
    }, 
    {
      "width": "14", 
      "dec": "169", 
      "d": "M 4.2608696,3 3.0434783,4 1.826087,6 1.2173913,8 0.60869565,12 v 3 l 0.60869565,4 0.6086957,2 1.8260869,3 2.4347826,1 h 1.8260869 l 2.4347826,-1 1.826087,-3 0.608696,-2 0.608695,-4 V 12 L 12.782609,8 12.173913,6 10.956522,4 9.7391304,3 7.9130434,2 H 6.0869565 L 4.2608696,3 M 10.956522,10 10.347826,8 9.1304348,6 7.9130434,5 H 6.0869565 L 4.8695652,6 3.6521739,8 3.0434783,11 v 5 l 0.6086956,3 1.2173913,2 1.2173913,1 h 1.8260869 l 1.2173914,-1 1.2173912,-2 0.608696,-2"
    }
  ], 
  "height": 40
}