<?xml version="1.0" encoding="UTF-8" standalone="no"?>
<svg
   xmlns:dc="http://purl.org/dc/elements/1.1/"
   xmlns:cc="http://creativecommons.org/ns#"
   xmlns:rdf="http://www.w3.org/1999/02/22-rdf-syntax-ns#"
   xmlns:svg="http://www.w3.org/2000/svg"
   xmlns="http://www.w3.org/2000/svg"
   xmlns:sodipodi="http://sodipodi.sourceforge.net/DTD/sodipodi-0.dtd"
   xmlns:inkscape="http://www.inkscape.org/namespaces/inkscape"
   data-dec="36"
   width="20"
   height="40"
   version="1.1"
   id="svg4"
   sodipodi:docname="36.svg"
   inkscape:version="0.92.4 (unknown)">
  <metadata
     id="metadata10">
    <rdf:RDF>
      <cc:Work
         rdf:about="">
        <dc:format>image/svg+xml</dc:format>
        <dc:type
           rdf:resource="http://purl.org/dc/dcmitype/StillImage" />
      </cc:Work>
    </rdf:RDF>
  </metadata>
  <defs
     id="defs8" />
  <sodipodi:namedview
     pagecolor="#ffffff"
     bordercolor="#666666"
     borderopacity="1"
     objecttolerance="10"
     gridtolerance="10"
     guidetolerance="10"
     inkscape:pageopacity="0"
     inkscape:pageshadow="2"
     inkscape:window-width="640"
     inkscape:window-height="480"
     id="namedview6"
     showgrid="false"
     inkscape:zoom="5.9"
     inkscape:cx="10"
     inkscape:cy="20"
     inkscape:window-x="0"
     inkscape:window-y="27"
     inkscape:window-maximized="0"
     inkscape:current-layer="svg4" />
  <path
     style="color:#000000;font-style:normal;font-variant:normal;font-weight:normal;font-stretch:normal;font-size:medium;line-height:normal;font-family:sans-serif;font-variant-ligatures:normal;font-variant-position:normal;font-variant-caps:normal;font-variant-numeric:normal;font-variant-alternates:normal;font-feature-settings:normal;text-indent:0;text-align:start;text-decoration:none;text-decoration-line:none;text-decoration-style:solid;text-decoration-color:#000000;letter-spacing:normal;word-spacing:normal;text-transform:none;writing-mode:lr-tb;direction:ltr;text-orientation:mixed;dominant-baseline:auto;baseline-shift:baseline;text-anchor:start;white-space:normal;shape-padding:0;clip-rule:nonzero;display:inline;overflow:visible;visibility:visible;opacity:1;isolation:auto;mix-blend-mode:normal;color-interpolation:sRGB;color-interpolation-filters:linearRGB;solid-color:#000000;solid-opacity:1;vector-effect:none;fill:#013272;fill-opacity:1;fill-rule:nonzero;stroke:none;stroke-width:1.5;stroke-linecap:round;stroke-linejoin:round;stroke-miterlimit:4;stroke-dasharray:none;stroke-dashoffset:0;stroke-opacity:1;color-rendering:auto;image-rendering:auto;shape-rendering:auto;text-rendering:auto;enable-background:accumulate"
     d="m 12.75,12.714844 v 8.24414 L 14.595703,20.34375 16.25,18.689453 V 15.3125 l -1.693359,-1.695312 z m -4,-1.341797 V 21.25 h 2.5 V 12.207031 Z M 7.25,2.0410156 5.4042969,2.65625 3.75,4.3105469 V 5.6875 L 5.4433594,7.3828125 7.25,8.2851562 Z M 8.75,1.75 v 7.0429688 l 2.5,0.8339843 V 1.75 Z M 7.9882812,-3.7597656 A 0.750075,0.750075 0 0 1 8.75,-3 v 3.25 h 2.5 V -3 a 0.750075,0.750075 0 1 1 1.5,0 v 3.4609375 l 2.486328,0.828125 A 0.750075,0.750075 0 0 1 15.53125,1.46875 l 2,2 A 0.750075,0.750075 0 0 1 17.75,4 v 1 a 0.750075,0.750075 0 0 1 -0.21875,0.53125 l -1,1 a 0.750075,0.750075 0 0 1 -1.0625,0 l -1,-1 a 0.750075,0.750075 0 0 1 0,-1.0625 L 15.4375,3.5 14.595703,2.65625 12.75,2.0410156 v 8.0859374 l 0.486328,0.162109 a 0.750075,0.750075 0 0 1 0.09961,0.04102 l 2,1 a 0.750075,0.750075 0 0 1 0.195312,0.138672 l 1,1 a 0.750075,0.750075 0 0 1 0.138672,0.195312 l 0.976562,1.953126 A 0.750075,0.750075 0 0 1 17.75,15.105469 V 19 a 0.750075,0.750075 0 0 1 -0.21875,0.53125 l -2,2 a 0.750075,0.750075 0 0 1 -0.294922,0.179688 L 12.75,22.539062 V 26 a 0.750075,0.750075 0 1 1 -1.5,0 V 22.75 H 8.75 V 26 a 0.750075,0.750075 0 1 1 -1.5,0 V 22.539062 L 4.7636719,21.710938 A 0.750075,0.750075 0 0 1 4.46875,21.53125 l -2,-2 A 0.750075,0.750075 0 0 1 2.25,19 v -1 a 0.750075,0.750075 0 0 1 0.21875,-0.53125 l 1,-1 a 0.750075,0.750075 0 0 1 1.0625,0 l 1,1 a 0.750075,0.750075 0 0 1 0,1.0625 L 4.5625,19.5 5.4042969,20.34375 7.25,20.958984 V 10.873047 L 6.7636719,10.710938 a 0.750075,0.750075 0 0 1 -0.099609,-0.04102 l -2,-1.0000001 A 0.750075,0.750075 0 0 1 4.46875,9.53125 l -1,-1 A 0.750075,0.750075 0 0 1 3.3300781,8.3359375 L 2.3535156,6.3828125 A 0.750075,0.750075 0 0 1 2.25,5.8945312 V 4 A 0.750075,0.750075 0 0 1 2.46875,3.46875 l 2,-2 A 0.750075,0.750075 0 0 1 4.7636719,1.2890625 L 7.25,0.4609375 V -3 a 0.750075,0.750075 0 0 1 0.7382812,-0.7597656 z"
     id="path2" />
</svg>
