<?xml version="1.0" encoding="UTF-8"?>
<glyph name="edieresis" format="1">
  <advance width="520"/>
  <unicode hex="00EB"/>
  <outline>
    <component base="dieresis" xOffset="73" yOffset="66"/>
    <component base="e"/>
  </outline>
  <lib>
    <dict>
      <key>com.fontlab.hintData</key>
      <dict>
        <key>hhints</key>
        <array>
          <dict>
            <key>position</key>
            <integer>0</integer>
            <key>width</key>
            <integer>23</integer>
          </dict>
          <dict>
            <key>position</key>
            <integer>173</integer>
            <key>width</key>
            <integer>117</integer>
          </dict>
          <dict>
            <key>position</key>
            <integer>441</integer>
            <key>width</key>
            <integer>22</integer>
          </dict>
          <dict>
            <key>position</key>
            <integer>521</integer>
            <key>width</key>
            <integer>174</integer>
          </dict>
        </array>
        <key>vhints</key>
        <array>
          <dict>
            <key>position</key>
            <integer>101</integer>
            <key>width</key>
            <integer>174</integer>
          </dict>
          <dict>
            <key>position</key>
            <integer>305</integer>
            <key>width</key>
            <integer>173</integer>
          </dict>
        </array>
      </dict>
    </dict>
  </lib>
</glyph>
