<?xml version="1.0" encoding="UTF-8"?>
<glyph name="dollar" format="2">
  <advance width="578"/>
  <unicode hex="0024"/>
  <outline>
    <contour>
      <point x="390" y="273" type="line"/>
      <point x="390" y="104" type="line"/>
      <point x="410" y="111" type="line"/>
      <point x="428" y="128" type="line"/>
      <point x="449" y="169" type="line"/>
      <point x="449" y="207" type="line"/>
      <point x="428" y="250" type="line"/>
      <point x="410" y="266" type="line"/>
    </contour>
    <contour>
      <point x="275" y="290" type="line"/>
      <point x="275" y="87" type="line"/>
      <point x="304" y="87" type="line"/>
      <point x="304" y="290" type="line"/>
    </contour>
    <contour>
      <point x="188" y="518" type="line"/>
      <point x="180" y="510" type="line"/>
      <point x="160" y="468" type="line"/>
      <point x="160" y="460" type="line"/>
      <point x="180" y="417" type="line"/>
      <point x="188" y="409" type="line"/>
    </contour>
    <contour>
      <point x="275" y="550" type="line"/>
      <point x="275" y="377" type="line"/>
      <point x="304" y="377" type="line"/>
      <point x="304" y="550" type="line"/>
    </contour>
    <contour>
      <point x="231" y="754" type="curve" smooth="yes"/>
      <point x="232" y="754" type="line" smooth="yes"/>
      <point x="256" y="754"/>
      <point x="275" y="735"/>
      <point x="275" y="711" type="curve" smooth="yes"/>
      <point x="275" y="710" type="line"/>
      <point x="275" y="637" type="line"/>
      <point x="304" y="637" type="line"/>
      <point x="304" y="710" type="line"/>
      <point x="304" y="711" type="line" smooth="yes"/>
      <point x="304" y="735"/>
      <point x="324" y="754"/>
      <point x="348" y="754" type="curve" smooth="yes"/>
      <point x="372" y="754"/>
      <point x="390" y="735"/>
      <point x="390" y="711" type="curve" smooth="yes"/>
      <point x="390" y="710" type="line"/>
      <point x="390" y="625" type="line"/>
      <point x="448" y="606" type="line" smooth="yes"/>
      <point x="454" y="604"/>
      <point x="461" y="599"/>
      <point x="465" y="595" type="curve" smooth="yes"/>
      <point x="494" y="566" type="line" smooth="yes"/>
      <point x="502" y="559"/>
      <point x="507" y="546"/>
      <point x="507" y="536" type="curve" smooth="yes"/>
      <point x="507" y="512"/>
      <point x="488" y="492"/>
      <point x="464" y="492" type="curve" smooth="yes"/>
      <point x="454" y="492"/>
      <point x="439" y="497"/>
      <point x="432" y="505" type="curve" smooth="yes"/>
      <point x="410" y="527" type="line"/>
      <point x="390" y="534" type="line"/>
      <point x="390" y="365" type="line"/>
      <point x="448" y="345" type="line" smooth="yes"/>
      <point x="454" y="343"/>
      <point x="461" y="340"/>
      <point x="465" y="336" type="curve" smooth="yes"/>
      <point x="494" y="306" type="line" smooth="yes"/>
      <point x="496" y="304"/>
      <point x="500" y="298"/>
      <point x="502" y="295" type="curve" smooth="yes"/>
      <point x="531" y="236" type="line" smooth="yes"/>
      <point x="533" y="230"/>
      <point x="536" y="224"/>
      <point x="536" y="218" type="curve" smooth="yes"/>
      <point x="536" y="160" type="line" smooth="yes"/>
      <point x="536" y="154"/>
      <point x="533" y="147"/>
      <point x="531" y="141" type="curve" smooth="yes"/>
      <point x="502" y="82" type="line" smooth="yes"/>
      <point x="500" y="79"/>
      <point x="496" y="74"/>
      <point x="494" y="72" type="curve" smooth="yes"/>
      <point x="465" y="42" type="line" smooth="yes"/>
      <point x="461" y="38"/>
      <point x="454" y="34"/>
      <point x="448" y="32" type="curve" smooth="yes"/>
      <point x="390" y="12" type="line"/>
      <point x="390" y="-72" type="line"/>
      <point x="390" y="-73" type="line" smooth="yes"/>
      <point x="390" y="-97"/>
      <point x="372" y="-116"/>
      <point x="348" y="-116" type="curve" smooth="yes"/>
      <point x="324" y="-116"/>
      <point x="304" y="-97"/>
      <point x="304" y="-73" type="curve" smooth="yes"/>
      <point x="304" y="-72" type="line"/>
      <point x="304" y="0" type="line"/>
      <point x="275" y="0" type="line"/>
      <point x="275" y="-72" type="line"/>
      <point x="275" y="-73" type="line" smooth="yes"/>
      <point x="275" y="-97"/>
      <point x="256" y="-116"/>
      <point x="232" y="-116" type="curve" smooth="yes"/>
      <point x="208" y="-116"/>
      <point x="188" y="-97"/>
      <point x="188" y="-73" type="curve" smooth="yes"/>
      <point x="188" y="-72" type="line"/>
      <point x="188" y="18" type="line"/>
      <point x="154" y="34" type="line" smooth="yes"/>
      <point x="151" y="36"/>
      <point x="145" y="40"/>
      <point x="143" y="42" type="curve" smooth="yes"/>
      <point x="85" y="100" type="line" smooth="yes"/>
      <point x="77" y="107"/>
      <point x="72" y="121"/>
      <point x="72" y="131" type="curve" smooth="yes"/>
      <point x="72" y="155"/>
      <point x="92" y="175"/>
      <point x="116" y="175" type="curve" smooth="yes"/>
      <point x="126" y="175"/>
      <point x="139" y="170"/>
      <point x="146" y="162" type="curve" smooth="yes"/>
      <point x="188" y="120" type="line"/>
      <point x="188" y="311" type="line"/>
      <point x="160" y="321" type="line" smooth="yes"/>
      <point x="154" y="323"/>
      <point x="147" y="327"/>
      <point x="143" y="331" type="curve" smooth="yes"/>
      <point x="114" y="361" type="line" smooth="yes"/>
      <point x="112" y="363"/>
      <point x="108" y="369"/>
      <point x="106" y="372" type="curve" smooth="yes"/>
      <point x="77" y="430" type="line" smooth="yes"/>
      <point x="75" y="436"/>
      <point x="73" y="443"/>
      <point x="73" y="449" type="curve" smooth="yes"/>
      <point x="73" y="478" type="line" smooth="yes"/>
      <point x="73" y="484"/>
      <point x="75" y="491"/>
      <point x="77" y="497" type="curve" smooth="yes"/>
      <point x="106" y="556" type="line" smooth="yes"/>
      <point x="108" y="559"/>
      <point x="112" y="564"/>
      <point x="114" y="566" type="curve" smooth="yes"/>
      <point x="143" y="595" type="line" smooth="yes"/>
      <point x="145" y="597"/>
      <point x="151" y="602"/>
      <point x="154" y="604" type="curve" smooth="yes"/>
      <point x="188" y="620" type="line"/>
      <point x="188" y="710" type="line"/>
      <point x="188" y="711" type="line" smooth="yes"/>
      <point x="188" y="734"/>
      <point x="208" y="754"/>
    </contour>
  </outline>
  <lib>
    <dict>
      <key>com.fontlab.hintData</key>
      <dict>
        <key>hhints</key>
        <array>
          <dict>
            <key>position</key>
            <integer>0</integer>
            <key>width</key>
            <integer>87</integer>
          </dict>
          <dict>
            <key>position</key>
            <integer>290</integer>
            <key>width</key>
            <integer>87</integer>
          </dict>
          <dict>
            <key>position</key>
            <integer>492</integer>
            <key>width</key>
            <integer>23</integer>
          </dict>
          <dict>
            <key>position</key>
            <integer>550</integer>
            <key>width</key>
            <integer>87</integer>
          </dict>
        </array>
        <key>vhints</key>
        <array>
          <dict>
            <key>position</key>
            <integer>188</integer>
            <key>width</key>
            <integer>87</integer>
          </dict>
          <dict>
            <key>position</key>
            <integer>304</integer>
            <key>width</key>
            <integer>87</integer>
          </dict>
          <dict>
            <key>position</key>
            <integer>449</integer>
            <key>width</key>
            <integer>87</integer>
          </dict>
        </array>
      </dict>
    </dict>
  </lib>
</glyph>
