<?xml version="1.0" encoding="UTF-8" standalone="no"?>
<svg
   xmlns:dc="http://purl.org/dc/elements/1.1/"
   xmlns:cc="http://creativecommons.org/ns#"
   xmlns:rdf="http://www.w3.org/1999/02/22-rdf-syntax-ns#"
   xmlns:svg="http://www.w3.org/2000/svg"
   xmlns="http://www.w3.org/2000/svg"
   xmlns:sodipodi="http://sodipodi.sourceforge.net/DTD/sodipodi-0.dtd"
   xmlns:inkscape="http://www.inkscape.org/namespaces/inkscape"
   data-dec="81"
   width="24"
   height="40"
   version="1.1"
   id="svg4"
   sodipodi:docname="81.svg"
   inkscape:version="0.92.4 5da689c313, 2019-01-14">
  <metadata
     id="metadata10">
    <rdf:RDF>
      <cc:Work
         rdf:about="">
        <dc:format>image/svg+xml</dc:format>
        <dc:type
           rdf:resource="http://purl.org/dc/dcmitype/StillImage" />
        <dc:title></dc:title>
      </cc:Work>
    </rdf:RDF>
  </metadata>
  <defs
     id="defs8" />
  <sodipodi:namedview
     pagecolor="#ffffff"
     bordercolor="#666666"
     borderopacity="1"
     objecttolerance="10"
     gridtolerance="10"
     guidetolerance="10"
     inkscape:pageopacity="0"
     inkscape:pageshadow="2"
     inkscape:window-width="1920"
     inkscape:window-height="1043"
     id="namedview6"
     showgrid="false"
     inkscape:zoom="5.9"
     inkscape:cx="12"
     inkscape:cy="20"
     inkscape:window-x="0"
     inkscape:window-y="37"
     inkscape:window-maximized="0"
     inkscape:current-layer="svg4" />
  <path
     style="color:#000000;font-style:normal;font-variant:normal;font-weight:normal;font-stretch:normal;font-size:medium;line-height:normal;font-family:sans-serif;font-variant-ligatures:normal;font-variant-position:normal;font-variant-caps:normal;font-variant-numeric:normal;font-variant-alternates:normal;font-feature-settings:normal;text-indent:0;text-align:start;text-decoration:none;text-decoration-line:none;text-decoration-style:solid;text-decoration-color:#000000;letter-spacing:normal;word-spacing:normal;text-transform:none;writing-mode:lr-tb;direction:ltr;text-orientation:mixed;dominant-baseline:auto;baseline-shift:baseline;text-anchor:start;white-space:normal;shape-padding:0;clip-rule:nonzero;display:inline;overflow:visible;visibility:visible;opacity:1;isolation:auto;mix-blend-mode:normal;color-interpolation:sRGB;color-interpolation-filters:linearRGB;solid-color:#000000;solid-opacity:1;vector-effect:none;fill:#000000;fill-opacity:1;fill-rule:nonzero;stroke:none;stroke-width:0.5;stroke-linecap:round;stroke-linejoin:round;stroke-miterlimit:4;stroke-dasharray:none;stroke-dashoffset:0;stroke-opacity:1;color-rendering:auto;image-rendering:auto;shape-rendering:auto;text-rendering:auto;enable-background:accumulate"
     d="M 11.712891,22.25 12.630859,22.984375 11.896484,22.25 Z m 5.771484,-20.1210938 1.693359,1.6933594 a 0.250025,0.250025 0 0 1 0.04492,0.066406 l 1,2 a 0.250025,0.250025 0 0 1 0.01367,0.033203 l 1,3 A 0.250025,0.250025 0 0 1 21.25,9 v 5 a 0.250025,0.250025 0 0 1 -0.01367,0.07813 l -1,3 a 0.250025,0.250025 0 0 1 -0.01367,0.0332 l -1,2 a 0.250025,0.250025 0 0 1 -0.04492,0.06641 l -1.693359,1.69336 0.388672,-0.09766 1.921875,-1.921876 0.974609,-1.947265 L 21.75,13.958984 V 9.0410156 L 20.767578,6.0957031 19.794922,4.1484375 17.873047,2.2265625 Z m -10.96875,0 -0.3886719,0.097656 -1.921875,1.921875 L 3.2324219,6.0957031 2.25,9.0410156 v 4.9179684 l 0.9824219,2.945313 0.9726562,1.947265 1.921875,1.921876 0.3886719,0.09766 -1.6933594,-1.69336 a 0.250025,0.250025 0 0 1 -0.044922,-0.06641 l -1,-2 a 0.250025,0.250025 0 0 1 -0.013672,-0.0332 l -1,-3 A 0.250025,0.250025 0 0 1 2.75,14 V 9 a 0.250025,0.250025 0 0 1 0.013672,-0.078125 l 1,-3 a 0.250025,0.250025 0 0 1 0.013672,-0.033203 l 1,-2 a 0.250025,0.250025 0 0 1 0.044922,-0.066406 z M 10.037109,1.25 7.1347656,2.21875 5.2050781,4.1484375 4.2324219,6.0957031 3.25,9.0410156 v 4.9179684 l 0.9824219,2.945313 0.9726562,1.947265 1.9296875,1.929688 2.9023434,0.96875 h 0.931641 a 0.250025,0.250025 0 0 1 0.0625,0 H 12 h 0.02148 1.941407 l 2.902343,-0.96875 1.929688,-1.929688 0.972656,-1.947265 L 20.75,13.958984 V 9.0410156 L 19.767578,6.0957031 18.794922,4.1484375 16.865234,2.21875 13.962891,1.25 Z M 10.011719,0.74804688 A 0.250025,0.250025 0 0 1 10.023438,0.75 h 3.957031 a 0.250025,0.250025 0 0 1 0.03125,0 0.250025,0.250025 0 0 1 0.02344,0.001953 0.250025,0.250025 0 0 1 0.01953,0.003906 0.250025,0.250025 0 0 1 0.0059,0.001953 l 4,1 a 0.250025,0.250025 0 0 1 0.117187,0.064453 l 2,2 a 0.250025,0.250025 0 0 1 0.04492,0.066406 l 1,2 a 0.250025,0.250025 0 0 1 0.01367,0.033203 l 1,3 A 0.250025,0.250025 0 0 1 22.25,9 v 5 a 0.250025,0.250025 0 0 1 -0.01367,0.07813 l -0.988281,2.962891 a 0.250025,0.250025 0 0 1 -0.0059,0.02344 0.250025,0.250025 0 0 1 -0.01172,0.03125 0.250025,0.250025 0 0 1 -0.002,0.0059 0.250025,0.250025 0 0 1 -0.0059,0.0098 0.250025,0.250025 0 0 1 -0.01367,0.0293 l -0.002,0.0039 -0.984375,1.966797 a 0.250025,0.250025 0 0 1 -0.04492,0.06641 l -2,2 a 0.250025,0.250025 0 0 1 -0.117187,0.06445 l -3.994141,0.998046 -0.0059,0.002 a 0.250025,0.250025 0 0 1 -0.01172,0.002 0.250025,0.250025 0 0 1 -0.02344,0.0039 0.250025,0.250025 0 0 1 -0.01172,0.002 0.250025,0.250025 0 0 1 -0.01367,0 0.250025,0.250025 0 0 1 -0.02344,0 h -1.371093 l 3.521484,3.523438 3.84375,0.960937 1.917969,-0.957031 a 0.250025,0.250025 0 0 1 0.222656,0.445312 l -2,1 a 0.250025,0.250025 0 0 1 -0.002,0.002 0.250025,0.250025 0 0 1 -0.04687,0.01758 0.250025,0.250025 0 0 1 -0.02344,0.0039 0.250025,0.250025 0 0 1 -0.09961,-0.0039 l -4,-1 a 0.250025,0.250025 0 0 1 -0.0098,-0.002 0.250025,0.250025 0 0 1 -0.02149,-0.0078 0.250025,0.250025 0 0 1 -0.002,0 0.250025,0.250025 0 0 1 -0.0098,-0.0059 0.250025,0.250025 0 0 1 -0.01367,-0.0059 0.250025,0.250025 0 0 1 -0.01953,-0.01172 0.250025,0.250025 0 0 1 -0.002,0 0.250025,0.250025 0 0 1 -0.01367,-0.01172 0.250025,0.250025 0 0 1 -0.0039,-0.002 l -0.002,-0.002 a 0.250025,0.250025 0 0 1 -0.01953,-0.01563 L 10.912109,22.25 H 10.041016 L 7.1347656,23.21875 6.1777344,24.177734 A 0.25135412,0.25135412 0 1 1 5.8222656,23.822266 l 1,-1 a 0.250025,0.250025 0 0 1 0.099609,-0.05859 l 2.1875,-0.728516 -3.1699219,-0.792968 a 0.250025,0.250025 0 0 1 -0.1171875,-0.06445 l -2,-2 a 0.250025,0.250025 0 0 1 -0.044922,-0.06641 l -1,-2 a 0.250025,0.250025 0 0 1 -0.013672,-0.0332 l -1,-3 A 0.250025,0.250025 0 0 1 1.75,14 V 9 a 0.250025,0.250025 0 0 1 0.013672,-0.078125 l 1,-3 a 0.250025,0.250025 0 0 1 0.013672,-0.033203 l 1,-2 a 0.250025,0.250025 0 0 1 0.044922,-0.066406 l 2,-2 A 0.250025,0.250025 0 0 1 5.9394531,1.7578125 L 9.9335938,0.75976562 a 0.250025,0.250025 0 0 1 0.017578,-0.003906 0.250025,0.250025 0 0 1 0.023437,-0.003906 A 0.250025,0.250025 0 0 1 10,0.75 a 0.250025,0.250025 0 0 1 0.01172,-0.001953 z"
     id="path2" />
</svg>
