<?xml version="1.0" encoding="UTF-8" standalone="no"?>
<svg
   xmlns:dc="http://purl.org/dc/elements/1.1/"
   xmlns:cc="http://creativecommons.org/ns#"
   xmlns:rdf="http://www.w3.org/1999/02/22-rdf-syntax-ns#"
   xmlns:svg="http://www.w3.org/2000/svg"
   xmlns="http://www.w3.org/2000/svg"
   xmlns:sodipodi="http://sodipodi.sourceforge.net/DTD/sodipodi-0.dtd"
   xmlns:inkscape="http://www.inkscape.org/namespaces/inkscape"
   data-dec="48"
   id="dec_48"
   width="20"
   height="40"
   version="1.1"
   sodipodi:docname="48.svg"
   inkscape:version="0.91 r13725">
  <metadata
     id="metadata9">
    <rdf:RDF>
      <cc:Work
         rdf:about="">
        <dc:format>image/svg+xml</dc:format>
        <dc:type
           rdf:resource="http://purl.org/dc/dcmitype/StillImage" />
      </cc:Work>
    </rdf:RDF>
  </metadata>
  <defs
     id="defs7" />
  <sodipodi:namedview
     pagecolor="#ffffff"
     bordercolor="#666666"
     borderopacity="1"
     objecttolerance="10"
     gridtolerance="10"
     guidetolerance="10"
     inkscape:pageopacity="0"
     inkscape:pageshadow="2"
     inkscape:window-width="1333"
     inkscape:window-height="744"
     id="namedview5"
     showgrid="true"
     inkscape:zoom="23.6"
     inkscape:cx="6.2923729"
     inkscape:cy="26.461865"
     inkscape:window-x="33"
     inkscape:window-y="924"
     inkscape:window-maximized="1"
     inkscape:current-layer="dec_48">
    <inkscape:grid
       type="xygrid"
       id="grid11" />
  </sodipodi:namedview>
  <path
     style="color:#000000;font-style:normal;font-variant:normal;font-weight:normal;font-stretch:normal;font-size:medium;line-height:normal;font-family:sans-serif;text-indent:0;text-align:start;text-decoration:none;text-decoration-line:none;text-decoration-style:solid;text-decoration-color:#000000;letter-spacing:normal;word-spacing:normal;text-transform:none;direction:ltr;block-progression:tb;writing-mode:lr-tb;baseline-shift:baseline;text-anchor:start;white-space:normal;clip-rule:nonzero;display:inline;overflow:visible;visibility:visible;opacity:1;isolation:auto;mix-blend-mode:normal;color-interpolation:sRGB;color-interpolation-filters:linearRGB;solid-color:#000000;solid-opacity:1;fill:#000000;fill-opacity:1;fill-rule:nonzero;stroke:none;stroke-width:1;stroke-linecap:round;stroke-linejoin:round;stroke-miterlimit:4;stroke-dasharray:none;stroke-dashoffset:0;stroke-opacity:1;color-rendering:auto;image-rendering:auto;shape-rendering:auto;text-rendering:auto;enable-background:accumulate"
     d="M 8.9746094 0.49804688 A 0.50005 0.50005 0 0 0 8.9492188 0.50195312 A 0.50005 0.50005 0 0 0 8.9140625 0.50585938 A 0.50005 0.50005 0 0 0 8.8046875 0.53710938 A 0.50005 0.50005 0 0 0 8.8007812 0.5390625 L 5.8417969 1.5253906 A 0.50005 0.50005 0 0 0 5.5839844 1.7226562 L 3.5839844 4.7226562 A 0.50005 0.50005 0 0 0 3.5097656 4.9023438 L 2.5097656 9.9023438 A 0.50005 0.50005 0 0 0 2.5 10 L 2.5 13 A 0.50005 0.50005 0 0 0 2.5097656 13.097656 L 3.5097656 18.097656 A 0.50005 0.50005 0 0 0 3.5839844 18.277344 L 4.53125 19.699219 A 0.50005 0.50005 0 0 0 4.5332031 19.703125 A 0.50005 0.50005 0 0 0 4.6386719 19.859375 L 5.5839844 21.277344 A 0.50005 0.50005 0 0 0 5.8417969 21.474609 L 8.7910156 22.457031 L 8.796875 22.458984 A 0.50005 0.50005 0 0 0 9.0839844 22.5 L 11.988281 22.5 L 12 22.5 A 0.50005 0.50005 0 0 0 12.039062 22.498047 A 0.50005 0.50005 0 0 0 12.085938 22.492188 A 0.50005 0.50005 0 0 0 12.087891 22.492188 A 0.50005 0.50005 0 0 0 12.099609 22.490234 A 0.50005 0.50005 0 0 0 12.136719 22.480469 A 0.50005 0.50005 0 0 0 12.148438 22.478516 A 0.50005 0.50005 0 0 0 12.158203 22.474609 L 12.164062 22.472656 A 0.50005 0.50005 0 0 0 12.195312 22.460938 L 15.158203 21.474609 A 0.50005 0.50005 0 0 0 15.416016 21.277344 L 17.416016 18.277344 A 0.50005 0.50005 0 0 0 17.490234 18.097656 L 18.490234 13.097656 A 0.50005 0.50005 0 0 0 18.5 13 L 18.5 10 A 0.50005 0.50005 0 0 0 18.490234 9.9023438 L 17.490234 4.9023438 A 0.50005 0.50005 0 0 0 17.416016 4.7226562 L 15.416016 1.7226562 A 0.50005 0.50005 0 0 0 15.158203 1.5253906 L 12.177734 0.53320312 A 0.50005 0.50005 0 0 0 12.132812 0.51953125 A 0.50005 0.50005 0 0 0 12.130859 0.51757812 A 0.50005 0.50005 0 0 0 12.109375 0.51171875 A 0.50005 0.50005 0 0 0 12.101562 0.50976562 A 0.50005 0.50005 0 0 0 12.064453 0.50390625 A 0.50005 0.50005 0 0 0 12.060547 0.50390625 A 0.50005 0.50005 0 0 0 12.03125 0.50195312 A 0.50005 0.50005 0 0 0 12.011719 0.5 A 0.50005 0.50005 0 0 0 12 0.5 L 10.048828 0.5 A 0.50005 0.50005 0 0 0 9.9570312 0.5 L 9.0488281 0.5 A 0.50005 0.50005 0 0 0 8.9746094 0.49804688 z M 10.5 2.890625 L 12.826172 3.4726562 L 13.658203 3.8886719 L 14.529297 5.1953125 L 15.5 10.048828 L 15.5 12.951172 L 14.529297 17.804688 L 13.314453 19.626953 L 10.548828 20.179688 L 7.8261719 19.599609 L 6.46875 17.791016 L 5.5 12.951172 L 5.5 10.048828 L 6.4707031 5.1953125 L 7.3417969 3.8886719 L 8.1738281 3.4726562 L 10.5 2.890625 z "
     id="path13" />
</svg>
