<?xml version="1.0" encoding="UTF-8" standalone="no"?>
<svg
   xmlns:dc="http://purl.org/dc/elements/1.1/"
   xmlns:cc="http://creativecommons.org/ns#"
   xmlns:rdf="http://www.w3.org/1999/02/22-rdf-syntax-ns#"
   xmlns:svg="http://www.w3.org/2000/svg"
   xmlns="http://www.w3.org/2000/svg"
   xmlns:sodipodi="http://sodipodi.sourceforge.net/DTD/sodipodi-0.dtd"
   xmlns:inkscape="http://www.inkscape.org/namespaces/inkscape"
   data-dec="169"
   width="23"
   height="40"
   version="1.1"
   id="svg4"
   sodipodi:docname="169.svg"
   inkscape:version="0.92.4 (unknown)">
  <metadata
     id="metadata10">
    <rdf:RDF>
      <cc:Work
         rdf:about="">
        <dc:format>image/svg+xml</dc:format>
        <dc:type
           rdf:resource="http://purl.org/dc/dcmitype/StillImage" />
      </cc:Work>
    </rdf:RDF>
  </metadata>
  <defs
     id="defs8" />
  <sodipodi:namedview
     pagecolor="#ffffff"
     bordercolor="#666666"
     borderopacity="1"
     objecttolerance="10"
     gridtolerance="10"
     guidetolerance="10"
     inkscape:pageopacity="0"
     inkscape:pageshadow="2"
     inkscape:window-width="640"
     inkscape:window-height="480"
     id="namedview6"
     showgrid="false"
     inkscape:zoom="5.9"
     inkscape:cx="11.5"
     inkscape:cy="20"
     inkscape:window-x="0"
     inkscape:window-y="27"
     inkscape:window-maximized="0"
     inkscape:current-layer="svg4" />
  <path
     style="color:#000000;font-style:normal;font-variant:normal;font-weight:normal;font-stretch:normal;font-size:medium;line-height:normal;font-family:sans-serif;font-variant-ligatures:normal;font-variant-position:normal;font-variant-caps:normal;font-variant-numeric:normal;font-variant-alternates:normal;font-feature-settings:normal;text-indent:0;text-align:start;text-decoration:none;text-decoration-line:none;text-decoration-style:solid;text-decoration-color:#000000;letter-spacing:normal;word-spacing:normal;text-transform:none;writing-mode:lr-tb;direction:ltr;text-orientation:mixed;dominant-baseline:auto;baseline-shift:baseline;text-anchor:start;white-space:normal;shape-padding:0;clip-rule:nonzero;display:inline;overflow:visible;visibility:visible;opacity:1;isolation:auto;mix-blend-mode:normal;color-interpolation:sRGB;color-interpolation-filters:linearRGB;solid-color:#000000;solid-opacity:1;vector-effect:none;fill:#013272;fill-opacity:1;fill-rule:nonzero;stroke:none;stroke-width:1.5;stroke-linecap:round;stroke-linejoin:round;stroke-miterlimit:4;stroke-dasharray:none;stroke-dashoffset:0;stroke-opacity:1;color-rendering:auto;image-rendering:auto;shape-rendering:auto;text-rendering:auto;enable-background:accumulate"
     d="m 10,4.25 h 3 a 0.750075,0.750075 0 0 1 0.335938,0.080078 l 2,1 A 0.750075,0.750075 0 0 1 15.53125,5.46875 l 2,2 a 0.750075,0.750075 0 0 1 0.138672,0.1953125 l 1,2 A 0.750075,0.750075 0 1 1 17.330078,10.335938 L 16.382812,8.4433594 14.556641,6.6171875 12.822266,5.75 H 10.177734 L 8.4433594,6.6171875 6.65625,8.4042969 5.75,11.121094 v 4.757812 L 6.65625,18.595703 8.4433594,20.382812 10.177734,21.25 h 2.644532 l 1.734375,-0.867188 1.826171,-1.826171 0.947266,-1.892579 a 0.750075,0.750075 0 1 1 1.339844,0.671876 l -1,2 A 0.750075,0.750075 0 0 1 17.53125,19.53125 l -2,2 a 0.750075,0.750075 0 0 1 -0.195312,0.138672 l -2,1 A 0.750075,0.750075 0 0 1 13,22.75 h -3 a 0.750075,0.750075 0 0 1 -0.3359375,-0.08008 l -2,-1 A 0.750075,0.750075 0 0 1 7.46875,21.53125 l -2,-2 A 0.750075,0.750075 0 0 1 5.2890625,19.236328 l -1,-3 A 0.750075,0.750075 0 0 1 4.25,16 v -5 a 0.750075,0.750075 0 0 1 0.039063,-0.236328 l 1,-3.0000001 A 0.750075,0.750075 0 0 1 5.46875,7.46875 l 2,-2 A 0.750075,0.750075 0 0 1 7.6640625,5.3300781 l 2,-1 A 0.750075,0.750075 0 0 1 10,4.25 Z M 10.121094,2.75 7.2890625,3.6933594 5.4433594,4.6171875 3.6171875,6.4433594 2.7070312,8.2617188 1.75,12.091797 v 2.816406 l 0.9570312,3.830078 0.9101563,1.81836 2.765625,2.765625 L 10.091797,24.25 h 2.816406 l 3.708985,-0.927734 2.765624,-2.765625 0.910157,-1.81836 L 21.25,14.908203 V 12.091797 L 20.292969,8.2617188 19.382812,6.4433594 17.556641,4.6171875 15.712891,3.6953125 12.878906,2.75 Z M 10,1.25 h 3 a 0.750075,0.750075 0 0 1 0.236328,0.039063 l 3,1 a 0.750075,0.750075 0 0 1 0.09961,0.041016 l 2,1 A 0.750075,0.750075 0 0 1 18.53125,3.46875 l 2,2 a 0.750075,0.750075 0 0 1 0.138672,0.1953125 l 1,2 a 0.750075,0.750075 0 0 1 0.05859,0.1542969 l 1,3.9999996 A 0.750075,0.750075 0 0 1 22.75,12 v 3 a 0.750075,0.750075 0 0 1 -0.02148,0.181641 l -1,4 a 0.750075,0.750075 0 0 1 -0.05859,0.154297 l -1,2 A 0.750075,0.750075 0 0 1 20.53125,21.53125 l -3,3 a 0.750075,0.750075 0 0 1 -0.349609,0.197266 l -4,1 A 0.750075,0.750075 0 0 1 13,25.75 h -3 a 0.750075,0.750075 0 0 1 -0.1816406,-0.02148 l -4,-1 A 0.750075,0.750075 0 0 1 5.46875,24.53125 l -3,-3 A 0.750075,0.750075 0 0 1 2.3300781,21.335938 l -1,-2 a 0.750075,0.750075 0 0 1 -0.058594,-0.154297 l -1.00000002,-4 A 0.750075,0.750075 0 0 1 0.25,15 v -3 a 0.750075,0.750075 0 0 1 0.0214844,-0.181641 L 1.2714844,7.8183594 a 0.750075,0.750075 0 0 1 0.058594,-0.1542969 l 1,-2 A 0.750075,0.750075 0 0 1 2.46875,5.46875 l 2,-2 A 0.750075,0.750075 0 0 1 4.6640625,3.3300781 L 6.609375,2.3574219 a 0.750075,0.750075 0 0 1 0.054687,-0.027344 0.750075,0.750075 0 0 1 0.042969,-0.019531 0.750075,0.750075 0 0 1 0.056641,-0.021484 0.750075,0.750075 0 0 1 0.044922,-0.015625 L 9.7636719,1.2890625 A 0.750075,0.750075 0 0 1 10,1.25 Z"
     id="path2" />
</svg>
