<?xml version="1.0" encoding="UTF-8" standalone="no"?>
<svg
   xmlns:dc="http://purl.org/dc/elements/1.1/"
   xmlns:cc="http://creativecommons.org/ns#"
   xmlns:rdf="http://www.w3.org/1999/02/22-rdf-syntax-ns#"
   xmlns:svg="http://www.w3.org/2000/svg"
   xmlns="http://www.w3.org/2000/svg"
   xmlns:sodipodi="http://sodipodi.sourceforge.net/DTD/sodipodi-0.dtd"
   xmlns:inkscape="http://www.inkscape.org/namespaces/inkscape"
   data-dec="110"
   width="24"
   height="40"
   version="1.1"
   id="svg4"
   sodipodi:docname="110.svg"
   inkscape:version="0.92.4 (unknown)">
  <metadata
     id="metadata10">
    <rdf:RDF>
      <cc:Work
         rdf:about="">
        <dc:format>image/svg+xml</dc:format>
        <dc:type
           rdf:resource="http://purl.org/dc/dcmitype/StillImage" />
      </cc:Work>
    </rdf:RDF>
  </metadata>
  <defs
     id="defs8" />
  <sodipodi:namedview
     pagecolor="#ffffff"
     bordercolor="#666666"
     borderopacity="1"
     objecttolerance="10"
     gridtolerance="10"
     guidetolerance="10"
     inkscape:pageopacity="0"
     inkscape:pageshadow="2"
     inkscape:window-width="640"
     inkscape:window-height="480"
     id="namedview6"
     showgrid="false"
     inkscape:zoom="5.9"
     inkscape:cx="12"
     inkscape:cy="20"
     inkscape:window-x="0"
     inkscape:window-y="27"
     inkscape:window-maximized="0"
     inkscape:current-layer="svg4" />
  <path
     style="color:#000000;font-style:normal;font-variant:normal;font-weight:normal;font-stretch:normal;font-size:medium;line-height:normal;font-family:sans-serif;font-variant-ligatures:normal;font-variant-position:normal;font-variant-caps:normal;font-variant-numeric:normal;font-variant-alternates:normal;font-feature-settings:normal;text-indent:0;text-align:start;text-decoration:none;text-decoration-line:none;text-decoration-style:solid;text-decoration-color:#000000;letter-spacing:normal;word-spacing:normal;text-transform:none;writing-mode:lr-tb;direction:ltr;text-orientation:mixed;dominant-baseline:auto;baseline-shift:baseline;text-anchor:start;white-space:normal;shape-padding:0;clip-rule:nonzero;display:inline;overflow:visible;visibility:visible;opacity:1;isolation:auto;mix-blend-mode:normal;color-interpolation:sRGB;color-interpolation-filters:linearRGB;solid-color:#000000;solid-opacity:1;vector-effect:none;fill:#013272;fill-opacity:1;fill-rule:nonzero;stroke:none;stroke-width:2;stroke-linecap:round;stroke-linejoin:round;stroke-miterlimit:4;stroke-dasharray:none;stroke-dashoffset:0;stroke-opacity:1;color-rendering:auto;image-rendering:auto;shape-rendering:auto;text-rendering:auto;enable-background:accumulate"
     d="m 4,7 h 2 a 1.0001,1.0001 0 0 1 0.7070312,0.2929688 l 0.8964844,0.8964843 a 1.0001,1.0001 0 0 1 0.3300782,0.4394531 l 0.9609374,1.9238278 a 1.0001,1.0001 0 0 1 0.072266,0.195313 l 0.2011719,-0.302735 a 1.0001,1.0001 0 0 1 0.125,-0.152343 L 11.292969,8.2929688 a 1.0001,1.0001 0 0 1 0.259765,-0.1875 l 2,-1 A 1.0001,1.0001 0 0 1 14,7 h 2 a 1.0001,1.0001 0 0 1 0.447266,0.1054688 l 1.853515,0.9277343 a 1.0001,1.0001 0 0 1 0.632813,0.5957031 l 0.960937,1.9238278 A 1.0001,1.0001 0 0 1 20,11 v 3 a 1.0001,1.0001 0 0 1 -0.07227,0.371094 L 18,19.191406 v 1.394532 L 18.414062,21 h 1.171876 l 1.591796,-1.591797 0.927735,-1.855469 a 1.0001163,1.0001163 0 1 1 1.789062,0.894532 l -1,2 a 1.0001,1.0001 0 0 1 -0.1875,0.259765 l -2,2 A 1.0001,1.0001 0 0 1 20,23 H 18 A 1.0001,1.0001 0 0 1 17.292969,22.707031 L 16.396484,21.810547 A 1.0001,1.0001 0 0 1 16.066406,21.371094 L 15.105469,19.447266 A 1.0001,1.0001 0 0 1 15,19 v -3 a 1.0001,1.0001 0 0 1 0.07227,-0.371094 L 17,10.808594 V 9.6191406 L 15.763672,9 h -1.527344 l -1.644531,0.8222656 -1.814453,1.8144534 -1.8476565,2.773437 -1.9199219,7.673828 a 1.0001,1.0001 0 0 1 0,0.0039 1.0001,1.0001 0 0 1 -0.3144531,0.642578 1.0001,1.0001 0 0 1 -0.00586,0.0059 1.0001,1.0001 0 0 1 -0.068359,0.05859 1.0001,1.0001 0 0 1 -0.054688,0.03906 A 1.0001,1.0001 0 0 1 5.8339844,23 H 5.1660156 A 1.0001,1.0001 0 0 1 4.8339844,23 H 4 A 1.0001,1.0001 0 0 1 3.0390625,21.724609 L 5.0332031,14.742188 6,10.875 V 9.4140625 L 5.5859375,9 H 4.4140625 L 2.8222656,10.591797 1.8945312,12.447266 A 1.0001165,1.0001165 0 1 1 0.10546875,11.552734 L 1.1054688,9.5527344 a 1.0001,1.0001 0 0 1 0.1875,-0.2597656 l 2,-2 A 1.0001,1.0001 0 0 1 4,7 Z"
     id="path2" />
</svg>
