<?xml version="1.0" encoding="UTF-8" standalone="no"?>
<svg
   xmlns:dc="http://purl.org/dc/elements/1.1/"
   xmlns:cc="http://creativecommons.org/ns#"
   xmlns:rdf="http://www.w3.org/1999/02/22-rdf-syntax-ns#"
   xmlns:svg="http://www.w3.org/2000/svg"
   xmlns="http://www.w3.org/2000/svg"
   xmlns:sodipodi="http://sodipodi.sourceforge.net/DTD/sodipodi-0.dtd"
   xmlns:inkscape="http://www.inkscape.org/namespaces/inkscape"
   data-dec="101"
   id="dec_101"
   width="18"
   height="40"
   version="1.1"
   sodipodi:docname="101.svg"
   inkscape:version="0.91 r13725">
  <metadata
     id="metadata9">
    <rdf:RDF>
      <cc:Work
         rdf:about="">
        <dc:format>image/svg+xml</dc:format>
        <dc:type
           rdf:resource="http://purl.org/dc/dcmitype/StillImage" />
      </cc:Work>
    </rdf:RDF>
  </metadata>
  <defs
     id="defs7" />
  <sodipodi:namedview
     pagecolor="#ffffff"
     bordercolor="#666666"
     borderopacity="1"
     objecttolerance="10"
     gridtolerance="10"
     guidetolerance="10"
     inkscape:pageopacity="0"
     inkscape:pageshadow="2"
     inkscape:window-width="1407"
     inkscape:window-height="876"
     id="namedview5"
     showgrid="true"
     inkscape:zoom="23.6"
     inkscape:cx="-2.2288136"
     inkscape:cy="19.682204"
     inkscape:window-x="33"
     inkscape:window-y="24"
     inkscape:window-maximized="1"
     inkscape:current-layer="dec_101">
    <inkscape:grid
       type="xygrid"
       id="grid11" />
  </sodipodi:namedview>
  <path
     style="color:#000000;font-style:normal;font-variant:normal;font-weight:normal;font-stretch:normal;font-size:medium;line-height:normal;font-family:sans-serif;text-indent:0;text-align:start;text-decoration:none;text-decoration-line:none;text-decoration-style:solid;text-decoration-color:#000000;letter-spacing:normal;word-spacing:normal;text-transform:none;direction:ltr;block-progression:tb;writing-mode:lr-tb;baseline-shift:baseline;text-anchor:start;white-space:normal;clip-rule:nonzero;display:inline;overflow:visible;visibility:visible;opacity:1;isolation:auto;mix-blend-mode:normal;color-interpolation:sRGB;color-interpolation-filters:linearRGB;solid-color:#000000;solid-opacity:1;fill:#000000;fill-opacity:1;fill-rule:nonzero;stroke:none;stroke-width:1;stroke-linecap:round;stroke-linejoin:round;stroke-miterlimit:4;stroke-dasharray:none;stroke-dashoffset:0;stroke-opacity:1;color-rendering:auto;image-rendering:auto;shape-rendering:auto;text-rendering:auto;enable-background:accumulate"
     d="M 8 7.5 A 0.50005 0.50005 0 0 0 7.7773438 7.5527344 L 5.7773438 8.5527344 A 0.50005 0.50005 0 0 0 5.6464844 8.6464844 L 3.6464844 10.646484 A 0.50005 0.50005 0 0 0 3.5253906 10.841797 L 2.5253906 13.841797 A 0.50005 0.50005 0 0 0 2.5 14 L 2.5 16 A 0.50005 0.50005 0 0 0 2.5253906 16.158203 L 3.5253906 19.158203 A 0.50005 0.50005 0 0 0 3.6464844 19.353516 L 5.6464844 21.353516 A 0.50005 0.50005 0 0 0 5.7773438 21.447266 L 7.7773438 22.447266 A 0.50005 0.50005 0 0 0 8 22.5 L 9.0175781 22.5 L 11 22.5 L 12.017578 22.5 A 0.50005 0.50005 0 0 0 12.240234 22.447266 L 14.240234 21.447266 A 0.50005 0.50005 0 0 0 14.371094 21.353516 L 16.316406 19.408203 A 0.50005 0.50005 0 0 0 16.519531 18.945312 A 0.50005 0.50005 0 0 0 16.517578 18.925781 A 0.50005 0.50005 0 0 0 16.509766 18.886719 A 0.50005 0.50005 0 0 0 16.507812 18.876953 A 0.50005 0.50005 0 0 0 16.505859 18.871094 A 0.50005 0.50005 0 0 0 16.492188 18.830078 A 0.50005 0.50005 0 0 0 16.472656 18.783203 A 0.50005 0.50005 0 0 0 16.166016 18.517578 L 14.232422 17.558594 A 0.50005 0.50005 0 0 0 14.222656 17.552734 A 0.50005 0.50005 0 0 0 14.1875 17.537109 A 0.50005 0.50005 0 0 0 14.158203 17.525391 A 0.50005 0.50005 0 0 0 14.128906 17.517578 A 0.50005 0.50005 0 0 0 14.091797 17.507812 A 0.50005 0.50005 0 0 0 14.042969 17.501953 A 0.50005 0.50005 0 0 0 13.992188 17.5 A 0.50005 0.50005 0 0 0 13.943359 17.503906 A 0.50005 0.50005 0 0 0 13.929688 17.505859 A 0.50005 0.50005 0 0 0 13.90625 17.509766 A 0.50005 0.50005 0 0 0 13.892578 17.511719 A 0.50005 0.50005 0 0 0 13.845703 17.525391 A 0.50005 0.50005 0 0 0 13.833984 17.529297 A 0.50005 0.50005 0 0 0 13.798828 17.542969 A 0.50005 0.50005 0 0 0 13.753906 17.564453 A 0.50005 0.50005 0 0 0 13.722656 17.585938 A 0.50005 0.50005 0 0 0 13.710938 17.591797 A 0.50005 0.50005 0 0 0 13.701172 17.599609 A 0.50005 0.50005 0 0 0 13.671875 17.623047 A 0.50005 0.50005 0 0 0 13.662109 17.630859 A 0.50005 0.50005 0 0 0 13.636719 17.65625 A 0.50005 0.50005 0 0 0 13.626953 17.666016 A 0.50005 0.50005 0 0 0 13.603516 17.695312 A 0.50005 0.50005 0 0 0 13.595703 17.705078 A 0.50005 0.50005 0 0 0 13.576172 17.736328 A 0.50005 0.50005 0 0 0 13.552734 17.777344 A 0.50005 0.50005 0 0 0 13.542969 17.798828 L 12.960938 18.960938 L 10 20.441406 L 6.4296875 18.65625 L 5.7109375 16.5 L 16 16.5 A 0.50005 0.50005 0 0 0 16.5 16.001953 L 16.517578 12.001953 A 0.50005 0.50005 0 0 0 16.464844 11.777344 L 15.464844 9.7773438 A 0.50005 0.50005 0 0 0 15.371094 9.6464844 L 14.371094 8.6464844 A 0.50005 0.50005 0 0 0 14.240234 8.5527344 L 12.240234 7.5527344 A 0.50005 0.50005 0 0 0 12.017578 7.5 L 11 7.5 L 9.0175781 7.5 L 8 7.5 z M 10 9.5273438 L 12.644531 10.408203 L 13.5 12.117188 L 13.5 13.5 L 5.7109375 13.5 L 6.453125 11.269531 L 7.2871094 10.4375 L 10 9.5273438 z M 15.507812 14.09375 L 15.501953 15.5 L 15 15.5 A 0.50005 0.50005 0 0 0 15.5 15 L 15.5 14.125 A 0.50005 0.50005 0 0 0 15.507812 14.09375 z "
     id="path13" />
</svg>
