<?xml version="1.0" encoding="UTF-8" standalone="no"?>
<svg
   xmlns:dc="http://purl.org/dc/elements/1.1/"
   xmlns:cc="http://creativecommons.org/ns#"
   xmlns:rdf="http://www.w3.org/1999/02/22-rdf-syntax-ns#"
   xmlns:svg="http://www.w3.org/2000/svg"
   xmlns="http://www.w3.org/2000/svg"
   xmlns:sodipodi="http://sodipodi.sourceforge.net/DTD/sodipodi-0.dtd"
   xmlns:inkscape="http://www.inkscape.org/namespaces/inkscape"
   data-dec="51"
   width="20"
   height="40"
   version="1.1"
   id="svg4"
   sodipodi:docname="51.svg"
   inkscape:version="0.92.4 5da689c313, 2019-01-14">
  <metadata
     id="metadata10">
    <rdf:RDF>
      <cc:Work
         rdf:about="">
        <dc:format>image/svg+xml</dc:format>
        <dc:type
           rdf:resource="http://purl.org/dc/dcmitype/StillImage" />
        <dc:title></dc:title>
      </cc:Work>
    </rdf:RDF>
  </metadata>
  <defs
     id="defs8" />
  <sodipodi:namedview
     pagecolor="#ffffff"
     bordercolor="#666666"
     borderopacity="1"
     objecttolerance="10"
     gridtolerance="10"
     guidetolerance="10"
     inkscape:pageopacity="0"
     inkscape:pageshadow="2"
     inkscape:window-width="1920"
     inkscape:window-height="1043"
     id="namedview6"
     showgrid="false"
     inkscape:zoom="5.9"
     inkscape:cx="10"
     inkscape:cy="20"
     inkscape:window-x="0"
     inkscape:window-y="37"
     inkscape:window-maximized="0"
     inkscape:current-layer="svg4" />
  <path
     style="color:#000000;font-style:normal;font-variant:normal;font-weight:normal;font-stretch:normal;font-size:medium;line-height:normal;font-family:sans-serif;font-variant-ligatures:normal;font-variant-position:normal;font-variant-caps:normal;font-variant-numeric:normal;font-variant-alternates:normal;font-feature-settings:normal;text-indent:0;text-align:start;text-decoration:none;text-decoration-line:none;text-decoration-style:solid;text-decoration-color:#000000;letter-spacing:normal;word-spacing:normal;text-transform:none;writing-mode:lr-tb;direction:ltr;text-orientation:mixed;dominant-baseline:auto;baseline-shift:baseline;text-anchor:start;white-space:normal;shape-padding:0;clip-rule:nonzero;display:inline;overflow:visible;visibility:visible;opacity:1;isolation:auto;mix-blend-mode:normal;color-interpolation:sRGB;color-interpolation-filters:linearRGB;solid-color:#000000;solid-opacity:1;vector-effect:none;fill:#000000;fill-opacity:1;fill-rule:nonzero;stroke:none;stroke-width:0.5;stroke-linecap:round;stroke-linejoin:round;stroke-miterlimit:4;stroke-dasharray:none;stroke-dashoffset:0;stroke-opacity:1;color-rendering:auto;image-rendering:auto;shape-rendering:auto;text-rendering:auto;enable-background:accumulate"
     d="m 3.4042969,18.25 0.3476562,0.697266 A 0.250025,0.250025 0 0 1 4.109375,18.775391 L 3.8476562,18.25 Z m 6.4960937,-9 -0.3886718,0.5 H 11 a 0.250025,0.250025 0 0 1 0.07813,0.013672 l 0.669922,0.2226562 a 0.250025,0.250025 0 0 1 0.390625,-0.1953125 l 0.978516,0.6523434 0.960937,0.320313 a 0.250025,0.250025 0 0 1 0.130859,0.09766 l 0.371094,0.558594 0.558594,0.371094 a 0.250025,0.250025 0 0 1 0.09766,0.130859 l 0.320313,0.960937 0.652343,0.978516 a 0.250025,0.250025 0 0 1 -0.195312,0.392578 l 0.222656,0.667969 A 0.250025,0.250025 0 0 1 16.25,15 v 1 a 0.250025,0.250025 0 0 1 -0.01367,0.07813 l -0.222656,0.669922 a 0.250025,0.250025 0 0 1 0.195312,0.390625 l -0.652343,0.978516 -0.320313,0.960937 a 0.250025,0.250025 0 0 1 -0.09766,0.130859 l -0.558594,0.371094 -0.371094,0.558594 a 0.250025,0.250025 0 0 1 -0.130859,0.09766 l -0.960937,0.320313 -0.978516,0.652343 a 0.250025,0.250025 0 0 1 -0.392578,-0.195312 l -0.667969,0.222656 A 0.250025,0.250025 0 0 1 11,21.25 H 8 A 0.250025,0.250025 0 0 1 7.921875,21.236328 L 7.2519531,21.013672 a 0.250025,0.250025 0 0 1 -0.390625,0.195312 L 5.8828125,20.556641 4.921875,20.236328 a 0.250025,0.250025 0 0 1 -0.1445312,-0.125 l -0.21875,-0.4375 -0.6640626,-0.443359 0.3105469,0.621093 0.9296875,0.929688 2.90625,0.96875 h 2.9179684 l 2.90625,-0.96875 1.916016,-1.916016 0.96875,-2.90625 V 15.041016 L 15.78125,12.134766 13.865234,10.21875 10.958984,9.25 Z M 8.9121094,9.234375 8.5117188,9.75 H 8.8769531 L 9.265625,9.25 H 9 A 0.250025,0.250025 0 0 1 8.9121094,9.234375 Z M 14.345703,2.25 9.2890625,8.75 h 0.3652344 l 5.0566411,-6.5 z m 0.777344,-1 -0.388672,0.5 H 15 a 0.250025,0.250025 0 0 1 0.08789,0.015625 L 15.488281,1.25 Z M 5.25,1.25 v 0.5 h 8.849609 l 0.388672,-0.5 z M 4.9960938,0.74609375 A 0.250025,0.250025 0 0 1 5.046875,0.75 h 9.916016 a 0.250025,0.250025 0 0 1 0.07617,0 H 16 a 0.250025,0.250025 0 0 1 0.197266,0.4042969 L 10.289062,8.75 H 11 a 0.250025,0.250025 0 0 1 0.07813,0.013672 l 3,1 a 0.250025,0.250025 0 0 1 0.09961,0.058594 l 2,2.0000004 a 0.250025,0.250025 0 0 1 0.05859,0.09961 l 1,3 A 0.250025,0.250025 0 0 1 17.25,15 v 1 a 0.250025,0.250025 0 0 1 -0.01367,0.07813 l -1,3 a 0.250025,0.250025 0 0 1 -0.05859,0.09961 l -2,2 a 0.250025,0.250025 0 0 1 -0.09961,0.05859 l -3,1 A 0.250025,0.250025 0 0 1 11,22.25 H 8 a 0.250025,0.250025 0 0 1 -0.078125,-0.01367 l -3,-1 a 0.250025,0.250025 0 0 1 -0.099609,-0.05859 l -1,-1 a 0.250025,0.250025 0 0 1 -0.044922,-0.06641 l -1,-2 A 0.250025,0.250025 0 0 1 3,17.75 h 0.953125 a 0.250025,0.250025 0 0 1 0.1367188,0.01563 0.250025,0.250025 0 0 1 0.011719,0.0039 0.250025,0.250025 0 0 1 0.011719,0.0059 0.250025,0.250025 0 0 1 0.00977,0.0039 0.250025,0.250025 0 0 1 0.011719,0.0078 0.250025,0.250025 0 0 1 0.00977,0.0059 0.250025,0.250025 0 0 1 0.011719,0.0098 0.250025,0.250025 0 0 1 0.00781,0.0059 0.250025,0.250025 0 0 1 0.00195,0.002 0.250025,0.250025 0 0 1 0.015625,0.01563 0.250025,0.250025 0 0 1 0.0625,0.105469 L 4.9433594,19.328125 6.1113281,20.107422 8.0410156,20.75 H 10.958984 L 12.888672,20.105469 14.21875,19.21875 15.105469,17.888672 15.75,15.958984 V 15.041016 L 15.105469,13.111328 14.21875,11.78125 12.888672,10.894531 10.958984,10.25 H 9.0371094 a 0.250025,0.250025 0 0 1 -0.076172,0 H 8.0371094 a 0.250025,0.250025 0 0 1 -0.2089844,-0.06445 0.250025,0.250025 0 0 1 -0.00391,-0.0039 0.250025,0.250025 0 0 1 -0.013672,-0.01367 0.250025,0.250025 0 0 1 -0.00195,-0.0039 0.250025,0.250025 0 0 1 -0.013672,-0.01562 0.250025,0.250025 0 0 1 -0.00195,-0.0039 0.250025,0.250025 0 0 1 -0.013672,-0.02148 0.250025,0.250025 0 0 1 -0.011719,-0.02149 0.250025,0.250025 0 0 1 -0.013672,-0.04297 0.250025,0.250025 0 0 1 -0.00195,-0.0059 0.250025,0.250025 0 0 1 -0.00391,-0.068359 0.250025,0.250025 0 0 1 0,-0.00586 0.250025,0.250025 0 0 1 0.068359,-0.1503906 l 0.00391,-0.00391 L 13.710938,2.25 H 5 A 0.250025,0.250025 0 0 1 4.75,2 V 1.0410156 a 0.250025,0.250025 0 0 1 0.052734,-0.1972656 0.250025,0.250025 0 0 1 0,-0.001953 0.250025,0.250025 0 0 1 0.00781,-0.007813 0.250025,0.250025 0 0 1 0.027344,-0.0273438 0.250025,0.250025 0 0 1 0.017578,-0.0136719 0.250025,0.250025 0 0 1 0.00195,-0.001953 0.250025,0.250025 0 0 1 0.00781,-0.003906 0.250025,0.250025 0 0 1 0.013672,-0.007813 0.250025,0.250025 0 0 1 0.1171876,-0.0332031 z"
     id="path2" />
</svg>
