<?xml version="1.0" encoding="UTF-8" standalone="no"?>
<svg
   xmlns:dc="http://purl.org/dc/elements/1.1/"
   xmlns:cc="http://creativecommons.org/ns#"
   xmlns:rdf="http://www.w3.org/1999/02/22-rdf-syntax-ns#"
   xmlns:svg="http://www.w3.org/2000/svg"
   xmlns="http://www.w3.org/2000/svg"
   xmlns:sodipodi="http://sodipodi.sourceforge.net/DTD/sodipodi-0.dtd"
   xmlns:inkscape="http://www.inkscape.org/namespaces/inkscape"
   data-dec="79"
   width="22"
   height="40"
   version="1.1"
   id="svg4"
   sodipodi:docname="79.svg"
   inkscape:version="0.92.4 (unknown)">
  <metadata
     id="metadata10">
    <rdf:RDF>
      <cc:Work
         rdf:about="">
        <dc:format>image/svg+xml</dc:format>
        <dc:type
           rdf:resource="http://purl.org/dc/dcmitype/StillImage" />
      </cc:Work>
    </rdf:RDF>
  </metadata>
  <defs
     id="defs8" />
  <sodipodi:namedview
     pagecolor="#ffffff"
     bordercolor="#666666"
     borderopacity="1"
     objecttolerance="10"
     gridtolerance="10"
     guidetolerance="10"
     inkscape:pageopacity="0"
     inkscape:pageshadow="2"
     inkscape:window-width="640"
     inkscape:window-height="480"
     id="namedview6"
     showgrid="false"
     inkscape:zoom="5.9"
     inkscape:cx="11"
     inkscape:cy="20"
     inkscape:window-x="0"
     inkscape:window-y="27"
     inkscape:window-maximized="0"
     inkscape:current-layer="svg4" />
  <path
     style="color:#000000;font-style:normal;font-variant:normal;font-weight:normal;font-stretch:normal;font-size:medium;line-height:normal;font-family:sans-serif;font-variant-ligatures:normal;font-variant-position:normal;font-variant-caps:normal;font-variant-numeric:normal;font-variant-alternates:normal;font-feature-settings:normal;text-indent:0;text-align:start;text-decoration:none;text-decoration-line:none;text-decoration-style:solid;text-decoration-color:#000000;letter-spacing:normal;word-spacing:normal;text-transform:none;writing-mode:lr-tb;direction:ltr;text-orientation:mixed;dominant-baseline:auto;baseline-shift:baseline;text-anchor:start;white-space:normal;shape-padding:0;clip-rule:nonzero;display:inline;overflow:visible;visibility:visible;opacity:1;isolation:auto;mix-blend-mode:normal;color-interpolation:sRGB;color-interpolation-filters:linearRGB;solid-color:#000000;solid-opacity:1;vector-effect:none;fill:#013272;fill-opacity:1;fill-rule:nonzero;stroke:none;stroke-width:0.5;stroke-linecap:round;stroke-linejoin:round;stroke-miterlimit:4;stroke-dasharray:none;stroke-dashoffset:0;stroke-opacity:1;color-rendering:auto;image-rendering:auto;shape-rendering:auto;text-rendering:auto;enable-background:accumulate"
     d="m 14.429688,2.0742188 1.748046,1.7480468 a 0.250025,0.250025 0 0 1 0.04492,0.066406 l 1,2 a 0.250025,0.250025 0 0 1 0.01953,0.050781 l 1,4 A 0.250025,0.250025 0 0 1 18.25,10 v 3 a 0.250025,0.250025 0 0 1 -0.0078,0.06055 l -1,4 a 0.250025,0.250025 0 0 1 -0.01953,0.05078 l -1,2 a 0.250025,0.250025 0 0 1 -0.04492,0.06641 l -1.748046,1.748047 0.435546,-0.144531 1.929688,-1.929688 0.96875,-1.939453 L 18.75,12.96875 v -2.9375 L 17.763672,6.0878906 16.794922,4.1484375 14.865234,2.21875 Z M 7.5722656,2.0722656 7.1347656,2.21875 5.2050781,4.1484375 4.2363281,6.0878906 3.25,10.03125 v 2.9375 l 0.9863281,3.943359 0.96875,1.939453 1.9296875,1.929688 0.4355469,0.144531 -1.7480469,-1.748047 a 0.250025,0.250025 0 0 1 -0.044922,-0.06641 l -1,-2 a 0.250025,0.250025 0 0 1 -0.019531,-0.05078 l -1,-4 A 0.250025,0.250025 0 0 1 3.75,13 v -3 a 0.250025,0.250025 0 0 1 0.00781,-0.060547 l 1,-4 a 0.250025,0.250025 0 0 1 0.019531,-0.050781 l 1,-2 a 0.250025,0.250025 0 0 1 0.044922,-0.066406 z M 10.056641,1.25 8.1484375,2.2050781 6.2050781,4.1484375 5.2363281,6.0878906 4.25,10.03125 v 2.9375 l 0.9863281,3.943359 0.96875,1.939453 1.9433594,1.94336 L 10.056641,21.75 h 1.886718 l 1.908203,-0.955078 1.94336,-1.94336 0.96875,-1.939453 L 17.75,12.96875 v -2.9375 L 16.763672,6.0878906 15.794922,4.1484375 13.851562,2.2050781 11.943359,1.25 Z m -0.05469,-0.50195312 a 0.250025,0.250025 0 0 1 0.02149,0.001953 0.250025,0.250025 0 0 1 0.002,0 h 1.941406 a 0.250025,0.250025 0 0 1 0.03906,0 0.250025,0.250025 0 0 1 0.02539,0.001953 0.250025,0.250025 0 0 1 0.02344,0.003906 0.250025,0.250025 0 0 1 0.0098,0.001953 0.250025,0.250025 0 0 1 0.03516,0.0136719 l 2.978516,0.99218752 a 0.250025,0.250025 0 0 1 0.09961,0.058594 l 2,2 a 0.250025,0.250025 0 0 1 0.04492,0.066406 l 1,2 a 0.250025,0.250025 0 0 1 0.01953,0.050781 l 1,4 A 0.250025,0.250025 0 0 1 19.25,10 v 3 a 0.250025,0.250025 0 0 1 -0.0078,0.06055 l -1,4 a 0.250025,0.250025 0 0 1 -0.01953,0.05078 l -1,2 a 0.250025,0.250025 0 0 1 -0.04492,0.06641 l -2,2 a 0.250025,0.250025 0 0 1 -0.09961,0.05859 l -2.982422,0.994141 a 0.250025,0.250025 0 0 1 -0.02148,0.0078 0.250025,0.250025 0 0 1 -0.09961,0.01172 h -1.941406 a 0.250025,0.250025 0 0 1 -0.039062,0 0.250025,0.250025 0 0 1 -0.00977,0 0.250025,0.250025 0 0 1 -0.015625,-0.002 0.250025,0.250025 0 0 1 -0.023437,-0.0039 0.250025,0.250025 0 0 1 -0.00977,-0.002 0.250025,0.250025 0 0 1 -0.035156,-0.01367 L 6.921875,21.236328 a 0.250025,0.250025 0 0 1 -0.099609,-0.05859 l -2,-2 a 0.250025,0.250025 0 0 1 -0.044922,-0.06641 l -1,-2 a 0.250025,0.250025 0 0 1 -0.019531,-0.05078 l -1,-4 A 0.250025,0.250025 0 0 1 2.75,13 v -3 a 0.250025,0.250025 0 0 1 0.00781,-0.060547 l 1,-4 a 0.250025,0.250025 0 0 1 0.019531,-0.050781 l 1,-2 a 0.250025,0.250025 0 0 1 0.044922,-0.066406 l 2,-2 A 0.250025,0.250025 0 0 1 6.921875,1.7636719 L 9.8789062,0.77929688 a 0.250025,0.250025 0 0 1 0.00781,-0.003906 0.250025,0.250025 0 0 1 0.039062,-0.015625 0.250025,0.250025 0 0 1 0.011719,-0.001953 0.250025,0.250025 0 0 1 0.013672,-0.003906 0.250025,0.250025 0 0 1 0.00977,-0.001953 0.250025,0.250025 0 0 1 0.013672,-0.001953 0.250025,0.250025 0 0 1 0.00195,0 0.250025,0.250025 0 0 1 0.00977,0 0.250025,0.250025 0 0 1 0.015625,-0.001953 z"
     id="path2" />
</svg>
