<?xml version="1.0" encoding="UTF-8" standalone="no"?>
<svg
   xmlns:dc="http://purl.org/dc/elements/1.1/"
   xmlns:cc="http://creativecommons.org/ns#"
   xmlns:rdf="http://www.w3.org/1999/02/22-rdf-syntax-ns#"
   xmlns:svg="http://www.w3.org/2000/svg"
   xmlns="http://www.w3.org/2000/svg"
   xmlns:sodipodi="http://sodipodi.sourceforge.net/DTD/sodipodi-0.dtd"
   xmlns:inkscape="http://www.inkscape.org/namespaces/inkscape"
   data-dec="40"
   width="14"
   height="40"
   version="1.1"
   id="svg4"
   sodipodi:docname="40.svg"
   inkscape:version="0.92.4 (unknown)">
  <metadata
     id="metadata10">
    <rdf:RDF>
      <cc:Work
         rdf:about="">
        <dc:format>image/svg+xml</dc:format>
        <dc:type
           rdf:resource="http://purl.org/dc/dcmitype/StillImage" />
      </cc:Work>
    </rdf:RDF>
  </metadata>
  <defs
     id="defs8" />
  <sodipodi:namedview
     pagecolor="#ffffff"
     bordercolor="#666666"
     borderopacity="1"
     objecttolerance="10"
     gridtolerance="10"
     guidetolerance="10"
     inkscape:pageopacity="0"
     inkscape:pageshadow="2"
     inkscape:window-width="615"
     inkscape:window-height="417"
     id="namedview6"
     showgrid="false"
     inkscape:zoom="5.9"
     inkscape:cx="7"
     inkscape:cy="20"
     inkscape:window-x="0"
     inkscape:window-y="27"
     inkscape:window-maximized="0"
     inkscape:current-layer="svg4" />
  <path
     style="color:#000000;font-style:normal;font-variant:normal;font-weight:normal;font-stretch:normal;font-size:medium;line-height:normal;font-family:sans-serif;font-variant-ligatures:normal;font-variant-position:normal;font-variant-caps:normal;font-variant-numeric:normal;font-variant-alternates:normal;font-feature-settings:normal;text-indent:0;text-align:start;text-decoration:none;text-decoration-line:none;text-decoration-style:solid;text-decoration-color:#000000;letter-spacing:normal;word-spacing:normal;text-transform:none;writing-mode:lr-tb;direction:ltr;text-orientation:mixed;dominant-baseline:auto;baseline-shift:baseline;text-anchor:start;white-space:normal;shape-padding:0;clip-rule:nonzero;display:inline;overflow:visible;visibility:visible;opacity:1;isolation:auto;mix-blend-mode:normal;color-interpolation:sRGB;color-interpolation-filters:linearRGB;solid-color:#000000;solid-opacity:1;vector-effect:none;fill:#013272;fill-opacity:1;fill-rule:nonzero;stroke:none;stroke-width:0.30000001;stroke-linecap:round;stroke-linejoin:round;stroke-miterlimit:4;stroke-dasharray:none;stroke-dashoffset:0;stroke-opacity:1;color-rendering:auto;image-rendering:auto;shape-rendering:auto;text-rendering:auto;enable-background:accumulate"
     d="m 5.9863281,2.8476562 a 0.15001501,0.15001501 0 0 1 0.15625,0.1992188 L 5.1445312,6.0410156 4.1503906,10.017578 v 5.964844 l 0.9941406,3.976562 0.9980469,2.994141 a 0.15008591,0.15008591 0 1 1 -0.2851562,0.09375 l -1,-3 a 0.15001501,0.15001501 0 0 1 -0.00391,-0.0098 l -1,-4 A 0.15001501,0.15001501 0 0 1 3.8496094,16 v -6 a 0.15001501,0.15001501 0 0 1 0.00391,-0.037109 l 1,-4 a 0.15001501,0.15001501 0 0 1 0.00391,-0.00977 l 1,-3 A 0.15001501,0.15001501 0 0 1 5.9863281,2.8476562 Z M 6.8359375,1.0195312 6.1308594,2.0761719 4.1425781,6.0488281 3.1503906,11.015625 v 3.96875 l 0.9921875,4.966797 1.9882813,3.972656 0.7050781,1.056641 -0.9785156,-2.933594 a 0.15001501,0.15001501 0 0 1 -0.00586,-0.02148 l -1,-6 A 0.15001501,0.15001501 0 0 1 4.8496094,16 v -6 a 0.15001501,0.15001501 0 0 1 0.00195,-0.025391 l 1,-6 a 0.15001501,0.15001501 0 0 1 0.00586,-0.021484 z m 3.1601563,-4.171875 a 0.15001501,0.15001501 0 0 1 0.1093752,0.2578126 L 8.1230469,-0.91015625 7.1386719,1.0566406 6.1464844,4.0371094 5.1503906,10.011719 v 5.976562 l 0.9960938,5.97461 0.9921875,2.980468 0.984375,1.966797 1.9824221,1.984375 A 0.15001501,0.15001501 0 1 1 9.8945312,29.105469 L 7.9140625,27.123047 a 0.15001501,0.15001501 0 0 1 -0.019531,-0.01758 0.15001501,0.15001501 0 0 1 -0.00391,-0.002 0.15001501,0.15001501 0 0 1 -0.00586,-0.0078 0.15001501,0.15001501 0 0 1 -0.00391,-0.0039 0.15001501,0.15001501 0 0 1 -0.00195,-0.0039 0.15001501,0.15001501 0 0 1 -0.00391,-0.0039 l -0.00195,-0.0039 L 5.875,24.083984 a 0.15001501,0.15001501 0 0 1 -0.00977,-0.01758 l -2,-4 a 0.15001501,0.15001501 0 0 1 -0.011719,-0.03711 l -1,-5 A 0.15001501,0.15001501 0 0 1 2.8496094,15 v -4 a 0.15001501,0.15001501 0 0 1 0.00391,-0.0293 l 1,-4.9999999 a 0.15001501,0.15001501 0 0 1 0.011719,-0.037109 l 2,-4 A 0.15001501,0.15001501 0 0 1 5.875,1.9160156 l 1.9960938,-2.9921875 a 0.15001501,0.15001501 0 0 1 0.00391,-0.00781 0.15001501,0.15001501 0 0 1 0.00195,-0.00195 0.15001501,0.15001501 0 0 1 0.00781,-0.00977 0.15001501,0.15001501 0 0 1 0.00391,-0.00586 0.15001501,0.15001501 0 0 1 0.00586,-0.00391 l 0.00391,-0.00586 a 0.15001501,0.15001501 0 0 1 0.011719,-0.00977 l 1.984375,-1.984375 a 0.15001501,0.15001501 0 0 1 0.1015626,-0.046875 z"
     id="path2" />
</svg>
