<?xml version="1.0" encoding="UTF-8"?>
<glyph name="acute" format="1">
  <advance width="346"/>
  <unicode hex="00B4"/>
  <outline>
    <contour>
      <point x="260" y="637" type="curve" smooth="yes"/>
      <point x="261" y="637" type="line" smooth="yes"/>
      <point x="277" y="637"/>
      <point x="289" y="623"/>
      <point x="289" y="607" type="curve" smooth="yes"/>
      <point x="289" y="599"/>
      <point x="285" y="589"/>
      <point x="279" y="585" type="curve" smooth="yes"/>
      <point x="106" y="440" type="line" smooth="yes"/>
      <point x="102" y="436"/>
      <point x="92" y="433"/>
      <point x="86" y="433" type="curve" smooth="yes"/>
      <point x="70" y="433"/>
      <point x="57" y="446"/>
      <point x="57" y="462" type="curve" smooth="yes"/>
      <point x="57" y="470"/>
      <point x="61" y="481"/>
      <point x="68" y="485" type="curve" smooth="yes"/>
      <point x="242" y="629" type="line" smooth="yes"/>
      <point x="246" y="632"/>
      <point x="254" y="637"/>
    </contour>
  </outline>
  <lib>
    <dict>
      <key>com.fontlab.hintData</key>
      <dict>
        <key>hhints</key>
        <array>
          <dict>
            <key>position</key>
            <integer>433</integer>
            <key>width</key>
            <integer>204</integer>
          </dict>
        </array>
        <key>vhints</key>
        <array>
          <dict>
            <key>position</key>
            <integer>57</integer>
            <key>width</key>
            <integer>232</integer>
          </dict>
        </array>
      </dict>
    </dict>
  </lib>
</glyph>
