<?xml version="1.0" encoding="UTF-8" standalone="no"?>
<svg
   xmlns:dc="http://purl.org/dc/elements/1.1/"
   xmlns:cc="http://creativecommons.org/ns#"
   xmlns:rdf="http://www.w3.org/1999/02/22-rdf-syntax-ns#"
   xmlns:svg="http://www.w3.org/2000/svg"
   xmlns="http://www.w3.org/2000/svg"
   xmlns:sodipodi="http://sodipodi.sourceforge.net/DTD/sodipodi-0.dtd"
   xmlns:inkscape="http://www.inkscape.org/namespaces/inkscape"
   data-dec="51"
   width="19"
   height="40"
   version="1.1"
   id="svg4"
   sodipodi:docname="51.svg"
   inkscape:version="0.92.4 (unknown)">
  <metadata
     id="metadata10">
    <rdf:RDF>
      <cc:Work
         rdf:about="">
        <dc:format>image/svg+xml</dc:format>
        <dc:type
           rdf:resource="http://purl.org/dc/dcmitype/StillImage" />
      </cc:Work>
    </rdf:RDF>
  </metadata>
  <defs
     id="defs8" />
  <sodipodi:namedview
     pagecolor="#ffffff"
     bordercolor="#666666"
     borderopacity="1"
     objecttolerance="10"
     gridtolerance="10"
     guidetolerance="10"
     inkscape:pageopacity="0"
     inkscape:pageshadow="2"
     inkscape:window-width="640"
     inkscape:window-height="480"
     id="namedview6"
     showgrid="false"
     inkscape:zoom="5.9"
     inkscape:cx="9.5"
     inkscape:cy="20"
     inkscape:window-x="0"
     inkscape:window-y="27"
     inkscape:window-maximized="0"
     inkscape:current-layer="svg4" />
  <path
     style="color:#000000;font-style:normal;font-variant:normal;font-weight:normal;font-stretch:normal;font-size:medium;line-height:normal;font-family:sans-serif;font-variant-ligatures:normal;font-variant-position:normal;font-variant-caps:normal;font-variant-numeric:normal;font-variant-alternates:normal;font-feature-settings:normal;text-indent:0;text-align:start;text-decoration:none;text-decoration-line:none;text-decoration-style:solid;text-decoration-color:#000000;letter-spacing:normal;word-spacing:normal;text-transform:none;writing-mode:lr-tb;direction:ltr;text-orientation:mixed;dominant-baseline:auto;baseline-shift:baseline;text-anchor:start;white-space:normal;shape-padding:0;clip-rule:nonzero;display:inline;overflow:visible;visibility:visible;opacity:1;isolation:auto;mix-blend-mode:normal;color-interpolation:sRGB;color-interpolation-filters:linearRGB;solid-color:#000000;solid-opacity:1;vector-effect:none;fill:#013272;fill-opacity:1;fill-rule:nonzero;stroke:none;stroke-width:3;stroke-linecap:round;stroke-linejoin:round;stroke-miterlimit:4;stroke-dasharray:none;stroke-dashoffset:0;stroke-opacity:1;color-rendering:auto;image-rendering:auto;shape-rendering:auto;text-rendering:auto;enable-background:accumulate"
     d="m 8,-0.5 h 3 a 1.50015,1.50015 0 0 1 0.474609,0.0761719 l 3,1 a 1.50015,1.50015 0 0 1 0.867188,0.75390622 l 1,2 A 1.50015,1.50015 0 0 1 16.5,4 v 3 a 1.50015,1.50015 0 0 1 -0.158203,0.6699219 l -1,2 a 1.50015,1.50015 0 0 1 -0.816406,0.7343751 l 1.535156,1.535156 a 1.50015,1.50015 0 0 1 0.28125,0.390625 l 1,2 A 1.50015,1.50015 0 0 1 17.5,15 v 3 a 1.50015,1.50015 0 0 1 -0.158203,0.669922 l -1,2 a 1.50015,1.50015 0 0 1 -0.28125,0.390625 l -1,1 a 1.50015,1.50015 0 0 1 -0.585938,0.363281 l -3,1 A 1.50015,1.50015 0 0 1 11,23.5 H 8 a 1.50015,1.50015 0 0 1 -0.4746094,-0.07617 l -3,-1 A 1.50015,1.50015 0 0 1 3.9394531,22.060547 l -1,-1 a 1.50015,1.50015 0 0 1 -0.28125,-0.390625 l -1,-2 A 1.50015,1.50015 0 0 1 1.5,18 V 17.240234 A 1.50015,1.50015 0 0 1 2.0683594,15.810547 L 2.9394531,14.939453 A 1.50015,1.50015 0 0 1 5.5,16 v 1 a 1.50015,1.50015 0 0 1 -0.6914062,1.261719 l 0.4238281,0.849609 0.578125,0.578125 L 8.2441406,20.5 H 10.755859 L 13.189453,19.689453 13.767578,19.111328 14.5,17.646484 V 15.353516 L 13.767578,13.888672 12.111328,12.232422 10.646484,11.5 H 9 a 1.50015,1.50015 0 1 1 0,-3 h 1.755859 L 12.935547,7.7734375 13.5,6.6464844 V 4.3535156 L 12.935547,3.2265625 10.755859,2.5 H 8.2441406 L 5.8105469,3.3105469 5.2324219,3.8886719 4.8085938,4.7363281 A 1.50015,1.50015 0 0 1 5.5,6 V 7 A 1.50015,1.50015 0 0 1 2.9394531,8.0605469 L 2.0761719,7.1972656 A 1.50015,1.50015 0 0 1 1.5,5.7539062 V 5 A 1.50015,1.50015 0 0 1 1.6582031,4.3300781 l 1,-2 a 1.50015,1.50015 0 0 1 0.28125,-0.390625 l 1,-0.99999998 A 1.50015,1.50015 0 0 1 4.5253906,0.57617188 l 3,-1 A 1.50015,1.50015 0 0 1 8,-0.5 Z"
     id="path2" />
</svg>
