<?xml version="1.0" encoding="UTF-8" standalone="no"?>
<svg
   xmlns:dc="http://purl.org/dc/elements/1.1/"
   xmlns:cc="http://creativecommons.org/ns#"
   xmlns:rdf="http://www.w3.org/1999/02/22-rdf-syntax-ns#"
   xmlns:svg="http://www.w3.org/2000/svg"
   xmlns="http://www.w3.org/2000/svg"
   xmlns:sodipodi="http://sodipodi.sourceforge.net/DTD/sodipodi-0.dtd"
   xmlns:inkscape="http://www.inkscape.org/namespaces/inkscape"
   data-dec="51"
   width="20"
   height="40"
   version="1.1"
   id="svg4"
   sodipodi:docname="51.svg"
   inkscape:version="0.92.4 (unknown)">
  <metadata
     id="metadata10">
    <rdf:RDF>
      <cc:Work
         rdf:about="">
        <dc:format>image/svg+xml</dc:format>
        <dc:type
           rdf:resource="http://purl.org/dc/dcmitype/StillImage" />
      </cc:Work>
    </rdf:RDF>
  </metadata>
  <defs
     id="defs8" />
  <sodipodi:namedview
     pagecolor="#ffffff"
     bordercolor="#666666"
     borderopacity="1"
     objecttolerance="10"
     gridtolerance="10"
     guidetolerance="10"
     inkscape:pageopacity="0"
     inkscape:pageshadow="2"
     inkscape:window-width="640"
     inkscape:window-height="480"
     id="namedview6"
     showgrid="false"
     inkscape:zoom="5.9"
     inkscape:cx="10"
     inkscape:cy="20"
     inkscape:window-x="0"
     inkscape:window-y="27"
     inkscape:window-maximized="0"
     inkscape:current-layer="svg4" />
  <path
     style="color:#000000;font-style:normal;font-variant:normal;font-weight:normal;font-stretch:normal;font-size:medium;line-height:normal;font-family:sans-serif;font-variant-ligatures:normal;font-variant-position:normal;font-variant-caps:normal;font-variant-numeric:normal;font-variant-alternates:normal;font-feature-settings:normal;text-indent:0;text-align:start;text-decoration:none;text-decoration-line:none;text-decoration-style:solid;text-decoration-color:#000000;letter-spacing:normal;word-spacing:normal;text-transform:none;writing-mode:lr-tb;direction:ltr;text-orientation:mixed;dominant-baseline:auto;baseline-shift:baseline;text-anchor:start;white-space:normal;shape-padding:0;clip-rule:nonzero;display:inline;overflow:visible;visibility:visible;opacity:1;isolation:auto;mix-blend-mode:normal;color-interpolation:sRGB;color-interpolation-filters:linearRGB;solid-color:#000000;solid-opacity:1;vector-effect:none;fill:#013272;fill-opacity:1;fill-rule:nonzero;stroke:none;stroke-width:2;stroke-linecap:round;stroke-linejoin:round;stroke-miterlimit:4;stroke-dasharray:none;stroke-dashoffset:0;stroke-opacity:1;color-rendering:auto;image-rendering:auto;shape-rendering:auto;text-rendering:auto;enable-background:accumulate"
     d="M 10.964844,-0.00585938 A 1.0001,1.0001 0 0 1 11.09375,0 H 12 a 1.0001,1.0001 0 0 1 0.316406,0.05078125 l 3,0.99999995 a 1.0001,1.0001 0 0 1 0.578125,0.5019532 l 1,2 A 1.0001,1.0001 0 0 1 17,4 v 3 a 1.0001,1.0001 0 0 1 -0.105469,0.4472656 l -1,2 a 1.0001,1.0001 0 0 1 -0.578125,0.5019532 l -0.728515,0.2421872 a 1.0001,1.0001 0 0 1 0.11914,0.101563 l 2,2 a 1.0001,1.0001 0 0 1 0.1875,0.259765 l 1,2 A 1.0001,1.0001 0 0 1 18,15 v 3 a 1.0001,1.0001 0 0 1 -0.105469,0.447266 l -1,2 a 1.0001,1.0001 0 0 1 -0.1875,0.259765 l -1,1 a 1.0001,1.0001 0 0 1 -0.390625,0.242188 l -2.99414,0.998047 -0.0059,0.002 A 1.0001,1.0001 0 0 1 11.880859,23 H 8 a 1.0001,1.0001 0 0 1 -0.3164062,-0.05078 l -3,-1 a 1.0001,1.0001 0 0 1 -0.390625,-0.242188 l -1,-1 a 1.0001,1.0001 0 0 1 -0.1875,-0.259765 l -1,-2 A 1.0001,1.0001 0 0 1 2,18 v -1 a 1.0001,1.0001 0 0 1 0.2929688,-0.707031 l 1,-1 A 1.0001,1.0001 0 0 1 4,15 h 1 a 1.0001,1.0001 0 0 1 0.7070312,0.292969 l 1,1 A 1.0001,1.0001 0 0 1 7,17 v 1 a 1.0001,1.0001 0 0 1 -0.2929688,0.707031 l -1,1 A 1.0001,1.0001 0 0 1 5.3515625,19.935547 L 5.5410156,20.125 8.1621094,21 H 11.763672 L 13.181641,20.291016 14,17.837891 V 15.162109 L 13.125,12.541016 12.408203,11.822266 10.763672,11 H 9 A 1.0001,1.0001 0 1 1 9,9 h 1.763672 L 12.253906,8.2539062 13,6.7636719 V 4.2363281 L 12.253906,2.7460938 10.763672,2 H 8.1621094 L 5.5410156,2.875 5.3496094,3.0644531 a 1.0001,1.0001 0 0 1 0.3574218,0.2285157 l 1,1 A 1.0001,1.0001 0 0 1 7,5 V 6 A 1.0001,1.0001 0 0 1 6.7070312,6.7070312 l -1,1 A 1.0001,1.0001 0 0 1 5,8 H 4 A 1.0001,1.0001 0 0 1 3.2929688,7.7070312 l -1,-1 A 1.0001,1.0001 0 0 1 2,6 V 5 A 1.0001,1.0001 0 0 1 2.1054688,4.5527344 l 1,-2 a 1.0001,1.0001 0 0 1 0.1875,-0.2597656 l 1,-1 a 1.0001,1.0001 0 0 1 0.390625,-0.2421876 l 3,-0.99999995 A 1.0001,1.0001 0 0 1 8,0 h 2.890625 a 1.0001,1.0001 0 0 1 0.07422,-0.00585938 z"
     id="path2" />
</svg>
