<?xml version="1.0" encoding="UTF-8" standalone="no"?>
<svg
   xmlns:dc="http://purl.org/dc/elements/1.1/"
   xmlns:cc="http://creativecommons.org/ns#"
   xmlns:rdf="http://www.w3.org/1999/02/22-rdf-syntax-ns#"
   xmlns:svg="http://www.w3.org/2000/svg"
   xmlns="http://www.w3.org/2000/svg"
   xmlns:sodipodi="http://sodipodi.sourceforge.net/DTD/sodipodi-0.dtd"
   xmlns:inkscape="http://www.inkscape.org/namespaces/inkscape"
   data-dec="69"
   width="20"
   height="40"
   version="1.1"
   id="svg4"
   sodipodi:docname="69.svg"
   inkscape:version="0.92.4 (unknown)">
  <metadata
     id="metadata10">
    <rdf:RDF>
      <cc:Work
         rdf:about="">
        <dc:format>image/svg+xml</dc:format>
        <dc:type
           rdf:resource="http://purl.org/dc/dcmitype/StillImage" />
      </cc:Work>
    </rdf:RDF>
  </metadata>
  <defs
     id="defs8" />
  <sodipodi:namedview
     pagecolor="#ffffff"
     bordercolor="#666666"
     borderopacity="1"
     objecttolerance="10"
     gridtolerance="10"
     guidetolerance="10"
     inkscape:pageopacity="0"
     inkscape:pageshadow="2"
     inkscape:window-width="615"
     inkscape:window-height="417"
     id="namedview6"
     showgrid="false"
     inkscape:zoom="5.9"
     inkscape:cx="10"
     inkscape:cy="20"
     inkscape:window-x="0"
     inkscape:window-y="27"
     inkscape:window-maximized="0"
     inkscape:current-layer="svg4" />
  <path
     style="color:#000000;font-style:normal;font-variant:normal;font-weight:normal;font-stretch:normal;font-size:medium;line-height:normal;font-family:sans-serif;font-variant-ligatures:normal;font-variant-position:normal;font-variant-caps:normal;font-variant-numeric:normal;font-variant-alternates:normal;font-feature-settings:normal;text-indent:0;text-align:start;text-decoration:none;text-decoration-line:none;text-decoration-style:solid;text-decoration-color:#000000;letter-spacing:normal;word-spacing:normal;text-transform:none;writing-mode:lr-tb;direction:ltr;text-orientation:mixed;dominant-baseline:auto;baseline-shift:baseline;text-anchor:start;white-space:normal;shape-padding:0;clip-rule:nonzero;display:inline;overflow:visible;visibility:visible;opacity:1;isolation:auto;mix-blend-mode:normal;color-interpolation:sRGB;color-interpolation-filters:linearRGB;solid-color:#000000;solid-opacity:1;vector-effect:none;fill:#013272;fill-opacity:1;fill-rule:nonzero;stroke:none;stroke-width:2;stroke-linecap:round;stroke-linejoin:round;stroke-miterlimit:4;stroke-dasharray:none;stroke-dashoffset:0;stroke-opacity:1;color-rendering:auto;image-rendering:auto;shape-rendering:auto;text-rendering:auto;enable-background:accumulate"
     d="M 4.984375,-0.01367188 A 1.0001,1.0001 0 0 1 5.1679688,0 h 1.6738281 a 1.0001,1.0001 0 0 1 0.3261719,0 h 0.6777343 a 1.0001,1.0001 0 0 1 0.3183594,0 h 0.7402344 a 1.0001,1.0001 0 0 1 0.2148437,0 h 3.8300784 a 1.0001,1.0001 0 0 1 0.08203,0 h 1.833984 a 1.0001,1.0001 0 0 1 0.238282,0 h 0.74414 a 1.0001,1.0001 0 0 1 0.291016,0 h 0.693359 a 1.0001,1.0001 0 0 1 0.328125,0 H 18 a 1.0001,1.0001 0 0 1 1,1 v 0.8417969 a 1.0001,1.0001 0 0 1 0,0.3261719 V 2.859375 a 1.0001,1.0001 0 0 1 0,0.2910156 v 0.7285156 a 1.0001,1.0001 0 0 1 0,0.25 v 2.8417969 a 1.0001,1.0001 0 0 1 -0.01172,0.1992188 1.0001,1.0001 0 0 1 -0.05078,0.1933593 1.0001,1.0001 0 0 1 -0.03906,0.091797 1.0001,1.0001 0 0 1 -0.105469,0.1679688 1.0001,1.0001 0 0 1 -0.06445,0.076172 1.0001,1.0001 0 0 1 -0.05664,0.054687 1.0001,1.0001 0 0 1 -0.01563,0.015625 1.0001,1.0001 0 0 1 -0.0098,0.00586 1.0001,1.0001 0 0 1 -0.07031,0.054687 1.0001,1.0001 0 0 1 -0.07422,0.048828 1.0001,1.0001 0 0 1 -0.0098,0.00586 1.0001,1.0001 0 0 1 -0.0059,0.00195 1.0001,1.0001 0 0 1 -0.08203,0.042969 1.0001,1.0001 0 0 1 -0.002,0 1.0001,1.0001 0 0 1 -0.07813,0.029297 1.0001,1.0001 0 0 1 -0.01367,0.00586 1.0001,1.0001 0 0 1 -0.0098,0.00195 1.0001,1.0001 0 0 1 -0.08789,0.023437 1.0001,1.0001 0 0 1 -0.08203,0.015625 1.0001,1.0001 0 0 1 -0.01563,0.00195 1.0001,1.0001 0 0 1 -0.0078,0 1.0001,1.0001 0 0 1 -0.07617,0.00391 1.0001,1.0001 0 0 1 -0.01563,0.00195 1.0001,1.0001 0 0 1 -0.01172,0 1.0001,1.0001 0 0 1 -0.08789,-0.00391 1.0001,1.0001 0 0 1 -0.06445,-0.00781 1.0001,1.0001 0 0 1 -0.06641,-0.011719 1.0001,1.0001 0 0 1 -0.09766,-0.027344 1.0001,1.0001 0 0 1 -0.08398,-0.03125 1.0001,1.0001 0 0 1 -0.03125,-0.015625 1.0001,1.0001 0 0 1 -0.06055,-0.029297 1.0001,1.0001 0 0 1 -0.01563,-0.00977 1.0001,1.0001 0 0 1 -0.07422,-0.048828 1.0001,1.0001 0 0 1 -0.07813,-0.0625 1.0001,1.0001 0 0 1 -0.07227,-0.068359 1.0001,1.0001 0 0 1 -0.169922,-0.2480468 1.0001,1.0001 0 0 1 -0.03906,-0.091797 1.0001,1.0001 0 0 1 -0.0293,-0.095703 1.0001,1.0001 0 0 1 -0.01953,-0.097656 L 17.003906,7.0996094 16.382812,3.3769531 16.078125,2.921875 15.466797,2.5136719 12.902344,2 H 9.2363281 L 8.4121094,2.4121094 8,3.2363281 V 10 H 8.875 L 11.15625,9.4296875 11.429688,9.15625 12.011719,6.8300781 a 1.0001,1.0001 0 0 1 0.0039,-0.015625 1.0001,1.0001 0 0 1 0.222656,-0.4726562 1.0001,1.0001 0 0 1 0.06836,-0.074219 1.0001,1.0001 0 0 1 0.15625,-0.1230469 1.0001,1.0001 0 0 1 0.08789,-0.050781 1.0001,1.0001 0 0 1 0.169922,-0.066406 1.0001,1.0001 0 0 1 0.05274,-0.013672 1.0001,1.0001 0 0 1 0.02734,-0.00586 1.0001,1.0001 0 0 1 0.05469,-0.00977 1.0001,1.0001 0 0 1 0.06055,-0.00781 1.0001,1.0001 0 0 1 0.08398,-0.00391 1.0001,1.0001 0 0 1 0.08203,0.00391 1.0001,1.0001 0 0 1 0.002,0 1.0001,1.0001 0 0 1 0.002,0 1.0001,1.0001 0 0 1 0.07617,0.00977 1.0001,1.0001 0 0 1 0.04297,0.00781 1.0001,1.0001 0 0 1 0.05078,0.011719 1.0001,1.0001 0 0 1 0.05469,0.015625 1.0001,1.0001 0 0 1 0.01758,0.00586 1.0001,1.0001 0 0 1 0.04687,0.017578 1.0001,1.0001 0 0 1 0.02148,0.00977 1.0001,1.0001 0 0 1 0.07031,0.033203 1.0001,1.0001 0 0 1 0.08594,0.050781 1.0001,1.0001 0 0 1 0.08008,0.058594 1.0001,1.0001 0 0 1 0.140626,0.140625 A 1.0001,1.0001 0 0 1 14,7.0625 v 1.7910156 a 1.0001,1.0001 0 0 1 0,0.2734375 V 9.828125 a 1.0001,1.0001 0 0 1 0,0.328125 v 0.685547 a 1.0001,1.0001 0 0 1 0,0.326172 v 0.666015 a 1.0001,1.0001 0 0 1 0,0.332032 v 0.703125 a 1.0001,1.0001 0 0 1 0,0.277343 v 1.777344 a 1.0001,1.0001 0 0 1 -0.0625,0.439453 1.0001,1.0001 0 0 1 -0.03906,0.0918 1.0001,1.0001 0 0 1 -0.04883,0.08594 1.0001,1.0001 0 0 1 -0.121093,0.158203 1.0001,1.0001 0 0 1 -0.07227,0.07031 1.0001,1.0001 0 0 1 -0.164062,0.115235 1.0001,1.0001 0 0 1 -0.08399,0.04297 1.0001,1.0001 0 0 1 -0.0059,0.002 1.0001,1.0001 0 0 1 -0.0098,0.0039 1.0001,1.0001 0 0 1 -0.06445,0.02539 1.0001,1.0001 0 0 1 -0.01758,0.0059 1.0001,1.0001 0 0 1 -0.01367,0.0039 1.0001,1.0001 0 0 1 -0.08398,0.02148 1.0001,1.0001 0 0 1 -0.08203,0.01563 1.0001,1.0001 0 0 1 -0.04883,0.0039 1.0001,1.0001 0 0 1 -0.01953,0.002 1.0001,1.0001 0 0 1 -0.01953,0 1.0001,1.0001 0 0 1 -0.04492,0.002 1.0001,1.0001 0 0 1 -0.07031,-0.0039 1.0001,1.0001 0 0 1 -0.04687,-0.0039 1.0001,1.0001 0 0 1 -0.02148,-0.002 1.0001,1.0001 0 0 1 -0.189453,-0.04687 1.0001,1.0001 0 0 1 -0.263672,-0.140625 1.0001,1.0001 0 0 1 -0.148438,-0.134765 1.0001,1.0001 0 0 1 -0.164062,-0.25 1.0001,1.0001 0 0 1 -0.03711,-0.09375 1.0001,1.0001 0 0 1 -0.03906,-0.138672 1.0001,1.0001 0 0 1 -0.002,-0.0078 L 11.429688,12.84375 11.15625,12.570312 8.875,12 H 8 v 7.763672 L 8.4121094,20.587891 9.2363281,21 h 3.6660159 l 2.564453,-0.513672 0.611328,-0.408203 0.304687,-0.455078 0.625,-3.75 a 1.0001,1.0001 0 0 1 0.04492,-0.203125 1.0001,1.0001 0 0 1 0.08203,-0.181641 1.0001,1.0001 0 0 1 0.05469,-0.08398 1.0001,1.0001 0 0 1 0.130859,-0.150391 1.0001,1.0001 0 0 1 0.0625,-0.05469 1.0001,1.0001 0 0 1 0.02734,-0.01953 1.0001,1.0001 0 0 1 0.06055,-0.04102 1.0001,1.0001 0 0 1 0.01172,-0.0078 1.0001,1.0001 0 0 1 0.08594,-0.04492 1.0001,1.0001 0 0 1 0.0918,-0.03906 1.0001,1.0001 0 0 1 0.08984,-0.02734 1.0001,1.0001 0 0 1 0.0059,-0.002 1.0001,1.0001 0 0 1 0.0059,-0.002 1.0001,1.0001 0 0 1 0.0918,-0.01758 1.0001,1.0001 0 0 1 0.06836,-0.0078 1.0001,1.0001 0 0 1 0.0625,-0.0039 1.0001,1.0001 0 0 1 0.09961,0.0039 1.0001,1.0001 0 0 1 0.07031,0.0078 1.0001,1.0001 0 0 1 0.08789,0.01758 1.0001,1.0001 0 0 1 0.01172,0.0039 1.0001,1.0001 0 0 1 0.06445,0.01953 1.0001,1.0001 0 0 1 0.04687,0.01563 1.0001,1.0001 0 0 1 0.0098,0.0039 1.0001,1.0001 0 0 1 0.01758,0.0078 1.0001,1.0001 0 0 1 0.07422,0.03516 1.0001,1.0001 0 0 1 0.08594,0.05078 1.0001,1.0001 0 0 1 0.08008,0.05859 1.0001,1.0001 0 0 1 0.07422,0.06836 1.0001,1.0001 0 0 1 0.06641,0.07226 1.0001,1.0001 0 0 1 0.06055,0.08203 1.0001,1.0001 0 0 1 0.05078,0.08594 A 1.0001,1.0001 0 0 1 19,16.064453 v 2.800781 a 1.0001,1.0001 0 0 1 0,0.238282 v 0.74414 a 1.0001,1.0001 0 0 1 0,0.291016 v 0.697266 a 1.0001,1.0001 0 0 1 0,0.318359 V 22 a 1.0001,1.0001 0 0 1 -1,1 h -0.84375 a 1.0001,1.0001 0 0 1 -0.318359,0 h -0.697266 a 1.0001,1.0001 0 0 1 -0.291016,0 h -0.728515 a 1.0001,1.0001 0 0 1 -0.25,0 h -1.824219 a 1.0001,1.0001 0 0 1 -0.136719,0 H 9.109375 A 1.0001,1.0001 0 0 1 8.90625,23 h -0.75 A 1.0001,1.0001 0 0 1 7.8515625,23 H 7.1582031 A 1.0001,1.0001 0 0 1 6.8320312,23 H 5.1582031 A 1.0001,1.0001 0 0 1 4.8320312,23 H 4.1542969 A 1.0001,1.0001 0 0 1 3.8359375,23 H 3.0957031 A 1.0001,1.0001 0 0 1 2.8808594,23 H 2 A 1.0001,1.0001 0 1 1 2,21 H 2.7636719 L 3.5878906,20.587891 4,19.763672 V 3.2363281 L 3.5878906,2.4121094 2.7636719,2 H 2 A 1.0001,1.0001 0 1 1 2,0 H 2.890625 A 1.0001,1.0001 0 0 1 3.09375,0 h 0.75 A 1.0001,1.0001 0 0 1 4.1484375,0 H 4.8417969 A 1.0001,1.0001 0 0 1 4.984375,-0.01367188 Z"
     id="path2" />
</svg>
