<?xml version="1.0" encoding="UTF-8" standalone="no"?>
<svg
   xmlns:dc="http://purl.org/dc/elements/1.1/"
   xmlns:cc="http://creativecommons.org/ns#"
   xmlns:rdf="http://www.w3.org/1999/02/22-rdf-syntax-ns#"
   xmlns:svg="http://www.w3.org/2000/svg"
   xmlns="http://www.w3.org/2000/svg"
   xmlns:sodipodi="http://sodipodi.sourceforge.net/DTD/sodipodi-0.dtd"
   xmlns:inkscape="http://www.inkscape.org/namespaces/inkscape"
   data-dec="52"
   width="12"
   height="40"
   version="1.1"
   id="svg4"
   sodipodi:docname="52.svg"
   inkscape:version="0.92.4 5da689c313, 2019-01-14">
  <metadata
     id="metadata10">
    <rdf:RDF>
      <cc:Work
         rdf:about="">
        <dc:format>image/svg+xml</dc:format>
        <dc:type
           rdf:resource="http://purl.org/dc/dcmitype/StillImage" />
        <dc:title></dc:title>
      </cc:Work>
    </rdf:RDF>
  </metadata>
  <defs
     id="defs8" />
  <sodipodi:namedview
     pagecolor="#ffffff"
     bordercolor="#666666"
     borderopacity="1"
     objecttolerance="10"
     gridtolerance="10"
     guidetolerance="10"
     inkscape:pageopacity="0"
     inkscape:pageshadow="2"
     inkscape:window-width="1920"
     inkscape:window-height="1043"
     id="namedview6"
     showgrid="false"
     inkscape:zoom="5.9"
     inkscape:cx="6"
     inkscape:cy="20"
     inkscape:window-x="0"
     inkscape:window-y="37"
     inkscape:window-maximized="0"
     inkscape:current-layer="svg4" />
  <path
     style="color:#000000;font-style:normal;font-variant:normal;font-weight:normal;font-stretch:normal;font-size:medium;line-height:normal;font-family:sans-serif;font-variant-ligatures:normal;font-variant-position:normal;font-variant-caps:normal;font-variant-numeric:normal;font-variant-alternates:normal;font-feature-settings:normal;text-indent:0;text-align:start;text-decoration:none;text-decoration-line:none;text-decoration-style:solid;text-decoration-color:#000000;letter-spacing:normal;word-spacing:normal;text-transform:none;writing-mode:lr-tb;direction:ltr;text-orientation:mixed;dominant-baseline:auto;baseline-shift:baseline;text-anchor:start;white-space:normal;shape-padding:0;clip-rule:nonzero;display:inline;overflow:visible;visibility:visible;opacity:1;isolation:auto;mix-blend-mode:normal;color-interpolation:sRGB;color-interpolation-filters:linearRGB;solid-color:#000000;solid-opacity:1;vector-effect:none;fill:#000000;fill-opacity:1;fill-rule:nonzero;stroke:none;stroke-width:1.5;stroke-linecap:round;stroke-linejoin:round;stroke-miterlimit:4;stroke-dasharray:none;stroke-dashoffset:0;stroke-opacity:1;color-rendering:auto;image-rendering:auto;shape-rendering:auto;text-rendering:auto;enable-background:accumulate"
     d="M 6.4492188,4.8984375 2.3085938,15.25 h 4.140625 z M 7.1777344,0.24023438 a 0.750075,0.750075 0 0 1 0.076172,0.001953 0.750075,0.750075 0 0 1 0.00977,0 0.750075,0.750075 0 0 1 0.064453,0.007813 0.750075,0.750075 0 0 1 0.00977,0.001953 0.750075,0.750075 0 0 1 0.00586,0.001953 0.750075,0.750075 0 0 1 0.066406,0.015625 0.750075,0.750075 0 0 1 0.072266,0.0253906 0.750075,0.750075 0 0 1 0.066406,0.03125 0.750075,0.750075 0 0 1 0.056641,0.03125 0.750075,0.750075 0 0 1 0.00781,0.005859 A 0.750075,0.750075 0 0 1 7.78125,0.51367188 0.750075,0.750075 0 0 1 7.9492188,1.0722656 V 15.25 h 2.2500002 a 0.750075,0.750075 0 1 1 0,1.5 H 7.9492188 v 4.5 H 9 a 0.750075,0.750075 0 1 1 0,1.5 H 7.3222656 a 0.750075,0.750075 0 0 1 -0.2441406,0 H 5.4003906 a 0.750075,0.750075 0 1 1 0,-1.5 h 1.0488282 v -4.5 h -5.25 A 0.750075,0.750075 0 0 1 0.50390625,15.720703 L 6.4804688,0.77734375 a 0.750075,0.750075 0 0 1 0.6230468,-0.53125 0.750075,0.750075 0 0 1 0.052734,-0.003906 0.750075,0.750075 0 0 1 0.021484,-0.001953 z"
     id="path2" />
</svg>
