<?xml version="1.0" encoding="UTF-8" standalone="no"?>
<svg
   xmlns:dc="http://purl.org/dc/elements/1.1/"
   xmlns:cc="http://creativecommons.org/ns#"
   xmlns:rdf="http://www.w3.org/1999/02/22-rdf-syntax-ns#"
   xmlns:svg="http://www.w3.org/2000/svg"
   xmlns="http://www.w3.org/2000/svg"
   xmlns:sodipodi="http://sodipodi.sourceforge.net/DTD/sodipodi-0.dtd"
   xmlns:inkscape="http://www.inkscape.org/namespaces/inkscape"
   data-dec="118"
   width="16"
   height="40"
   version="1.1"
   id="svg4"
   sodipodi:docname="118.svg"
   inkscape:version="0.92.4 5da689c313, 2019-01-14">
  <metadata
     id="metadata10">
    <rdf:RDF>
      <cc:Work
         rdf:about="">
        <dc:format>image/svg+xml</dc:format>
        <dc:type
           rdf:resource="http://purl.org/dc/dcmitype/StillImage" />
        <dc:title></dc:title>
      </cc:Work>
    </rdf:RDF>
  </metadata>
  <defs
     id="defs8" />
  <sodipodi:namedview
     pagecolor="#ffffff"
     bordercolor="#666666"
     borderopacity="1"
     objecttolerance="10"
     gridtolerance="10"
     guidetolerance="10"
     inkscape:pageopacity="0"
     inkscape:pageshadow="2"
     inkscape:window-width="1920"
     inkscape:window-height="1043"
     id="namedview6"
     showgrid="false"
     inkscape:zoom="5.9"
     inkscape:cx="8"
     inkscape:cy="20"
     inkscape:window-x="0"
     inkscape:window-y="37"
     inkscape:window-maximized="0"
     inkscape:current-layer="svg4" />
  <path
     style="color:#000000;font-style:normal;font-variant:normal;font-weight:normal;font-stretch:normal;font-size:medium;line-height:normal;font-family:sans-serif;font-variant-ligatures:normal;font-variant-position:normal;font-variant-caps:normal;font-variant-numeric:normal;font-variant-alternates:normal;font-feature-settings:normal;text-indent:0;text-align:start;text-decoration:none;text-decoration-line:none;text-decoration-style:solid;text-decoration-color:#000000;letter-spacing:normal;word-spacing:normal;text-transform:none;writing-mode:lr-tb;direction:ltr;text-orientation:mixed;dominant-baseline:auto;baseline-shift:baseline;text-anchor:start;white-space:normal;shape-padding:0;clip-rule:nonzero;display:inline;overflow:visible;visibility:visible;opacity:1;isolation:auto;mix-blend-mode:normal;color-interpolation:sRGB;color-interpolation-filters:linearRGB;solid-color:#000000;solid-opacity:1;vector-effect:none;fill:#000000;fill-opacity:1;fill-rule:nonzero;stroke:none;stroke-width:1.5;stroke-linecap:round;stroke-linejoin:round;stroke-miterlimit:4;stroke-dasharray:none;stroke-dashoffset:0;stroke-opacity:1;color-rendering:auto;image-rendering:auto;shape-rendering:auto;text-rendering:auto;enable-background:accumulate"
     d="M 1.9804688,7.2402344 A 0.750075,0.750075 0 0 1 2.1152344,7.25 H 3 A 0.750075,0.750075 0 0 1 3.6914062,7.7109375 L 8,18.050781 12.308594,7.7109375 A 0.750075,0.750075 0 0 1 13,7.25 h 0.884766 a 0.750075,0.750075 0 0 1 0.734375,0.3105469 0.750075,0.750075 0 0 1 0.0039,0.00586 0.750075,0.750075 0 0 1 0.0078,0.011719 0.750075,0.750075 0 0 1 0.0332,0.052734 0.750075,0.750075 0 0 1 0.0059,0.011719 0.750075,0.750075 0 0 1 -0.02734,0.7597657 L 8.7265625,22.208984 a 0.750075,0.750075 0 0 1 -0.5742187,0.535157 0.750075,0.750075 0 0 1 -0.058594,0.0098 0.750075,0.750075 0 0 1 -0.00586,0 0.750075,0.750075 0 0 1 -0.037109,0.0039 0.750075,0.750075 0 0 1 -0.03125,0.002 0.750075,0.750075 0 0 1 -0.03125,0 0.750075,0.750075 0 0 1 -0.058594,-0.0039 0.750075,0.750075 0 0 1 -0.00195,0 0.750075,0.750075 0 0 1 -0.058594,-0.0078 0.750075,0.750075 0 0 1 -0.5957031,-0.541016 L 1.3554688,8.4003906 a 0.750075,0.750075 0 0 1 -0.064453,-0.6679687 0.750075,0.750075 0 0 1 0.029297,-0.068359 0.750075,0.750075 0 0 1 0.037109,-0.066406 0.750075,0.750075 0 0 1 0.021484,-0.033203 0.750075,0.750075 0 0 1 0.029297,-0.039063 0.750075,0.750075 0 0 1 0.5722657,-0.2851562 z"
     id="path2" />
</svg>
