<?xml version="1.0" encoding="UTF-8"?>
<glyph name="glyph156" format="1">
  <advance width="520"/>
  <unicode hex="015F"/>
  <outline>
    <contour>
      <point x="217" y="7" type="curve" smooth="yes"/>
      <point x="219" y="7" type="line" smooth="yes"/>
      <point x="243" y="7"/>
      <point x="262" y="-13"/>
      <point x="262" y="-37" type="curve" smooth="yes"/>
      <point x="262" y="-47"/>
      <point x="257" y="-61"/>
      <point x="249" y="-68" type="curve" smooth="yes"/>
      <point x="236" y="-81" type="line"/>
      <point x="249" y="-94" type="line" smooth="yes"/>
      <point x="256" y="-101"/>
      <point x="262" y="-114"/>
      <point x="262" y="-124" type="curve" smooth="yes"/>
      <point x="262" y="-134"/>
      <point x="256" y="-148"/>
      <point x="249" y="-155" type="curve" smooth="yes"/>
      <point x="220" y="-184" type="line" smooth="yes"/>
      <point x="213" y="-191"/>
      <point x="199" y="-197"/>
      <point x="189" y="-197" type="curve" smooth="yes"/>
      <point x="161" y="-197" type="line"/>
      <point x="160" y="-197" type="line" smooth="yes"/>
      <point x="136" y="-197"/>
      <point x="117" y="-177"/>
      <point x="117" y="-153" type="curve" smooth="yes"/>
      <point x="117" y="-144"/>
      <point x="121" y="-131"/>
      <point x="128" y="-124" type="curve"/>
      <point x="122" y="-117"/>
      <point x="117" y="-105"/>
      <point x="117" y="-96" type="curve" smooth="yes"/>
      <point x="117" y="-86"/>
      <point x="123" y="-72"/>
      <point x="130" y="-65" type="curve" smooth="yes"/>
      <point x="187" y="-7" type="line" smooth="yes"/>
      <point x="194" y="0"/>
      <point x="207" y="7"/>
    </contour>
    <contour>
      <point x="174" y="493" type="curve" smooth="yes"/>
      <point x="289" y="493" type="line" smooth="yes"/>
      <point x="295" y="493"/>
      <point x="303" y="490"/>
      <point x="309" y="488" type="curve" smooth="yes"/>
      <point x="366" y="459" type="line" smooth="yes"/>
      <point x="369" y="458"/>
      <point x="374" y="455"/>
      <point x="376" y="453" type="curve"/>
      <point x="383" y="460"/>
      <point x="396" y="464"/>
      <point x="405" y="464" type="curve" smooth="yes"/>
      <point x="429" y="464"/>
      <point x="449" y="445"/>
      <point x="449" y="421" type="curve" smooth="yes"/>
      <point x="449" y="420" type="line"/>
      <point x="449" y="333" type="line" smooth="yes"/>
      <point x="449" y="309"/>
      <point x="429" y="290"/>
      <point x="405" y="290" type="curve" smooth="yes"/>
      <point x="391" y="290"/>
      <point x="373" y="301"/>
      <point x="366" y="314" type="curve" smooth="yes"/>
      <point x="341" y="365" type="line"/>
      <point x="321" y="385" type="line"/>
      <point x="279" y="406" type="line"/>
      <point x="184" y="406" type="line"/>
      <point x="142" y="385" type="line"/>
      <point x="130" y="373" type="line"/>
      <point x="130" y="351" type="line"/>
      <point x="142" y="340" type="line"/>
      <point x="188" y="317" type="line"/>
      <point x="327" y="289" type="line" smooth="yes"/>
      <point x="330" y="288"/>
      <point x="335" y="286"/>
      <point x="338" y="285" type="curve" smooth="yes"/>
      <point x="396" y="256" type="line" smooth="yes"/>
      <point x="399" y="254"/>
      <point x="405" y="251"/>
      <point x="407" y="249" type="curve" smooth="yes"/>
      <point x="436" y="219" type="line" smooth="yes"/>
      <point x="443" y="212"/>
      <point x="449" y="198"/>
      <point x="449" y="188" type="curve" smooth="yes"/>
      <point x="449" y="102" type="line" smooth="yes"/>
      <point x="449" y="92"/>
      <point x="443" y="79"/>
      <point x="436" y="72" type="curve" smooth="yes"/>
      <point x="407" y="42" type="line" smooth="yes"/>
      <point x="405" y="40"/>
      <point x="399" y="36"/>
      <point x="396" y="34" type="curve" smooth="yes"/>
      <point x="338" y="6" type="line" smooth="yes"/>
      <point x="332" y="4"/>
      <point x="324" y="0"/>
      <point x="318" y="0" type="curve" smooth="yes"/>
      <point x="202" y="0" type="line" smooth="yes"/>
      <point x="196" y="0"/>
      <point x="190" y="4"/>
      <point x="184" y="6" type="curve" smooth="yes"/>
      <point x="129" y="32" type="line"/>
      <point x="125" y="14"/>
      <point x="106" y="0"/>
      <point x="87" y="0" type="curve" smooth="yes"/>
      <point x="63" y="0"/>
      <point x="43" y="19"/>
      <point x="43" y="43" type="curve" smooth="yes"/>
      <point x="43" y="44" type="line"/>
      <point x="43" y="160" type="line" smooth="yes"/>
      <point x="43" y="184"/>
      <point x="63" y="204"/>
      <point x="87" y="204" type="curve" smooth="yes"/>
      <point x="101" y="204"/>
      <point x="118" y="192"/>
      <point x="125" y="179" type="curve" smooth="yes"/>
      <point x="152" y="128" type="line"/>
      <point x="170" y="109" type="line"/>
      <point x="213" y="87" type="line"/>
      <point x="308" y="87" type="line"/>
      <point x="351" y="109" type="line"/>
      <point x="362" y="120" type="line"/>
      <point x="362" y="170" type="line"/>
      <point x="351" y="182" type="line"/>
      <point x="305" y="205" type="line"/>
      <point x="165" y="233" type="line" smooth="yes"/>
      <point x="162" y="234"/>
      <point x="157" y="235"/>
      <point x="154" y="236" type="curve" smooth="yes"/>
      <point x="97" y="265" type="line" smooth="yes"/>
      <point x="94" y="267"/>
      <point x="87" y="272"/>
      <point x="85" y="274" type="curve" smooth="yes"/>
      <point x="56" y="302" type="line" smooth="yes"/>
      <point x="49" y="309"/>
      <point x="43" y="323"/>
      <point x="43" y="333" type="curve" smooth="yes"/>
      <point x="43" y="392" type="line" smooth="yes"/>
      <point x="43" y="402"/>
      <point x="49" y="415"/>
      <point x="56" y="422" type="curve" smooth="yes"/>
      <point x="85" y="451" type="line" smooth="yes"/>
      <point x="87" y="453"/>
      <point x="94" y="457"/>
      <point x="97" y="459" type="curve" smooth="yes"/>
      <point x="154" y="488" type="line" smooth="yes"/>
      <point x="160" y="490"/>
      <point x="168" y="493"/>
    </contour>
  </outline>
  <lib>
    <dict>
      <key>com.fontlab.hintData</key>
      <dict>
        <key>hhints</key>
        <array>
          <dict>
            <key>position</key>
            <integer>-197</integer>
            <key>width</key>
            <integer>204</integer>
          </dict>
          <dict>
            <key>position</key>
            <integer>0</integer>
            <key>width</key>
            <integer>87</integer>
          </dict>
          <dict>
            <key>position</key>
            <integer>0</integer>
            <key>width</key>
            <integer>204</integer>
          </dict>
          <dict>
            <key>position</key>
            <integer>290</integer>
            <key>width</key>
            <integer>174</integer>
          </dict>
          <dict>
            <key>position</key>
            <integer>406</integer>
            <key>width</key>
            <integer>87</integer>
          </dict>
        </array>
        <key>vhints</key>
        <array>
          <dict>
            <key>position</key>
            <integer>43</integer>
            <key>width</key>
            <integer>87</integer>
          </dict>
          <dict>
            <key>position</key>
            <integer>117</integer>
            <key>width</key>
            <integer>145</integer>
          </dict>
          <dict>
            <key>position</key>
            <integer>362</integer>
            <key>width</key>
            <integer>87</integer>
          </dict>
        </array>
      </dict>
    </dict>
  </lib>
</glyph>
