<?xml version="1.0" encoding="UTF-8"?>
<glyph name="Odieresis" format="1">
  <advance width="635"/>
  <unicode hex="00D6"/>
  <outline>
    <component base="dieresis" xOffset="102" yOffset="196"/>
    <component base="O"/>
  </outline>
  <lib>
    <dict>
      <key>com.fontlab.hintData</key>
      <dict>
        <key>hhints</key>
        <array>
          <dict>
            <key>position</key>
            <integer>0</integer>
            <key>width</key>
            <integer>14</integer>
          </dict>
          <dict>
            <key>position</key>
            <integer>608</integer>
            <key>width</key>
            <integer>14</integer>
          </dict>
          <dict>
            <key>position</key>
            <integer>681</integer>
            <key>width</key>
            <integer>72</integer>
          </dict>
        </array>
        <key>vhints</key>
        <array>
          <dict>
            <key>position</key>
            <integer>79</integer>
            <key>width</key>
            <integer>15</integer>
          </dict>
          <dict>
            <key>position</key>
            <integer>109</integer>
            <key>width</key>
            <integer>14</integer>
          </dict>
          <dict>
            <key>position</key>
            <integer>154</integer>
            <key>width</key>
            <integer>271</integer>
          </dict>
          <dict>
            <key>position</key>
            <integer>514</integer>
            <key>width</key>
            <integer>14</integer>
          </dict>
          <dict>
            <key>position</key>
            <integer>542</integer>
            <key>width</key>
            <integer>15</integer>
          </dict>
        </array>
      </dict>
    </dict>
  </lib>
</glyph>
