<?xml version="1.0" encoding="UTF-8" standalone="no"?>
<svg
   xmlns:dc="http://purl.org/dc/elements/1.1/"
   xmlns:cc="http://creativecommons.org/ns#"
   xmlns:rdf="http://www.w3.org/1999/02/22-rdf-syntax-ns#"
   xmlns:svg="http://www.w3.org/2000/svg"
   xmlns="http://www.w3.org/2000/svg"
   xmlns:sodipodi="http://sodipodi.sourceforge.net/DTD/sodipodi-0.dtd"
   xmlns:inkscape="http://www.inkscape.org/namespaces/inkscape"
   data-dec="120"
   width="19"
   height="40"
   version="1.1"
   id="svg4"
   sodipodi:docname="120.svg"
   inkscape:version="0.92.4 5da689c313, 2019-01-14">
  <metadata
     id="metadata10">
    <rdf:RDF>
      <cc:Work
         rdf:about="">
        <dc:format>image/svg+xml</dc:format>
        <dc:type
           rdf:resource="http://purl.org/dc/dcmitype/StillImage" />
        <dc:title></dc:title>
      </cc:Work>
    </rdf:RDF>
  </metadata>
  <defs
     id="defs8" />
  <sodipodi:namedview
     pagecolor="#ffffff"
     bordercolor="#666666"
     borderopacity="1"
     objecttolerance="10"
     gridtolerance="10"
     guidetolerance="10"
     inkscape:pageopacity="0"
     inkscape:pageshadow="2"
     inkscape:window-width="1920"
     inkscape:window-height="1043"
     id="namedview6"
     showgrid="false"
     inkscape:zoom="5.9"
     inkscape:cx="9.5"
     inkscape:cy="20"
     inkscape:window-x="0"
     inkscape:window-y="37"
     inkscape:window-maximized="0"
     inkscape:current-layer="svg4" />
  <path
     style="color:#000000;font-style:normal;font-variant:normal;font-weight:normal;font-stretch:normal;font-size:medium;line-height:normal;font-family:sans-serif;font-variant-ligatures:normal;font-variant-position:normal;font-variant-caps:normal;font-variant-numeric:normal;font-variant-alternates:normal;font-feature-settings:normal;text-indent:0;text-align:start;text-decoration:none;text-decoration-line:none;text-decoration-style:solid;text-decoration-color:#000000;letter-spacing:normal;word-spacing:normal;text-transform:none;writing-mode:lr-tb;direction:ltr;text-orientation:mixed;dominant-baseline:auto;baseline-shift:baseline;text-anchor:start;white-space:normal;shape-padding:0;clip-rule:nonzero;display:inline;overflow:visible;visibility:visible;opacity:1;isolation:auto;mix-blend-mode:normal;color-interpolation:sRGB;color-interpolation-filters:linearRGB;solid-color:#000000;solid-opacity:1;vector-effect:none;fill:#000000;fill-opacity:1;fill-rule:nonzero;stroke:none;stroke-width:1.5;stroke-linecap:round;stroke-linejoin:round;stroke-miterlimit:4;stroke-dasharray:none;stroke-dashoffset:0;stroke-opacity:1;color-rendering:auto;image-rendering:auto;shape-rendering:auto;text-rendering:auto;enable-background:accumulate"
     d="M 2.9746094,7.2421875 A 0.750075,0.750075 0 0 1 3.0957031,7.25 h 0.7929688 a 0.750075,0.750075 0 0 1 0.2070312,0 h 1.8046875 a 0.750075,0.750075 0 0 1 0.2050782,0 H 7 a 0.750075,0.750075 0 1 1 0,1.5 H 6.3125 L 5.9453125,9.1171875 9.7832031,13.59375 13.996094,9.0585938 13.6875,8.75 H 13 a 0.750075,0.750075 0 1 1 0,-1.5 h 0.892578 a 0.750075,0.750075 0 0 1 0.199219,0 h 1.810547 a 0.750075,0.750075 0 0 1 0.214844,0 H 17 a 0.750075,0.750075 0 1 1 0,1.5 H 16.326172 L 10.765625,14.738281 16.345703,21.25 H 17 a 0.750075,0.750075 0 1 1 0,1.5 h -0.888672 a 0.750075,0.750075 0 0 1 -0.207031,0 h -0.792969 a 0.750075,0.750075 0 0 1 -0.207031,0 H 13 12 a 0.750075,0.750075 0 0 1 0,-1.5 h 0.689453 L 13.054688,20.884766 9.2167969,16.40625 5.0039062,20.941406 5.3125,21.25 H 6 a 0.750075,0.750075 0 1 1 0,1.5 H 5.1074219 a 0.750075,0.750075 0 0 1 -0.1992188,0 H 3.0976562 a 0.750075,0.750075 0 0 1 -0.2148437,0 H 2 a 0.750075,0.750075 0 1 1 0,-1.5 H 2.6738281 L 8.234375,15.261719 2.6542969,8.75 H 2 a 0.750075,0.750075 0 1 1 0,-1.5 h 0.8886719 a 0.750075,0.750075 0 0 1 0.085937,-0.00781 z"
     id="path2" />
</svg>
