<?xml version="1.0" encoding="UTF-8" standalone="no"?>
<svg
   xmlns:dc="http://purl.org/dc/elements/1.1/"
   xmlns:cc="http://creativecommons.org/ns#"
   xmlns:rdf="http://www.w3.org/1999/02/22-rdf-syntax-ns#"
   xmlns:svg="http://www.w3.org/2000/svg"
   xmlns="http://www.w3.org/2000/svg"
   xmlns:sodipodi="http://sodipodi.sourceforge.net/DTD/sodipodi-0.dtd"
   xmlns:inkscape="http://www.inkscape.org/namespaces/inkscape"
   data-dec="123"
   width="14"
   height="40"
   version="1.1"
   id="svg4"
   sodipodi:docname="123.svg"
   inkscape:version="0.92.4 (unknown)">
  <metadata
     id="metadata10">
    <rdf:RDF>
      <cc:Work
         rdf:about="">
        <dc:format>image/svg+xml</dc:format>
        <dc:type
           rdf:resource="http://purl.org/dc/dcmitype/StillImage" />
      </cc:Work>
    </rdf:RDF>
  </metadata>
  <defs
     id="defs8" />
  <sodipodi:namedview
     pagecolor="#ffffff"
     bordercolor="#666666"
     borderopacity="1"
     objecttolerance="10"
     gridtolerance="10"
     guidetolerance="10"
     inkscape:pageopacity="0"
     inkscape:pageshadow="2"
     inkscape:window-width="640"
     inkscape:window-height="480"
     id="namedview6"
     showgrid="false"
     inkscape:zoom="5.9"
     inkscape:cx="7"
     inkscape:cy="20"
     inkscape:window-x="0"
     inkscape:window-y="27"
     inkscape:window-maximized="0"
     inkscape:current-layer="svg4" />
  <path
     style="color:#000000;font-style:normal;font-variant:normal;font-weight:normal;font-stretch:normal;font-size:medium;line-height:normal;font-family:sans-serif;font-variant-ligatures:normal;font-variant-position:normal;font-variant-caps:normal;font-variant-numeric:normal;font-variant-alternates:normal;font-feature-settings:normal;text-indent:0;text-align:start;text-decoration:none;text-decoration-line:none;text-decoration-style:solid;text-decoration-color:#000000;letter-spacing:normal;word-spacing:normal;text-transform:none;writing-mode:lr-tb;direction:ltr;text-orientation:mixed;dominant-baseline:auto;baseline-shift:baseline;text-anchor:start;white-space:normal;shape-padding:0;clip-rule:nonzero;display:inline;overflow:visible;visibility:visible;opacity:1;isolation:auto;mix-blend-mode:normal;color-interpolation:sRGB;color-interpolation-filters:linearRGB;solid-color:#000000;solid-opacity:1;vector-effect:none;fill:#013272;fill-opacity:1;fill-rule:nonzero;stroke:none;stroke-width:2.5;stroke-linecap:round;stroke-linejoin:round;stroke-miterlimit:4;stroke-dasharray:none;stroke-dashoffset:0;stroke-opacity:1;color-rendering:auto;image-rendering:auto;shape-rendering:auto;text-rendering:auto;enable-background:accumulate"
     d="m 9.0058594,-4.2578125 a 1.250125,1.250125 0 0 1 0.5527344,2.375 L 7.9316406,-1.0683594 7.25,0.29492188 V 1.7050781 l 0.7773438,1.5546875 0.8574218,0.8554688 a 1.250125,1.250125 0 0 1 0.2324219,0.3261718 l 1.0000005,2 A 1.250125,1.250125 0 0 1 10.25,7 V 9 A 1.250125,1.250125 0 0 1 10.117188,9.5585938 L 9.1171875,11.558594 A 1.250125,1.250125 0 0 1 8.5585938,12.117188 L 6.7929688,13 l 1.765625,0.882812 a 1.250125,1.250125 0 0 1 0.5585937,0.558594 l 1.0000005,2 A 1.250125,1.250125 0 0 1 10.25,17 v 2 a 1.250125,1.250125 0 0 1 -0.132812,0.558594 l -1.0000005,2 A 1.250125,1.250125 0 0 1 8.8847656,21.884766 L 8.0273438,22.740234 7.25,24.294922 v 1.410156 l 0.6816406,1.363281 1.6269532,0.814453 A 1.250125,1.250125 0 1 1 8.4414062,30.117188 L 6.5957031,29.195312 A 1.250125,1.250125 0 0 1 6.0703125,28.839844 L 5.1152344,27.884766 A 1.250125,1.250125 0 0 1 4.8828125,27.558594 l -1,-2 A 1.250125,1.250125 0 0 1 3.75,25 v -2 a 1.250125,1.250125 0 0 1 0.1328125,-0.558594 l 1,-2 A 1.250125,1.250125 0 0 1 5.1152344,20.115234 L 5.9726562,19.259766 6.75,17.705078 v -1.1875 L 5.2558594,15.025391 3.4414062,14.117188 a 1.250125,1.250125 0 0 1 0,-2.234376 L 5.2558594,10.974609 6.75,9.4824219 v -1.1875 L 5.9726562,6.7402344 5.1152344,5.8847656 A 1.250125,1.250125 0 0 1 4.8828125,5.5585938 l -1,-2 A 1.250125,1.250125 0 0 1 3.75,3 V 1 A 1.250125,1.250125 0 0 1 3.8828125,0.44140625 l 1,-2.00000005 a 1.250125,1.250125 0 0 1 0.2324219,-0.3261718 l 0.9453125,-0.9453125 a 1.250125,1.250125 0 0 1 0.00781,-0.00977 1.250125,1.250125 0 0 1 0.53125,-0.3554687 l 1.8417968,-0.921875 a 1.250125,1.250125 0 0 1 0.5644532,-0.140625 z"
     id="path2" />
</svg>
