<?xml version="1.0" encoding="UTF-8" standalone="no"?>
<svg
   xmlns:dc="http://purl.org/dc/elements/1.1/"
   xmlns:cc="http://creativecommons.org/ns#"
   xmlns:rdf="http://www.w3.org/1999/02/22-rdf-syntax-ns#"
   xmlns:svg="http://www.w3.org/2000/svg"
   xmlns="http://www.w3.org/2000/svg"
   xmlns:sodipodi="http://sodipodi.sourceforge.net/DTD/sodipodi-0.dtd"
   xmlns:inkscape="http://www.inkscape.org/namespaces/inkscape"
   data-dec="171"
   width="14"
   height="40"
   version="1.1"
   id="svg4"
   sodipodi:docname="171.svg"
   inkscape:version="0.92.4 (unknown)">
  <metadata
     id="metadata10">
    <rdf:RDF>
      <cc:Work
         rdf:about="">
        <dc:format>image/svg+xml</dc:format>
        <dc:type
           rdf:resource="http://purl.org/dc/dcmitype/StillImage" />
      </cc:Work>
    </rdf:RDF>
  </metadata>
  <defs
     id="defs8" />
  <sodipodi:namedview
     pagecolor="#ffffff"
     bordercolor="#666666"
     borderopacity="1"
     objecttolerance="10"
     gridtolerance="10"
     guidetolerance="10"
     inkscape:pageopacity="0"
     inkscape:pageshadow="2"
     inkscape:window-width="640"
     inkscape:window-height="480"
     id="namedview6"
     showgrid="false"
     inkscape:zoom="5.9"
     inkscape:cx="7"
     inkscape:cy="20"
     inkscape:window-x="0"
     inkscape:window-y="27"
     inkscape:window-maximized="0"
     inkscape:current-layer="svg4" />
  <path
     style="color:#000000;font-style:normal;font-variant:normal;font-weight:normal;font-stretch:normal;font-size:medium;line-height:normal;font-family:sans-serif;font-variant-ligatures:normal;font-variant-position:normal;font-variant-caps:normal;font-variant-numeric:normal;font-variant-alternates:normal;font-feature-settings:normal;text-indent:0;text-align:start;text-decoration:none;text-decoration-line:none;text-decoration-style:solid;text-decoration-color:#000000;letter-spacing:normal;word-spacing:normal;text-transform:none;writing-mode:lr-tb;direction:ltr;text-orientation:mixed;dominant-baseline:auto;baseline-shift:baseline;text-anchor:start;white-space:normal;shape-padding:0;clip-rule:nonzero;display:inline;overflow:visible;visibility:visible;opacity:1;isolation:auto;mix-blend-mode:normal;color-interpolation:sRGB;color-interpolation-filters:linearRGB;solid-color:#000000;solid-opacity:1;vector-effect:none;fill:#013272;fill-opacity:1;fill-rule:nonzero;stroke:none;stroke-width:2.5;stroke-linecap:round;stroke-linejoin:round;stroke-miterlimit:4;stroke-dasharray:none;stroke-dashoffset:0;stroke-opacity:1;color-rendering:auto;image-rendering:auto;shape-rendering:auto;text-rendering:auto;enable-background:accumulate"
     d="m 12.986328,6.7363281 a 1.250125,1.250125 0 0 1 0.113281,0.00391 1.250125,1.250125 0 0 1 0.246094,0.042969 1.250125,1.250125 0 0 1 0.0098,0.00195 1.250125,1.250125 0 0 1 0.109375,0.037109 1.250125,1.250125 0 0 1 0.0098,0.00391 1.250125,1.250125 0 0 1 0.103516,0.046875 1.250125,1.250125 0 0 1 0.06836,0.039063 1.250125,1.250125 0 0 1 0.04102,0.023437 1.250125,1.250125 0 0 1 0.0078,0.00586 1.250125,1.250125 0 0 1 0.09375,0.066406 1.250125,1.250125 0 0 1 0.05469,0.046875 1.250125,1.250125 0 0 1 0.03906,0.035156 1.250125,1.250125 0 0 1 0.0078,0.00781 1.250125,1.250125 0 0 1 0.07813,0.083984 1.250125,1.250125 0 0 1 0.0059,0.00781 1.250125,1.250125 0 0 1 0.07422,0.099609 1.250125,1.250125 0 0 1 0.06445,0.1074219 1.250125,1.250125 0 0 1 0.05078,0.1035156 1.250125,1.250125 0 0 1 0.0039,0.00977 1.250125,1.250125 0 0 1 0.0078,0.019531 1.250125,1.250125 0 0 1 0.0332,0.097656 1.250125,1.250125 0 0 1 0.04687,0.2460938 1.250125,1.250125 0 0 1 0.0059,0.1132812 1.250125,1.250125 0 0 1 0,0.011719 1.250125,1.250125 0 0 1 -0.002,0.035156 1.250125,1.250125 0 0 1 -0.0059,0.089844 1.250125,1.250125 0 0 1 -0.01953,0.1230469 1.250125,1.250125 0 0 1 -0.02734,0.109375 1.250125,1.250125 0 0 1 -0.0039,0.011719 1.250125,1.250125 0 0 1 -0.0059,0.013672 1.250125,1.250125 0 0 1 -0.03906,0.1035156 1.250125,1.250125 0 0 1 -0.04883,0.1015625 1.250125,1.250125 0 0 1 -0.0059,0.00977 1.250125,1.250125 0 0 1 -0.142578,0.2050781 l -0.0059,0.00781 L 9.6269531,14 13.939453,19.173828 a 1.250125,1.250125 0 0 1 0.0059,0.0059 l 0.01563,0.01953 a 1.250125,1.250125 0 0 1 0.05469,0.06836 1.250125,1.250125 0 0 1 0.06836,0.103516 1.250125,1.250125 0 0 1 0.05859,0.111328 1.250125,1.250125 0 0 1 0.08398,0.234375 1.250125,1.250125 0 0 1 0.02149,0.117187 1.250125,1.250125 0 0 1 0.002,0.0059 1.250125,1.250125 0 0 1 0.002,0.01172 1.250125,1.250125 0 0 1 0.0078,0.238282 1.250125,1.250125 0 0 1 0,0.0098 1.250125,1.250125 0 0 1 -0.01367,0.115235 1.250125,1.250125 0 0 1 -0.002,0.0098 1.250125,1.250125 0 0 1 -0.02539,0.111329 1.250125,1.250125 0 0 1 -0.002,0.0098 1.250125,1.250125 0 0 1 -0.03516,0.109375 1.250125,1.250125 0 0 1 -0.0039,0.0098 1.250125,1.250125 0 0 1 -0.04687,0.105468 1.250125,1.250125 0 0 1 -0.0039,0.0078 1.250125,1.250125 0 0 1 -0.05664,0.09961 1.250125,1.250125 0 0 1 -0.0059,0.0098 1.250125,1.250125 0 0 1 -0.06641,0.09375 1.250125,1.250125 0 0 1 -0.0059,0.0078 1.250125,1.250125 0 0 1 -0.07617,0.08594 1.250125,1.250125 0 0 1 -0.08984,0.08594 1.250125,1.250125 0 0 1 -0.205078,0.144531 1.250125,1.250125 0 0 1 -0.0078,0.0039 1.250125,1.250125 0 0 1 -0.123047,0.05859 1.250125,1.250125 0 0 1 -0.107422,0.03906 1.250125,1.250125 0 0 1 -0.111328,0.0293 1.250125,1.250125 0 0 1 -0.0059,0 1.250125,1.250125 0 0 1 -0.0293,0.0059 1.250125,1.250125 0 0 1 -0.09766,0.01367 1.250125,1.250125 0 0 1 -0.25,0 1.250125,1.250125 0 0 1 -0.148438,-0.02344 1.250125,1.250125 0 0 1 -0.0957,-0.02539 1.250125,1.250125 0 0 1 -0.11914,-0.04297 1.250125,1.250125 0 0 1 -0.21875,-0.11914 1.250125,1.250125 0 0 1 -0.183594,-0.152344 1.250125,1.250125 0 0 1 -0.0039,-0.0039 1.250125,1.250125 0 0 1 -0.0039,-0.0039 l -5.9999996,-6 a 1.250125,1.250125 0 0 1 0,-1.769532 l 5.9824216,-5.9804684 0.01758,-0.019531 a 1.250125,1.250125 0 0 1 0.06055,-0.056641 1.250125,1.250125 0 0 1 0.09961,-0.082031 1.250125,1.250125 0 0 1 0.0098,-0.00781 1.250125,1.250125 0 0 1 0.08008,-0.050781 1.250125,1.250125 0 0 1 0.01758,-0.011719 1.250125,1.250125 0 0 1 0.109376,-0.054687 1.250125,1.250125 0 0 1 0.115234,-0.046875 1.250125,1.250125 0 0 1 0.0098,-0.00391 1.250125,1.250125 0 0 1 0.111328,-0.03125 1.250125,1.250125 0 0 1 0.123046,-0.021484 1.250125,1.250125 0 0 1 0.123047,-0.00977 1.250125,1.250125 0 0 1 0.01172,-0.00195 z m -5.9999999,0 a 1.250125,1.250125 0 0 1 0.1132813,0.00391 1.250125,1.250125 0 0 1 0.2460937,0.042969 1.250125,1.250125 0 0 1 0.00977,0.00195 1.250125,1.250125 0 0 1 0.109375,0.037109 1.250125,1.250125 0 0 1 0.00977,0.00391 1.250125,1.250125 0 0 1 0.1035156,0.046875 1.250125,1.250125 0 0 1 0.068359,0.039063 1.250125,1.250125 0 0 1 0.041016,0.023437 1.250125,1.250125 0 0 1 0.00781,0.00586 1.250125,1.250125 0 0 1 0.09375,0.066406 1.250125,1.250125 0 0 1 0.00781,0.00586 1.250125,1.250125 0 0 1 0.085937,0.076172 1.250125,1.250125 0 0 1 0.00781,0.00781 1.250125,1.250125 0 0 1 0.078125,0.083984 1.250125,1.250125 0 0 1 0.00586,0.00781 1.250125,1.250125 0 0 1 0.074219,0.099609 1.250125,1.250125 0 0 1 0.064453,0.1074219 A 1.250125,1.250125 0 0 1 8.1640625,7.5 a 1.250125,1.250125 0 0 1 0.00391,0.00977 1.250125,1.250125 0 0 1 0.00781,0.019531 1.250125,1.250125 0 0 1 0.033203,0.097656 1.250125,1.250125 0 0 1 0.046875,0.2460938 1.250125,1.250125 0 0 1 0.00586,0.1132812 1.250125,1.250125 0 0 1 0,0.011719 1.250125,1.250125 0 0 1 -0.00195,0.035156 1.250125,1.250125 0 0 1 -0.00586,0.089844 1.250125,1.250125 0 0 1 -0.019531,0.1230469 1.250125,1.250125 0 0 1 -0.027344,0.109375 1.250125,1.250125 0 0 1 -0.00391,0.011719 1.250125,1.250125 0 0 1 -0.00586,0.013672 1.250125,1.250125 0 0 1 -0.039063,0.1035156 1.250125,1.250125 0 0 1 -0.048828,0.1015625 1.250125,1.250125 0 0 1 -0.00586,0.00977 1.250125,1.250125 0 0 1 -0.1425781,0.2050781 l -0.00586,0.00781 L 3.6269531,14 l 4.3125,5.173828 a 1.250125,1.250125 0 0 1 0.00586,0.0059 l 0.015625,0.01953 a 1.250125,1.250125 0 0 1 0.054687,0.06836 1.250125,1.250125 0 0 1 0.068359,0.103516 1.250125,1.250125 0 0 1 0.058594,0.111328 1.250125,1.250125 0 0 1 0.083984,0.234375 1.250125,1.250125 0 0 1 0.021484,0.117187 1.250125,1.250125 0 0 1 0.00195,0.0059 1.250125,1.250125 0 0 1 0.00195,0.01172 1.250125,1.250125 0 0 1 0.00781,0.238282 1.250125,1.250125 0 0 1 0,0.0098 1.250125,1.250125 0 0 1 -0.013672,0.115235 1.250125,1.250125 0 0 1 -0.00195,0.0098 1.250125,1.250125 0 0 1 -0.025391,0.111329 1.250125,1.250125 0 0 1 -0.00195,0.0098 1.250125,1.250125 0 0 1 -0.035156,0.109375 1.250125,1.250125 0 0 1 -0.00391,0.0098 1.250125,1.250125 0 0 1 -0.046875,0.105468 1.250125,1.250125 0 0 1 -0.00391,0.0078 1.250125,1.250125 0 0 1 -0.056641,0.09961 1.250125,1.250125 0 0 1 -0.00586,0.0098 1.250125,1.250125 0 0 1 -0.066406,0.09375 1.250125,1.250125 0 0 1 -0.00586,0.0078 1.250125,1.250125 0 0 1 -0.076172,0.08594 1.250125,1.250125 0 0 1 -0.089844,0.08594 1.250125,1.250125 0 0 1 -0.2050781,0.144531 1.250125,1.250125 0 0 1 -0.00781,0.0039 1.250125,1.250125 0 0 1 -0.1035156,0.05078 1.250125,1.250125 0 0 1 -0.00977,0.0039 1.250125,1.250125 0 0 1 -0.00977,0.0039 1.250125,1.250125 0 0 1 -0.1074219,0.03906 1.250125,1.250125 0 0 1 -0.1113281,0.0293 1.250125,1.250125 0 0 1 -0.00586,0 1.250125,1.250125 0 0 1 -0.029297,0.0059 1.250125,1.250125 0 0 1 -0.097656,0.01367 1.250125,1.250125 0 0 1 -0.25,0 1.250125,1.250125 0 0 1 -0.1132813,-0.01563 1.250125,1.250125 0 0 1 -0.00977,-0.002 1.250125,1.250125 0 0 1 -0.025391,-0.0059 1.250125,1.250125 0 0 1 -0.095703,-0.02539 1.250125,1.250125 0 0 1 -0.1191406,-0.04297 1.250125,1.250125 0 0 1 -0.21875,-0.11914 1.250125,1.250125 0 0 1 -0.1835937,-0.152344 1.250125,1.250125 0 0 1 -0.00391,-0.0039 1.250125,1.250125 0 0 1 -0.00391,-0.0039 l -6.00000002,-6 a 1.250125,1.250125 0 0 1 0,-1.769532 L 6.0976562,7.1347656 6.1152344,7.1152344 a 1.250125,1.250125 0 0 1 0.060547,-0.056641 1.250125,1.250125 0 0 1 0.00391,-0.00391 1.250125,1.250125 0 0 1 0.00781,-0.00781 1.250125,1.250125 0 0 1 0.087891,-0.070312 1.250125,1.250125 0 0 1 0.00977,-0.00781 1.250125,1.250125 0 0 1 0.080078,-0.050781 1.250125,1.250125 0 0 1 0.017578,-0.011719 1.250125,1.250125 0 0 1 0.109375,-0.054687 1.250125,1.250125 0 0 1 0.1152344,-0.046875 1.250125,1.250125 0 0 1 0.00977,-0.00391 1.250125,1.250125 0 0 1 0.1113281,-0.03125 1.250125,1.250125 0 0 1 0.1230469,-0.021484 1.250125,1.250125 0 0 1 0.1230469,-0.00977 1.250125,1.250125 0 0 1 0.011719,-0.00195 z"
     id="path2" />
</svg>
