<?xml version="1.0" encoding="UTF-8" standalone="no"?>
<svg
   xmlns:dc="http://purl.org/dc/elements/1.1/"
   xmlns:cc="http://creativecommons.org/ns#"
   xmlns:rdf="http://www.w3.org/1999/02/22-rdf-syntax-ns#"
   xmlns:svg="http://www.w3.org/2000/svg"
   xmlns="http://www.w3.org/2000/svg"
   xmlns:sodipodi="http://sodipodi.sourceforge.net/DTD/sodipodi-0.dtd"
   xmlns:inkscape="http://www.inkscape.org/namespaces/inkscape"
   data-dec="123"
   width="14"
   height="40"
   version="1.1"
   id="svg4"
   sodipodi:docname="123.svg"
   inkscape:version="0.92.4 5da689c313, 2019-01-14">
  <metadata
     id="metadata10">
    <rdf:RDF>
      <cc:Work
         rdf:about="">
        <dc:format>image/svg+xml</dc:format>
        <dc:type
           rdf:resource="http://purl.org/dc/dcmitype/StillImage" />
        <dc:title></dc:title>
      </cc:Work>
    </rdf:RDF>
  </metadata>
  <defs
     id="defs8" />
  <sodipodi:namedview
     pagecolor="#ffffff"
     bordercolor="#666666"
     borderopacity="1"
     objecttolerance="10"
     gridtolerance="10"
     guidetolerance="10"
     inkscape:pageopacity="0"
     inkscape:pageshadow="2"
     inkscape:window-width="1920"
     inkscape:window-height="1043"
     id="namedview6"
     showgrid="false"
     inkscape:zoom="5.9"
     inkscape:cx="7"
     inkscape:cy="20"
     inkscape:window-x="0"
     inkscape:window-y="37"
     inkscape:window-maximized="0"
     inkscape:current-layer="svg4" />
  <path
     style="color:#000000;font-style:normal;font-variant:normal;font-weight:normal;font-stretch:normal;font-size:medium;line-height:normal;font-family:sans-serif;font-variant-ligatures:normal;font-variant-position:normal;font-variant-caps:normal;font-variant-numeric:normal;font-variant-alternates:normal;font-feature-settings:normal;text-indent:0;text-align:start;text-decoration:none;text-decoration-line:none;text-decoration-style:solid;text-decoration-color:#000000;letter-spacing:normal;word-spacing:normal;text-transform:none;writing-mode:lr-tb;direction:ltr;text-orientation:mixed;dominant-baseline:auto;baseline-shift:baseline;text-anchor:start;white-space:normal;shape-padding:0;clip-rule:nonzero;display:inline;overflow:visible;visibility:visible;opacity:1;isolation:auto;mix-blend-mode:normal;color-interpolation:sRGB;color-interpolation-filters:linearRGB;solid-color:#000000;solid-opacity:1;vector-effect:none;fill:#000000;fill-opacity:1;fill-rule:nonzero;stroke:none;stroke-width:1.5;stroke-linecap:round;stroke-linejoin:round;stroke-miterlimit:4;stroke-dasharray:none;stroke-dashoffset:0;stroke-opacity:1;color-rendering:auto;image-rendering:auto;shape-rendering:auto;text-rendering:auto;enable-background:accumulate"
     d="m 9.0039062,-3.7539062 a 0.750075,0.750075 0 0 1 0.3320313,1.4238281 L 7.5585938,-1.4394531 6.75,0.17773438 V 1.8222656 L 7.6171875,3.5566406 8.53125,4.46875 a 0.750075,0.750075 0 0 1 0.1386719,0.1953125 l 1,2 A 0.750075,0.750075 0 0 1 9.75,7 v 2 a 0.750075,0.750075 0 0 1 -0.080078,0.3359375 l -1,2.0000005 a 0.750075,0.750075 0 0 1 -0.3339844,0.333984 l -1.953125,0.976562 a 0.750075,0.750075 0 0 1 -0.1132813,0.05664 L 5.6757812,13 6.2597656,13.291016 a 0.750075,0.750075 0 0 1 0.1289063,0.06445 l 1.9472656,0.974609 a 0.750075,0.750075 0 0 1 0.3339844,0.333984 l 1,2 A 0.750075,0.750075 0 0 1 9.75,17 v 2 a 0.750075,0.750075 0 0 1 -0.080078,0.335938 l -1,2 A 0.750075,0.750075 0 0 1 8.53125,21.53125 L 7.6171875,22.443359 6.75,24.177734 v 1.644532 l 0.8085938,1.617187 1.7773437,0.890625 a 0.750075,0.750075 0 1 1 -0.671875,1.339844 L 6.7675781,28.720703 a 0.750075,0.750075 0 0 1 -0.00977,-0.0039 A 0.750075,0.750075 0 0 1 6.46875,28.53125 l -0.013672,-0.01172 a 0.750075,0.750075 0 0 1 -0.00977,-0.01172 L 5.46875,27.53125 A 0.750075,0.750075 0 0 1 5.3300781,27.335938 l -1,-2 A 0.750075,0.750075 0 0 1 4.25,25 v -2 a 0.750075,0.750075 0 0 1 0.080078,-0.335938 l 1,-2 A 0.750075,0.750075 0 0 1 5.46875,20.46875 L 6.3828125,19.556641 7.25,17.822266 V 16.310547 L 5.5507812,14.613281 3.6640625,13.669922 a 0.750075,0.750075 0 0 1 0,-1.339844 L 5.5507812,11.386719 7.25,9.6894531 V 8.1777344 L 6.3828125,6.4433594 5.46875,5.53125 A 0.750075,0.750075 0 0 1 5.3300781,5.3359375 l -1,-2 A 0.750075,0.750075 0 0 1 4.25,3 V 1 a 0.750075,0.750075 0 0 1 0.080078,-0.3359375 l 1,-2 A 0.750075,0.750075 0 0 1 5.46875,-1.53125 L 6.4414062,-2.5039062 A 0.750075,0.750075 0 0 1 6.46875,-2.53125 0.750075,0.750075 0 0 1 6.7578125,-2.7167969 l 1.90625,-0.953125 a 0.750075,0.750075 0 0 1 0.3398437,-0.083984 z"
     id="path2" />
</svg>
