<?xml version="1.0" encoding="UTF-8"?>
<glyph name="icircumflex" format="1">
  <advance width="289"/>
  <unicode hex="00EE"/>
  <outline>
    <contour>
      <point x="144" y="463" type="line"/>
      <point x="145" y="463" type="line" smooth="yes"/>
      <point x="152" y="463"/>
      <point x="161" y="459"/>
      <point x="165" y="455" type="curve"/>
      <point x="165" y="454" type="line"/>
      <point x="169" y="450"/>
      <point x="174" y="440"/>
      <point x="174" y="433" type="curve" smooth="yes"/>
      <point x="174" y="429" type="line"/>
      <point x="174" y="57" type="line"/>
      <point x="232" y="57" type="line" smooth="yes"/>
      <point x="248" y="57"/>
      <point x="261" y="45"/>
      <point x="261" y="29" type="curve" smooth="yes"/>
      <point x="261" y="13"/>
      <point x="248" y="0"/>
      <point x="232" y="0" type="curve" smooth="yes"/>
      <point x="150" y="0" type="line" smooth="yes"/>
      <point x="149" y="0"/>
      <point x="145" y="-1"/>
      <point x="144" y="-1" type="curve" smooth="yes"/>
      <point x="143" y="-1"/>
      <point x="141" y="0"/>
      <point x="140" y="0" type="curve" smooth="yes"/>
      <point x="58" y="0" type="line"/>
      <point x="57" y="0" type="line" smooth="yes"/>
      <point x="41" y="0"/>
      <point x="29" y="13"/>
      <point x="29" y="29" type="curve" smooth="yes"/>
      <point x="29" y="45"/>
      <point x="41" y="57"/>
      <point x="57" y="57" type="curve" smooth="yes"/>
      <point x="58" y="57" type="line"/>
      <point x="116" y="57" type="line"/>
      <point x="116" y="405" type="line"/>
      <point x="58" y="405" type="line"/>
      <point x="57" y="405" type="line" smooth="yes"/>
      <point x="41" y="405"/>
      <point x="29" y="417"/>
      <point x="29" y="433" type="curve" smooth="yes"/>
      <point x="29" y="449"/>
      <point x="41" y="463"/>
      <point x="57" y="463" type="curve" smooth="yes"/>
      <point x="58" y="463" type="line"/>
      <point x="140" y="463" type="line"/>
    </contour>
    <component base="asciicircum" xOffset="-115" yOffset="232"/>
  </outline>
  <lib>
    <dict>
      <key>com.fontlab.hintData</key>
      <dict>
        <key>hhints</key>
        <array>
          <dict>
            <key>position</key>
            <integer>0</integer>
            <key>width</key>
            <integer>57</integer>
          </dict>
          <dict>
            <key>position</key>
            <integer>405</integer>
            <key>width</key>
            <integer>58</integer>
          </dict>
          <dict>
            <key>position</key>
            <integer>550</integer>
            <key>width</key>
            <integer>116</integer>
          </dict>
          <dict>
            <key>position</key>
            <integer>724</integer>
            <key>width</key>
            <integer>232</integer>
          </dict>
        </array>
        <key>vhints</key>
        <array>
          <dict>
            <key>position</key>
            <integer>29</integer>
            <key>width</key>
            <integer>136</integer>
          </dict>
          <dict>
            <key>position</key>
            <integer>58</integer>
            <key>width</key>
            <integer>116</integer>
          </dict>
          <dict>
            <key>position</key>
            <integer>116</integer>
            <key>width</key>
            <integer>58</integer>
          </dict>
        </array>
      </dict>
    </dict>
  </lib>
</glyph>
