<?xml version="1.0" encoding="UTF-8" standalone="no"?>
<svg
   xmlns:dc="http://purl.org/dc/elements/1.1/"
   xmlns:cc="http://creativecommons.org/ns#"
   xmlns:rdf="http://www.w3.org/1999/02/22-rdf-syntax-ns#"
   xmlns:svg="http://www.w3.org/2000/svg"
   xmlns="http://www.w3.org/2000/svg"
   xmlns:sodipodi="http://sodipodi.sourceforge.net/DTD/sodipodi-0.dtd"
   xmlns:inkscape="http://www.inkscape.org/namespaces/inkscape"
   data-dec="64259"
   width="22"
   height="40"
   version="1.1"
   id="svg4"
   sodipodi:docname="64259.svg"
   inkscape:version="0.92.4 5da689c313, 2019-01-14">
  <metadata
     id="metadata10">
    <rdf:RDF>
      <cc:Work
         rdf:about="">
        <dc:format>image/svg+xml</dc:format>
        <dc:type
           rdf:resource="http://purl.org/dc/dcmitype/StillImage" />
        <dc:title></dc:title>
      </cc:Work>
    </rdf:RDF>
  </metadata>
  <defs
     id="defs8" />
  <sodipodi:namedview
     pagecolor="#ffffff"
     bordercolor="#666666"
     borderopacity="1"
     objecttolerance="10"
     gridtolerance="10"
     guidetolerance="10"
     inkscape:pageopacity="0"
     inkscape:pageshadow="2"
     inkscape:window-width="1920"
     inkscape:window-height="1043"
     id="namedview6"
     showgrid="false"
     inkscape:zoom="5.9"
     inkscape:cx="11"
     inkscape:cy="20"
     inkscape:window-x="0"
     inkscape:window-y="37"
     inkscape:window-maximized="0"
     inkscape:current-layer="svg4" />
  <path
     style="color:#000000;font-style:normal;font-variant:normal;font-weight:normal;font-stretch:normal;font-size:medium;line-height:normal;font-family:sans-serif;font-variant-ligatures:normal;font-variant-position:normal;font-variant-caps:normal;font-variant-numeric:normal;font-variant-alternates:normal;font-feature-settings:normal;text-indent:0;text-align:start;text-decoration:none;text-decoration-line:none;text-decoration-style:solid;text-decoration-color:#000000;letter-spacing:normal;word-spacing:normal;text-transform:none;writing-mode:lr-tb;direction:ltr;text-orientation:mixed;dominant-baseline:auto;baseline-shift:baseline;text-anchor:start;white-space:normal;shape-padding:0;clip-rule:nonzero;display:inline;overflow:visible;visibility:visible;opacity:1;isolation:auto;mix-blend-mode:normal;color-interpolation:sRGB;color-interpolation-filters:linearRGB;solid-color:#000000;solid-opacity:1;vector-effect:none;fill:#000000;fill-opacity:1;fill-rule:nonzero;stroke:none;stroke-width:0.5;stroke-linecap:round;stroke-linejoin:round;stroke-miterlimit:4;stroke-dasharray:none;stroke-dashoffset:0;stroke-opacity:1;color-rendering:auto;image-rendering:auto;shape-rendering:auto;text-rendering:auto;enable-background:accumulate"
     d="M 18.25,21.605469 V 21.75 h 0.144531 z m -1.5,0 L 16.605469,21.75 H 16.75 Z m -5.5,0 V 21.75 h 0.144531 z m -1.5,0 L 9.6054688,21.75 H 9.75 Z m -5.5,0 V 21.75 h 0.1445312 z m -1.5,0 L 2.6054688,21.75 H 2.75 Z M 16.056641,8.25 17.066406,8.7539062 a 0.250025,0.250025 0 0 1 0.0039,0.00195 0.250025,0.250025 0 0 1 0.103516,0.064453 A 0.250025,0.250025 0 0 1 17.25,9 v 1 a 0.250025,0.250025 0 0 1 0,0.01758 v 10.94336 a 0.250025,0.250025 0 0 1 0,0.07422 V 21.75 h 0.5 v -0.720703 a 0.250025,0.250025 0 0 1 0,-0.06055 V 8.25 Z M 11.25,8.25 V 8.3945312 L 11.394531,8.25 Z m -1,0 v 0.7207031 a 0.250025,0.250025 0 0 1 0,0.060547 v 11.929688 a 0.250025,0.250025 0 0 1 0,0.07422 V 21.75 h 0.5 v -0.720703 a 0.250025,0.250025 0 0 1 0,-0.06055 V 9.0390625 a 0.250025,0.250025 0 0 1 0,-0.074219 V 8.25 Z M 9.6054688,8.25 9.75,8.3945312 V 8.25 Z M 4.25,8.25 V 8.3945312 L 4.3945312,8.25 Z m -1,0 v 0.7207031 a 0.250025,0.250025 0 0 1 0,0.060547 v 11.929688 a 0.250025,0.250025 0 0 1 0,0.07422 V 21.75 h 0.5 v -0.720703 a 0.250025,0.250025 0 0 1 0,-0.06055 V 9.0390625 a 0.250025,0.250025 0 0 1 0,-0.074219 V 8.25 Z M 2.6054688,8.25 2.75,8.3945312 V 8.25 Z M 17.25,3.25 V 3.3945312 L 17.394531,3.25 Z m -0.644531,0 L 16.75,3.3945312 V 3.25 Z M 11.5,2.8554688 11.21875,3.1347656 10.25,6.0371094 V 7.75 h 0.5 V 6.0195312 a 0.250025,0.250025 0 0 1 0,-0.037109 0.250025,0.250025 0 0 1 0.002,-0.013672 0.250025,0.250025 0 0 1 0.002,-0.011719 0.250025,0.250025 0 0 1 0.002,-0.011719 0.250025,0.250025 0 0 1 0.01953,-0.058594 l 0.939453,-2.8164063 z m 5.75,-0.25 V 2.75 h 0.144531 z M 12.730469,1.9140625 12.148438,2.2050781 11.855469,2.5 12,2.6445312 Z m -7.0000002,0 L 5.1484375,2.2050781 4.21875,3.1347656 3.25,6.0371094 V 7.75 h 0.5 V 6.0195312 a 0.250025,0.250025 0 0 1 0,-0.037109 0.250025,0.250025 0 0 1 0.00195,-0.013672 0.250025,0.250025 0 0 1 0.00195,-0.011719 0.250025,0.250025 0 0 1 0.00195,-0.011719 0.250025,0.250025 0 0 1 0.019531,-0.058594 L 4.7636719,2.921875 a 0.250025,0.250025 0 0 1 0.058594,-0.099609 z M 16.267578,1.9121094 16.5,2.1445312 l 0.07813,-0.078125 z m -6,0 L 11,2.6445312 11.144531,2.5 10.845703,2.2011719 Z M 7.1035156,1.25 5.21875,3.1347656 4.25,6.0371094 V 7.75 h 0.7207031 a 0.250025,0.250025 0 0 1 0.060547,0 H 6.9746094 7 7.0175781 8.9609375 a 0.250025,0.250025 0 0 1 0.074219,0 H 9.75 V 6.0195312 a 0.250025,0.250025 0 0 1 0,-0.037109 0.250025,0.250025 0 0 1 0.00195,-0.013672 0.250025,0.250025 0 0 1 0.00195,-0.011719 0.250025,0.250025 0 0 1 0.00195,-0.011719 0.250025,0.250025 0 0 1 0.019531,-0.058594 L 10.714844,3.0703125 8.8964844,1.25 Z M 8.9921875,0.74804688 A 0.250025,0.250025 0 0 1 9.015625,0.75 a 0.250025,0.250025 0 0 1 0.00586,0 0.250025,0.250025 0 0 1 0.019531,0.001953 0.250025,0.250025 0 0 1 0.00586,0.001953 0.250025,0.250025 0 0 1 0.019531,0.003906 0.250025,0.250025 0 0 1 0.00391,0.001953 0.250025,0.250025 0 0 1 0.019531,0.005859 0.250025,0.250025 0 0 1 0.00391,0.001953 0.250025,0.250025 0 0 1 0.044922,0.0234375 l 0.00391,0.001953 1.9277339,0.96484375 a 0.250025,0.250025 0 0 1 0.0078,0.00391 0.250025,0.250025 0 0 1 0.04883,0.023437 0.250025,0.250025 0 0 1 0.04102,0.029297 0.250025,0.250025 0 0 1 0.0098,0.00781 0.250025,0.250025 0 0 1 0.0078,0.00781 L 11.5,2.1445312 11.822266,1.8222656 a 0.250025,0.250025 0 0 1 0.06641,-0.044922 l 1.966797,-0.98242192 a 0.250025,0.250025 0 0 1 0.0078,-0.003906 0.250025,0.250025 0 0 1 0.03906,-0.0214844 0.250025,0.250025 0 0 1 0.02344,-0.007813 A 0.250025,0.250025 0 0 1 14.03125,0.75 h 0.935547 a 0.250025,0.250025 0 0 1 0.04883,0 0.250025,0.250025 0 0 1 0.0059,0 0.250025,0.250025 0 0 1 0.0059,0 0.250025,0.250025 0 0 1 0.01367,0.001953 0.250025,0.250025 0 0 1 0.0059,0.001953 0.250025,0.250025 0 0 1 0.01758,0.003906 0.250025,0.250025 0 0 1 0.0059,0.001953 0.250025,0.250025 0 0 1 0.01953,0.005859 0.250025,0.250025 0 0 1 0.0039,0.001953 0.250025,0.250025 0 0 1 0.01758,0.009766 0.250025,0.250025 0 0 1 0.02734,0.0136719 l 1.927734,0.96289058 0.002,0.00195 h 0.002 a 0.250025,0.250025 0 0 1 0.0059,0.00195 0.250025,0.250025 0 0 1 0.0332,0.013672 0.250025,0.250025 0 0 1 0.0059,0.00391 0.250025,0.250025 0 0 1 0.002,0 0.250025,0.250025 0 0 1 0.01953,0.011719 0.250025,0.250025 0 0 1 0.002,0 0.250025,0.250025 0 0 1 0.0078,0.00586 0.250025,0.250025 0 0 1 0.01172,0.00977 0.250025,0.250025 0 0 1 0.01758,0.015625 0.250025,0.250025 0 0 1 0,0.00195 0.250025,0.250025 0 0 1 0.0098,0.00977 0.250025,0.250025 0 0 1 0.0078,0.00586 0.250025,0.250025 0 0 1 0,0.00195 l 0.0078,0.00781 a 0.250025,0.250025 0 0 1 0.0078,0.00977 l 0.94336,0.9414062 a 0.250025,0.250025 0 0 1 0.0059,0.00391 0.250025,0.250025 0 0 1 0.0078,0.00977 0.250025,0.250025 0 0 1 0.0098,0.00781 l 0.002,0.00391 a 0.250025,0.250025 0 0 1 0.01367,0.013672 0.250025,0.250025 0 0 1 0.03711,0.056641 0.250025,0.250025 0 0 1 0.0039,0.00586 0.250025,0.250025 0 0 1 0,0.00195 0.250025,0.250025 0 0 1 0.01953,0.072266 0.250025,0.250025 0 0 1 0,0.046875 0.250025,0.250025 0 0 1 0,0.00195 0.250025,0.250025 0 0 1 -0.0078,0.046875 0.250025,0.250025 0 0 1 -0.002,0.00781 0.250025,0.250025 0 0 1 -0.01367,0.033203 0.250025,0.250025 0 0 1 -0.0039,0.00586 0.250025,0.250025 0 0 1 0,0.00195 0.250025,0.250025 0 0 1 -0.01172,0.019531 0.250025,0.250025 0 0 1 -0.0059,0.00977 0.250025,0.250025 0 0 1 -0.0098,0.011719 0.250025,0.250025 0 0 1 -0.01758,0.017578 0.250025,0.250025 0 0 1 -0.002,0.00195 l -0.02344,0.023437 a 0.250025,0.250025 0 0 1 -0.0098,0.00781 l -0.941406,0.9433594 a 0.250025,0.250025 0 0 1 -0.0039,0.00586 l -0.0098,0.00781 a 0.250025,0.250025 0 0 1 -0.0078,0.00977 0.250025,0.250025 0 0 1 -0.0039,0.00195 0.250025,0.250025 0 0 1 -0.01367,0.013672 0.250025,0.250025 0 0 1 -0.05664,0.037109 0.250025,0.250025 0 0 1 -0.0059,0.00391 0.250025,0.250025 0 0 1 -0.002,0 0.250025,0.250025 0 0 1 -0.02344,0.00977 0.250025,0.250025 0 0 1 -0.02344,0.00586 0.250025,0.250025 0 0 1 -0.02344,0.00391 0.250025,0.250025 0 0 1 -0.002,0 0.250025,0.250025 0 0 1 -0.04687,0 0.250025,0.250025 0 0 1 -0.002,0 0.250025,0.250025 0 0 1 -0.04687,-0.00781 0.250025,0.250025 0 0 1 -0.002,0 0.250025,0.250025 0 0 1 -0.0059,-0.00195 0.250025,0.250025 0 0 1 -0.0332,-0.013672 0.250025,0.250025 0 0 1 -0.0059,-0.00391 0.250025,0.250025 0 0 1 -0.002,0 0.250025,0.250025 0 0 1 -0.01953,-0.011719 0.250025,0.250025 0 0 1 -0.002,0 0.250025,0.250025 0 0 1 -0.0078,-0.00586 0.250025,0.250025 0 0 1 -0.01172,-0.00977 0.250025,0.250025 0 0 1 -0.01758,-0.015625 0.250025,0.250025 0 0 1 0,-0.00195 0.250025,0.250025 0 0 1 -0.002,-0.00195 l -0.01563,-0.013672 a 0.250025,0.250025 0 0 1 0,-0.00195 0.250025,0.250025 0 0 1 -0.0078,-0.00781 l -0.0078,-0.00977 -0.94336,-0.9414062 a 0.250025,0.250025 0 0 1 -0.0059,-0.00391 0.250025,0.250025 0 0 1 -0.0078,-0.00977 0.250025,0.250025 0 0 1 -0.01172,-0.011719 0.250025,0.250025 0 0 1 -0.01367,-0.013672 0.250025,0.250025 0 0 1 -0.03711,-0.056641 0.250025,0.250025 0 0 1 -0.0039,-0.00586 0.250025,0.250025 0 0 1 0,-0.00195 0.250025,0.250025 0 0 1 -0.0098,-0.021484 0.250025,0.250025 0 0 1 0,-0.00195 0.250025,0.250025 0 0 1 -0.0059,-0.023437 0.250025,0.250025 0 0 1 -0.0039,-0.025391 0.250025,0.250025 0 0 1 0,-0.046875 0.250025,0.250025 0 0 1 0,-0.00195 0.250025,0.250025 0 0 1 0.0078,-0.046875 0.250025,0.250025 0 0 1 0,-0.00195 0.250025,0.250025 0 0 1 0.002,-0.00586 0.250025,0.250025 0 0 1 0.01367,-0.033203 0.250025,0.250025 0 0 1 0.0039,-0.00586 0.250025,0.250025 0 0 1 0,-0.00195 0.250025,0.250025 0 0 1 0.01172,-0.019531 0.250025,0.250025 0 0 1 0,-0.00195 0.250025,0.250025 0 0 1 0.0059,-0.00781 0.250025,0.250025 0 0 1 0.0098,-0.011719 0.250025,0.250025 0 0 1 0.01758,-0.017578 0.250025,0.250025 0 0 1 0.002,-0.00195 l 0.01367,-0.015625 a 0.250025,0.250025 0 0 1 0.0098,-0.00781 l 0.0098,-0.00781 L 16.144531,2.5 14.896484,1.25 H 14.105469 L 12.21875,3.1347656 11.25,6.0371094 V 7.75 h 0.720703 a 0.250025,0.250025 0 0 1 0.06055,0 H 15 h 0.01758 2.941406 a 0.250025,0.250025 0 0 1 0.197266,0.052734 0.250025,0.250025 0 0 1 0.002,0 0.250025,0.250025 0 0 1 0.01758,0.015625 0.250025,0.250025 0 0 1 0,0.00195 0.250025,0.250025 0 0 1 0.01563,0.015625 0.250025,0.250025 0 0 1 0.002,0.00195 0.250025,0.250025 0 0 1 0.01367,0.017578 0.250025,0.250025 0 0 1 0.002,0.00195 0.250025,0.250025 0 0 1 0.01172,0.019531 0.250025,0.250025 0 0 1 0,0.00195 A 0.250025,0.250025 0 0 1 18.25,8.046875 V 20.894531 L 19.103516,21.75 H 20 a 0.250025,0.250025 0 0 1 0,0.5 h -1.021484 -0.9375 a 0.250025,0.250025 0 0 1 -0.08789,0 h -0.912109 a 0.250025,0.250025 0 0 1 -0.08789,0 H 16 15 a 0.250025,0.250025 0 0 1 0,-0.5 h 0.896484 L 16.75,20.894531 V 10.025391 A 0.250025,0.250025 0 0 1 16.75,10 V 9.1542969 L 14.943359,8.25 h -2.83789 L 11.25,9.1054688 V 20.894531 L 12.105469,21.75 H 13 a 0.250025,0.250025 0 1 1 0,0.5 h -0.960938 a 0.250025,0.250025 0 0 1 -0.07422,0 h -0.923828 a 0.250025,0.250025 0 0 1 -0.08789,0 h -0.912109 a 0.250025,0.250025 0 0 1 -0.087891,0 H 9.0292969 a 0.250025,0.250025 0 0 1 -0.060547,0 H 8 a 0.250025,0.250025 0 1 1 0,-0.5 H 8.8945312 L 9.75,20.894531 V 9.1054688 L 8.8945312,8.25 H 7.0253906 7 6.9824219 5.1054688 L 4.25,9.1054688 V 20.894531 L 5.1035156,21.75 H 6 a 0.250025,0.250025 0 0 1 0,0.5 h -1.0214844 -0.9375 a 0.250025,0.250025 0 0 1 -0.087891,0 H 3.0410156 a 0.250025,0.250025 0 0 1 -0.087891,0 H 2.0292969 a 0.250025,0.250025 0 0 1 -0.060547,0 H 1 a 0.250025,0.250025 0 1 1 0,-0.5 H 1.8945312 L 2.75,20.894531 V 9.1054688 L 1.8945312,8.25 H 1 a 0.250025,0.250025 0 1 1 0,-0.5 h 0.9609375 a 0.250025,0.250025 0 0 1 0.074219,0 H 2.75 V 6.0195312 a 0.250025,0.250025 0 0 1 0,-0.037109 0.250025,0.250025 0 0 1 0.00195,-0.013672 0.250025,0.250025 0 0 1 0.00195,-0.011719 0.250025,0.250025 0 0 1 0.00195,-0.011719 0.250025,0.250025 0 0 1 0.019531,-0.058594 L 3.7636719,2.921875 a 0.250025,0.250025 0 0 1 0.058594,-0.099609 l 1,-1 a 0.250025,0.250025 0 0 1 0.066406,-0.044922 L 6.859375,0.79296875 a 0.250025,0.250025 0 0 1 0.029297,-0.015625 0.250025,0.250025 0 0 1 0.013672,-0.007813 0.250025,0.250025 0 0 1 0.048828,-0.0136719 0.250025,0.250025 0 0 1 0.023437,-0.003906 A 0.250025,0.250025 0 0 1 7,0.75 h 1.9667969 a 0.250025,0.250025 0 0 1 0.025391,-0.001953 z"
     id="path2" />
</svg>
