<?xml version="1.0" encoding="UTF-8" standalone="no"?>
<svg
   xmlns:dc="http://purl.org/dc/elements/1.1/"
   xmlns:cc="http://creativecommons.org/ns#"
   xmlns:rdf="http://www.w3.org/1999/02/22-rdf-syntax-ns#"
   xmlns:svg="http://www.w3.org/2000/svg"
   xmlns="http://www.w3.org/2000/svg"
   xmlns:sodipodi="http://sodipodi.sourceforge.net/DTD/sodipodi-0.dtd"
   xmlns:inkscape="http://www.inkscape.org/namespaces/inkscape"
   data-dec="125"
   width="14"
   height="40"
   version="1.1"
   id="svg4"
   sodipodi:docname="125.svg"
   inkscape:version="0.92.4 (unknown)">
  <metadata
     id="metadata10">
    <rdf:RDF>
      <cc:Work
         rdf:about="">
        <dc:format>image/svg+xml</dc:format>
        <dc:type
           rdf:resource="http://purl.org/dc/dcmitype/StillImage" />
      </cc:Work>
    </rdf:RDF>
  </metadata>
  <defs
     id="defs8" />
  <sodipodi:namedview
     pagecolor="#ffffff"
     bordercolor="#666666"
     borderopacity="1"
     objecttolerance="10"
     gridtolerance="10"
     guidetolerance="10"
     inkscape:pageopacity="0"
     inkscape:pageshadow="2"
     inkscape:window-width="615"
     inkscape:window-height="417"
     id="namedview6"
     showgrid="false"
     inkscape:zoom="5.9"
     inkscape:cx="7"
     inkscape:cy="20"
     inkscape:window-x="0"
     inkscape:window-y="27"
     inkscape:window-maximized="0"
     inkscape:current-layer="svg4" />
  <path
     style="color:#000000;font-style:normal;font-variant:normal;font-weight:normal;font-stretch:normal;font-size:medium;line-height:normal;font-family:sans-serif;font-variant-ligatures:normal;font-variant-position:normal;font-variant-caps:normal;font-variant-numeric:normal;font-variant-alternates:normal;font-feature-settings:normal;text-indent:0;text-align:start;text-decoration:none;text-decoration-line:none;text-decoration-style:solid;text-decoration-color:#000000;letter-spacing:normal;word-spacing:normal;text-transform:none;writing-mode:lr-tb;direction:ltr;text-orientation:mixed;dominant-baseline:auto;baseline-shift:baseline;text-anchor:start;white-space:normal;shape-padding:0;clip-rule:nonzero;display:inline;overflow:visible;visibility:visible;opacity:1;isolation:auto;mix-blend-mode:normal;color-interpolation:sRGB;color-interpolation-filters:linearRGB;solid-color:#000000;solid-opacity:1;vector-effect:none;fill:#013272;fill-opacity:1;fill-rule:nonzero;stroke:none;stroke-width:2;stroke-linecap:round;stroke-linejoin:round;stroke-miterlimit:4;stroke-dasharray:none;stroke-dashoffset:0;stroke-opacity:1;color-rendering:auto;image-rendering:auto;shape-rendering:auto;text-rendering:auto;enable-background:accumulate"
     d="m 4.9648438,-4.0058594 a 1.0001,1.0001 0 0 1 0.4824218,0.1113282 l 1.8847656,0.9414062 a 1.0001,1.0001 0 0 1 0.4257813,0.296875 l 0.9492187,0.9492188 a 1.0001,1.0001 0 0 1 0.1875,0.2597656 l 1,1.99999998 A 1.0001,1.0001 0 0 1 10,1 V 3 A 1.0001,1.0001 0 0 1 9.8945312,3.4472656 l -1,2 a 1.0001,1.0001 0 0 1 -0.1875,0.2597656 L 7.8222656,6.5917969 7,8.2363281 v 1.3496094 l 1.5898438,1.5898435 1.8574222,0.929688 a 1.0001,1.0001 0 0 1 0,1.789062 L 8.5898438,14.824219 7,16.414062 v 1.34961 l 0.8222656,1.644531 0.8847656,0.884766 a 1.0001,1.0001 0 0 1 0.1875,0.259765 l 1,2 A 1.0001,1.0001 0 0 1 10,23 v 2 a 1.0001,1.0001 0 0 1 -0.1054688,0.447266 l -1,2 a 1.0001,1.0001 0 0 1 -0.1875,0.259765 L 7.7617188,28.652344 A 1.0001,1.0001 0 0 1 7.328125,28.955078 L 5.4472656,29.894531 A 1.0001161,1.0001161 0 0 1 4.5527344,28.105469 L 6.2539062,27.253906 7,25.763672 V 24.236328 L 6.1777344,22.591797 5.2929688,21.707031 a 1.0001,1.0001 0 0 1 -0.1875,-0.259765 l -1,-2 A 1.0001,1.0001 0 0 1 4,19 v -2 a 1.0001,1.0001 0 0 1 0.1054688,-0.447266 l 1,-2 a 1.0001,1.0001 0 0 1 0.4472656,-0.447265 l 1.9335937,-0.966797 a 1.0001,1.0001 0 0 1 0.1582031,-0.08008 L 7.7636719,13 7.640625,12.939453 A 1.0001,1.0001 0 0 1 7.4882812,12.863281 L 5.5527344,11.894531 A 1.0001,1.0001 0 0 1 5.1054688,11.447266 l -1,-2.0000004 A 1.0001,1.0001 0 0 1 4,9 V 7 A 1.0001,1.0001 0 0 1 4.1054688,6.5527344 l 1,-2 a 1.0001,1.0001 0 0 1 0.1875,-0.2597656 L 6.1777344,3.4082031 7,1.7636719 V 0.23632812 L 6.2539062,-1.2539062 4.5527344,-2.1054688 a 1.0001,1.0001 0 0 1 0.4121094,-1.9003906 z"
     id="path2" />
</svg>
