<?xml version="1.0" encoding="UTF-8" standalone="no"?>
<svg
   xmlns:dc="http://purl.org/dc/elements/1.1/"
   xmlns:cc="http://creativecommons.org/ns#"
   xmlns:rdf="http://www.w3.org/1999/02/22-rdf-syntax-ns#"
   xmlns:svg="http://www.w3.org/2000/svg"
   xmlns="http://www.w3.org/2000/svg"
   xmlns:sodipodi="http://sodipodi.sourceforge.net/DTD/sodipodi-0.dtd"
   xmlns:inkscape="http://www.inkscape.org/namespaces/inkscape"
   data-dec="52"
   width="22"
   height="40"
   version="1.1"
   id="svg4"
   sodipodi:docname="52.svg"
   inkscape:version="0.92.4 (unknown)">
  <metadata
     id="metadata10">
    <rdf:RDF>
      <cc:Work
         rdf:about="">
        <dc:format>image/svg+xml</dc:format>
        <dc:type
           rdf:resource="http://purl.org/dc/dcmitype/StillImage" />
      </cc:Work>
    </rdf:RDF>
  </metadata>
  <defs
     id="defs8" />
  <sodipodi:namedview
     pagecolor="#ffffff"
     bordercolor="#666666"
     borderopacity="1"
     objecttolerance="10"
     gridtolerance="10"
     guidetolerance="10"
     inkscape:pageopacity="0"
     inkscape:pageshadow="2"
     inkscape:window-width="640"
     inkscape:window-height="480"
     id="namedview6"
     showgrid="false"
     inkscape:zoom="5.9"
     inkscape:cx="11"
     inkscape:cy="20"
     inkscape:window-x="0"
     inkscape:window-y="27"
     inkscape:window-maximized="0"
     inkscape:current-layer="svg4" />
  <path
     style="color:#000000;font-style:normal;font-variant:normal;font-weight:normal;font-stretch:normal;font-size:medium;line-height:normal;font-family:sans-serif;font-variant-ligatures:normal;font-variant-position:normal;font-variant-caps:normal;font-variant-numeric:normal;font-variant-alternates:normal;font-feature-settings:normal;text-indent:0;text-align:start;text-decoration:none;text-decoration-line:none;text-decoration-style:solid;text-decoration-color:#000000;letter-spacing:normal;word-spacing:normal;text-transform:none;writing-mode:lr-tb;direction:ltr;text-orientation:mixed;dominant-baseline:auto;baseline-shift:baseline;text-anchor:start;white-space:normal;shape-padding:0;clip-rule:nonzero;display:inline;overflow:visible;visibility:visible;opacity:1;isolation:auto;mix-blend-mode:normal;color-interpolation:sRGB;color-interpolation-filters:linearRGB;solid-color:#000000;solid-opacity:1;vector-effect:none;fill:#013272;fill-opacity:1;fill-rule:nonzero;stroke:none;stroke-width:1.5;stroke-linecap:round;stroke-linejoin:round;stroke-miterlimit:4;stroke-dasharray:none;stroke-dashoffset:0;stroke-opacity:1;color-rendering:auto;image-rendering:auto;shape-rendering:auto;text-rendering:auto;enable-background:accumulate"
     d="M 14.425781,4.6367188 3.8125,15.25 h 7.429688 z m 2.548828,-4.39648442 a 0.750075,0.750075 0 0 1 0.08594,0.003906 0.750075,0.750075 0 0 1 0.146484,0.0253906 0.750075,0.750075 0 0 1 0.0625,0.0195313 0.750075,0.750075 0 0 1 0.0098,0.003906 0.750075,0.750075 0 0 1 0.05859,0.0253906 0.750075,0.750075 0 0 1 0.0098,0.005859 0.750075,0.750075 0 0 1 0.05664,0.03125 0.750075,0.750075 0 0 1 0.0078,0.005859 0.750075,0.750075 0 0 1 0.05273,0.0371094 0.750075,0.750075 0 0 1 0.0078,0.005859 0.750075,0.750075 0 0 1 0.04883,0.0429687 0.750075,0.750075 0 0 1 0.0078,0.007813 0.750075,0.750075 0 0 1 0.04297,0.046875 0.750075,0.750075 0 0 1 0.123046,0.78906248 L 13.707031,15.25 H 18 a 0.750075,0.750075 0 1 1 0,1.5 h -4.720703 l -1.558594,5.455078 A 0.750075,0.750075 0 0 1 10.498047,22.568359 0.750075,0.750075 0 0 1 9.28125,21.785156 L 10.791016,16.75 H 2 A 0.750075,0.750075 0 0 1 1.46875,15.46875 L 15.429688,1.5078125 a 0.750075,0.750075 0 0 1 0.0957,-0.095703 l 0.90039,-0.90039065 a 0.750075,0.750075 0 0 1 0.548828,-0.27148437 z"
     id="path2" />
</svg>
