<?xml version="1.0" encoding="UTF-8" standalone="no"?>
<svg
   xmlns:dc="http://purl.org/dc/elements/1.1/"
   xmlns:cc="http://creativecommons.org/ns#"
   xmlns:rdf="http://www.w3.org/1999/02/22-rdf-syntax-ns#"
   xmlns:svg="http://www.w3.org/2000/svg"
   xmlns="http://www.w3.org/2000/svg"
   xmlns:sodipodi="http://sodipodi.sourceforge.net/DTD/sodipodi-0.dtd"
   xmlns:inkscape="http://www.inkscape.org/namespaces/inkscape"
   data-dec="97"
   width="22"
   height="40"
   version="1.1"
   id="svg4"
   sodipodi:docname="97.svg"
   inkscape:version="0.92.4 (unknown)">
  <metadata
     id="metadata10">
    <rdf:RDF>
      <cc:Work
         rdf:about="">
        <dc:format>image/svg+xml</dc:format>
        <dc:type
           rdf:resource="http://purl.org/dc/dcmitype/StillImage" />
      </cc:Work>
    </rdf:RDF>
  </metadata>
  <defs
     id="defs8" />
  <sodipodi:namedview
     pagecolor="#ffffff"
     bordercolor="#666666"
     borderopacity="1"
     objecttolerance="10"
     gridtolerance="10"
     guidetolerance="10"
     inkscape:pageopacity="0"
     inkscape:pageshadow="2"
     inkscape:window-width="640"
     inkscape:window-height="480"
     id="namedview6"
     showgrid="false"
     inkscape:zoom="5.9"
     inkscape:cx="11"
     inkscape:cy="20"
     inkscape:window-x="0"
     inkscape:window-y="27"
     inkscape:window-maximized="0"
     inkscape:current-layer="svg4" />
  <path
     style="color:#000000;font-style:normal;font-variant:normal;font-weight:normal;font-stretch:normal;font-size:medium;line-height:normal;font-family:sans-serif;font-variant-ligatures:normal;font-variant-position:normal;font-variant-caps:normal;font-variant-numeric:normal;font-variant-alternates:normal;font-feature-settings:normal;text-indent:0;text-align:start;text-decoration:none;text-decoration-line:none;text-decoration-style:solid;text-decoration-color:#000000;letter-spacing:normal;word-spacing:normal;text-transform:none;writing-mode:lr-tb;direction:ltr;text-orientation:mixed;dominant-baseline:auto;baseline-shift:baseline;text-anchor:start;white-space:normal;shape-padding:0;clip-rule:nonzero;display:inline;overflow:visible;visibility:visible;opacity:1;isolation:auto;mix-blend-mode:normal;color-interpolation:sRGB;color-interpolation-filters:linearRGB;solid-color:#000000;solid-opacity:1;vector-effect:none;fill:#013272;fill-opacity:1;fill-rule:nonzero;stroke:none;stroke-width:0.5;stroke-linecap:round;stroke-linejoin:round;stroke-miterlimit:4;stroke-dasharray:none;stroke-dashoffset:0;stroke-opacity:1;color-rendering:auto;image-rendering:auto;shape-rendering:auto;text-rendering:auto;enable-background:accumulate"
     d="M 6.671875,9.0410156 6.1601562,9.2109375 4.2265625,12.111328 3.25,15.041016 v 2.90039 l 0.5,1 V 15 a 0.250025,0.250025 0 0 1 0.013672,-0.07813 l 1,-3 a 0.250025,0.250025 0 0 1 0.027344,-0.06055 z M 9.0566406,8.25 7.171875,9.1933594 5.2265625,12.111328 4.25,15.041016 v 3.90039 L 5.1855469,20.8125 7.0585938,21.75 H 8.9414062 L 10.828125,20.806641 12.773438,17.888672 13.75,14.962891 V 12.041016 L 12.794922,9.1777344 10.941406,8.25 Z M 17.001953,7.7382812 a 0.250025,0.250025 0 0 1 0.238281,0.3300782 L 15.242188,15.064453 14.25,19.03125 v 1.865234 L 15.105469,21.75 h 1.791015 l 1.898438,-1.898438 0.982422,-1.96289 a 0.250025,0.250025 0 1 1 0.445312,0.222656 l -1,2 a 0.250025,0.250025 0 0 1 -0.04492,0.06641 l -2,2 A 0.250025,0.250025 0 0 1 17,22.25 h -1.960938 a 0.250025,0.250025 0 0 1 -0.07422,0 H 14 a 0.250025,0.250025 0 0 1 -0.177734,-0.07227 l -1,-1 A 0.250025,0.250025 0 0 1 12.75,21 v -2 a 0.250025,0.250025 0 0 1 0.0078,-0.06055 l 0.04883,-0.199219 -1.597657,2.398438 a 0.250025,0.250025 0 0 1 -0.09766,0.08398 l -1.9999999,1 A 0.250025,0.250025 0 0 1 9,22.25 H 7 A 0.250025,0.250025 0 0 1 6.8886719,22.222656 L 4.9277344,21.242188 a 0.250025,0.250025 0 0 1 -0.00586,-0.002 0.250025,0.250025 0 0 1 -0.099609,-0.0625 l -0.00391,-0.0039 -0.9960938,-0.996094 a 0.250025,0.250025 0 0 1 -0.044922,-0.06641 l -1,-2 A 0.250025,0.250025 0 0 1 2.75,18 v -3 a 0.250025,0.250025 0 0 1 0.013672,-0.07813 l 1,-3 a 0.250025,0.250025 0 0 1 0.027344,-0.06055 l 2,-2.9999999 A 0.250025,0.250025 0 0 1 5.921875,8.7636719 L 8.9042969,7.7695312 A 0.250025,0.250025 0 0 1 8.9257812,7.7617188 0.250025,0.250025 0 0 1 9.0253906,7.75 H 11 a 0.250025,0.250025 0 0 1 0.111328,0.027344 l 2,1 a 0.250025,0.250025 0 0 1 0.125,0.1445312 l 1,3 A 0.250025,0.250025 0 0 1 14.25,12 v 1.214844 l 1.509766,-5.2832034 a 0.250025,0.250025 0 0 1 0.232422,-0.1855468 0.250025,0.250025 0 0 1 0.248046,0.3222656 l -1.996093,6.9863286 a 0.250025,0.250025 0 0 1 -0.002,0.0078 v 0.002 a 0.250025,0.250025 0 0 1 0,0.002 l -0.002,0.0059 L 13.25,19.03125 v 1.865234 L 14.103516,21.75 h 0.291015 L 13.822266,21.177734 A 0.250025,0.250025 0 0 1 13.75,21 v -2 a 0.250025,0.250025 0 0 1 0.0078,-0.06055 l 1,-4 a 0.250025,0.250025 0 0 1 0.002,-0.0078 l 2,-7.0000004 a 0.250025,0.250025 0 0 1 0.242187,-0.1933594 z"
     id="path2" />
</svg>
