<?xml version="1.0" encoding="UTF-8" standalone="no"?>
<svg
   xmlns:dc="http://purl.org/dc/elements/1.1/"
   xmlns:cc="http://creativecommons.org/ns#"
   xmlns:rdf="http://www.w3.org/1999/02/22-rdf-syntax-ns#"
   xmlns:svg="http://www.w3.org/2000/svg"
   xmlns="http://www.w3.org/2000/svg"
   xmlns:sodipodi="http://sodipodi.sourceforge.net/DTD/sodipodi-0.dtd"
   xmlns:inkscape="http://www.inkscape.org/namespaces/inkscape"
   data-dec="112"
   width="19"
   height="40"
   version="1.1"
   id="svg4"
   sodipodi:docname="112.svg"
   inkscape:version="0.92.4 (unknown)">
  <metadata
     id="metadata10">
    <rdf:RDF>
      <cc:Work
         rdf:about="">
        <dc:format>image/svg+xml</dc:format>
        <dc:type
           rdf:resource="http://purl.org/dc/dcmitype/StillImage" />
      </cc:Work>
    </rdf:RDF>
  </metadata>
  <defs
     id="defs8" />
  <sodipodi:namedview
     pagecolor="#ffffff"
     bordercolor="#666666"
     borderopacity="1"
     objecttolerance="10"
     gridtolerance="10"
     guidetolerance="10"
     inkscape:pageopacity="0"
     inkscape:pageshadow="2"
     inkscape:window-width="640"
     inkscape:window-height="480"
     id="namedview6"
     showgrid="false"
     inkscape:zoom="5.9"
     inkscape:cx="9.5"
     inkscape:cy="20"
     inkscape:window-x="0"
     inkscape:window-y="27"
     inkscape:window-maximized="0"
     inkscape:current-layer="svg4" />
  <path
     style="color:#000000;font-style:normal;font-variant:normal;font-weight:normal;font-stretch:normal;font-size:medium;line-height:normal;font-family:sans-serif;font-variant-ligatures:normal;font-variant-position:normal;font-variant-caps:normal;font-variant-numeric:normal;font-variant-alternates:normal;font-feature-settings:normal;text-indent:0;text-align:start;text-decoration:none;text-decoration-line:none;text-decoration-style:solid;text-decoration-color:#000000;letter-spacing:normal;word-spacing:normal;text-transform:none;writing-mode:lr-tb;direction:ltr;text-orientation:mixed;dominant-baseline:auto;baseline-shift:baseline;text-anchor:start;white-space:normal;shape-padding:0;clip-rule:nonzero;display:inline;overflow:visible;visibility:visible;opacity:1;isolation:auto;mix-blend-mode:normal;color-interpolation:sRGB;color-interpolation-filters:linearRGB;solid-color:#000000;solid-opacity:1;vector-effect:none;fill:#000000;fill-opacity:1;fill-rule:nonzero;stroke:none;stroke-width:1;stroke-linecap:round;stroke-linejoin:round;stroke-miterlimit:4;stroke-dasharray:none;stroke-dashoffset:0;stroke-opacity:1;color-rendering:auto;image-rendering:auto;shape-rendering:auto;text-rendering:auto;enable-background:accumulate"
     d="M 9.1171875,8.5 7.296875,9.4101562 6.3886719,10.318359 4.5,13.152344 v 3.695312 L 6.3886719,19.681641 7.296875,20.589844 9.1171875,21.5 H 10.882812 L 12.703125,20.589844 14.5625,18.730469 15.5,15.917969 V 14.082031 L 14.5625,11.269531 12.703125,9.4101562 10.882812,8.5 Z m -5.125,-1.0078125 A 0.50005,0.50005 0 0 1 4.5,8 v 3.347656 L 5.5839844,9.7226562 a 0.50005,0.50005 0 0 1 0.0625,-0.076172 l 1,-1 a 0.50005,0.50005 0 0 1 0.1308594,-0.09375 l 2,-1 A 0.50005,0.50005 0 0 1 9,7.5 h 2 a 0.50005,0.50005 0 0 1 0.222656,0.052734 l 2,1 a 0.50005,0.50005 0 0 1 0.13086,0.09375 l 2,1.9999996 a 0.50005,0.50005 0 0 1 0.121093,0.195313 l 1,3 A 0.50005,0.50005 0 0 1 16.5,14 v 2 a 0.50005,0.50005 0 0 1 -0.02539,0.158203 l -1,3 a 0.50005,0.50005 0 0 1 -0.121093,0.195313 l -2,2 a 0.50005,0.50005 0 0 1 -0.13086,0.09375 l -2,1 A 0.50005,0.50005 0 0 1 11,22.5 H 9 a 0.50005,0.50005 0 0 1 -0.2226562,-0.05273 l -2,-1 a 0.50005,0.50005 0 0 1 -0.1308594,-0.09375 l -1,-1 a 0.50005,0.50005 0 0 1 -0.0625,-0.07617 L 4.5,18.652344 V 30 a 0.50005,0.50005 0 1 1 -1,0 V 17.060547 a 0.50005,0.50005 0 0 1 0,-0.117188 v -3.876953 a 0.50005,0.50005 0 0 1 0,-0.123047 V 8 A 0.50005,0.50005 0 0 1 3.9921875,7.4921875 Z"
     id="path2" />
</svg>
