<?xml version="1.0" encoding="UTF-8" standalone="no"?>
<svg
   xmlns:dc="http://purl.org/dc/elements/1.1/"
   xmlns:cc="http://creativecommons.org/ns#"
   xmlns:rdf="http://www.w3.org/1999/02/22-rdf-syntax-ns#"
   xmlns:svg="http://www.w3.org/2000/svg"
   xmlns="http://www.w3.org/2000/svg"
   xmlns:sodipodi="http://sodipodi.sourceforge.net/DTD/sodipodi-0.dtd"
   xmlns:inkscape="http://www.inkscape.org/namespaces/inkscape"
   data-dec="171"
   width="14"
   height="40"
   version="1.1"
   id="svg4"
   sodipodi:docname="171.svg"
   inkscape:version="0.92.4 (unknown)">
  <metadata
     id="metadata10">
    <rdf:RDF>
      <cc:Work
         rdf:about="">
        <dc:format>image/svg+xml</dc:format>
        <dc:type
           rdf:resource="http://purl.org/dc/dcmitype/StillImage" />
      </cc:Work>
    </rdf:RDF>
  </metadata>
  <defs
     id="defs8" />
  <sodipodi:namedview
     pagecolor="#ffffff"
     bordercolor="#666666"
     borderopacity="1"
     objecttolerance="10"
     gridtolerance="10"
     guidetolerance="10"
     inkscape:pageopacity="0"
     inkscape:pageshadow="2"
     inkscape:window-width="640"
     inkscape:window-height="480"
     id="namedview6"
     showgrid="false"
     inkscape:zoom="5.9"
     inkscape:cx="7"
     inkscape:cy="20"
     inkscape:window-x="0"
     inkscape:window-y="27"
     inkscape:window-maximized="0"
     inkscape:current-layer="svg4" />
  <path
     style="color:#000000;font-style:normal;font-variant:normal;font-weight:normal;font-stretch:normal;font-size:medium;line-height:normal;font-family:sans-serif;font-variant-ligatures:normal;font-variant-position:normal;font-variant-caps:normal;font-variant-numeric:normal;font-variant-alternates:normal;font-feature-settings:normal;text-indent:0;text-align:start;text-decoration:none;text-decoration-line:none;text-decoration-style:solid;text-decoration-color:#000000;letter-spacing:normal;word-spacing:normal;text-transform:none;writing-mode:lr-tb;direction:ltr;text-orientation:mixed;dominant-baseline:auto;baseline-shift:baseline;text-anchor:start;white-space:normal;shape-padding:0;clip-rule:nonzero;display:inline;overflow:visible;visibility:visible;opacity:1;isolation:auto;mix-blend-mode:normal;color-interpolation:sRGB;color-interpolation-filters:linearRGB;solid-color:#000000;solid-opacity:1;vector-effect:none;fill:#013272;fill-opacity:1;fill-rule:nonzero;stroke:none;stroke-width:0.5;stroke-linecap:round;stroke-linejoin:round;stroke-miterlimit:4;stroke-dasharray:none;stroke-dashoffset:0;stroke-opacity:1;color-rendering:auto;image-rendering:auto;shape-rendering:auto;text-rendering:auto;enable-background:accumulate"
     d="M 9.2734375,12.082031 7.3554688,14 9.2734375,15.917969 7.8085938,14.160156 a 0.250025,0.250025 0 0 1 0,-0.320312 z m -6,0 L 1.3554688,14 3.2734375,15.917969 1.8085938,14.160156 a 0.250025,0.250025 0 0 1 0,-0.320312 z M 12.994141,7.7480469 a 0.250025,0.250025 0 0 1 0.02539,0 0.250025,0.250025 0 0 1 0.002,0 0.250025,0.250025 0 0 1 0.02344,0.00391 0.250025,0.250025 0 0 1 0.002,0 0.250025,0.250025 0 0 1 0.0039,0.00195 0.250025,0.250025 0 0 1 0.04492,0.011719 0.250025,0.250025 0 0 1 0.01953,0.00977 0.250025,0.250025 0 0 1 0.002,0 0.250025,0.250025 0 0 1 0.01953,0.011719 0.250025,0.250025 0 0 1 0.002,0.00195 0.250025,0.250025 0 0 1 0.01953,0.011719 0.250025,0.250025 0 0 1 0.002,0.00195 0.250025,0.250025 0 0 1 0.01563,0.015625 0.250025,0.250025 0 0 1 0.002,0.00195 0.250025,0.250025 0 0 1 0.01563,0.015625 0.250025,0.250025 0 0 1 0.002,0.00195 0.250025,0.250025 0 0 1 0.01367,0.017578 0.250025,0.250025 0 0 1 0,0.00195 0.250025,0.250025 0 0 1 0.01367,0.019531 0.250025,0.250025 0 0 1 0.0039,0.011719 0.250025,0.250025 0 0 1 0.0059,0.011719 0.250025,0.250025 0 0 1 0.002,0.00195 0.250025,0.250025 0 0 1 0.0078,0.021484 0.250025,0.250025 0 0 1 0,0.00195 0.250025,0.250025 0 0 1 0.0059,0.021484 0.250025,0.250025 0 0 1 0,0.00195 0.250025,0.250025 0 0 1 0.0039,0.023437 0.250025,0.250025 0 0 1 0,0.00195 0.250025,0.250025 0 0 1 0,0.023437 0.250025,0.250025 0 0 1 0,0.00195 0.250025,0.250025 0 0 1 -0.0098,0.070312 0.250025,0.250025 0 0 1 -0.0039,0.011719 0.250025,0.250025 0 0 1 -0.0059,0.013672 0.250025,0.250025 0 0 1 0,0.00195 0.250025,0.250025 0 0 1 -0.0098,0.019531 0.250025,0.250025 0 0 1 -0.002,0.00195 0.250025,0.250025 0 0 1 -0.01172,0.019531 0.250025,0.250025 0 0 1 -0.002,0.00195 0.250025,0.250025 0 0 1 -0.01367,0.017578 0.250025,0.250025 0 0 1 -0.002,0.00195 0.250025,0.250025 0 0 1 -0.01367,0.017578 l -0.0059,0.00586 L 8.3261719,14 l 4.8457031,5.816406 0.0059,0.0059 a 0.250025,0.250025 0 0 1 0.01172,0.01367 l 0.002,0.0039 a 0.250025,0.250025 0 0 1 0.01172,0.01367 0.250025,0.250025 0 0 1 0.002,0.002 0.250025,0.250025 0 0 1 0.01172,0.01953 0.250025,0.250025 0 0 1 0.002,0.002 0.250025,0.250025 0 0 1 0.0098,0.01953 0.250025,0.250025 0 0 1 0.002,0.002 0.250025,0.250025 0 0 1 0.0078,0.02148 0.250025,0.250025 0 0 1 0,0.002 0.250025,0.250025 0 0 1 0.0078,0.02148 0.250025,0.250025 0 0 1 0,0.002 0.250025,0.250025 0 0 1 0.0039,0.02344 0.250025,0.250025 0 0 1 0,0.002 0.250025,0.250025 0 0 1 0.002,0.02148 0.250025,0.250025 0 0 1 0,0.002 0.250025,0.250025 0 0 1 0,0.02344 0.250025,0.250025 0 0 1 0,0.002 0.250025,0.250025 0 0 1 0,0.002 0.250025,0.250025 0 0 1 -0.0059,0.04102 0.250025,0.250025 0 0 1 -0.002,0.0039 0.250025,0.250025 0 0 1 0,0.002 0.250025,0.250025 0 0 1 -0.0078,0.02344 0.250025,0.250025 0 0 1 0,0.002 0.250025,0.250025 0 0 1 -0.0098,0.01953 0.250025,0.250025 0 0 1 -0.002,0.002 0.250025,0.250025 0 0 1 -0.0098,0.01953 0.250025,0.250025 0 0 1 -0.0059,0.0078 0.250025,0.250025 0 0 1 -0.0098,0.01367 0.250025,0.250025 0 0 1 0,0.002 0.250025,0.250025 0 0 1 -0.0078,0.0078 0.250025,0.250025 0 0 1 -0.02539,0.02539 0.250025,0.250025 0 0 1 -0.002,0.002 0.250025,0.250025 0 0 1 -0.03906,0.02734 0.250025,0.250025 0 0 1 -0.01367,0.0059 0.250025,0.250025 0 0 1 -0.0098,0.0059 0.250025,0.250025 0 0 1 -0.002,0 0.250025,0.250025 0 0 1 -0.0078,0.0039 0.250025,0.250025 0 0 1 -0.03125,0.0098 0.250025,0.250025 0 0 1 -0.05664,0.0059 0.250025,0.250025 0 0 1 -0.002,0 0.250025,0.250025 0 0 1 -0.02148,0 0.250025,0.250025 0 0 1 -0.002,0 0.250025,0.250025 0 0 1 -0.02344,-0.0039 0.250025,0.250025 0 0 1 -0.002,0 0.250025,0.250025 0 0 1 -0.03125,-0.0098 0.250025,0.250025 0 0 1 -0.02734,-0.0098 0.250025,0.250025 0 0 1 -0.02344,-0.01367 0.250025,0.250025 0 0 1 -0.03125,-0.02344 0.250025,0.250025 0 0 1 -0.01563,-0.01367 0.250025,0.250025 0 0 1 -0.002,0 l -6.0000004,-6 a 0.250025,0.250025 0 0 1 0,-0.355468 L 12.820312,7.8261719 a 0.250025,0.250025 0 0 1 0.002,-0.00391 0.250025,0.250025 0 0 1 0.01563,-0.013672 0.250025,0.250025 0 0 1 0.01758,-0.013672 0.250025,0.250025 0 0 1 0.002,-0.00195 0.250025,0.250025 0 0 1 0.0078,-0.00391 0.250025,0.250025 0 0 1 0.0332,-0.019531 0.250025,0.250025 0 0 1 0.002,0 0.250025,0.250025 0 0 1 0.02344,-0.00977 0.250025,0.250025 0 0 1 0.01563,-0.00391 0.250025,0.250025 0 0 1 0.05469,-0.00781 z m -6.0000004,0 a 0.250025,0.250025 0 0 1 0.025391,0 0.250025,0.250025 0 0 1 0.00195,0 0.250025,0.250025 0 0 1 0.023437,0.00391 0.250025,0.250025 0 0 1 0.00195,0 0.250025,0.250025 0 0 1 0.00391,0.00195 0.250025,0.250025 0 0 1 0.044922,0.011719 0.250025,0.250025 0 0 1 0.00977,0.00391 0.250025,0.250025 0 0 1 0.00977,0.00586 0.250025,0.250025 0 0 1 0.00195,0 0.250025,0.250025 0 0 1 0.019531,0.011719 0.250025,0.250025 0 0 1 0.00195,0.00195 0.250025,0.250025 0 0 1 0.019531,0.011719 0.250025,0.250025 0 0 1 0.00195,0.00195 0.250025,0.250025 0 0 1 0.015625,0.015625 0.250025,0.250025 0 0 1 0.00195,0.00195 0.250025,0.250025 0 0 1 0.015625,0.015625 0.250025,0.250025 0 0 1 0.00195,0.00195 0.250025,0.250025 0 0 1 0.013672,0.017578 0.250025,0.250025 0 0 1 0,0.00195 0.250025,0.250025 0 0 1 0.013672,0.019531 0.250025,0.250025 0 0 1 0.00391,0.011719 0.250025,0.250025 0 0 1 0.00586,0.011719 0.250025,0.250025 0 0 1 0.00195,0.00195 0.250025,0.250025 0 0 1 0.00781,0.021484 0.250025,0.250025 0 0 1 0,0.00195 0.250025,0.250025 0 0 1 0.00586,0.021484 0.250025,0.250025 0 0 1 0,0.00195 0.250025,0.250025 0 0 1 0.00391,0.023437 0.250025,0.250025 0 0 1 0,0.00195 0.250025,0.250025 0 0 1 0,0.023437 0.250025,0.250025 0 0 1 0,0.00195 0.250025,0.250025 0 0 1 -0.00977,0.070312 0.250025,0.250025 0 0 1 -0.00391,0.011719 0.250025,0.250025 0 0 1 -0.00586,0.013672 0.250025,0.250025 0 0 1 0,0.00195 0.250025,0.250025 0 0 1 -0.00977,0.019531 0.250025,0.250025 0 0 1 -0.00195,0.00195 0.250025,0.250025 0 0 1 -0.011719,0.019531 0.250025,0.250025 0 0 1 -0.00195,0.00195 0.250025,0.250025 0 0 1 -0.013672,0.017578 0.250025,0.250025 0 0 1 -0.00195,0.00195 0.250025,0.250025 0 0 1 -0.013672,0.017578 L 7.171875,8.1835938 2.3261719,14 l 4.8457031,5.816406 0.00586,0.0059 a 0.250025,0.250025 0 0 1 0.011719,0.01367 l 0.00195,0.0039 a 0.250025,0.250025 0 0 1 0.011719,0.01367 0.250025,0.250025 0 0 1 0.00195,0.002 0.250025,0.250025 0 0 1 0.011719,0.01953 0.250025,0.250025 0 0 1 0.00195,0.002 0.250025,0.250025 0 0 1 0.00977,0.01953 0.250025,0.250025 0 0 1 0.00195,0.002 0.250025,0.250025 0 0 1 0.00781,0.02148 0.250025,0.250025 0 0 1 0,0.002 0.250025,0.250025 0 0 1 0.00781,0.02148 0.250025,0.250025 0 0 1 0,0.002 0.250025,0.250025 0 0 1 0.00391,0.02344 0.250025,0.250025 0 0 1 0,0.002 0.250025,0.250025 0 0 1 0.00195,0.02148 0.250025,0.250025 0 0 1 0,0.002 0.250025,0.250025 0 0 1 0,0.02344 0.250025,0.250025 0 0 1 0,0.002 0.250025,0.250025 0 0 1 0,0.002 0.250025,0.250025 0 0 1 -0.00586,0.04102 0.250025,0.250025 0 0 1 -0.00195,0.0039 0.250025,0.250025 0 0 1 0,0.002 0.250025,0.250025 0 0 1 -0.00781,0.02344 0.250025,0.250025 0 0 1 0,0.002 0.250025,0.250025 0 0 1 -0.00977,0.01953 0.250025,0.250025 0 0 1 -0.00195,0.002 0.250025,0.250025 0 0 1 -0.00977,0.01953 0.250025,0.250025 0 0 1 -0.00586,0.0078 0.250025,0.250025 0 0 1 -0.00977,0.01367 0.250025,0.250025 0 0 1 0,0.002 0.250025,0.250025 0 0 1 -0.00781,0.0078 0.250025,0.250025 0 0 1 -0.00977,0.0098 0.250025,0.250025 0 0 1 -0.017578,0.01758 0.250025,0.250025 0 0 1 -0.039063,0.02734 0.250025,0.250025 0 0 1 -0.013672,0.0059 0.250025,0.250025 0 0 1 -0.019531,0.0098 0.250025,0.250025 0 0 1 -0.03125,0.0098 0.250025,0.250025 0 0 1 -0.056641,0.0059 0.250025,0.250025 0 0 1 -0.00195,0 0.250025,0.250025 0 0 1 -0.021484,0 0.250025,0.250025 0 0 1 -0.00195,0 0.250025,0.250025 0 0 1 -0.023437,-0.0039 0.250025,0.250025 0 0 1 -0.00195,0 0.250025,0.250025 0 0 1 -0.021484,-0.0059 0.250025,0.250025 0 0 1 -0.00195,0 0.250025,0.250025 0 0 1 -0.00781,-0.0039 0.250025,0.250025 0 0 1 -0.017578,-0.0059 0.250025,0.250025 0 0 1 -0.019531,-0.0098 0.250025,0.250025 0 0 1 -0.00195,0 0.250025,0.250025 0 0 1 -0.011719,-0.0078 0.250025,0.250025 0 0 1 -0.00977,-0.0059 0.250025,0.250025 0 0 1 -0.017578,-0.01367 0.250025,0.250025 0 0 1 -0.00195,-0.002 0.250025,0.250025 0 0 1 -0.017578,-0.01563 0.250025,0.250025 0 0 1 -0.00195,0 l -5.99999998,-6 a 0.250025,0.250025 0 0 1 0,-0.355468 L 6.8203125,7.8261719 a 0.250025,0.250025 0 0 1 0.00195,-0.00391 0.250025,0.250025 0 0 1 0.015625,-0.013672 0.250025,0.250025 0 0 1 0.017578,-0.013672 0.250025,0.250025 0 0 1 0.00195,-0.00195 0.250025,0.250025 0 0 1 0.00781,-0.00391 0.250025,0.250025 0 0 1 0.058594,-0.029297 0.250025,0.250025 0 0 1 0.015625,-0.00391 0.250025,0.250025 0 0 1 0.00781,-0.00195 0.250025,0.250025 0 0 1 0.023437,-0.00391 0.250025,0.250025 0 0 1 0.023437,-0.00195 z"
     id="path2" />
</svg>
