<?xml version="1.0" encoding="UTF-8" standalone="no"?>
<svg
   xmlns:dc="http://purl.org/dc/elements/1.1/"
   xmlns:cc="http://creativecommons.org/ns#"
   xmlns:rdf="http://www.w3.org/1999/02/22-rdf-syntax-ns#"
   xmlns:svg="http://www.w3.org/2000/svg"
   xmlns="http://www.w3.org/2000/svg"
   xmlns:sodipodi="http://sodipodi.sourceforge.net/DTD/sodipodi-0.dtd"
   xmlns:inkscape="http://www.inkscape.org/namespaces/inkscape"
   data-dec="339"
   id="dec_111"
   width="30"
   height="40"
   version="1.1"
   sodipodi:docname="339.svg"
   inkscape:version="0.91 r13725">
  <metadata
     id="metadata9">
    <rdf:RDF>
      <cc:Work
         rdf:about="">
        <dc:format>image/svg+xml</dc:format>
        <dc:type
           rdf:resource="http://purl.org/dc/dcmitype/StillImage" />
        <dc:title />
      </cc:Work>
    </rdf:RDF>
  </metadata>
  <defs
     id="defs7" />
  <sodipodi:namedview
     pagecolor="#ffffff"
     bordercolor="#666666"
     borderopacity="1"
     objecttolerance="10"
     gridtolerance="10"
     guidetolerance="10"
     inkscape:pageopacity="0"
     inkscape:pageshadow="2"
     inkscape:window-width="1364"
     inkscape:window-height="730"
     id="namedview5"
     showgrid="true"
     showguides="true"
     inkscape:zoom="11.869141"
     inkscape:cx="15.074258"
     inkscape:cy="18.991062"
     inkscape:window-x="76"
     inkscape:window-y="24"
     inkscape:window-maximized="0"
     inkscape:current-layer="dec_111">
    <inkscape:grid
       type="xygrid"
       id="grid825" />
  </sodipodi:namedview>
  <path
     style="color:#000000;font-style:normal;font-variant:normal;font-weight:normal;font-stretch:normal;font-size:medium;line-height:normal;font-family:sans-serif;text-indent:0;text-align:start;text-decoration:none;text-decoration-line:none;text-decoration-style:solid;text-decoration-color:#000000;letter-spacing:normal;word-spacing:normal;text-transform:none;direction:ltr;block-progression:tb;writing-mode:lr-tb;baseline-shift:baseline;text-anchor:start;white-space:normal;clip-rule:nonzero;display:inline;overflow:visible;visibility:visible;opacity:1;isolation:auto;mix-blend-mode:normal;color-interpolation:sRGB;color-interpolation-filters:linearRGB;solid-color:#000000;solid-opacity:1;fill:#000000;fill-opacity:1;fill-rule:nonzero;stroke:none;stroke-width:1;stroke-linecap:round;stroke-linejoin:round;stroke-miterlimit:4;stroke-dasharray:none;stroke-dashoffset:0;stroke-opacity:1;color-rendering:auto;image-rendering:auto;shape-rendering:auto;text-rendering:auto;enable-background:accumulate"
     d="M 8.0019531 7.4960938 A 0.50005 0.50005 0 0 0 7.9101562 7.5058594 A 0.50005 0.50005 0 0 0 7.8554688 7.5195312 A 0.50005 0.50005 0 0 0 7.7265625 7.578125 A 0.50005 0.50005 0 0 0 7.7167969 7.5839844 L 5.7773438 8.5527344 A 0.50005 0.50005 0 0 0 5.6464844 8.6464844 L 3.6464844 10.646484 A 0.50005 0.50005 0 0 0 3.5253906 10.841797 L 2.5253906 13.841797 A 0.50005 0.50005 0 0 0 2.5 14 L 2.5 16 A 0.50005 0.50005 0 0 0 2.5253906 16.158203 L 3.5253906 19.158203 A 0.50005 0.50005 0 0 0 3.6464844 19.353516 L 5.6464844 21.353516 A 0.50005 0.50005 0 0 0 5.7773438 21.447266 L 7.7773438 22.447266 A 0.50005 0.50005 0 0 0 8 22.5 L 9 22.5 L 11 22.5 L 12 22.5 A 0.50005 0.50005 0 0 0 12.222656 22.447266 L 14.222656 21.447266 A 0.50005 0.50005 0 0 0 14.353516 21.353516 L 16 19.707031 L 17.646484 21.353516 A 0.50005 0.50005 0 0 0 17.777344 21.447266 L 19.777344 22.447266 A 0.50005 0.50005 0 0 0 20 22.5 L 21 22.5 L 23 22.5 L 24 22.5 A 0.50005 0.50005 0 0 0 24.222656 22.447266 L 26.222656 21.447266 A 0.50005 0.50005 0 0 0 26.353516 21.353516 L 28.296875 19.410156 A 0.50005 0.50005 0 0 0 28.496094 19.09375 A 0.50005 0.50005 0 0 0 28.505859 18.994141 A 0.50005 0.50005 0 0 0 28.501953 18.945312 A 0.50005 0.50005 0 0 0 28.5 18.927734 A 0.50005 0.50005 0 0 0 28.478516 18.837891 A 0.50005 0.50005 0 0 0 28.476562 18.830078 A 0.50005 0.50005 0 0 0 28.464844 18.800781 A 0.50005 0.50005 0 0 0 28.457031 18.785156 A 0.50005 0.50005 0 0 0 28.15625 18.519531 L 26.232422 17.558594 A 0.50005 0.50005 0 0 0 26.222656 17.552734 A 0.50005 0.50005 0 0 0 26.1875 17.537109 A 0.50005 0.50005 0 0 0 26.177734 17.533203 A 0.50005 0.50005 0 0 0 26.140625 17.519531 A 0.50005 0.50005 0 0 0 26.130859 17.517578 A 0.50005 0.50005 0 0 0 26.091797 17.507812 A 0.50005 0.50005 0 0 0 26.082031 17.505859 A 0.50005 0.50005 0 0 0 26.042969 17.501953 A 0.50005 0.50005 0 0 0 26.03125 17.501953 A 0.50005 0.50005 0 0 0 25.943359 17.503906 A 0.50005 0.50005 0 0 0 25.892578 17.511719 A 0.50005 0.50005 0 0 0 25.882812 17.513672 A 0.50005 0.50005 0 0 0 25.798828 17.542969 A 0.50005 0.50005 0 0 0 25.771484 17.556641 A 0.50005 0.50005 0 0 0 25.748047 17.568359 A 0.50005 0.50005 0 0 0 25.732422 17.578125 A 0.50005 0.50005 0 0 0 25.707031 17.595703 A 0.50005 0.50005 0 0 0 25.703125 17.597656 A 0.50005 0.50005 0 0 0 25.671875 17.623047 A 0.50005 0.50005 0 0 0 25.646484 17.646484 A 0.50005 0.50005 0 0 0 25.636719 17.65625 L 23.792969 19.5 L 23 19.5 L 19.207031 19.5 L 18.4375 18.730469 L 17.5 15.917969 L 17.5 15.5 L 27 15.5 L 28 15.5 A 0.50005 0.50005 0 0 0 28.5 15 L 28.5 12 A 0.50005 0.50005 0 0 0 28.447266 11.777344 L 27.447266 9.7773438 A 0.50005 0.50005 0 0 0 27.353516 9.6464844 L 26.353516 8.6464844 A 0.50005 0.50005 0 0 0 26.222656 8.5527344 L 24.222656 7.5527344 A 0.50005 0.50005 0 0 0 24 7.5 L 23 7.5 L 21 7.5 L 20 7.5 A 0.50005 0.50005 0 0 0 19.777344 7.5527344 L 17.777344 8.5527344 A 0.50005 0.50005 0 0 0 17.646484 8.6464844 L 16 10.292969 L 14.353516 8.6464844 A 0.50005 0.50005 0 0 0 14.222656 8.5527344 L 12.222656 7.5527344 A 0.50005 0.50005 0 0 0 12 7.5 L 11 7.5 L 9.0644531 7.5 A 0.50005 0.50005 0 0 0 8.953125 7.5 L 8.0644531 7.5 A 0.50005 0.50005 0 0 0 8.0019531 7.4960938 z M 9.1171875 8.5 L 10.882812 8.5 L 11.1875 8.6523438 L 10 8.890625 L 9.4570312 8.78125 A 0.50005 0.50005 0 0 0 9.1035156 8.5058594 L 9.1171875 8.5 z M 21.117188 9.5 L 22.882812 9.5 L 24.626953 10.373047 L 25.5 12.117188 L 25.5 12.5 L 17.808594 12.5 L 18.410156 11.296875 L 19.296875 10.410156 L 21.117188 9.5 z M 10 9.9101562 L 12.902344 10.490234 A 0.50005 0.50005 0 0 0 13 10.5 L 12.792969 10.5 L 13.5625 11.269531 L 14.5 14.082031 L 14.5 15.917969 L 13.5625 18.730469 L 12.744141 19.548828 L 10.181641 20.189453 L 7.4394531 19.732422 L 6.4375 18.730469 L 5.5 15.917969 L 5.5 14.082031 L 6.4375 11.269531 L 7.2460938 10.460938 L 10 9.9101562 z M 26.5 14 L 26.5 14.5 L 26 14.5 A 0.50005 0.50005 0 0 0 26.5 14 z M 26.136719 18.84375 L 26.292969 19 L 25.824219 19.46875 L 26.136719 18.84375 z "
     id="path816" />
</svg>
