<?xml version="1.0" encoding="UTF-8" standalone="no"?>
<svg
   xmlns:dc="http://purl.org/dc/elements/1.1/"
   xmlns:cc="http://creativecommons.org/ns#"
   xmlns:rdf="http://www.w3.org/1999/02/22-rdf-syntax-ns#"
   xmlns:svg="http://www.w3.org/2000/svg"
   xmlns="http://www.w3.org/2000/svg"
   xmlns:sodipodi="http://sodipodi.sourceforge.net/DTD/sodipodi-0.dtd"
   xmlns:inkscape="http://www.inkscape.org/namespaces/inkscape"
   data-dec="116"
   id="dec_116"
   width="12"
   height="40"
   version="1.1"
   sodipodi:docname="116.svg"
   inkscape:version="0.91 r13725">
  <metadata
     id="metadata9">
    <rdf:RDF>
      <cc:Work
         rdf:about="">
        <dc:format>image/svg+xml</dc:format>
        <dc:type
           rdf:resource="http://purl.org/dc/dcmitype/StillImage" />
      </cc:Work>
    </rdf:RDF>
  </metadata>
  <defs
     id="defs7" />
  <sodipodi:namedview
     pagecolor="#ffffff"
     bordercolor="#666666"
     borderopacity="1"
     objecttolerance="10"
     gridtolerance="10"
     guidetolerance="10"
     inkscape:pageopacity="0"
     inkscape:pageshadow="2"
     inkscape:window-width="1407"
     inkscape:window-height="876"
     id="namedview5"
     showgrid="true"
     inkscape:zoom="23.6"
     inkscape:cx="-5.2288136"
     inkscape:cy="26.461865"
     inkscape:window-x="33"
     inkscape:window-y="24"
     inkscape:window-maximized="1"
     inkscape:current-layer="dec_116">
    <inkscape:grid
       type="xygrid"
       id="grid11" />
  </sodipodi:namedview>
  <path
     style="color:#000000;font-style:normal;font-variant:normal;font-weight:normal;font-stretch:normal;font-size:medium;line-height:normal;font-family:sans-serif;text-indent:0;text-align:start;text-decoration:none;text-decoration-line:none;text-decoration-style:solid;text-decoration-color:#000000;letter-spacing:normal;word-spacing:normal;text-transform:none;direction:ltr;block-progression:tb;writing-mode:lr-tb;baseline-shift:baseline;text-anchor:start;white-space:normal;clip-rule:nonzero;display:inline;overflow:visible;visibility:visible;opacity:1;isolation:auto;mix-blend-mode:normal;color-interpolation:sRGB;color-interpolation-filters:linearRGB;solid-color:#000000;solid-opacity:1;fill:#000000;fill-opacity:1;fill-rule:nonzero;stroke:none;stroke-width:1;stroke-linecap:round;stroke-linejoin:round;stroke-miterlimit:4;stroke-dasharray:none;stroke-dashoffset:0;stroke-opacity:1;color-rendering:auto;image-rendering:auto;shape-rendering:auto;text-rendering:auto;enable-background:accumulate"
     d="M 4.9921875 0.4921875 A 0.50005 0.50005 0 0 0 4.6757812 0.61328125 A 0.50005 0.50005 0 0 0 4.65625 0.62890625 A 0.50005 0.50005 0 0 0 4.6386719 0.64648438 A 0.50005 0.50005 0 0 0 4.6367188 0.65039062 A 0.50005 0.50005 0 0 0 4.6054688 0.68359375 A 0.50005 0.50005 0 0 0 4.6035156 0.6875 A 0.50005 0.50005 0 0 0 4.5 1.0820312 L 4.5 7.5 L 3 7.5 L 2.0800781 7.5 A 0.50005 0.50005 0 0 0 2.0429688 7.4941406 A 0.50005 0.50005 0 0 0 1.9921875 7.4921875 A 0.50005 0.50005 0 0 0 1.9433594 7.4960938 A 0.50005 0.50005 0 0 0 1.8925781 7.5039062 A 0.50005 0.50005 0 0 0 1.7988281 7.5351562 A 0.50005 0.50005 0 0 0 1.6757812 7.6132812 A 0.50005 0.50005 0 0 0 1.65625 7.6289062 A 0.50005 0.50005 0 0 0 1.6386719 7.6464844 A 0.50005 0.50005 0 0 0 1.6367188 7.6503906 A 0.50005 0.50005 0 0 0 1.6054688 7.6835938 A 0.50005 0.50005 0 0 0 1.6035156 7.6875 A 0.50005 0.50005 0 0 0 1.5 8.0820312 L 1.5 9 L 1.5 10 A 0.50005 0.50005 0 0 0 2 10.5 L 4.5 10.5 L 4.5 22 A 0.50005 0.50005 0 0 0 5 22.5 L 5.9199219 22.5 A 0.50005 0.50005 0 0 0 6.0820312 22.5 L 6.9199219 22.5 A 0.50005 0.50005 0 0 0 7.3242188 22.386719 A 0.50005 0.50005 0 0 0 7.328125 22.384766 A 0.50005 0.50005 0 0 0 7.3613281 22.353516 A 0.50005 0.50005 0 0 0 7.3632812 22.349609 A 0.50005 0.50005 0 0 0 7.3945312 22.316406 A 0.50005 0.50005 0 0 0 7.3964844 22.3125 A 0.50005 0.50005 0 0 0 7.5 21.917969 L 7.5 10.5 L 9.9199219 10.5 A 0.50005 0.50005 0 0 0 10.324219 10.386719 A 0.50005 0.50005 0 0 0 10.328125 10.384766 A 0.50005 0.50005 0 0 0 10.361328 10.353516 A 0.50005 0.50005 0 0 0 10.363281 10.349609 A 0.50005 0.50005 0 0 0 10.394531 10.316406 A 0.50005 0.50005 0 0 0 10.396484 10.3125 A 0.50005 0.50005 0 0 0 10.5 9.9179688 L 10.5 8 A 0.50005 0.50005 0 0 0 10 7.5 L 9 7.5 L 7.5 7.5 L 7.5 1 A 0.50005 0.50005 0 0 0 7 0.5 L 6.0800781 0.5 A 0.50005 0.50005 0 0 0 5.9179688 0.5 L 5.0800781 0.5 A 0.50005 0.50005 0 0 0 4.9921875 0.4921875 z M 9.5 9.0800781 L 9.5 9.5 L 9.0820312 9.5 A 0.50005 0.50005 0 0 0 9.3242188 9.3867188 A 0.50005 0.50005 0 0 0 9.328125 9.3847656 A 0.50005 0.50005 0 0 0 9.3613281 9.3535156 A 0.50005 0.50005 0 0 0 9.3632812 9.3496094 A 0.50005 0.50005 0 0 0 9.3945312 9.3164062 A 0.50005 0.50005 0 0 0 9.3964844 9.3125 A 0.50005 0.50005 0 0 0 9.5 9.0800781 z "
     id="path13" />
</svg>
