<?xml version="1.0" encoding="UTF-8" standalone="no"?>
<svg
   xmlns:dc="http://purl.org/dc/elements/1.1/"
   xmlns:cc="http://creativecommons.org/ns#"
   xmlns:rdf="http://www.w3.org/1999/02/22-rdf-syntax-ns#"
   xmlns:svg="http://www.w3.org/2000/svg"
   xmlns="http://www.w3.org/2000/svg"
   xmlns:sodipodi="http://sodipodi.sourceforge.net/DTD/sodipodi-0.dtd"
   xmlns:inkscape="http://www.inkscape.org/namespaces/inkscape"
   data-dec="52"
   width="17"
   height="40"
   version="1.1"
   id="svg4"
   sodipodi:docname="52.svg"
   inkscape:version="0.92.4 5da689c313, 2019-01-14">
  <metadata
     id="metadata10">
    <rdf:RDF>
      <cc:Work
         rdf:about="">
        <dc:format>image/svg+xml</dc:format>
        <dc:type
           rdf:resource="http://purl.org/dc/dcmitype/StillImage" />
        <dc:title></dc:title>
      </cc:Work>
    </rdf:RDF>
  </metadata>
  <defs
     id="defs8" />
  <sodipodi:namedview
     pagecolor="#ffffff"
     bordercolor="#666666"
     borderopacity="1"
     objecttolerance="10"
     gridtolerance="10"
     guidetolerance="10"
     inkscape:pageopacity="0"
     inkscape:pageshadow="2"
     inkscape:window-width="1920"
     inkscape:window-height="1043"
     id="namedview6"
     showgrid="false"
     inkscape:zoom="5.9"
     inkscape:cx="8.5"
     inkscape:cy="20"
     inkscape:window-x="0"
     inkscape:window-y="37"
     inkscape:window-maximized="0"
     inkscape:current-layer="svg4" />
  <path
     style="color:#000000;font-style:normal;font-variant:normal;font-weight:normal;font-stretch:normal;font-size:medium;line-height:normal;font-family:sans-serif;font-variant-ligatures:normal;font-variant-position:normal;font-variant-caps:normal;font-variant-numeric:normal;font-variant-alternates:normal;font-feature-settings:normal;text-indent:0;text-align:start;text-decoration:none;text-decoration-line:none;text-decoration-style:solid;text-decoration-color:#000000;letter-spacing:normal;word-spacing:normal;text-transform:none;writing-mode:lr-tb;direction:ltr;text-orientation:mixed;dominant-baseline:auto;baseline-shift:baseline;text-anchor:start;white-space:normal;shape-padding:0;clip-rule:nonzero;display:inline;overflow:visible;visibility:visible;opacity:1;isolation:auto;mix-blend-mode:normal;color-interpolation:sRGB;color-interpolation-filters:linearRGB;solid-color:#000000;solid-opacity:1;vector-effect:none;fill:#000000;fill-opacity:1;fill-rule:nonzero;stroke:none;stroke-width:0.5;stroke-linecap:round;stroke-linejoin:round;stroke-miterlimit:4;stroke-dasharray:none;stroke-dashoffset:0;stroke-opacity:1;color-rendering:auto;image-rendering:auto;shape-rendering:auto;text-rendering:auto;enable-background:accumulate"
     d="m 11.25,16.25 v 5.5 h 0.5 v -5.5 z m 1,-1 v 0.5 h 2.5 v -0.5 z m -1,0 v 0.5 h 0.5 v -0.5 z M 2.8398438,15.193359 2.46875,15.75 H 10.75 v -0.5 H 3 A 0.250025,0.250025 0 0 1 2.8398438,15.193359 Z M 10.75,3.328125 3.1347656,14.75 H 10.75 Z m 1,-1.5 -0.632812,0.9472656 A 0.250025,0.250025 0 0 1 11.25,3 v 11.75 h 0.5 z m 0.246094,-1.08203125 a 0.250025,0.250025 0 0 1 0.02344,0.001953 0.250025,0.250025 0 0 1 0.002,0 0.250025,0.250025 0 0 1 0.02344,0.001953 0.250025,0.250025 0 0 1 0.02539,0.005859 0.250025,0.250025 0 0 1 0.03906,0.015625 0.250025,0.250025 0 0 1 0.0059,0.003906 0.250025,0.250025 0 0 1 0.002,0 0.250025,0.250025 0 0 1 0.01953,0.0117188 0.250025,0.250025 0 0 1 0.002,0 0.250025,0.250025 0 0 1 0.0078,0.005859 0.250025,0.250025 0 0 1 0.01172,0.009766 0.250025,0.250025 0 0 1 0.01758,0.015625 0.250025,0.250025 0 0 1 0,0.001953 0.250025,0.250025 0 0 1 0.01758,0.015625 0.250025,0.250025 0 0 1 0,0.001953 0.250025,0.250025 0 0 1 0.01563,0.0175781 0.250025,0.250025 0 0 1 0,0.001953 0.250025,0.250025 0 0 1 0.01172,0.0195312 0.250025,0.250025 0 0 1 0,0.001953 0.250025,0.250025 0 0 1 0.01172,0.0214844 0.250025,0.250025 0 0 1 0,0.001953 0.250025,0.250025 0 0 1 0.0078,0.0214844 0.250025,0.250025 0 0 1 0,0.001953 0.250025,0.250025 0 0 1 0.0098,0.046875 0.250025,0.250025 0 0 1 0,0.001953 0.250025,0.250025 0 0 1 0,0.0488281 V 14.75 h 2.708984 a 0.250025,0.250025 0 0 1 0.197266,0.05273 0.250025,0.250025 0 0 1 0.002,0 0.250025,0.250025 0 0 1 0.01758,0.01563 0.250025,0.250025 0 0 1 0,0.002 0.250025,0.250025 0 0 1 0.01563,0.01563 0.250025,0.250025 0 0 1 0.002,0.002 0.250025,0.250025 0 0 1 0.01367,0.01758 0.250025,0.250025 0 0 1 0.002,0.002 0.250025,0.250025 0 0 1 0.01172,0.01953 0.250025,0.250025 0 0 1 0,0.002 0.250025,0.250025 0 0 1 0.0293,0.167969 v 0.912109 a 0.250025,0.250025 0 0 1 -0.05273,0.197266 0.250025,0.250025 0 0 1 0,0.002 0.250025,0.250025 0 0 1 -0.0078,0.0078 0.250025,0.250025 0 0 1 -0.0098,0.0098 0.250025,0.250025 0 0 1 -0.01563,0.01563 0.250025,0.250025 0 0 1 -0.002,0.002 0.250025,0.250025 0 0 1 -0.01758,0.01367 0.250025,0.250025 0 0 1 -0.002,0.002 0.250025,0.250025 0 0 1 -0.0078,0.0039 0.250025,0.250025 0 0 1 -0.01367,0.0078 0.250025,0.250025 0 0 1 -0.167969,0.0293 H 12.25 v 5.708984 a 0.250025,0.250025 0 0 1 -0.05273,0.197266 0.250025,0.250025 0 0 1 0,0.002 0.250025,0.250025 0 0 1 -0.0078,0.0078 0.250025,0.250025 0 0 1 -0.0098,0.0098 0.250025,0.250025 0 0 1 -0.01563,0.01563 0.250025,0.250025 0 0 1 -0.002,0.002 0.250025,0.250025 0 0 1 -0.01758,0.01367 0.250025,0.250025 0 0 1 -0.002,0.002 0.250025,0.250025 0 0 1 -0.0078,0.0039 0.250025,0.250025 0 0 1 -0.01367,0.0078 0.250025,0.250025 0 0 1 -0.167969,0.0293 h -0.912109 a 0.250025,0.250025 0 0 1 -0.197266,-0.05273 0.250025,0.250025 0 0 1 -0.002,0 0.250025,0.250025 0 0 1 -0.0078,-0.0078 0.250025,0.250025 0 0 1 -0.0098,-0.0098 0.250025,0.250025 0 0 1 -0.01563,-0.01563 0.250025,0.250025 0 0 1 -0.002,-0.002 0.250025,0.250025 0 0 1 -0.01367,-0.01758 0.250025,0.250025 0 0 1 -0.002,-0.002 0.250025,0.250025 0 0 1 -0.0039,-0.0078 0.250025,0.250025 0 0 1 -0.0078,-0.01367 A 0.250025,0.250025 0 0 1 10.75,21.953125 V 16.25 H 2.0292969 a 0.250025,0.250025 0 0 1 -0.1425781,-0.02539 0.250025,0.250025 0 0 1 -0.00195,0 0.250025,0.250025 0 0 1 -0.019531,-0.01172 0.250025,0.250025 0 0 1 -0.00195,0 0.250025,0.250025 0 0 1 -0.039062,-0.03125 0.250025,0.250025 0 0 1 -0.015625,-0.01758 0.250025,0.250025 0 0 1 -0.029297,-0.04102 0.250025,0.250025 0 0 1 -0.011719,-0.02148 0.250025,0.250025 0 0 1 0,-0.002 0.250025,0.250025 0 0 1 -0.015625,-0.04687 0.250025,0.250025 0 0 1 0.013672,-0.146484 0.250025,0.250025 0 0 1 0.00195,-0.002 0.250025,0.250025 0 0 1 0.035156,-0.0625 0.250025,0.250025 0 0 1 0.00391,-0.0039 L 11.775391,0.88671875 a 0.250025,0.250025 0 0 1 0.01563,-0.0253906 0.250025,0.250025 0 0 1 0.205078,-0.11523437 z"
     id="path2" />
</svg>
