<?xml version="1.0" encoding="UTF-8" standalone="no"?>
<svg
   xmlns:dc="http://purl.org/dc/elements/1.1/"
   xmlns:cc="http://creativecommons.org/ns#"
   xmlns:rdf="http://www.w3.org/1999/02/22-rdf-syntax-ns#"
   xmlns:svg="http://www.w3.org/2000/svg"
   xmlns="http://www.w3.org/2000/svg"
   xmlns:sodipodi="http://sodipodi.sourceforge.net/DTD/sodipodi-0.dtd"
   xmlns:inkscape="http://www.inkscape.org/namespaces/inkscape"
   data-dec="97"
   width="19"
   height="40"
   version="1.1"
   id="svg4"
   sodipodi:docname="97.svg"
   inkscape:version="0.92.4 5da689c313, 2019-01-14">
  <metadata
     id="metadata10">
    <rdf:RDF>
      <cc:Work
         rdf:about="">
        <dc:format>image/svg+xml</dc:format>
        <dc:type
           rdf:resource="http://purl.org/dc/dcmitype/StillImage" />
        <dc:title></dc:title>
      </cc:Work>
    </rdf:RDF>
  </metadata>
  <defs
     id="defs8" />
  <sodipodi:namedview
     pagecolor="#ffffff"
     bordercolor="#666666"
     borderopacity="1"
     objecttolerance="10"
     gridtolerance="10"
     guidetolerance="10"
     inkscape:pageopacity="0"
     inkscape:pageshadow="2"
     inkscape:window-width="1920"
     inkscape:window-height="1043"
     id="namedview6"
     showgrid="false"
     inkscape:zoom="5.9"
     inkscape:cx="9.5"
     inkscape:cy="20"
     inkscape:window-x="0"
     inkscape:window-y="37"
     inkscape:window-maximized="0"
     inkscape:current-layer="svg4" />
  <path
     style="color:#000000;font-style:normal;font-variant:normal;font-weight:normal;font-stretch:normal;font-size:medium;line-height:normal;font-family:sans-serif;font-variant-ligatures:normal;font-variant-position:normal;font-variant-caps:normal;font-variant-numeric:normal;font-variant-alternates:normal;font-feature-settings:normal;text-indent:0;text-align:start;text-decoration:none;text-decoration-line:none;text-decoration-style:solid;text-decoration-color:#000000;letter-spacing:normal;word-spacing:normal;text-transform:none;writing-mode:lr-tb;direction:ltr;text-orientation:mixed;dominant-baseline:auto;baseline-shift:baseline;text-anchor:start;white-space:normal;shape-padding:0;clip-rule:nonzero;display:inline;overflow:visible;visibility:visible;opacity:1;isolation:auto;mix-blend-mode:normal;color-interpolation:sRGB;color-interpolation-filters:linearRGB;solid-color:#000000;solid-opacity:1;vector-effect:none;fill:#000000;fill-opacity:1;fill-rule:nonzero;stroke:none;stroke-width:1;stroke-linecap:round;stroke-linejoin:round;stroke-miterlimit:4;stroke-dasharray:none;stroke-dashoffset:0;stroke-opacity:1;color-rendering:auto;image-rendering:auto;shape-rendering:auto;text-rendering:auto;enable-background:accumulate"
     d="M 8.1171875,8.5 6.296875,9.4101562 4.4375,11.269531 3.5,14.082031 v 1.835938 l 0.9375,2.8125 1.859375,1.859375 L 8.1171875,21.5 H 10.882812 L 12.703125,20.589844 14.5,18.792969 V 11.207031 L 12.703125,9.4101562 10.882812,8.5 Z M 14.992188,7.4921875 A 0.50005,0.50005 0 0 1 15.5,8 v 2.939453 a 0.50005,0.50005 0 0 1 0,0.134766 v 7.859375 a 0.50005,0.50005 0 0 1 0,0.126953 V 22 a 0.50005,0.50005 0 1 1 -1,0 v -1.792969 l -1.146484,1.146485 a 0.50005,0.50005 0 0 1 -0.13086,0.09375 l -2,1 A 0.50005,0.50005 0 0 1 11,22.5 H 8 a 0.50005,0.50005 0 0 1 -0.2226562,-0.05273 l -2,-1 a 0.50005,0.50005 0 0 1 -0.1308594,-0.09375 l -2,-2 A 0.50005,0.50005 0 0 1 3.5253906,19.158203 l -1,-3 A 0.50005,0.50005 0 0 1 2.5,16 v -2 a 0.50005,0.50005 0 0 1 0.025391,-0.158203 l 1,-3 a 0.50005,0.50005 0 0 1 0.1210938,-0.195313 l 2,-1.9999996 a 0.50005,0.50005 0 0 1 0.1308594,-0.09375 l 2,-1 A 0.50005,0.50005 0 0 1 8,7.5 h 3 a 0.50005,0.50005 0 0 1 0.222656,0.052734 l 2,1 a 0.50005,0.50005 0 0 1 0.13086,0.09375 L 14.5,9.7929688 V 8 a 0.50005,0.50005 0 0 1 0.492188,-0.5078125 z"
     id="path2" />
</svg>
