StartFontMetrics 2.0
Comment Generated by FontForge 20170924
Comment Creation Date: Thu Mar 12 11:06:59 2020
FontName Hershey-Noailles-Times-Simplex-Regular
FullName Hershey-Noailles-Times-Simplex-Regular
FamilyName Hershey-Noailles-Times
Weight Regular
Notice (by Luuse (contact@luuse.io), SIL Open Font License)
ItalicAngle 0
IsFixedPitch false
UnderlinePosition 0
UnderlineThickness 26,4
Version 001.000
EncodingScheme ISO10646-1
FontBBox -81 -187 764 843
CapHeight 605
XHeight 421
Ascender 605
Descender -185
StartCharMetrics 159
C 32 ; WX 314 ; N space ; B 0 0 0 0 ;
C 33 ; WX 262 ; N exclam ; B 79 0 184 606 ;
C 34 ; WX 420 ; N quotedbl ; B 79 368 342 606 ;
C 35 ; WX 577 ; N numbersign ; B 51 -187 500 711 ;
C 36 ; WX 525 ; N dollar ; B 51 -107 474 710 ;
C 37 ; WX 630 ; N percent ; B 52 0 580 606 ;
C 38 ; WX 604 ; N ampersand ; B 26 0 580 606 ;
C 39 ; WX 262 ; N quotesingle ; B 105 420 159 606 ;
C 40 ; WX 367 ; N parenleft ; B 79 -186 317 710 ;
C 41 ; WX 367 ; N parenright ; B 51 -186 290 710 ;
C 42 ; WX 420 ; N asterisk ; B 51 78 370 448 ;
C 43 ; WX 683 ; N plus ; B 79 -1 607 527 ;
C 44 ; WX 210 ; N comma ; B 51 -1 159 184 ;
C 45 ; WX 235 ; N hyphen ; B 0 210 238 263 ;
C 46 ; WX 210 ; N period ; B 52 79 159 184 ;
C 47 ; WX 577 ; N slash ; B 26 -186 553 710 ;
C 48 ; WX 472 ; N zero ; B 26 0 448 606 ;
C 49 ; WX 420 ; N one ; B 79 -1 342 606 ;
C 50 ; WX 525 ; N two ; B 51 -1 474 606 ;
C 51 ; WX 498 ; N three ; B 51 0 448 606 ;
C 52 ; WX 525 ; N four ; B 26 -1 474 606 ;
C 53 ; WX 472 ; N five ; B 26 0 448 606 ;
C 54 ; WX 525 ; N six ; B 51 0 474 606 ;
C 55 ; WX 472 ; N seven ; B 26 -1 449 606 ;
C 56 ; WX 446 ; N eight ; B 26 0 421 606 ;
C 57 ; WX 446 ; N nine ; B 26 0 421 606 ;
C 58 ; WX 210 ; N colon ; B 52 79 159 369 ;
C 59 ; WX 210 ; N semicolon ; B 51 -1 159 369 ;
C 60 ; WX 630 ; N less ; B 79 -1 553 527 ;
C 61 ; WX 683 ; N equal ; B 79 157 607 369 ;
C 62 ; WX 630 ; N greater ; B 78 -1 553 527 ;
C 63 ; WX 393 ; N question ; B 26 0 369 606 ;
C 64 ; WX 735 ; N at ; B 52 0 659 606 ;
C 65 ; WX 525 ; N A ; B 0 -1 528 606 ;
C 66 ; WX 551 ; N B ; B 26 -1 500 606 ;
C 67 ; WX 525 ; N C ; B 52 0 500 606 ;
C 68 ; WX 551 ; N D ; B 26 -1 500 606 ;
C 69 ; WX 498 ; N E ; B 26 -1 474 606 ;
C 70 ; WX 446 ; N F ; B 26 -1 474 606 ;
C 71 ; WX 630 ; N G ; B 52 -1 580 606 ;
C 72 ; WX 604 ; N H ; B 26 -1 580 606 ;
C 73 ; WX 262 ; N I ; B 26 -1 238 606 ;
C 74 ; WX 367 ; N J ; B 0 0 342 606 ;
C 75 ; WX 525 ; N K ; B 26 -1 553 606 ;
C 76 ; WX 472 ; N L ; B 26 -1 448 606 ;
C 77 ; WX 630 ; N M ; B 26 -1 607 606 ;
C 78 ; WX 577 ; N N ; B 26 -1 553 606 ;
C 79 ; WX 577 ; N O ; B 52 0 527 606 ;
C 80 ; WX 525 ; N P ; B 26 -1 474 606 ;
C 81 ; WX 577 ; N Q ; B 52 -80 528 606 ;
C 82 ; WX 551 ; N R ; B 26 -1 528 606 ;
C 83 ; WX 525 ; N S ; B 52 -1 474 606 ;
C 84 ; WX 472 ; N T ; B 26 -1 448 606 ;
C 85 ; WX 604 ; N U ; B 26 0 580 606 ;
C 86 ; WX 525 ; N V ; B 0 -1 528 606 ;
C 87 ; WX 630 ; N W ; B 0 -1 632 606 ;
C 88 ; WX 525 ; N X ; B 0 -1 528 606 ;
C 89 ; WX 525 ; N Y ; B 0 -1 528 606 ;
C 90 ; WX 525 ; N Z ; B 51 -1 474 606 ;
C 91 ; WX 367 ; N bracketleft ; B 79 -186 317 710 ;
C 92 ; WX 367 ; N backslash ; B -27 -80 395 606 ;
C 93 ; WX 367 ; N bracketright ; B 51 -186 290 710 ;
C 94 ; WX 420 ; N asciicircum ; B 26 289 395 500 ;
C 95 ; WX 525 ; N underscore ; B -28 -159 553 -106 ;
C 96 ; WX 314 ; N grave ; B 51 393 264 580 ;
C 97 ; WX 446 ; N a ; B 26 0 449 421 ;
C 98 ; WX 472 ; N b ; B 0 -1 448 606 ;
C 99 ; WX 472 ; N c ; B 52 0 421 421 ;
C 100 ; WX 498 ; N d ; B 26 -1 474 606 ;
C 101 ; WX 420 ; N e ; B 26 0 395 421 ;
C 102 ; WX 314 ; N f ; B 26 -1 317 606 ;
C 103 ; WX 472 ; N g ; B 26 -186 448 421 ;
C 104 ; WX 525 ; N h ; B 26 -1 500 606 ;
C 105 ; WX 262 ; N i ; B 26 -1 238 606 ;
C 106 ; WX 262 ; N j ; B 0 -186 211 606 ;
C 107 ; WX 525 ; N k ; B 26 -1 500 606 ;
C 108 ; WX 262 ; N l ; B 26 -1 238 606 ;
C 109 ; WX 788 ; N m ; B 26 -1 764 421 ;
C 110 ; WX 525 ; N n ; B 26 -1 500 421 ;
C 111 ; WX 472 ; N o ; B 26 0 448 421 ;
C 112 ; WX 498 ; N p ; B 26 -186 474 421 ;
C 113 ; WX 498 ; N q ; B 26 -186 474 421 ;
C 114 ; WX 420 ; N r ; B 26 -1 395 421 ;
C 115 ; WX 472 ; N s ; B 52 -1 395 421 ;
C 116 ; WX 367 ; N t ; B 26 0 342 606 ;
C 117 ; WX 551 ; N u ; B 26 -1 528 421 ;
C 118 ; WX 472 ; N v ; B 0 -1 474 421 ;
C 119 ; WX 630 ; N w ; B 0 -1 632 421 ;
C 120 ; WX 498 ; N x ; B 26 -1 474 421 ;
C 121 ; WX 472 ; N y ; B 26 -186 500 421 ;
C 122 ; WX 393 ; N z ; B 26 -1 370 421 ;
C 123 ; WX 367 ; N braceleft ; B 79 -186 263 710 ;
C 124 ; WX 210 ; N bar ; B 79 -186 132 710 ;
C 125 ; WX 367 ; N braceright ; B 105 -186 290 710 ;
C 126 ; WX 630 ; N asciitilde ; B 52 157 580 369 ;
C 127 ; WX 420 ; N uni007F ; B -27 -1 448 606 ;
C 168 ; WX 393 ; N dieresis ; B 52 447 342 552 ;
C 169 ; WX 630 ; N copyright ; B 52 -53 580 552 ;
C 171 ; WX 367 ; N guillemotleft ; B 0 51 370 421 ;
C 180 ; WX 314 ; N acute ; B 51 393 263 580 ;
C 184 ; WX 130 ; N cedilla ; B 26 -107 132 52 ;
C 187 ; WX 367 ; N guillemotright ; B 0 51 369 421 ;
C 192 ; WX 525 ; N Agrave ; B 0 -1 480 798 ;
C 193 ; WX 525 ; N Aacute ; B 0 -1 480 798 ;
C 194 ; WX 525 ; N Acircumflex ; B 0 -1 480 831 ;
C 195 ; WX 525 ; N Atilde ; B -4 -1 480 843 ;
C 196 ; WX 525 ; N Adieresis ; B 0 -1 480 720 ;
C 199 ; WX 525 ; N Ccedilla ; B 48 -144 455 550 ;
C 200 ; WX 498 ; N Egrave ; B 23 -1 431 798 ;
C 201 ; WX 498 ; N Eacute ; B 23 -1 431 798 ;
C 202 ; WX 498 ; N Ecircumflex ; B 23 -1 431 831 ;
C 203 ; WX 498 ; N Edieresis ; B 23 -1 431 720 ;
C 204 ; WX 262 ; N Igrave ; B -50 -1 216 798 ;
C 205 ; WX 262 ; N Iacute ; B 23 -1 284 798 ;
C 206 ; WX 262 ; N Icircumflex ; B -56 -1 281 831 ;
C 207 ; WX 262 ; N Idieresis ; B -18 -1 245 720 ;
C 210 ; WX 577 ; N Ograve ; B 48 0 479 798 ;
C 211 ; WX 577 ; N Oacute ; B 48 0 479 798 ;
C 212 ; WX 577 ; N Ocircumflex ; B 48 0 479 831 ;
C 213 ; WX 577 ; N Otilde ; B 20 0 499 843 ;
C 214 ; WX 577 ; N Odieresis ; B 48 0 479 720 ;
C 217 ; WX 604 ; N Ugrave ; B 23 0 527 798 ;
C 218 ; WX 604 ; N Uacute ; B 23 0 527 798 ;
C 219 ; WX 604 ; N Ucircumflex ; B 23 0 527 831 ;
C 220 ; WX 604 ; N Udieresis ; B 23 0 527 720 ;
C 224 ; WX 446 ; N agrave ; B 23 0 408 614 ;
C 225 ; WX 446 ; N aacute ; B 23 0 408 614 ;
C 226 ; WX 446 ; N acircumflex ; B 23 0 408 647 ;
C 227 ; WX 446 ; N atilde ; B -58 0 421 659 ;
C 231 ; WX 472 ; N ccedilla ; B 48 -144 383 383 ;
C 232 ; WX 420 ; N egrave ; B 23 0 360 614 ;
C 233 ; WX 420 ; N eacute ; B 23 0 360 614 ;
C 234 ; WX 420 ; N ecircumflex ; B 23 0 373 647 ;
C 235 ; WX 420 ; N edieresis ; B 23 0 360 536 ;
C 236 ; WX 262 ; N igrave ; B -6 -1 238 633 ;
C 237 ; WX 262 ; N iacute ; B -5 -1 238 633 ;
C 238 ; WX 262 ; N icircumflex ; B -81 -1 255 666 ;
C 239 ; WX 262 ; N idieresis ; B -29 -1 238 555 ;
C 242 ; WX 472 ; N ograve ; B 23 0 407 614 ;
C 243 ; WX 472 ; N oacute ; B 23 0 407 614 ;
C 244 ; WX 472 ; N ocircumflex ; B 23 0 407 647 ;
C 249 ; WX 551 ; N ugrave ; B 23 -1 480 614 ;
C 250 ; WX 551 ; N uacute ; B 23 -1 480 614 ;
C 251 ; WX 551 ; N ucircumflex ; B 23 -1 480 647 ;
C 252 ; WX 551 ; N udieresis ; B 23 -1 480 536 ;
C -1 ; WX 735 ; N glyph21 ; B 26 -1 711 606 ;
C -1 ; WX 788 ; N glyph10 ; B 26 0 764 421 ;
C -1 ; WX 525 ; N glyph155 ; B 52 -154 474 606 ;
C -1 ; WX 472 ; N glyph156 ; B 52 -154 395 421 ;
C -1 ; WX 104 ; N glyph46 ; B 0 0 0 0 ;
C -1 ; WX 683 ; N glyph39 ; B 79 210 607 263 ;
C -1 ; WX 367 ; N glyph108 ; B 26 210 342 263 ;
C -1 ; WX 525 ; N glyph55 ; B -28 210 553 263 ;
C -1 ; WX 183 ; N glyph98 ; B 51 368 159 552 ;
C -1 ; WX 183 ; N glyph24 ; B 51 368 159 552 ;
C -1 ; WX 367 ; N glyph23 ; B 51 368 317 552 ;
C -1 ; WX 367 ; N glyph38 ; B 51 368 317 552 ;
C -1 ; WX 367 ; N glyph73 ; B 26 79 342 184 ;
C -1 ; WX 500 ; N .notdef ; B 50 0 450 491 ;
EndCharMetrics
EndFontMetrics
