<?xml version="1.0" encoding="UTF-8" standalone="no"?>
<svg
   xmlns:dc="http://purl.org/dc/elements/1.1/"
   xmlns:cc="http://creativecommons.org/ns#"
   xmlns:rdf="http://www.w3.org/1999/02/22-rdf-syntax-ns#"
   xmlns:svg="http://www.w3.org/2000/svg"
   xmlns="http://www.w3.org/2000/svg"
   xmlns:sodipodi="http://sodipodi.sourceforge.net/DTD/sodipodi-0.dtd"
   xmlns:inkscape="http://www.inkscape.org/namespaces/inkscape"
   data-dec="53"
   width="20"
   height="40"
   version="1.1"
   id="svg4"
   sodipodi:docname="53.svg"
   inkscape:version="0.92.4 (unknown)">
  <metadata
     id="metadata10">
    <rdf:RDF>
      <cc:Work
         rdf:about="">
        <dc:format>image/svg+xml</dc:format>
        <dc:type
           rdf:resource="http://purl.org/dc/dcmitype/StillImage" />
      </cc:Work>
    </rdf:RDF>
  </metadata>
  <defs
     id="defs8" />
  <sodipodi:namedview
     pagecolor="#ffffff"
     bordercolor="#666666"
     borderopacity="1"
     objecttolerance="10"
     gridtolerance="10"
     guidetolerance="10"
     inkscape:pageopacity="0"
     inkscape:pageshadow="2"
     inkscape:window-width="640"
     inkscape:window-height="480"
     id="namedview6"
     showgrid="false"
     inkscape:zoom="5.9"
     inkscape:cx="10"
     inkscape:cy="20"
     inkscape:window-x="0"
     inkscape:window-y="27"
     inkscape:window-maximized="0"
     inkscape:current-layer="svg4" />
  <path
     style="color:#000000;font-style:normal;font-variant:normal;font-weight:normal;font-stretch:normal;font-size:medium;line-height:normal;font-family:sans-serif;font-variant-ligatures:normal;font-variant-position:normal;font-variant-caps:normal;font-variant-numeric:normal;font-variant-alternates:normal;font-feature-settings:normal;text-indent:0;text-align:start;text-decoration:none;text-decoration-line:none;text-decoration-style:solid;text-decoration-color:#000000;letter-spacing:normal;word-spacing:normal;text-transform:none;writing-mode:lr-tb;direction:ltr;text-orientation:mixed;dominant-baseline:auto;baseline-shift:baseline;text-anchor:start;white-space:normal;shape-padding:0;clip-rule:nonzero;display:inline;overflow:visible;visibility:visible;opacity:1;isolation:auto;mix-blend-mode:normal;color-interpolation:sRGB;color-interpolation-filters:linearRGB;solid-color:#000000;solid-opacity:1;vector-effect:none;fill:#013272;fill-opacity:1;fill-rule:nonzero;stroke:none;stroke-width:2;stroke-linecap:round;stroke-linejoin:round;stroke-miterlimit:4;stroke-dasharray:none;stroke-dashoffset:0;stroke-opacity:1;color-rendering:auto;image-rendering:auto;shape-rendering:auto;text-rendering:auto;enable-background:accumulate"
     d="M 4.984375,-0.01367188 A 1.0001,1.0001 0 0 1 5.1679688,0 h 9.7363282 a 1.0001,1.0001 0 0 1 0.980469,0.5078125 1.0001,1.0001 0 0 1 0.04492,0.0898438 1.0001,1.0001 0 0 1 0.03125,0.0800781 1.0001,1.0001 0 0 1 0.0039,0.0117187 1.0001,1.0001 0 0 1 0.002,0.003906 1.0001,1.0001 0 0 1 0.01953,0.0800781 1.0001,1.0001 0 0 1 0.0039,0.0136719 1.0001,1.0001 0 0 1 0.0059,0.0292969 1.0001,1.0001 0 0 1 0.002,0.015625 1.0001,1.0001 0 0 1 0.01172,0.0800781 1.0001,1.0001 0 0 1 0,0.001953 1.0001,1.0001 0 0 1 0,0.005859 1.0001,1.0001 0 0 1 0.002,0.0957031 1.0001,1.0001 0 0 1 -0.0059,0.099609 1.0001,1.0001 0 0 1 -0.634765,0.8183594 l -1.804688,0.9003906 a 1.0001,1.0001 0 0 1 -0.01172,0.00586 1.0001,1.0001 0 0 1 -0.355469,0.1425781 l -0.0078,0.00195 -3.9492185,0.9863281 A 1.0001,1.0001 0 0 1 9,4 H 5.4199219 L 4.6035156,8.0820312 a 1.0001,1.0001 0 0 1 0.080078,-0.03125 l 3,-1 A 1.0001,1.0001 0 0 1 8,7 h 2.890625 a 1.0001,1.0001 0 0 1 0.425781,0.050781 l 0.0078,0.00195 a 1.0001,1.0001 0 0 1 0.03125,0.011719 l 2.960937,0.9863281 a 1.0001,1.0001 0 0 1 0.390625,0.2421876 l 2,2.0000002 a 1.0001,1.0001 0 0 1 0.242188,0.390625 l 1,3 A 1.0001,1.0001 0 0 1 18,14 v 2 a 1.0001,1.0001 0 0 1 -0.05078,0.316406 l -1,3 a 1.0001,1.0001 0 0 1 -0.242188,0.390625 l -2,2 a 1.0001,1.0001 0 0 1 -0.390625,0.242188 l -2.99414,0.998047 -0.0059,0.002 A 1.0001,1.0001 0 0 1 10.880859,23 H 8 a 1.0001,1.0001 0 0 1 -0.3164062,-0.05078 l -3,-1 a 1.0001,1.0001 0 0 1 -0.390625,-0.242188 l -1,-1 a 1.0001,1.0001 0 0 1 -0.1875,-0.259765 l -1,-2 A 1.0001,1.0001 0 0 1 2,18 v -1 a 1.0001,1.0001 0 0 1 0.2929688,-0.707031 l 1,-1 A 1.0001,1.0001 0 0 1 4,15 h 1 a 1.0001,1.0001 0 0 1 0.7070312,0.292969 l 1,1 A 1.0001,1.0001 0 0 1 7,17 v 1 a 1.0001,1.0001 0 0 1 -0.2929688,0.707031 l -1,1 A 1.0001,1.0001 0 0 1 5.3515625,19.935547 L 5.5410156,20.125 8.1621094,21 H 10.763672 L 12.408203,20.177734 13.125,19.458984 14,16.837891 V 13.162109 L 13.125,10.541016 12.408203,9.8222656 10.763672,9 H 8.1621094 L 5.5410156,9.875 3.7070312,11.707031 a 1.0001,1.0001 0 0 1 -1.6875,-0.902343 l 1.96875,-9.84570362 a 1.0001,1.0001 0 0 1 0.3574219,-0.7265625 1.0001,1.0001 0 0 1 0.00586,-0.005859 1.0001,1.0001 0 0 1 0.019531,-0.0136719 1.0001,1.0001 0 0 1 0.6132812,-0.2265625 z"
     id="path2" />
</svg>
