<?xml version="1.0" encoding="UTF-8"?>
<glyph name="plus" format="1">
  <advance width="752"/>
  <unicode hex="002B"/>
  <outline>
    <contour>
      <point x="346" y="579" type="curve" smooth="yes"/>
      <point x="348" y="579" type="line"/>
      <point x="352" y="579" type="line"/>
      <point x="372" y="579" type="line"/>
      <point x="376" y="579" type="line"/>
      <point x="382" y="579" type="line"/>
      <point x="405" y="579" type="line" smooth="yes"/>
      <point x="421" y="579"/>
      <point x="434" y="566"/>
      <point x="434" y="550" type="curve" smooth="yes"/>
      <point x="434" y="346" type="line"/>
      <point x="608" y="346" type="line"/>
      <point x="637" y="346" type="line" smooth="yes"/>
      <point x="653" y="346"/>
      <point x="666" y="334"/>
      <point x="666" y="318" type="curve" smooth="yes"/>
      <point x="666" y="265" type="line" smooth="yes"/>
      <point x="666" y="264"/>
      <point x="667" y="261"/>
      <point x="667" y="260" type="curve" smooth="yes"/>
      <point x="667" y="253"/>
      <point x="662" y="244"/>
      <point x="658" y="240" type="curve" smooth="yes"/>
      <point x="654" y="236"/>
      <point x="644" y="231"/>
      <point x="637" y="231" type="curve" smooth="yes"/>
      <point x="632" y="231" type="line"/>
      <point x="434" y="231" type="line"/>
      <point x="434" y="62" type="line"/>
      <point x="434" y="57" type="line" smooth="yes"/>
      <point x="434" y="50"/>
      <point x="431" y="41"/>
      <point x="427" y="37" type="curve"/>
      <point x="426" y="37" type="line"/>
      <point x="422" y="33"/>
      <point x="412" y="29"/>
      <point x="405" y="29" type="curve" smooth="yes"/>
      <point x="400" y="29" type="line"/>
      <point x="381" y="29" type="line"/>
      <point x="376" y="29" type="line"/>
      <point x="372" y="29" type="line"/>
      <point x="348" y="29" type="line" smooth="yes"/>
      <point x="332" y="29"/>
      <point x="318" y="41"/>
      <point x="318" y="57" type="curve" smooth="yes"/>
      <point x="318" y="231" type="line"/>
      <point x="116" y="231" type="line" smooth="yes"/>
      <point x="100" y="231"/>
      <point x="87" y="244"/>
      <point x="87" y="260" type="curve" smooth="yes"/>
      <point x="87" y="289" type="line"/>
      <point x="87" y="314" type="line"/>
      <point x="87" y="318" type="line" smooth="yes"/>
      <point x="87" y="325"/>
      <point x="91" y="334"/>
      <point x="95" y="338" type="curve"/>
      <point x="95" y="339" type="line" smooth="yes"/>
      <point x="97" y="341"/>
      <point x="101" y="344"/>
      <point x="104" y="345" type="curve" smooth="yes"/>
      <point x="107" y="345" type="line" smooth="yes"/>
      <point x="108" y="345"/>
      <point x="111" y="348"/>
      <point x="112" y="348" type="curve" smooth="yes"/>
      <point x="116" y="348" type="line"/>
      <point x="118" y="348" type="line" smooth="yes"/>
      <point x="119" y="348"/>
      <point x="120" y="346"/>
      <point x="121" y="346" type="curve" smooth="yes"/>
      <point x="145" y="346" type="line"/>
      <point x="318" y="346" type="line"/>
      <point x="318" y="544" type="line"/>
      <point x="318" y="550" type="line" smooth="yes"/>
      <point x="318" y="557"/>
      <point x="322" y="566"/>
      <point x="326" y="570" type="curve"/>
      <point x="327" y="570" type="line"/>
      <point x="331" y="574"/>
      <point x="339" y="579"/>
    </contour>
  </outline>
  <lib>
    <dict>
      <key>com.fontlab.hintData</key>
      <dict>
        <key>hhints</key>
        <array>
          <dict>
            <key>position</key>
            <integer>231</integer>
            <key>width</key>
            <integer>116</integer>
          </dict>
        </array>
        <key>vhints</key>
        <array>
          <dict>
            <key>position</key>
            <integer>318</integer>
            <key>width</key>
            <integer>117</integer>
          </dict>
        </array>
      </dict>
    </dict>
  </lib>
</glyph>
