<?xml version="1.0" encoding="UTF-8" standalone="no"?>
<svg
   xmlns:dc="http://purl.org/dc/elements/1.1/"
   xmlns:cc="http://creativecommons.org/ns#"
   xmlns:rdf="http://www.w3.org/1999/02/22-rdf-syntax-ns#"
   xmlns:svg="http://www.w3.org/2000/svg"
   xmlns="http://www.w3.org/2000/svg"
   xmlns:sodipodi="http://sodipodi.sourceforge.net/DTD/sodipodi-0.dtd"
   xmlns:inkscape="http://www.inkscape.org/namespaces/inkscape"
   data-dec="88"
   width="22"
   height="40"
   version="1.1"
   id="svg4"
   sodipodi:docname="88.svg"
   inkscape:version="0.92.4 (unknown)">
  <metadata
     id="metadata10">
    <rdf:RDF>
      <cc:Work
         rdf:about="">
        <dc:format>image/svg+xml</dc:format>
        <dc:type
           rdf:resource="http://purl.org/dc/dcmitype/StillImage" />
      </cc:Work>
    </rdf:RDF>
  </metadata>
  <defs
     id="defs8" />
  <sodipodi:namedview
     pagecolor="#ffffff"
     bordercolor="#666666"
     borderopacity="1"
     objecttolerance="10"
     gridtolerance="10"
     guidetolerance="10"
     inkscape:pageopacity="0"
     inkscape:pageshadow="2"
     inkscape:window-width="640"
     inkscape:window-height="480"
     id="namedview6"
     showgrid="false"
     inkscape:zoom="5.9"
     inkscape:cx="11"
     inkscape:cy="20"
     inkscape:window-x="0"
     inkscape:window-y="27"
     inkscape:window-maximized="0"
     inkscape:current-layer="svg4" />
  <path
     style="color:#000000;font-style:normal;font-variant:normal;font-weight:normal;font-stretch:normal;font-size:medium;line-height:normal;font-family:sans-serif;font-variant-ligatures:normal;font-variant-position:normal;font-variant-caps:normal;font-variant-numeric:normal;font-variant-alternates:normal;font-feature-settings:normal;text-indent:0;text-align:start;text-decoration:none;text-decoration-line:none;text-decoration-style:solid;text-decoration-color:#000000;letter-spacing:normal;word-spacing:normal;text-transform:none;writing-mode:lr-tb;direction:ltr;text-orientation:mixed;dominant-baseline:auto;baseline-shift:baseline;text-anchor:start;white-space:normal;shape-padding:0;clip-rule:nonzero;display:inline;overflow:visible;visibility:visible;opacity:1;isolation:auto;mix-blend-mode:normal;color-interpolation:sRGB;color-interpolation-filters:linearRGB;solid-color:#000000;solid-opacity:1;vector-effect:none;fill:#013272;fill-opacity:1;fill-rule:nonzero;stroke:none;stroke-width:2;stroke-linecap:round;stroke-linejoin:round;stroke-miterlimit:4;stroke-dasharray:none;stroke-dashoffset:0;stroke-opacity:1;color-rendering:auto;image-rendering:auto;shape-rendering:auto;text-rendering:auto;enable-background:accumulate"
     d="M 7.0019531,-0.01367188 A 1.0001,1.0001 0 0 1 7.1523438,0 h 0.6894531 a 1.0001,1.0001 0 0 1 0.3105469,0 h 0.6894531 a 1.0001,1.0001 0 0 1 0.3105469,0 h 0.6933593 a 1.0001,1.0001 0 0 1 0.3183589,0 h 0.740235 a 1.0001,1.0001 0 0 1 0.214844,0 H 12 a 1.0001,1.0001 0 1 1 0,2 h -0.763672 l -0.796875,0.3984375 1.808594,6.3300781 6.097656,-6.4375 L 17.763672,2 H 17 a 1.0001,1.0001 0 1 1 0,-2 h 0.890625 a 1.0001,1.0001 0 0 1 0.203125,0 h 3.810547 a 1.0001,1.0001 0 0 1 0.214844,0 H 23 a 1.0001,1.0001 0 1 1 0,2 h -0.763672 l -1.630859,0.8164062 -7.71875,8.1464848 2.603515,9.113281 L 16.414062,21 H 17 a 1.0001,1.0001 0 1 1 0,2 h -0.853516 a 1.0001,1.0001 0 0 1 -0.273437,0 h -0.714844 a 1.0001,1.0001 0 0 1 -0.310547,0 h -0.689453 a 1.0001,1.0001 0 0 1 -0.310547,0 h -0.689453 a 1.0001,1.0001 0 0 1 -0.310547,0 h -0.693359 a 1.0001,1.0001 0 0 1 -0.318359,0 h -0.740235 a 1.0001,1.0001 0 0 1 -0.214844,0 H 10 a 1.0001,1.0001 0 1 1 0,-2 h 0.763672 L 11.560547,20.601562 9.7519531,14.271484 3.6542969,20.708984 4.2363281,21 H 5 a 1.0001,1.0001 0 1 1 0,2 H 4.109375 A 1.0001,1.0001 0 0 1 3.90625,23 H 0.09570312 a 1.0001,1.0001 0 0 1 -0.21484374,0 H -1 a 1.0001,1.0001 0 1 1 0,-2 h 0.76367188 L 1.3945312,20.183594 9.1132812,12.037109 6.5097656,2.9238281 5.5859375,2 H 5 A 1.0001,1.0001 0 1 1 5,0 h 0.8535156 a 1.0001,1.0001 0 0 1 0.2734375,0 h 0.7148438 a 1.0001,1.0001 0 0 1 0.1601562,-0.01367188 z"
     id="path2" />
</svg>
