<?xml version="1.0" encoding="UTF-8" standalone="no"?>
<svg
   xmlns:dc="http://purl.org/dc/elements/1.1/"
   xmlns:cc="http://creativecommons.org/ns#"
   xmlns:rdf="http://www.w3.org/1999/02/22-rdf-syntax-ns#"
   xmlns:svg="http://www.w3.org/2000/svg"
   xmlns="http://www.w3.org/2000/svg"
   xmlns:sodipodi="http://sodipodi.sourceforge.net/DTD/sodipodi-0.dtd"
   xmlns:inkscape="http://www.inkscape.org/namespaces/inkscape"
   data-dec="118"
   width="16"
   height="40"
   version="1.1"
   id="svg4"
   sodipodi:docname="118.svg"
   inkscape:version="0.92.4 5da689c313, 2019-01-14">
  <metadata
     id="metadata10">
    <rdf:RDF>
      <cc:Work
         rdf:about="">
        <dc:format>image/svg+xml</dc:format>
        <dc:type
           rdf:resource="http://purl.org/dc/dcmitype/StillImage" />
        <dc:title></dc:title>
      </cc:Work>
    </rdf:RDF>
  </metadata>
  <defs
     id="defs8" />
  <sodipodi:namedview
     pagecolor="#ffffff"
     bordercolor="#666666"
     borderopacity="1"
     objecttolerance="10"
     gridtolerance="10"
     guidetolerance="10"
     inkscape:pageopacity="0"
     inkscape:pageshadow="2"
     inkscape:window-width="1920"
     inkscape:window-height="1043"
     id="namedview6"
     showgrid="false"
     inkscape:zoom="5.9"
     inkscape:cx="8"
     inkscape:cy="20"
     inkscape:window-x="0"
     inkscape:window-y="37"
     inkscape:window-maximized="0"
     inkscape:current-layer="svg4" />
  <path
     style="color:#000000;font-style:normal;font-variant:normal;font-weight:normal;font-stretch:normal;font-size:medium;line-height:normal;font-family:sans-serif;font-variant-ligatures:normal;font-variant-position:normal;font-variant-caps:normal;font-variant-numeric:normal;font-variant-alternates:normal;font-feature-settings:normal;text-indent:0;text-align:start;text-decoration:none;text-decoration-line:none;text-decoration-style:solid;text-decoration-color:#000000;letter-spacing:normal;word-spacing:normal;text-transform:none;writing-mode:lr-tb;direction:ltr;text-orientation:mixed;dominant-baseline:auto;baseline-shift:baseline;text-anchor:start;white-space:normal;shape-padding:0;clip-rule:nonzero;display:inline;overflow:visible;visibility:visible;opacity:1;isolation:auto;mix-blend-mode:normal;color-interpolation:sRGB;color-interpolation-filters:linearRGB;solid-color:#000000;solid-opacity:1;vector-effect:none;fill:#000000;fill-opacity:1;fill-rule:nonzero;stroke:none;stroke-width:2.5;stroke-linecap:round;stroke-linejoin:round;stroke-miterlimit:4;stroke-dasharray:none;stroke-dashoffset:0;stroke-opacity:1;color-rendering:auto;image-rendering:auto;shape-rendering:auto;text-rendering:auto;enable-background:accumulate"
     d="M 1.96875,6.734375 A 1.250125,1.250125 0 0 1 2.1855469,6.75 H 3 A 1.250125,1.250125 0 0 1 4.1542969,7.5195312 L 8,16.75 11.845703,7.5195312 A 1.250125,1.250125 0 0 1 13,6.75 h 0.8125 a 1.250125,1.250125 0 0 1 1.148438,0.4296875 1.250125,1.250125 0 0 1 0.07812,0.099609 1.250125,1.250125 0 0 1 0.03906,0.0625 1.250125,1.250125 0 0 1 0.03711,0.064453 1.250125,1.250125 0 0 1 -0.04101,1.2617188 L 9.21875,22.326172 a 1.250125,1.250125 0 0 1 -0.00195,0.0078 1.250125,1.250125 0 0 1 -1.0820313,0.925782 1.250125,1.250125 0 0 1 -0.00391,0 1.250125,1.250125 0 0 1 -0.023437,0.002 1.250125,1.250125 0 0 1 -0.091797,0.0039 1.250125,1.250125 0 0 1 -0.109375,-0.0039 1.250125,1.250125 0 0 1 -1.1210938,-0.923828 L 0.92578125,8.6640625 A 1.250125,1.250125 0 0 1 0.8671875,7.4394531 1.250125,1.250125 0 0 1 0.91992188,7.3417969 1.250125,1.250125 0 0 1 0.9296875,7.3261719 1.250125,1.250125 0 0 1 0.9609375,7.28125 1.250125,1.250125 0 0 1 1.0136719,7.2089844 1.250125,1.250125 0 0 1 1.96875,6.734375 Z"
     id="path2" />
</svg>
