<?xml version="1.0" encoding="UTF-8" standalone="no"?>
<svg
   xmlns:dc="http://purl.org/dc/elements/1.1/"
   xmlns:cc="http://creativecommons.org/ns#"
   xmlns:rdf="http://www.w3.org/1999/02/22-rdf-syntax-ns#"
   xmlns:svg="http://www.w3.org/2000/svg"
   xmlns="http://www.w3.org/2000/svg"
   xmlns:sodipodi="http://sodipodi.sourceforge.net/DTD/sodipodi-0.dtd"
   xmlns:inkscape="http://www.inkscape.org/namespaces/inkscape"
   data-dec="37"
   width="24"
   height="40"
   version="1.1"
   id="svg4"
   sodipodi:docname="37.svg"
   inkscape:version="0.92.4 (unknown)">
  <metadata
     id="metadata10">
    <rdf:RDF>
      <cc:Work
         rdf:about="">
        <dc:format>image/svg+xml</dc:format>
        <dc:type
           rdf:resource="http://purl.org/dc/dcmitype/StillImage" />
      </cc:Work>
    </rdf:RDF>
  </metadata>
  <defs
     id="defs8" />
  <sodipodi:namedview
     pagecolor="#ffffff"
     bordercolor="#666666"
     borderopacity="1"
     objecttolerance="10"
     gridtolerance="10"
     guidetolerance="10"
     inkscape:pageopacity="0"
     inkscape:pageshadow="2"
     inkscape:window-width="640"
     inkscape:window-height="480"
     id="namedview6"
     showgrid="false"
     inkscape:zoom="5.9"
     inkscape:cx="12"
     inkscape:cy="20"
     inkscape:window-x="0"
     inkscape:window-y="27"
     inkscape:window-maximized="0"
     inkscape:current-layer="svg4" />
  <path
     style="color:#000000;font-style:normal;font-variant:normal;font-weight:normal;font-stretch:normal;font-size:medium;line-height:normal;font-family:sans-serif;font-variant-ligatures:normal;font-variant-position:normal;font-variant-caps:normal;font-variant-numeric:normal;font-variant-alternates:normal;font-feature-settings:normal;text-indent:0;text-align:start;text-decoration:none;text-decoration-line:none;text-decoration-style:solid;text-decoration-color:#000000;letter-spacing:normal;word-spacing:normal;text-transform:none;writing-mode:lr-tb;direction:ltr;text-orientation:mixed;dominant-baseline:auto;baseline-shift:baseline;text-anchor:start;white-space:normal;shape-padding:0;clip-rule:nonzero;display:inline;overflow:visible;visibility:visible;opacity:1;isolation:auto;mix-blend-mode:normal;color-interpolation:sRGB;color-interpolation-filters:linearRGB;solid-color:#000000;solid-opacity:1;vector-effect:none;fill:#013272;fill-opacity:1;fill-rule:nonzero;stroke:none;stroke-width:0.5;stroke-linecap:round;stroke-linejoin:round;stroke-miterlimit:4;stroke-dasharray:none;stroke-dashoffset:0;stroke-opacity:1;color-rendering:auto;image-rendering:auto;shape-rendering:auto;text-rendering:auto;enable-background:accumulate"
     d="M 17.056641,15.25 15.185547,16.185547 14.25,18.058594 v 1.83789 L 16.103516,21.75 h 1.83789 L 19.814453,20.814453 20.75,18.941406 v -1.83789 L 18.896484,15.25 Z m -0.05469,-0.501953 a 0.250025,0.250025 0 0 1 0.02344,0.002 H 19 a 0.250025,0.250025 0 0 1 0.177734,0.07227 l 2,2 A 0.250025,0.250025 0 0 1 21.25,17 v 2 a 0.250025,0.250025 0 0 1 -0.02734,0.111328 l -1,2 a 0.250025,0.250025 0 0 1 -0.111328,0.111328 l -2,1 A 0.250025,0.250025 0 0 1 18,22.25 h -2 a 0.250025,0.250025 0 0 1 -0.177734,-0.07227 l -2,-2 A 0.250025,0.250025 0 0 1 13.75,20 v -2 a 0.250025,0.250025 0 0 1 0.02734,-0.111328 l 1,-2 a 0.250025,0.250025 0 0 1 0.111328,-0.111328 l 1.96289,-0.980469 a 0.250025,0.250025 0 0 1 0.07422,-0.03711 0.250025,0.250025 0 0 1 0.05078,-0.0098 0.250025,0.250025 0 0 1 0.02539,-0.002 z M 6.0585938,1.25 4.1855469,2.1855469 3.25,4.0585938 V 5.8964844 L 5.1035156,7.75 H 6.9414062 L 8.8144531,6.8144531 9.75,4.9414062 V 3.1035156 L 7.8945312,1.25 Z M 7.9921875,0.74609375 a 0.250025,0.250025 0 0 1 0.097656,0.0195313 0.250025,0.250025 0 0 1 0.00586,0.001953 0.250025,0.250025 0 0 1 0.042969,0.0234375 L 10.095703,1.7675781 13.041016,2.75 h 2.917968 l 2.945313,-0.9824219 1.951172,-0.97460935 a 0.250025,0.250025 0 0 1 0.0039,-0.001953 0.250025,0.250025 0 0 1 0.06836,-0.03125 A 0.250025,0.250025 0 0 1 21,0.74804688 a 0.250025,0.250025 0 0 1 0.002,0 0.250025,0.250025 0 0 1 0.09766,0.0195312 0.250025,0.250025 0 0 1 0.04297,0.0234375 0.250025,0.250025 0 0 1 0.01953,0.015625 0.250025,0.250025 0 0 1 0.0098,0.007813 0.250025,0.250025 0 0 1 0.0078,0.007813 0.250025,0.250025 0 0 1 0.002,0 0.250025,0.250025 0 0 1 0.01563,0.0175781 0.250025,0.250025 0 0 1 0.0059,0.009766 0.250025,0.250025 0 0 1 0.02148,0.0332031 0.250025,0.250025 0 0 1 0.0098,0.0214844 0.250025,0.250025 0 0 1 0.01758,0.0742187 0.250025,0.250025 0 0 1 -0.01172,0.0976563 0.250025,0.250025 0 0 1 0,0.00195 0.250025,0.250025 0 0 1 -0.0098,0.021484 0.250025,0.250025 0 0 1 0,0.00195 0.250025,0.250025 0 0 1 -0.05664,0.080078 l -0.0039,0.00195 L 3.1894531,22.162109 A 0.250025,0.250025 0 1 1 2.8105469,21.837891 L 20.007812,1.7734375 19.111328,2.2226562 a 0.250025,0.250025 0 0 1 -0.0332,0.013672 l -3,1 A 0.250025,0.250025 0 0 1 16,3.25 h -3 a 0.250025,0.250025 0 0 1 -0.07813,-0.013672 l -3,-1 A 0.250025,0.250025 0 0 1 9.8886719,2.2226562 L 9.2675781,1.9121094 10.177734,2.8222656 A 0.250025,0.250025 0 0 1 10.25,3 v 2 a 0.250025,0.250025 0 0 1 -0.02734,0.1113281 l -0.9999998,2 A 0.250025,0.250025 0 0 1 9.1113281,7.2226562 l -2,1 A 0.250025,0.250025 0 0 1 7,8.25 H 5 A 0.250025,0.250025 0 0 1 4.8222656,8.1777344 l -2,-2 A 0.250025,0.250025 0 0 1 2.75,6 V 4 a 0.250025,0.250025 0 0 1 0.027344,-0.1113281 l 1,-2 A 0.250025,0.250025 0 0 1 3.8886719,1.7773438 l 2,-1.00000005 A 0.250025,0.250025 0 0 1 6,0.75 h 1.9609375 a 0.250025,0.250025 0 0 1 0.011719,-0.001953 0.250025,0.250025 0 0 1 0.019531,-0.001953 z"
     id="path2" />
</svg>
