<?xml version="1.0" encoding="UTF-8" standalone="no"?>
<svg
   xmlns:dc="http://purl.org/dc/elements/1.1/"
   xmlns:cc="http://creativecommons.org/ns#"
   xmlns:rdf="http://www.w3.org/1999/02/22-rdf-syntax-ns#"
   xmlns:svg="http://www.w3.org/2000/svg"
   xmlns="http://www.w3.org/2000/svg"
   xmlns:sodipodi="http://sodipodi.sourceforge.net/DTD/sodipodi-0.dtd"
   xmlns:inkscape="http://www.inkscape.org/namespaces/inkscape"
   data-dec="79"
   width="21"
   height="40"
   version="1.1"
   id="svg4"
   sodipodi:docname="79.svg"
   inkscape:version="0.92.4 (unknown)">
  <metadata
     id="metadata10">
    <rdf:RDF>
      <cc:Work
         rdf:about="">
        <dc:format>image/svg+xml</dc:format>
        <dc:type
           rdf:resource="http://purl.org/dc/dcmitype/StillImage" />
      </cc:Work>
    </rdf:RDF>
  </metadata>
  <defs
     id="defs8" />
  <sodipodi:namedview
     pagecolor="#ffffff"
     bordercolor="#666666"
     borderopacity="1"
     objecttolerance="10"
     gridtolerance="10"
     guidetolerance="10"
     inkscape:pageopacity="0"
     inkscape:pageshadow="2"
     inkscape:window-width="640"
     inkscape:window-height="480"
     id="namedview6"
     showgrid="false"
     inkscape:zoom="5.9"
     inkscape:cx="10.5"
     inkscape:cy="20"
     inkscape:window-x="0"
     inkscape:window-y="27"
     inkscape:window-maximized="0"
     inkscape:current-layer="svg4" />
  <path
     style="color:#000000;font-style:normal;font-variant:normal;font-weight:normal;font-stretch:normal;font-size:medium;line-height:normal;font-family:sans-serif;font-variant-ligatures:normal;font-variant-position:normal;font-variant-caps:normal;font-variant-numeric:normal;font-variant-alternates:normal;font-feature-settings:normal;text-indent:0;text-align:start;text-decoration:none;text-decoration-line:none;text-decoration-style:solid;text-decoration-color:#000000;letter-spacing:normal;word-spacing:normal;text-transform:none;writing-mode:lr-tb;direction:ltr;text-orientation:mixed;dominant-baseline:auto;baseline-shift:baseline;text-anchor:start;white-space:normal;shape-padding:0;clip-rule:nonzero;display:inline;overflow:visible;visibility:visible;opacity:1;isolation:auto;mix-blend-mode:normal;color-interpolation:sRGB;color-interpolation-filters:linearRGB;solid-color:#000000;solid-opacity:1;vector-effect:none;fill:#000000;fill-opacity:1;fill-rule:nonzero;stroke:none;stroke-width:1;stroke-linecap:round;stroke-linejoin:round;stroke-miterlimit:4;stroke-dasharray:none;stroke-dashoffset:0;stroke-opacity:1;color-rendering:auto;image-rendering:auto;shape-rendering:auto;text-rendering:auto;enable-background:accumulate"
     d="M 9.1171875,3.5 7.296875,4.4101562 5.4101562,6.296875 4.4628906,8.1914062 3.5,11.082031 v 2.835938 L 4.4628906,16.808594 5.4101562,18.703125 7.296875,20.589844 9.1171875,21.5 h 2.7656245 l 1.820313,-0.910156 1.886719,-1.886719 0.947265,-1.894531 L 17.5,13.917969 V 11.082031 L 16.537109,8.1914062 15.589844,6.296875 13.703125,4.4101562 11.882812,3.5 Z M 9.0019531,2.4960938 A 0.50005,0.50005 0 0 1 9.0644531,2.5 H 12 a 0.50005,0.50005 0 0 1 0.222656,0.052734 l 2,1 a 0.50005,0.50005 0 0 1 0.13086,0.09375 l 2,2 a 0.50005,0.50005 0 0 1 0.09375,0.1308594 l 1,2 a 0.50005,0.50005 0 0 1 0.02734,0.064453 l 1,3.0000001 A 0.50005,0.50005 0 0 1 18.5,11 v 3 a 0.50005,0.50005 0 0 1 -0.02539,0.158203 l -1,3 a 0.50005,0.50005 0 0 1 -0.02734,0.06445 l -1,2 a 0.50005,0.50005 0 0 1 -0.09375,0.13086 l -2,2 a 0.50005,0.50005 0 0 1 -0.13086,0.09375 l -2,1 A 0.50005,0.50005 0 0 1 12,22.5 H 9 a 0.50005,0.50005 0 0 1 -0.2226562,-0.05273 l -2,-1 a 0.50005,0.50005 0 0 1 -0.1308594,-0.09375 l -2,-2 a 0.50005,0.50005 0 0 1 -0.09375,-0.13086 l -1,-2 a 0.50005,0.50005 0 0 1 -0.027344,-0.06445 l -1,-3 A 0.50005,0.50005 0 0 1 2.5,14 v -3 a 0.50005,0.50005 0 0 1 0.025391,-0.158203 l 1,-3.0000001 a 0.50005,0.50005 0 0 1 0.027344,-0.064453 l 1,-2 a 0.50005,0.50005 0 0 1 0.09375,-0.1308594 l 2,-2 a 0.50005,0.50005 0 0 1 0.1308594,-0.09375 l 1.9394531,-0.96875 a 0.50005,0.50005 0 0 1 0.00977,-0.00586 0.50005,0.50005 0 0 1 0.1289063,-0.058594 0.50005,0.50005 0 0 1 0.054687,-0.013672 0.50005,0.50005 0 0 1 0.091797,-0.00977 z"
     id="path2" />
</svg>
