<?xml version="1.0" encoding="UTF-8" standalone="no"?>
<svg
   xmlns:dc="http://purl.org/dc/elements/1.1/"
   xmlns:cc="http://creativecommons.org/ns#"
   xmlns:rdf="http://www.w3.org/1999/02/22-rdf-syntax-ns#"
   xmlns:svg="http://www.w3.org/2000/svg"
   xmlns="http://www.w3.org/2000/svg"
   xmlns:sodipodi="http://sodipodi.sourceforge.net/DTD/sodipodi-0.dtd"
   xmlns:inkscape="http://www.inkscape.org/namespaces/inkscape"
   data-dec="52"
   width="17"
   height="40"
   version="1.1"
   id="svg4"
   sodipodi:docname="52.svg"
   inkscape:version="0.92.4 5da689c313, 2019-01-14">
  <metadata
     id="metadata10">
    <rdf:RDF>
      <cc:Work
         rdf:about="">
        <dc:format>image/svg+xml</dc:format>
        <dc:type
           rdf:resource="http://purl.org/dc/dcmitype/StillImage" />
        <dc:title></dc:title>
      </cc:Work>
    </rdf:RDF>
  </metadata>
  <defs
     id="defs8" />
  <sodipodi:namedview
     pagecolor="#ffffff"
     bordercolor="#666666"
     borderopacity="1"
     objecttolerance="10"
     gridtolerance="10"
     guidetolerance="10"
     inkscape:pageopacity="0"
     inkscape:pageshadow="2"
     inkscape:window-width="1920"
     inkscape:window-height="1043"
     id="namedview6"
     showgrid="false"
     inkscape:zoom="5.9"
     inkscape:cx="8.5"
     inkscape:cy="20"
     inkscape:window-x="0"
     inkscape:window-y="37"
     inkscape:window-maximized="0"
     inkscape:current-layer="svg4" />
  <path
     style="color:#000000;font-style:normal;font-variant:normal;font-weight:normal;font-stretch:normal;font-size:medium;line-height:normal;font-family:sans-serif;font-variant-ligatures:normal;font-variant-position:normal;font-variant-caps:normal;font-variant-numeric:normal;font-variant-alternates:normal;font-feature-settings:normal;text-indent:0;text-align:start;text-decoration:none;text-decoration-line:none;text-decoration-style:solid;text-decoration-color:#000000;letter-spacing:normal;word-spacing:normal;text-transform:none;writing-mode:lr-tb;direction:ltr;text-orientation:mixed;dominant-baseline:auto;baseline-shift:baseline;text-anchor:start;white-space:normal;shape-padding:0;clip-rule:nonzero;display:inline;overflow:visible;visibility:visible;opacity:1;isolation:auto;mix-blend-mode:normal;color-interpolation:sRGB;color-interpolation-filters:linearRGB;solid-color:#000000;solid-opacity:1;vector-effect:none;fill:#000000;fill-opacity:1;fill-rule:nonzero;stroke:none;stroke-width:1.5;stroke-linecap:round;stroke-linejoin:round;stroke-miterlimit:4;stroke-dasharray:none;stroke-dashoffset:0;stroke-opacity:1;color-rendering:auto;image-rendering:auto;shape-rendering:auto;text-rendering:auto;enable-background:accumulate"
     d="M 10.25,4.9785156 4.0683594,14.25 H 10.25 Z m 1.738281,-4.73828122 a 0.750075,0.750075 0 0 1 0.07227,0.001953 0.750075,0.750075 0 0 1 0.0039,0 0.750075,0.750075 0 0 1 0.07031,0.009766 0.750075,0.750075 0 0 1 0.0039,0 0.750075,0.750075 0 0 1 0.07031,0.0175781 0.750075,0.750075 0 0 1 0.002,0 0.750075,0.750075 0 0 1 0.06836,0.0234375 0.750075,0.750075 0 0 1 0.002,0.001953 0.750075,0.750075 0 0 1 0.06641,0.0292969 0.750075,0.750075 0 0 1 0.002,0.001953 0.750075,0.750075 0 0 1 0.0625,0.0351562 0.750075,0.750075 0 0 1 0.002,0.001953 A 0.750075,0.750075 0 0 1 12.75,1.0800781 V 14.25 h 2.126953 a 0.750075,0.750075 0 0 1 0.644531,0.201172 0.750075,0.750075 0 0 1 0.0039,0.0039 0.750075,0.750075 0 0 1 0.0039,0.0039 0.750075,0.750075 0 0 1 0.04687,0.04883 0.750075,0.750075 0 0 1 0.0039,0.0059 0.750075,0.750075 0 0 1 0.169922,0.609375 v 0.753906 a 0.750075,0.750075 0 0 1 -0.201172,0.644531 0.750075,0.750075 0 0 1 -0.0039,0.0039 0.750075,0.750075 0 0 1 -0.0039,0.0039 0.750075,0.750075 0 0 1 -0.04883,0.04687 0.750075,0.750075 0 0 1 -0.0059,0.0039 A 0.750075,0.750075 0 0 1 14.876953,16.75 H 12.75 v 5.126953 a 0.750075,0.750075 0 0 1 -0.201172,0.644531 0.750075,0.750075 0 0 1 -0.0078,0.0078 0.750075,0.750075 0 0 1 -0.04883,0.04687 0.750075,0.750075 0 0 1 -0.0059,0.0039 A 0.750075,0.750075 0 0 1 11.876953,22.75 h -0.753906 a 0.750075,0.750075 0 0 1 -0.644531,-0.201172 0.750075,0.750075 0 0 1 -0.0059,-0.0059 0.750075,0.750075 0 0 1 -0.0059,-0.0059 0.750075,0.750075 0 0 1 -0.04687,-0.05078 A 0.750075,0.750075 0 0 1 10.25,21.876953 V 16.75 H 2.1015625 a 0.750075,0.750075 0 0 1 -0.7246094,-0.316406 0.750075,0.750075 0 0 1 -0.00195,-0.002 0.750075,0.750075 0 0 1 -0.013672,-0.02344 0.750075,0.750075 0 0 1 -0.025391,-0.04102 0.750075,0.750075 0 0 1 0.09375,-0.863282 L 11.335938,0.64257812 a 0.750075,0.750075 0 0 1 0.652343,-0.40234374 z"
     id="path2" />
</svg>
