<?xml version="1.0" encoding="UTF-8" standalone="no"?>
<svg
   xmlns:dc="http://purl.org/dc/elements/1.1/"
   xmlns:cc="http://creativecommons.org/ns#"
   xmlns:rdf="http://www.w3.org/1999/02/22-rdf-syntax-ns#"
   xmlns:svg="http://www.w3.org/2000/svg"
   xmlns="http://www.w3.org/2000/svg"
   xmlns:sodipodi="http://sodipodi.sourceforge.net/DTD/sodipodi-0.dtd"
   xmlns:inkscape="http://www.inkscape.org/namespaces/inkscape"
   data-dec="114"
   width="14"
   height="40"
   version="1.1"
   id="svg4"
   sodipodi:docname="114.svg"
   inkscape:version="0.92.4 (unknown)">
  <metadata
     id="metadata10">
    <rdf:RDF>
      <cc:Work
         rdf:about="">
        <dc:format>image/svg+xml</dc:format>
        <dc:type
           rdf:resource="http://purl.org/dc/dcmitype/StillImage" />
      </cc:Work>
    </rdf:RDF>
  </metadata>
  <defs
     id="defs8" />
  <sodipodi:namedview
     pagecolor="#ffffff"
     bordercolor="#666666"
     borderopacity="1"
     objecttolerance="10"
     gridtolerance="10"
     guidetolerance="10"
     inkscape:pageopacity="0"
     inkscape:pageshadow="2"
     inkscape:window-width="640"
     inkscape:window-height="480"
     id="namedview6"
     showgrid="false"
     inkscape:zoom="5.9"
     inkscape:cx="7"
     inkscape:cy="20"
     inkscape:window-x="0"
     inkscape:window-y="27"
     inkscape:window-maximized="0"
     inkscape:current-layer="svg4" />
  <path
     style="color:#000000;font-style:normal;font-variant:normal;font-weight:normal;font-stretch:normal;font-size:medium;line-height:normal;font-family:sans-serif;font-variant-ligatures:normal;font-variant-position:normal;font-variant-caps:normal;font-variant-numeric:normal;font-variant-alternates:normal;font-feature-settings:normal;text-indent:0;text-align:start;text-decoration:none;text-decoration-line:none;text-decoration-style:solid;text-decoration-color:#000000;letter-spacing:normal;word-spacing:normal;text-transform:none;writing-mode:lr-tb;direction:ltr;text-orientation:mixed;dominant-baseline:auto;baseline-shift:baseline;text-anchor:start;white-space:normal;shape-padding:0;clip-rule:nonzero;display:inline;overflow:visible;visibility:visible;opacity:1;isolation:auto;mix-blend-mode:normal;color-interpolation:sRGB;color-interpolation-filters:linearRGB;solid-color:#000000;solid-opacity:1;vector-effect:none;fill:#000000;fill-opacity:1;fill-rule:nonzero;stroke:none;stroke-width:0.30000001;stroke-linecap:round;stroke-linejoin:round;stroke-miterlimit:4;stroke-dasharray:none;stroke-dashoffset:0;stroke-opacity:1;color-rendering:auto;image-rendering:auto;shape-rendering:auto;text-rendering:auto;enable-background:accumulate"
     d="m 5.8496094,12.634766 -0.6992188,1.40039 v 7.814453 h 0.6992188 v -6.830078 a 0.15001501,0.15001501 0 0 1 0,-0.0293 v -0.978515 a 0.15001501,0.15001501 0 0 1 0,-0.01563 z m 0,-0.710938 -0.041016,0.121094 0.041016,-0.08008 z M 6.65625,11.554688 6.1503906,12.060547 v 1.013672 z M 13.150391,8.1503906 V 9 A 0.15001501,0.15001501 0 0 1 13,9.1503906 h -2.964844 l -1.9472654,0.9726564 -0.9570312,0.957031 -0.9804688,2.94336 v 0.339843 l 0.7148438,-1.429687 1,-2 a 0.15001501,0.15001501 0 0 1 0.068359,-0.06836 l 2,-0.9999996 A 0.15001501,0.15001501 0 0 1 10,9.8496094 h 3.849609 V 8.1503906 Z m -2.115235,0 L 9.0878906,9.1230469 8.7578125,9.453125 9.9335938,8.8652344 A 0.15001501,0.15001501 0 0 1 10,8.8496094 h 2.849609 V 8.1503906 Z m -1,0 -1.9472654,0.9726563 -1.9375,1.9375001 v 0.578125 l 0.734375,-0.734375 a 0.15001501,0.15001501 0 0 1 0.00977,-0.0098 l 1,-0.9999998 a 0.15001501,0.15001501 0 0 1 0.013672,-0.011719 L 8.8945312,8.8945312 a 0.15001501,0.15001501 0 0 1 0.039063,-0.029297 L 10.363281,8.1503906 Z m -4.8847654,0 V 13.074219 L 5.8496094,10.976562 V 8.1503906 Z m -1,0 V 21.849609 h 0.6992188 v -7.830078 a 0.15001501,0.15001501 0 0 1 0,-0.0078 0.15001501,0.15001501 0 0 1 0,-0.0059 0.15001501,0.15001501 0 0 1 0,-0.0098 0.15001501,0.15001501 0 0 1 0,-0.0059 V 8.1503906 Z M 3.9980469,7.8476562 a 0.15001501,0.15001501 0 0 1 0.029297,0.00195 h 0.9550781 0.00195 a 0.15001501,0.15001501 0 0 1 0.042969,0 H 6 A 0.15001501,0.15001501 0 0 1 6.1503906,8 v 2.638672 L 7.8945312,8.8945312 a 0.15001501,0.15001501 0 0 1 0.039063,-0.029297 l 2,-1 A 0.15001501,0.15001501 0 0 1 10,7.8496094 h 1 1.982422 a 0.15001501,0.15001501 0 0 1 0.04492,0 h 0.955078 a 0.15001501,0.15001501 0 0 1 0.07227,0.00977 0.15001501,0.15001501 0 0 1 0.002,0 0.15001501,0.15001501 0 0 1 0.01172,0.00586 0.15001501,0.15001501 0 0 1 0.01367,0.00781 0.15001501,0.15001501 0 0 1 0.01172,0.00781 0.15001501,0.15001501 0 0 1 0.002,0 0.15001501,0.15001501 0 0 1 0.0098,0.00977 0.15001501,0.15001501 0 0 1 0,0.00195 0.15001501,0.15001501 0 0 1 0.0098,0.00977 0.15001501,0.15001501 0 0 1 0.0098,0.011719 0.15001501,0.15001501 0 0 1 0.0078,0.011719 0.15001501,0.15001501 0 0 1 0,0.00195 0.15001501,0.15001501 0 0 1 0.0059,0.011719 0.15001501,0.15001501 0 0 1 0,0.00195 0.15001501,0.15001501 0 0 1 0.0059,0.011719 0.15001501,0.15001501 0 0 1 0,0.00195 0.15001501,0.15001501 0 0 1 0.0059,0.027344 0.15001501,0.15001501 0 0 1 0,0.00195 0.15001501,0.15001501 0 0 1 0,0.042969 V 10 A 0.15001501,0.15001501 0 0 1 14,10.150391 h -3.964844 l -1.9238279,0.960937 -0.9765625,1.955078 -0.984375,1.96875 v 6.947266 a 0.15001501,0.15001501 0 0 1 -0.00977,0.07227 0.15001501,0.15001501 0 0 1 0,0.002 0.15001501,0.15001501 0 0 1 -0.00586,0.01172 0.15001501,0.15001501 0 0 1 -0.00781,0.01367 0.15001501,0.15001501 0 0 1 -0.00781,0.01172 0.15001501,0.15001501 0 0 1 0,0.002 0.15001501,0.15001501 0 0 1 -0.00586,0.0039 0.15001501,0.15001501 0 0 1 -0.015625,0.01563 0.15001501,0.15001501 0 0 1 -0.011719,0.0098 0.15001501,0.15001501 0 0 1 -0.041016,0.01953 0.15001501,0.15001501 0 0 1 -0.027344,0.0059 0.15001501,0.15001501 0 0 1 -0.00195,0 0.15001501,0.15001501 0 0 1 -0.042969,0 H 5.0175781 a 0.15001501,0.15001501 0 0 1 -0.00195,0 0.15001501,0.15001501 0 0 1 -0.042969,0 H 4 A 0.15001501,0.15001501 0 0 1 3.8496094,22 V 8.0175781 a 0.15001501,0.15001501 0 0 1 0.00977,-0.072266 0.15001501,0.15001501 0 0 1 0,-0.00195 0.15001501,0.15001501 0 0 1 0.00586,-0.011719 0.15001501,0.15001501 0 0 1 0,-0.00195 0.15001501,0.15001501 0 0 1 0.015625,-0.023437 0.15001501,0.15001501 0 0 1 0,-0.00195 0.15001501,0.15001501 0 0 1 0.00586,-0.00391 0.15001501,0.15001501 0 0 1 0.015625,-0.015625 0.15001501,0.15001501 0 0 1 0.011719,-0.00977 0.15001501,0.15001501 0 0 1 0.041016,-0.019531 0.15001501,0.15001501 0 0 1 0.027344,-0.00586 0.15001501,0.15001501 0 0 1 0.00195,0 0.15001501,0.15001501 0 0 1 0.013672,-0.00195 z"
     id="path2" />
</svg>
