<?xml version="1.0" encoding="UTF-8" standalone="no"?>
<svg
   xmlns:dc="http://purl.org/dc/elements/1.1/"
   xmlns:cc="http://creativecommons.org/ns#"
   xmlns:rdf="http://www.w3.org/1999/02/22-rdf-syntax-ns#"
   xmlns:svg="http://www.w3.org/2000/svg"
   xmlns="http://www.w3.org/2000/svg"
   xmlns:sodipodi="http://sodipodi.sourceforge.net/DTD/sodipodi-0.dtd"
   xmlns:inkscape="http://www.inkscape.org/namespaces/inkscape"
   data-dec="36"
   width="20"
   height="40"
   version="1.1"
   id="svg4"
   sodipodi:docname="36.svg"
   inkscape:version="0.92.4 (unknown)">
  <metadata
     id="metadata10">
    <rdf:RDF>
      <cc:Work
         rdf:about="">
        <dc:format>image/svg+xml</dc:format>
        <dc:type
           rdf:resource="http://purl.org/dc/dcmitype/StillImage" />
      </cc:Work>
    </rdf:RDF>
  </metadata>
  <defs
     id="defs8" />
  <sodipodi:namedview
     pagecolor="#ffffff"
     bordercolor="#666666"
     borderopacity="1"
     objecttolerance="10"
     gridtolerance="10"
     guidetolerance="10"
     inkscape:pageopacity="0"
     inkscape:pageshadow="2"
     inkscape:window-width="640"
     inkscape:window-height="480"
     id="namedview6"
     showgrid="false"
     inkscape:zoom="5.9"
     inkscape:cx="10"
     inkscape:cy="20"
     inkscape:window-x="0"
     inkscape:window-y="27"
     inkscape:window-maximized="0"
     inkscape:current-layer="svg4" />
  <path
     style="color:#000000;font-style:normal;font-variant:normal;font-weight:normal;font-stretch:normal;font-size:medium;line-height:normal;font-family:sans-serif;font-variant-ligatures:normal;font-variant-position:normal;font-variant-caps:normal;font-variant-numeric:normal;font-variant-alternates:normal;font-feature-settings:normal;text-indent:0;text-align:start;text-decoration:none;text-decoration-line:none;text-decoration-style:solid;text-decoration-color:#000000;letter-spacing:normal;word-spacing:normal;text-transform:none;writing-mode:lr-tb;direction:ltr;text-orientation:mixed;dominant-baseline:auto;baseline-shift:baseline;text-anchor:start;white-space:normal;shape-padding:0;clip-rule:nonzero;display:inline;overflow:visible;visibility:visible;opacity:1;isolation:auto;mix-blend-mode:normal;color-interpolation:sRGB;color-interpolation-filters:linearRGB;solid-color:#000000;solid-opacity:1;vector-effect:none;fill:#013272;fill-opacity:1;fill-rule:nonzero;stroke:none;stroke-width:1;stroke-linecap:round;stroke-linejoin:round;stroke-miterlimit:4;stroke-dasharray:none;stroke-dashoffset:0;stroke-opacity:1;color-rendering:auto;image-rendering:auto;shape-rendering:auto;text-rendering:auto;enable-background:accumulate"
     d="M 4.0800781,16.5 A 0.50005,0.50005 0 0 1 4.5,17 V 16.5 Z M 3.5,16.5 v 0.464844 A 0.50005,0.50005 0 0 1 3.9179688,16.5 Z m 12.994141,-1.396484 a 0.50005,0.50005 0 0 1 -0.220703,0.324218 l 0.173828,0.34961 A 0.50005,0.50005 0 0 1 16.5,16 V 15.117188 Z M 12.5,13.359375 v 7.947266 L 14.646484,20.589844 15.5,18.882812 v -2.765624 l -0.873047,-1.744141 -1.818359,-0.910156 z m -4,-1.332031 V 21.5 h 3 v -8.472656 z m 8,-5.9921878 A 0.50005,0.50005 0 0 1 16.082031,6.5 H 16.5 Z M 15.5,6 v 0.5 h 0.419922 A 0.50005,0.50005 0 0 1 15.5,6 Z m -12,0 v 0.8828125 l 0.00586,0.013672 A 0.50005,0.50005 0 0 1 3.7265625,6.5722656 L 3.5527344,6.2226562 A 0.50005,0.50005 0 0 1 3.5,6 Z M 7.5,1.6933594 5.3535156,2.4101562 4.5,4.1171875 v 1.765625 L 5.3730469,7.6269531 7.1914062,8.5371094 7.5,8.640625 Z M 8.5,1.5 v 7.4726562 l 3,1 V 1.5 Z M 7.9921875,-3.5078125 A 0.50005,0.50005 0 0 1 8.5,-3 v 3.5 h 3 V -3 a 0.50005,0.50005 0 1 1 1,0 v 3.63867188 l 2.658203,0.88671872 a 0.50005,0.50005 0 0 1 0.195313,0.1210938 l 1,1 a 0.50005,0.50005 0 0 1 0.09375,0.1308594 l 1,2 A 0.50005,0.50005 0 0 1 17.5,5 V 7 A 0.50005,0.50005 0 0 1 17,7.5 H 15 A 0.50005,0.50005 0 0 1 14.5,7 V 5 A 0.50005,0.50005 0 0 1 15,4.5 h 1 a 0.50005,0.50005 0 0 1 0.216797,0.048828 L 15.589844,3.296875 14.730469,2.4375 12.5,1.6933594 v 8.6132816 l 0.658203,0.21875 a 0.50005,0.50005 0 0 1 0.119141,0.05859 l 3,2 a 0.50005,0.50005 0 0 1 0.169922,0.19336 l 1,2 A 0.50005,0.50005 0 0 1 17.5,15 v 3 a 0.50005,0.50005 0 0 1 -0.05273,0.222656 l -1,2 a 0.50005,0.50005 0 0 1 -0.09375,0.13086 l -0.972657,0.972656 -0.02734,0.02734 a 0.50005,0.50005 0 0 1 -0.25586,0.142578 L 12.5,22.361328 V 26 a 0.50005,0.50005 0 1 1 -1,0 v -3.5 h -3 V 26 a 0.50005,0.50005 0 1 1 -1,0 V 22.361328 L 4.8417969,21.474609 A 0.50005,0.50005 0 0 1 4.6464844,21.353516 l -1,-1 a 0.50005,0.50005 0 0 1 -0.09375,-0.13086 l -1,-2 A 0.50005,0.50005 0 0 1 2.5,18 V 16 A 0.50005,0.50005 0 0 1 3,15.5 H 5 A 0.50005,0.50005 0 0 1 5.5,16 v 2 A 0.50005,0.50005 0 0 1 5,18.5 H 4 A 0.50005,0.50005 0 0 1 3.7832031,18.451172 L 4.4101562,19.703125 5.2695312,20.5625 7.5,21.306641 v -9.613282 l -0.6582031,-0.21875 a 0.50005,0.50005 0 0 1 -0.1191407,-0.05859 l -3,-2.0000004 A 0.50005,0.50005 0 0 1 3.5527344,9.2226562 l -1,-2 A 0.50005,0.50005 0 0 1 2.5,7 V 4 A 0.50005,0.50005 0 0 1 2.6464844,3.6464844 L 4.6191406,1.6738281 A 0.50005,0.50005 0 0 1 4.6464844,1.6464844 0.50005,0.50005 0 0 1 4.9023438,1.5039062 L 7.5,0.63867188 V -3 a 0.50005,0.50005 0 0 1 0.4921875,-0.5078125 z"
     id="path2" />
</svg>
