<?xml version="1.0" encoding="UTF-8" standalone="no"?>
<svg
   xmlns:dc="http://purl.org/dc/elements/1.1/"
   xmlns:cc="http://creativecommons.org/ns#"
   xmlns:rdf="http://www.w3.org/1999/02/22-rdf-syntax-ns#"
   xmlns:svg="http://www.w3.org/2000/svg"
   xmlns="http://www.w3.org/2000/svg"
   xmlns:sodipodi="http://sodipodi.sourceforge.net/DTD/sodipodi-0.dtd"
   xmlns:inkscape="http://www.inkscape.org/namespaces/inkscape"
   data-dec="105"
   width="12"
   height="40"
   version="1.1"
   id="svg4"
   sodipodi:docname="105.svg"
   inkscape:version="0.92.4 (unknown)">
  <metadata
     id="metadata10">
    <rdf:RDF>
      <cc:Work
         rdf:about="">
        <dc:format>image/svg+xml</dc:format>
        <dc:type
           rdf:resource="http://purl.org/dc/dcmitype/StillImage" />
      </cc:Work>
    </rdf:RDF>
  </metadata>
  <defs
     id="defs8" />
  <sodipodi:namedview
     pagecolor="#ffffff"
     bordercolor="#666666"
     borderopacity="1"
     objecttolerance="10"
     gridtolerance="10"
     guidetolerance="10"
     inkscape:pageopacity="0"
     inkscape:pageshadow="2"
     inkscape:window-width="615"
     inkscape:window-height="417"
     id="namedview6"
     showgrid="false"
     inkscape:zoom="5.9"
     inkscape:cx="6"
     inkscape:cy="20"
     inkscape:window-x="0"
     inkscape:window-y="27"
     inkscape:window-maximized="0"
     inkscape:current-layer="svg4" />
  <path
     style="color:#000000;font-style:normal;font-variant:normal;font-weight:normal;font-stretch:normal;font-size:medium;line-height:normal;font-family:sans-serif;font-variant-ligatures:normal;font-variant-position:normal;font-variant-caps:normal;font-variant-numeric:normal;font-variant-alternates:normal;font-feature-settings:normal;text-indent:0;text-align:start;text-decoration:none;text-decoration-line:none;text-decoration-style:solid;text-decoration-color:#000000;letter-spacing:normal;word-spacing:normal;text-transform:none;writing-mode:lr-tb;direction:ltr;text-orientation:mixed;dominant-baseline:auto;baseline-shift:baseline;text-anchor:start;white-space:normal;shape-padding:0;clip-rule:nonzero;display:inline;overflow:visible;visibility:visible;opacity:1;isolation:auto;mix-blend-mode:normal;color-interpolation:sRGB;color-interpolation-filters:linearRGB;solid-color:#000000;solid-opacity:1;vector-effect:none;fill:#013272;fill-opacity:1;fill-rule:nonzero;stroke:none;stroke-width:2;stroke-linecap:round;stroke-linejoin:round;stroke-miterlimit:4;stroke-dasharray:none;stroke-dashoffset:0;stroke-opacity:1;color-rendering:auto;image-rendering:auto;shape-rendering:auto;text-rendering:auto;enable-background:accumulate"
     d="M 4,7 H 6 A 1.0001,1.0001 0 0 1 6.7070312,7.2929688 L 7.6035156,8.1894531 A 1.0001,1.0001 0 0 1 7.9335938,8.6289062 L 8.8945312,10.552734 A 1.0001,1.0001 0 0 1 9,11 v 3 a 1.0001,1.0001 0 0 1 -0.072266,0.371094 L 7,19.191406 v 1.394532 L 7.4140625,21 h 1.171875 l 1.5917965,-1.591797 0.927735,-1.855469 a 1.0001163,1.0001163 0 1 1 1.789062,0.894532 l -1,2 a 1.0001,1.0001 0 0 1 -0.1875,0.259765 l -1.9999998,2 A 1.0001,1.0001 0 0 1 9,23 H 7 A 1.0001,1.0001 0 0 1 6.2929688,22.707031 L 5.3964844,21.810547 A 1.0001,1.0001 0 0 1 5.0664062,21.371094 L 4.1054688,19.447266 A 1.0001,1.0001 0 0 1 4,19 v -3 a 1.0001,1.0001 0 0 1 0.072266,-0.371094 L 6,10.808594 V 9.4140625 L 5.5859375,9 H 4.4140625 L 2.8222656,10.591797 1.8945312,12.447266 A 1.0001165,1.0001165 0 1 1 0.10546875,11.552734 L 1.1054688,9.5527344 a 1.0001,1.0001 0 0 1 0.1875,-0.2597656 l 2,-2 A 1.0001,1.0001 0 0 1 4,7 Z M 7.984375,-0.01367188 A 1.0001,1.0001 0 0 1 8.1679688,0 H 8.8417969 A 1.0001,1.0001 0 0 1 9.1679688,0 H 10 a 1.0001,1.0001 0 0 1 1,1 v 0.8417969 a 1.0001,1.0001 0 0 1 0,0.3261719 V 3 A 1.0001,1.0001 0 0 1 10,4 H 9.1582031 A 1.0001,1.0001 0 0 1 8.8320312,4 H 8 A 1.0001,1.0001 0 0 1 7,3 V 2.1582031 A 1.0001,1.0001 0 0 1 7,1.8320312 V 1.1582031 a 1.0001,1.0001 0 0 1 0.2636719,-0.84960935 1.0001,1.0001 0 0 1 0.013672,-0.0136719 1.0001,1.0001 0 0 1 0.00586,-0.005859 1.0001,1.0001 0 0 1 0.7011719,-0.30273438 z"
     id="path2" />
</svg>
