<?xml version="1.0" encoding="UTF-8" standalone="no"?>
<svg
   xmlns:dc="http://purl.org/dc/elements/1.1/"
   xmlns:cc="http://creativecommons.org/ns#"
   xmlns:rdf="http://www.w3.org/1999/02/22-rdf-syntax-ns#"
   xmlns:svg="http://www.w3.org/2000/svg"
   xmlns="http://www.w3.org/2000/svg"
   xmlns:sodipodi="http://sodipodi.sourceforge.net/DTD/sodipodi-0.dtd"
   xmlns:inkscape="http://www.inkscape.org/namespaces/inkscape"
   data-dec="54"
   width="20"
   height="40"
   version="1.1"
   id="svg4"
   sodipodi:docname="54.svg"
   inkscape:version="0.92.4 (unknown)">
  <metadata
     id="metadata10">
    <rdf:RDF>
      <cc:Work
         rdf:about="">
        <dc:format>image/svg+xml</dc:format>
        <dc:type
           rdf:resource="http://purl.org/dc/dcmitype/StillImage" />
      </cc:Work>
    </rdf:RDF>
  </metadata>
  <defs
     id="defs8" />
  <sodipodi:namedview
     pagecolor="#ffffff"
     bordercolor="#666666"
     borderopacity="1"
     objecttolerance="10"
     gridtolerance="10"
     guidetolerance="10"
     inkscape:pageopacity="0"
     inkscape:pageshadow="2"
     inkscape:window-width="640"
     inkscape:window-height="480"
     id="namedview6"
     showgrid="false"
     inkscape:zoom="5.9"
     inkscape:cx="10"
     inkscape:cy="20"
     inkscape:window-x="0"
     inkscape:window-y="27"
     inkscape:window-maximized="0"
     inkscape:current-layer="svg4" />
  <path
     style="color:#000000;font-style:normal;font-variant:normal;font-weight:normal;font-stretch:normal;font-size:medium;line-height:normal;font-family:sans-serif;font-variant-ligatures:normal;font-variant-position:normal;font-variant-caps:normal;font-variant-numeric:normal;font-variant-alternates:normal;font-feature-settings:normal;text-indent:0;text-align:start;text-decoration:none;text-decoration-line:none;text-decoration-style:solid;text-decoration-color:#000000;letter-spacing:normal;word-spacing:normal;text-transform:none;writing-mode:lr-tb;direction:ltr;text-orientation:mixed;dominant-baseline:auto;baseline-shift:baseline;text-anchor:start;white-space:normal;shape-padding:0;clip-rule:nonzero;display:inline;overflow:visible;visibility:visible;opacity:1;isolation:auto;mix-blend-mode:normal;color-interpolation:sRGB;color-interpolation-filters:linearRGB;solid-color:#000000;solid-opacity:1;vector-effect:none;fill:#000000;fill-opacity:1;fill-rule:nonzero;stroke:none;stroke-width:2;stroke-linecap:round;stroke-linejoin:round;stroke-miterlimit:4;stroke-dasharray:none;stroke-dashoffset:0;stroke-opacity:1;color-rendering:auto;image-rendering:auto;shape-rendering:auto;text-rendering:auto;enable-background:accumulate"
     d="M 10.802734,11.378906 8.6816406,11.732422 7.875,12.541016 l -0.8339844,2.5 0.6875,2.751953 0.5898438,0.884765 0.7871094,0.525391 2.3261722,0.462891 2.382812,-1.191407 0.611328,-0.917968 L 15,15.837891 v -0.675782 l -0.574219,-1.720703 -0.74414,-1.117187 -0.789063,-0.527344 z M 10,0 h 1 1 0.02148 H 13 a 1.0001,1.0001 0 0 1 0.316406,0.05078125 l 3,0.99999995 a 1.0001,1.0001 0 0 1 0.578125,0.5019532 l 1,2 A 1.0001,1.0001 0 0 1 18,4 v 0.8417969 a 1.0001,1.0001 0 0 1 -0.880859,1.1523437 1.0001,1.0001 0 0 1 -0.0039,0 1.0001,1.0001 0 0 1 -0.002,0 1.0001,1.0001 0 0 1 -0.06641,0.00391 A 1.0001,1.0001 0 0 1 17.015625,6 1.0001,1.0001 0 0 1 17,6 H 16.015625 A 1.0001,1.0001 0 0 1 16,6 1.0001,1.0001 0 0 1 15.914062,5.9960938 1.0001,1.0001 0 0 1 15.193359,5.6074219 l -0.90039,-0.9003907 a 1.0001,1.0001 0 0 1 -0.1875,-0.2597656 L 13.921875,4.078125 11.763672,3 H 11.123047 L 9.8105469,3.328125 8.921875,3.921875 7.9414062,5.390625 7.2480469,8.8632812 9.6835938,8.0507812 A 1.0001,1.0001 0 0 1 10,8 h 1 0.02148 H 12 a 1.0001,1.0001 0 0 1 0.316406,0.050781 l 3,1 a 1.0001,1.0001 0 0 1 0.390625,0.2421876 l 2,2.0000002 a 1.0001,1.0001 0 0 1 0.242188,0.390625 l 1,3 A 1.0001,1.0001 0 0 1 19,15 v 1 a 1.0001,1.0001 0 0 1 -0.05078,0.316406 l -1,3 a 1.0001,1.0001 0 0 1 -0.242188,0.390625 l -2,2 a 1.0001,1.0001 0 0 1 -0.390625,0.242188 l -3,1 A 1.0001,1.0001 0 0 1 12,23 H 11 10.978516 10 a 1.0001,1.0001 0 0 1 -0.3164062,-0.05078 l -3,-1 a 1.0001,1.0001 0 0 1 -0.390625,-0.242188 l -2,-2 A 1.0001,1.0001 0 0 1 4.0292969,19.242188 l -1,-4 A 1.0001,1.0001 0 0 1 3,15 v -5 a 1.0001,1.0001 0 0 1 0.019531,-0.1953125 l 1,-5 a 1.0001,1.0001 0 0 1 0.1484376,-0.359375 l 2,-3 a 1.0001,1.0001 0 0 1 0.515625,-0.3945313 l 3,-0.99999995 A 1.0001,1.0001 0 0 1 10,0 Z"
     id="path2" />
</svg>
