<?xml version="1.0" encoding="UTF-8" standalone="no"?>
<svg
   xmlns:dc="http://purl.org/dc/elements/1.1/"
   xmlns:cc="http://creativecommons.org/ns#"
   xmlns:rdf="http://www.w3.org/1999/02/22-rdf-syntax-ns#"
   xmlns:svg="http://www.w3.org/2000/svg"
   xmlns="http://www.w3.org/2000/svg"
   xmlns:sodipodi="http://sodipodi.sourceforge.net/DTD/sodipodi-0.dtd"
   xmlns:inkscape="http://www.inkscape.org/namespaces/inkscape"
   data-dec="64259"
   width="22"
   height="40"
   version="1.1"
   id="svg4"
   sodipodi:docname="64259.svg"
   inkscape:version="0.92.4 5da689c313, 2019-01-14">
  <metadata
     id="metadata10">
    <rdf:RDF>
      <cc:Work
         rdf:about="">
        <dc:format>image/svg+xml</dc:format>
        <dc:type
           rdf:resource="http://purl.org/dc/dcmitype/StillImage" />
        <dc:title></dc:title>
      </cc:Work>
    </rdf:RDF>
  </metadata>
  <defs
     id="defs8" />
  <sodipodi:namedview
     pagecolor="#ffffff"
     bordercolor="#666666"
     borderopacity="1"
     objecttolerance="10"
     gridtolerance="10"
     guidetolerance="10"
     inkscape:pageopacity="0"
     inkscape:pageshadow="2"
     inkscape:window-width="1920"
     inkscape:window-height="1043"
     id="namedview6"
     showgrid="false"
     inkscape:zoom="5.9"
     inkscape:cx="11"
     inkscape:cy="20"
     inkscape:window-x="0"
     inkscape:window-y="37"
     inkscape:window-maximized="0"
     inkscape:current-layer="svg4" />
  <path
     style="color:#000000;font-style:normal;font-variant:normal;font-weight:normal;font-stretch:normal;font-size:medium;line-height:normal;font-family:sans-serif;font-variant-ligatures:normal;font-variant-position:normal;font-variant-caps:normal;font-variant-numeric:normal;font-variant-alternates:normal;font-feature-settings:normal;text-indent:0;text-align:start;text-decoration:none;text-decoration-line:none;text-decoration-style:solid;text-decoration-color:#000000;letter-spacing:normal;word-spacing:normal;text-transform:none;writing-mode:lr-tb;direction:ltr;text-orientation:mixed;dominant-baseline:auto;baseline-shift:baseline;text-anchor:start;white-space:normal;shape-padding:0;clip-rule:nonzero;display:inline;overflow:visible;visibility:visible;opacity:1;isolation:auto;mix-blend-mode:normal;color-interpolation:sRGB;color-interpolation-filters:linearRGB;solid-color:#000000;solid-opacity:1;vector-effect:none;fill:#000000;fill-opacity:1;fill-rule:nonzero;stroke:none;stroke-width:1.5;stroke-linecap:round;stroke-linejoin:round;stroke-miterlimit:4;stroke-dasharray:none;stroke-dashoffset:0;stroke-opacity:1;color-rendering:auto;image-rendering:auto;shape-rendering:auto;text-rendering:auto;enable-background:accumulate"
     d="M 7.3105469,1.75 5.65625,3.4042969 4.75,6.1191406 V 7.25 h 0.1503906 a 0.750075,0.750075 0 0 1 0.2050782,0 H 7 8.8925781 a 0.750075,0.750075 0 0 1 0.1992188,0 H 9.25 V 6.078125 a 0.750075,0.750075 0 0 1 0.00977,-0.1972656 0.750075,0.750075 0 0 1 0.00781,-0.046875 A 0.750075,0.750075 0 0 1 9.3144531,5.6875 L 10.142578,3.2050781 8.6894531,1.75 Z M 13.984375,0.2421875 A 0.750075,0.750075 0 0 1 14.105469,0.25 h 0.792969 a 0.750075,0.750075 0 0 1 0.36914,0.0488281 0.750075,0.750075 0 0 1 0.01367,0.005859 0.750075,0.750075 0 0 1 0.05469,0.0253906 0.750075,0.750075 0 0 1 0.01367,0.005859 l 0.0098,0.005859 1.865234,0.93359372 a 0.750075,0.750075 0 0 1 0.02148,0.00586 0.750075,0.750075 0 0 1 0.0332,0.011719 0.750075,0.750075 0 0 1 0.002,0.00195 0.750075,0.750075 0 0 1 0.06641,0.029297 0.750075,0.750075 0 0 1 0.002,0.00195 0.750075,0.750075 0 0 1 0.0625,0.035156 0.750075,0.750075 0 0 1 0.002,0.00195 0.750075,0.750075 0 0 1 0.197266,0.1855469 l 0.841797,0.8417969 a 0.750075,0.750075 0 0 1 0.210937,0.2402344 0.750075,0.750075 0 0 1 0.002,0.00195 0.750075,0.750075 0 0 1 0.03125,0.064453 0.750075,0.750075 0 0 1 0,0.00195 0.750075,0.750075 0 0 1 0.02734,0.068359 0.750075,0.750075 0 0 1 0,0.00195 0.750075,0.750075 0 0 1 0.0059,0.4375 0.750075,0.750075 0 0 1 0,0.00391 0.750075,0.750075 0 0 1 -0.02344,0.068359 0.750075,0.750075 0 0 1 -0.002,0.00195 0.750075,0.750075 0 0 1 -0.0293,0.066406 0.750075,0.750075 0 0 1 -0.002,0.00195 0.750075,0.750075 0 0 1 -0.03516,0.0625 0.750075,0.750075 0 0 1 -0.002,0.00195 0.750075,0.750075 0 0 1 -0.185547,0.1972656 L 17.609375,4.453125 a 0.750075,0.750075 0 0 1 -0.240234,0.2109375 0.750075,0.750075 0 0 1 -0.002,0.00195 0.750075,0.750075 0 0 1 -0.0332,0.015625 0.750075,0.750075 0 0 1 -0.103515,0.042969 0.750075,0.750075 0 0 1 -0.4375,0.00586 0.750075,0.750075 0 0 1 -0.0039,0 0.750075,0.750075 0 0 1 -0.03516,-0.011719 0.750075,0.750075 0 0 1 -0.03516,-0.013672 0.750075,0.750075 0 0 1 -0.06641,-0.029297 0.750075,0.750075 0 0 1 -0.002,-0.00195 0.750075,0.750075 0 0 1 -0.0625,-0.035156 0.750075,0.750075 0 0 1 -0.002,-0.00195 0.750075,0.750075 0 0 1 -0.197266,-0.1855469 L 15.546875,3.609375 a 0.750075,0.750075 0 0 1 -0.210937,-0.2402344 0.750075,0.750075 0 0 1 -0.002,-0.00195 0.750075,0.750075 0 0 1 -0.01563,-0.033203 0.750075,0.750075 0 0 1 -0.01563,-0.033203 0.750075,0.750075 0 0 1 -0.02734,-0.068359 0.750075,0.750075 0 0 1 0,-0.00195 0.750075,0.750075 0 0 1 -0.0059,-0.4375 0.750075,0.750075 0 0 1 0,-0.00391 0.750075,0.750075 0 0 1 0.01172,-0.035156 0.750075,0.750075 0 0 1 0.01367,-0.035156 0.750075,0.750075 0 0 1 0.0293,-0.066406 0.750075,0.750075 0 0 1 0.002,-0.00195 0.750075,0.750075 0 0 1 0.03516,-0.0625 0.750075,0.750075 0 0 1 0.002,-0.00195 0.750075,0.750075 0 0 1 0.07031,-0.091797 L 14.689453,1.75 H 14.3125 L 12.65625,3.4042969 11.75,6.1191406 V 7.25 h 0.150391 a 0.750075,0.750075 0 0 1 0.205078,0 H 15 17.876953 a 0.750075,0.750075 0 0 1 0.644531,0.2011719 0.750075,0.750075 0 0 1 0.0039,0.00391 0.750075,0.750075 0 0 1 0.0039,0.00391 0.750075,0.750075 0 0 1 0.04687,0.048828 0.750075,0.750075 0 0 1 0.0039,0.00586 A 0.750075,0.750075 0 0 1 18.75,8.1230469 V 20.6875 L 19.310547,21.25 H 20 a 0.750075,0.750075 0 0 1 0,1.5 h -1 -0.876953 a 0.750075,0.750075 0 0 1 -0.246094,0 h -0.753906 a 0.750075,0.750075 0 0 1 -0.246094,0 H 16 15 a 0.750075,0.750075 0 0 1 0,-1.5 h 0.689453 L 16.25,20.6875 V 10 9.4628906 L 14.824219,8.75 H 12.3125 L 11.75,9.3125 v 11.375 L 12.3125,21.25 H 13 a 0.750075,0.750075 0 1 1 0,1.5 h -0.892578 a 0.750075,0.750075 0 0 1 -0.199219,0 h -0.785156 a 0.750075,0.750075 0 0 1 -0.246094,0 h -0.753906 a 0.750075,0.750075 0 0 1 -0.2460939,0 H 9.0996094 a 0.750075,0.750075 0 0 1 -0.2050782,0 H 8 a 0.750075,0.750075 0 1 1 0,-1.5 H 8.6875 L 9.25,20.6875 V 9.3125 L 8.6875,8.75 H 7 5.3125 L 4.75,9.3125 v 11.375 L 5.3105469,21.25 H 6 a 0.750075,0.750075 0 0 1 0,1.5 H 5 4.1230469 a 0.750075,0.750075 0 0 1 -0.2460938,0 H 3.1230469 a 0.750075,0.750075 0 0 1 -0.2460938,0 H 2.0996094 a 0.750075,0.750075 0 0 1 -0.2050782,0 H 1 a 0.750075,0.750075 0 1 1 0,-1.5 H 1.6875 L 2.25,20.6875 V 9.3125 L 1.6875,8.75 H 1 a 0.750075,0.750075 0 1 1 0,-1.5 h 0.8925781 a 0.750075,0.750075 0 0 1 0.1992188,0 H 2.25 V 6.078125 a 0.750075,0.750075 0 0 1 0.00977,-0.1972656 0.750075,0.750075 0 0 1 0.00781,-0.046875 A 0.750075,0.750075 0 0 1 2.3144531,5.6875 L 3.2890625,2.7636719 A 0.750075,0.750075 0 0 1 3.46875,2.46875 l 1,-1 A 0.750075,0.750075 0 0 1 4.6640625,1.3300781 L 6.640625,0.34179688 A 0.750075,0.750075 0 0 1 6.6640625,0.33007812 0.750075,0.750075 0 0 1 6.7070312,0.30859375 0.750075,0.750075 0 0 1 6.8515625,0.265625 0.750075,0.750075 0 0 1 7,0.25 h 1.8984375 a 0.750075,0.750075 0 0 1 0.2285156,0.009766 0.750075,0.750075 0 0 1 0.035156,0.005859 0.750075,0.750075 0 0 1 0.033203,0.007813 0.750075,0.750075 0 0 1 0.2207031,0.0976563 L 11.259766,1.2910156 a 0.750075,0.750075 0 0 1 0.177734,0.099609 0.750075,0.750075 0 0 1 0.0078,0.00391 0.750075,0.750075 0 0 1 0.0293,0.023438 0.750075,0.750075 0 0 1 0.02734,0.021484 0.750075,0.750075 0 0 1 0.162109,-0.109375 L 13.617188,0.35351562 A 0.750075,0.750075 0 0 1 13.984375,0.2421875 Z"
     id="path2" />
</svg>
