<?xml version="1.0" encoding="UTF-8" standalone="no"?>
<svg
   xmlns:dc="http://purl.org/dc/elements/1.1/"
   xmlns:cc="http://creativecommons.org/ns#"
   xmlns:rdf="http://www.w3.org/1999/02/22-rdf-syntax-ns#"
   xmlns:svg="http://www.w3.org/2000/svg"
   xmlns="http://www.w3.org/2000/svg"
   xmlns:sodipodi="http://sodipodi.sourceforge.net/DTD/sodipodi-0.dtd"
   xmlns:inkscape="http://www.inkscape.org/namespaces/inkscape"
   data-dec="98"
   width="20"
   height="40"
   version="1.1"
   id="svg4"
   sodipodi:docname="98.svg"
   inkscape:version="0.92.4 (unknown)">
  <metadata
     id="metadata10">
    <rdf:RDF>
      <cc:Work
         rdf:about="">
        <dc:format>image/svg+xml</dc:format>
        <dc:type
           rdf:resource="http://purl.org/dc/dcmitype/StillImage" />
      </cc:Work>
    </rdf:RDF>
  </metadata>
  <defs
     id="defs8" />
  <sodipodi:namedview
     pagecolor="#ffffff"
     bordercolor="#666666"
     borderopacity="1"
     objecttolerance="10"
     gridtolerance="10"
     guidetolerance="10"
     inkscape:pageopacity="0"
     inkscape:pageshadow="2"
     inkscape:window-width="640"
     inkscape:window-height="480"
     id="namedview6"
     showgrid="false"
     inkscape:zoom="5.9"
     inkscape:cx="10"
     inkscape:cy="20"
     inkscape:window-x="0"
     inkscape:window-y="27"
     inkscape:window-maximized="0"
     inkscape:current-layer="svg4" />
  <path
     style="color:#000000;font-style:normal;font-variant:normal;font-weight:normal;font-stretch:normal;font-size:medium;line-height:normal;font-family:sans-serif;font-variant-ligatures:normal;font-variant-position:normal;font-variant-caps:normal;font-variant-numeric:normal;font-variant-alternates:normal;font-feature-settings:normal;text-indent:0;text-align:start;text-decoration:none;text-decoration-line:none;text-decoration-style:solid;text-decoration-color:#000000;letter-spacing:normal;word-spacing:normal;text-transform:none;writing-mode:lr-tb;direction:ltr;text-orientation:mixed;dominant-baseline:auto;baseline-shift:baseline;text-anchor:start;white-space:normal;shape-padding:0;clip-rule:nonzero;display:inline;overflow:visible;visibility:visible;opacity:1;isolation:auto;mix-blend-mode:normal;color-interpolation:sRGB;color-interpolation-filters:linearRGB;solid-color:#000000;solid-opacity:1;vector-effect:none;fill:#013272;fill-opacity:1;fill-rule:nonzero;stroke:none;stroke-width:1;stroke-linecap:round;stroke-linejoin:round;stroke-miterlimit:4;stroke-dasharray:none;stroke-dashoffset:0;stroke-opacity:1;color-rendering:auto;image-rendering:auto;shape-rendering:auto;text-rendering:auto;enable-background:accumulate"
     d="m 12.507812,20.103516 -0.06055,0.11914 a 0.50005,0.50005 0 0 1 -0.09375,0.13086 l -0.501954,0.501953 0.828126,-0.275391 0.08594,-0.130859 a 0.50005,0.50005 0 0 1 -0.257813,-0.345703 z m 1.148438,-10.7167972 0.0625,0.1894531 a 0.50005,0.50005 0 0 1 0.101562,-0.048828 L 13.703125,9.4101562 Z M 10.117188,8.5 8.296875,9.4101562 7.4101562,10.296875 6.4628906,12.191406 5.5,15.082031 v 2.835938 L 6.4101562,20.646484 8.1171875,21.5 H 9.7929688 L 11.589844,19.703125 12.537109,17.808594 13.5,14.917969 V 12.082031 L 12.5625,9.2695312 11.792969,8.5 Z M 6.0078125,0.49414062 A 0.50005,0.50005 0 0 1 6.0703125,0.5 h 0.8535156 a 0.50005,0.50005 0 0 1 0.1601563,0 h 0.8398437 a 0.50005,0.50005 0 0 1 0.1601563,0 H 9 a 0.50005,0.50005 0 0 1 0.4804688,0.6367188 l -2,7 -0.2695313,0.9453124 0.4355469,-0.4355468 a 0.50005,0.50005 0 0 1 0.1308594,-0.09375 l 2,-1 A 0.50005,0.50005 0 0 1 10,7.5 h 1.933594 a 0.50005,0.50005 0 0 1 0.322265,0.070312 l 1.966797,0.9824219 a 0.50005,0.50005 0 0 1 0.13086,0.09375 l 1,1 a 0.50005,0.50005 0 0 1 0.121093,0.1953125 l 1,3.0000001 A 0.50005,0.50005 0 0 1 16.5,13 v 2 a 0.50005,0.50005 0 0 1 -0.02539,0.158203 l -1,3 a 0.50005,0.50005 0 0 1 -0.05859,0.119141 l -2,3 a 0.50005,0.50005 0 0 1 -0.257813,0.197265 l -2.955078,0.984375 a 0.50005,0.50005 0 0 1 -0.0078,0.0039 A 0.50005,0.50005 0 0 1 9.9257812,22.5 H 8 A 0.50005,0.50005 0 0 1 7.7773438,22.447266 L 5.8457031,21.482422 a 0.50005,0.50005 0 0 1 -0.2226562,-0.150391 0.50005,0.50005 0 0 1 -0.00781,-0.0098 l -0.96875,-0.96875 a 0.50005,0.50005 0 0 1 -0.09375,-0.13086 l -1,-2 A 0.50005,0.50005 0 0 1 3.5,18 v -4 a 0.50005,0.50005 0 0 1 0.00586,-0.08203 l 1,-6.0000002 a 0.50005,0.50005 0 0 1 0.013672,-0.054688 L 6.1035156,2.3222656 5.8457031,1.8085938 4.9179688,1.5 H 4 a 0.50005,0.50005 0 1 1 0,-1 h 0.9453125 a 0.50005,0.50005 0 0 1 0.089844,0 h 0.8886719 a 0.50005,0.50005 0 0 1 0.083984,-0.005859 z"
     id="path2" />
</svg>
