<?xml version="1.0" encoding="UTF-8" standalone="no"?>
<svg
   xmlns:dc="http://purl.org/dc/elements/1.1/"
   xmlns:cc="http://creativecommons.org/ns#"
   xmlns:rdf="http://www.w3.org/1999/02/22-rdf-syntax-ns#"
   xmlns:svg="http://www.w3.org/2000/svg"
   xmlns="http://www.w3.org/2000/svg"
   xmlns:sodipodi="http://sodipodi.sourceforge.net/DTD/sodipodi-0.dtd"
   xmlns:inkscape="http://www.inkscape.org/namespaces/inkscape"
   data-dec="120"
   width="18"
   height="40"
   version="1.1"
   id="svg4"
   sodipodi:docname="120.svg"
   inkscape:version="0.92.4 5da689c313, 2019-01-14">
  <metadata
     id="metadata10">
    <rdf:RDF>
      <cc:Work
         rdf:about="">
        <dc:format>image/svg+xml</dc:format>
        <dc:type
           rdf:resource="http://purl.org/dc/dcmitype/StillImage" />
        <dc:title></dc:title>
      </cc:Work>
    </rdf:RDF>
  </metadata>
  <defs
     id="defs8" />
  <sodipodi:namedview
     pagecolor="#ffffff"
     bordercolor="#666666"
     borderopacity="1"
     objecttolerance="10"
     gridtolerance="10"
     guidetolerance="10"
     inkscape:pageopacity="0"
     inkscape:pageshadow="2"
     inkscape:window-width="1920"
     inkscape:window-height="1043"
     id="namedview6"
     showgrid="false"
     inkscape:zoom="5.9"
     inkscape:cx="9"
     inkscape:cy="20"
     inkscape:window-x="0"
     inkscape:window-y="37"
     inkscape:window-maximized="0"
     inkscape:current-layer="svg4" />
  <path
     style="color:#000000;font-style:normal;font-variant:normal;font-weight:normal;font-stretch:normal;font-size:medium;line-height:normal;font-family:sans-serif;font-variant-ligatures:normal;font-variant-position:normal;font-variant-caps:normal;font-variant-numeric:normal;font-variant-alternates:normal;font-feature-settings:normal;text-indent:0;text-align:start;text-decoration:none;text-decoration-line:none;text-decoration-style:solid;text-decoration-color:#000000;letter-spacing:normal;word-spacing:normal;text-transform:none;writing-mode:lr-tb;direction:ltr;text-orientation:mixed;dominant-baseline:auto;baseline-shift:baseline;text-anchor:start;white-space:normal;shape-padding:0;clip-rule:nonzero;display:inline;overflow:visible;visibility:visible;opacity:1;isolation:auto;mix-blend-mode:normal;color-interpolation:sRGB;color-interpolation-filters:linearRGB;solid-color:#000000;solid-opacity:1;vector-effect:none;fill:#000000;fill-opacity:1;fill-rule:nonzero;stroke:none;stroke-width:1.5;stroke-linecap:round;stroke-linejoin:round;stroke-miterlimit:4;stroke-dasharray:none;stroke-dashoffset:0;stroke-opacity:1;color-rendering:auto;image-rendering:auto;shape-rendering:auto;text-rendering:auto;enable-background:accumulate"
     d="M 3.0078125,7.2421875 A 0.750075,0.750075 0 0 1 3.1035156,7.25 H 4 A 0.750075,0.750075 0 0 1 4.5898438,7.5371094 L 9,13.150391 13.410156,7.5371094 A 0.750075,0.750075 0 0 1 14,7.25 h 0.894531 a 0.750075,0.750075 0 0 1 0.728516,0.3164062 0.750075,0.750075 0 0 1 0.03516,0.052734 0.750075,0.750075 0 0 1 0.0059,0.011719 0.750075,0.750075 0 0 1 0.02734,0.054687 0.750075,0.750075 0 0 1 0.0059,0.011719 0.750075,0.750075 0 0 1 0.02148,0.058594 0.750075,0.750075 0 0 1 -0.189453,0.7851562 L 10.453125,15 l 5.072266,6.455078 a 0.750075,0.750075 0 0 1 0.179687,0.826172 0.750075,0.750075 0 0 1 -0.0293,0.0625 0.750075,0.750075 0 0 1 -0.002,0.0059 0.750075,0.750075 0 0 1 -0.0059,0.01172 0.750075,0.750075 0 0 1 -0.03125,0.05273 A 0.750075,0.750075 0 0 1 14.896484,22.75 H 14 A 0.750075,0.750075 0 0 1 13.410156,22.462891 L 9,16.849609 4.5898438,22.462891 A 0.750075,0.750075 0 0 1 4,22.75 H 3.1054688 a 0.750075,0.750075 0 0 1 -0.7285157,-0.316406 0.750075,0.750075 0 0 1 -0.035156,-0.05273 0.750075,0.750075 0 0 1 -0.00586,-0.01172 0.750075,0.750075 0 0 1 -0.027344,-0.05469 0.750075,0.750075 0 0 1 -0.00586,-0.01172 0.750075,0.750075 0 0 1 -0.021484,-0.05859 0.750075,0.750075 0 0 1 0.1894531,-0.785157 L 7.546875,15 2.4746094,8.5449219 A 0.750075,0.750075 0 0 1 2.2949219,7.71875 a 0.750075,0.750075 0 0 1 0.029297,-0.0625 0.750075,0.750075 0 0 1 0.00391,-0.00781 0.750075,0.750075 0 0 1 0.035156,-0.0625 0.750075,0.750075 0 0 1 0.6445313,-0.34375 z"
     id="path2" />
</svg>
