<?xml version="1.0" encoding="UTF-8" standalone="no"?>
<svg
   xmlns:dc="http://purl.org/dc/elements/1.1/"
   xmlns:cc="http://creativecommons.org/ns#"
   xmlns:rdf="http://www.w3.org/1999/02/22-rdf-syntax-ns#"
   xmlns:svg="http://www.w3.org/2000/svg"
   xmlns="http://www.w3.org/2000/svg"
   xmlns:sodipodi="http://sodipodi.sourceforge.net/DTD/sodipodi-0.dtd"
   xmlns:inkscape="http://www.inkscape.org/namespaces/inkscape"
   data-dec="169"
   id="dec_67"
   width="23"
   height="40"
   version="1.1"
   sodipodi:docname="145.svg"
   inkscape:version="0.92.4 5da689c313, 2019-01-14">
  <metadata
     id="metadata9">
    <rdf:RDF>
      <cc:Work
         rdf:about="">
        <dc:format>image/svg+xml</dc:format>
        <dc:type
           rdf:resource="http://purl.org/dc/dcmitype/StillImage" />
        <dc:title />
      </cc:Work>
    </rdf:RDF>
  </metadata>
  <defs
     id="defs7" />
  <sodipodi:namedview
     pagecolor="#ffffff"
     bordercolor="#666666"
     borderopacity="1"
     objecttolerance="10"
     gridtolerance="10"
     guidetolerance="10"
     inkscape:pageopacity="0"
     inkscape:pageshadow="2"
     inkscape:window-width="1920"
     inkscape:window-height="1043"
     id="namedview5"
     showgrid="true"
     showguides="true"
     inkscape:zoom="16.474276"
     inkscape:cx="-8.3903866"
     inkscape:cy="20.995689"
     inkscape:window-x="0"
     inkscape:window-y="37"
     inkscape:window-maximized="0"
     inkscape:current-layer="dec_67"
     inkscape:guide-bbox="true">
    <inkscape:grid
       type="xygrid"
       id="grid819" />
    <sodipodi:guide
       position="-24,2"
       orientation="0.98287219,0.18428854"
       id="guide816"
       inkscape:locked="false" />
  </sodipodi:namedview>
  <path
     d="m 16,3 2,1 2,2 1,2 1,4 v 3 l -1,4 -1,2 -3,3 -4,1 H 10 L 6,24 3,21 2,19 1,15 V 12 L 2,8 3,6 5,4 7,3 10,2 h 3 l 3,1 M 5,10 6,8 8,6 10,5 h 3 l 2,1 2,2 1,3 v 5 l -1,3 -2,2 -2,1 H 10 L 8,21 6,19 5,17"
     style="fill:none;stroke:#000000;stroke-width:1;stroke-linecap:round;stroke-linejoin:round"
     id="path2"
     inkscape:connector-curvature="0"
     sodipodi:nodetypes="ccccccccccccccccccccccc" />
</svg>
