<?xml version="1.0" encoding="UTF-8" standalone="no"?>
<svg
   xmlns:dc="http://purl.org/dc/elements/1.1/"
   xmlns:cc="http://creativecommons.org/ns#"
   xmlns:rdf="http://www.w3.org/1999/02/22-rdf-syntax-ns#"
   xmlns:svg="http://www.w3.org/2000/svg"
   xmlns="http://www.w3.org/2000/svg"
   xmlns:sodipodi="http://sodipodi.sourceforge.net/DTD/sodipodi-0.dtd"
   xmlns:inkscape="http://www.inkscape.org/namespaces/inkscape"
   data-dec="48"
   width="22"
   height="40"
   version="1.1"
   id="svg4"
   sodipodi:docname="48.svg"
   inkscape:version="0.92.4 (unknown)">
  <metadata
     id="metadata10">
    <rdf:RDF>
      <cc:Work
         rdf:about="">
        <dc:format>image/svg+xml</dc:format>
        <dc:type
           rdf:resource="http://purl.org/dc/dcmitype/StillImage" />
      </cc:Work>
    </rdf:RDF>
  </metadata>
  <defs
     id="defs8" />
  <sodipodi:namedview
     pagecolor="#ffffff"
     bordercolor="#666666"
     borderopacity="1"
     objecttolerance="10"
     gridtolerance="10"
     guidetolerance="10"
     inkscape:pageopacity="0"
     inkscape:pageshadow="2"
     inkscape:window-width="640"
     inkscape:window-height="480"
     id="namedview6"
     showgrid="false"
     inkscape:zoom="5.9"
     inkscape:cx="11"
     inkscape:cy="20"
     inkscape:window-x="0"
     inkscape:window-y="27"
     inkscape:window-maximized="0"
     inkscape:current-layer="svg4" />
  <path
     style="color:#000000;font-style:normal;font-variant:normal;font-weight:normal;font-stretch:normal;font-size:medium;line-height:normal;font-family:sans-serif;font-variant-ligatures:normal;font-variant-position:normal;font-variant-caps:normal;font-variant-numeric:normal;font-variant-alternates:normal;font-feature-settings:normal;text-indent:0;text-align:start;text-decoration:none;text-decoration-line:none;text-decoration-style:solid;text-decoration-color:#000000;letter-spacing:normal;word-spacing:normal;text-transform:none;writing-mode:lr-tb;direction:ltr;text-orientation:mixed;dominant-baseline:auto;baseline-shift:baseline;text-anchor:start;white-space:normal;shape-padding:0;clip-rule:nonzero;display:inline;overflow:visible;visibility:visible;opacity:1;isolation:auto;mix-blend-mode:normal;color-interpolation:sRGB;color-interpolation-filters:linearRGB;solid-color:#000000;solid-opacity:1;vector-effect:none;fill:#013272;fill-opacity:1;fill-rule:nonzero;stroke:none;stroke-width:0.30000001;stroke-linecap:round;stroke-linejoin:round;stroke-miterlimit:4;stroke-dasharray:none;stroke-dashoffset:0;stroke-opacity:1;color-rendering:auto;image-rendering:auto;shape-rendering:auto;text-rendering:auto;enable-background:accumulate"
     d="M 10.044922,1.8085938 9.0800781,2.1308594 7.1171875,4.0957031 5.1367188,7.0664062 4.1445312,10.041016 3.1503906,14.017578 v 2.958984 l 0.9804688,2.94336 0.9570312,0.957031 1.1542969,0.576172 -0.3476563,-0.347656 a 0.15001501,0.15001501 0 0 1 -0.029297,-0.03906 l -1,-2 A 0.15001501,0.15001501 0 0 1 4.8496094,19 v -5 a 0.15001501,0.15001501 0 0 1 0.00391,-0.03711 l 1,-4.0000004 a 0.15001501,0.15001501 0 0 1 0.00391,-0.00977 l 1,-3 a 0.15001501,0.15001501 0 0 1 0.00781,-0.019531 l 1,-2 A 0.15001501,0.15001501 0 0 1 7.875,4.9160156 L 9.0351562,3.1757812 7.1230469,5.0878906 6.1386719,7.0566406 5.1445312,10.041016 4.1503906,14.017578 v 3.947266 l 0.984375,1.96875 a 0.15023822,0.15023822 0 0 1 -0.2695312,0.132812 l -1,-2 A 0.15001501,0.15001501 0 0 1 3.8496094,18 v -4 a 0.15001501,0.15001501 0 0 1 0.00391,-0.03711 l 1,-4.0000004 a 0.15001501,0.15001501 0 0 1 0.00391,-0.00977 l 1,-3 a 0.15001501,0.15001501 0 0 1 0.00781,-0.019531 l 1,-2 a 0.15001501,0.15001501 0 0 1 0.029297,-0.039063 l 2,-2 A 0.15001501,0.15001501 0 0 1 9.1523438,2.9980469 L 9.875,1.9160156 a 0.15001501,0.15001501 0 0 1 0.058594,-0.050781 z m 4.71289,-0.2617188 0.347657,0.3476562 a 0.15001501,0.15001501 0 0 1 0.0293,0.039063 l 1,2 A 0.15001501,0.15001501 0 0 1 16.150391,4 v 5 a 0.15001501,0.15001501 0 0 1 -0.0039,0.037109 l -1,3.9999996 a 0.15001501,0.15001501 0 0 1 -0.0039,0.0098 l -1,3 a 0.15001501,0.15001501 0 0 1 -0.0078,0.01953 l -1,2 a 0.15001501,0.15001501 0 0 1 -0.0098,0.01758 l -1.160156,1.740235 1.912109,-1.91211 0.984375,-1.96875 0.994141,-2.984375 0.99414,-3.9765621 V 5.0351562 l -0.984375,-1.96875 a 0.15023867,0.15023867 0 0 1 0.269532,-0.1328124 l 1,2 A 0.15001501,0.15001501 0 0 1 17.150391,5 v 4 a 0.15001501,0.15001501 0 0 1 -0.0039,0.037109 l -1,3.9999996 a 0.15001501,0.15001501 0 0 1 -0.0039,0.0098 l -1,3 a 0.15001501,0.15001501 0 0 1 -0.0078,0.01953 l -1,2 a 0.15001501,0.15001501 0 0 1 -0.0293,0.03906 l -2,2 A 0.15001501,0.15001501 0 0 1 11.847656,20.001953 L 11.125,21.083984 a 0.15001501,0.15001501 0 0 1 -0.05859,0.05078 l -0.111328,0.05664 0.964844,-0.322265 1.96289,-1.964844 1.980469,-2.970703 0.992188,-2.97461 0.99414,-3.9765621 V 6.0234375 L 16.869141,3.0800781 15.912109,2.1230469 Z M 12.035156,1.1503906 10.103516,2.1171875 8.1308594,5.0761719 7.1386719,7.0566406 6.1445312,10.041016 5.1503906,14.017578 v 4.947266 l 0.9726563,1.947265 0.9375,0.9375 h 1.9042969 l 1.9316402,-0.966797 1.972657,-2.958984 0.992187,-1.980469 0.994141,-2.984375 0.99414,-3.9765621 V 4.0351562 l -0.972656,-1.9472656 -0.9375,-0.9375 z m 1.962891,-0.30273435 a 0.15001501,0.15001501 0 0 1 0.01172,0.001953 0.15001501,0.15001501 0 0 1 0.0039,0 0.15001501,0.15001501 0 0 1 0.03906,0.009766 0.15001501,0.15001501 0 0 1 0.01367,0.005859 l 0.01758,0.009766 1.982422,0.9902344 a 0.15001501,0.15001501 0 0 1 0.03906,0.029297 l 1,1 a 0.15001501,0.15001501 0 0 1 0.03711,0.058594 l 1,3 A 0.15001501,0.15001501 0 0 1 18.150391,6 v 3 a 0.15001501,0.15001501 0 0 1 -0.0039,0.037109 l -1,3.9999996 a 0.15001501,0.15001501 0 0 1 -0.0039,0.0098 l -1,3 a 0.15001501,0.15001501 0 0 1 -0.01758,0.03711 l -2,3 a 0.15001501,0.15001501 0 0 1 -0.01953,0.02148 l -2,2 a 0.15001501,0.15001501 0 0 1 -0.05859,0.03711 l -2.9804688,0.992188 a 0.15001501,0.15001501 0 0 1 -0.015625,0.0059 l -0.00391,0.002 A 0.15001501,0.15001501 0 0 1 9,22.150391 H 8.984375 7.015625 a 0.15001501,0.15001501 0 0 1 -0.025391,0 0.15001501,0.15001501 0 0 1 -0.00391,0 0.15001501,0.15001501 0 0 1 -0.011719,-0.002 0.15001501,0.15001501 0 0 1 -0.00195,0 0.15001501,0.15001501 0 0 1 -0.011719,-0.0039 0.15001501,0.15001501 0 0 1 -0.00391,0 0.15001501,0.15001501 0 0 1 -0.00977,-0.0039 0.15001501,0.15001501 0 0 1 -0.013672,-0.0059 l -0.00391,-0.002 A 0.15001501,0.15001501 0 0 1 6.9160156,22.125 L 4.9335938,21.134766 a 0.15001501,0.15001501 0 0 1 -0.039063,-0.0293 l -1,-1 a 0.15001501,0.15001501 0 0 1 -0.037109,-0.05859 l -1,-3 A 0.15001501,0.15001501 0 0 1 2.8496094,17 v -3 a 0.15001501,0.15001501 0 0 1 0.00391,-0.03711 l 1,-4.0000004 a 0.15001501,0.15001501 0 0 1 0.00391,-0.00977 l 1,-3 A 0.15001501,0.15001501 0 0 1 4.875,6.9160156 l 2,-3 a 0.15001501,0.15001501 0 0 1 0.019531,-0.021484 l 2,-2 a 0.15001501,0.15001501 0 0 1 0.058594,-0.037109 l 2.974609,-0.9902344 a 0.15001501,0.15001501 0 0 1 0.0059,-0.001953 0.15001501,0.15001501 0 0 1 0.0078,-0.003906 0.15001501,0.15001501 0 0 1 0.0078,-0.001953 0.15001501,0.15001501 0 0 1 0.0039,-0.001953 0.15001501,0.15001501 0 0 1 0.002,-0.001953 0.15001501,0.15001501 0 0 1 0.002,0 0.15001501,0.15001501 0 0 1 0.002,0 0.15001501,0.15001501 0 0 1 0.01758,-0.003906 0.15001501,0.15001501 0 0 1 0.002,0 0.15001501,0.15001501 0 0 1 0.0059,-0.001953 0.15001501,0.15001501 0 0 1 0.01563,0 0.15001501,0.15001501 0 0 1 0.0078,0 h 0.0078 1.96875 a 0.15001501,0.15001501 0 0 1 0.01367,-0.001953 z"
     id="path2" />
</svg>
