<?xml version="1.0" encoding="UTF-8" standalone="no"?>
<svg
   xmlns:dc="http://purl.org/dc/elements/1.1/"
   xmlns:cc="http://creativecommons.org/ns#"
   xmlns:rdf="http://www.w3.org/1999/02/22-rdf-syntax-ns#"
   xmlns:svg="http://www.w3.org/2000/svg"
   xmlns="http://www.w3.org/2000/svg"
   xmlns:sodipodi="http://sodipodi.sourceforge.net/DTD/sodipodi-0.dtd"
   xmlns:inkscape="http://www.inkscape.org/namespaces/inkscape"
   data-dec="84"
   width="18"
   height="40"
   version="1.1"
   id="svg4"
   sodipodi:docname="84.svg"
   inkscape:version="0.92.4 (unknown)">
  <metadata
     id="metadata10">
    <rdf:RDF>
      <cc:Work
         rdf:about="">
        <dc:format>image/svg+xml</dc:format>
        <dc:type
           rdf:resource="http://purl.org/dc/dcmitype/StillImage" />
      </cc:Work>
    </rdf:RDF>
  </metadata>
  <defs
     id="defs8" />
  <sodipodi:namedview
     pagecolor="#ffffff"
     bordercolor="#666666"
     borderopacity="1"
     objecttolerance="10"
     gridtolerance="10"
     guidetolerance="10"
     inkscape:pageopacity="0"
     inkscape:pageshadow="2"
     inkscape:window-width="640"
     inkscape:window-height="480"
     id="namedview6"
     showgrid="false"
     inkscape:zoom="5.9"
     inkscape:cx="9"
     inkscape:cy="20"
     inkscape:window-x="0"
     inkscape:window-y="27"
     inkscape:window-maximized="0"
     inkscape:current-layer="svg4" />
  <path
     style="color:#000000;font-style:normal;font-variant:normal;font-weight:normal;font-stretch:normal;font-size:medium;line-height:normal;font-family:sans-serif;font-variant-ligatures:normal;font-variant-position:normal;font-variant-caps:normal;font-variant-numeric:normal;font-variant-alternates:normal;font-feature-settings:normal;text-indent:0;text-align:start;text-decoration:none;text-decoration-line:none;text-decoration-style:solid;text-decoration-color:#000000;letter-spacing:normal;word-spacing:normal;text-transform:none;writing-mode:lr-tb;direction:ltr;text-orientation:mixed;dominant-baseline:auto;baseline-shift:baseline;text-anchor:start;white-space:normal;shape-padding:0;clip-rule:nonzero;display:inline;overflow:visible;visibility:visible;opacity:1;isolation:auto;mix-blend-mode:normal;color-interpolation:sRGB;color-interpolation-filters:linearRGB;solid-color:#000000;solid-opacity:1;vector-effect:none;fill:#000000;fill-opacity:1;fill-rule:nonzero;stroke:none;stroke-width:0.30000001;stroke-linecap:round;stroke-linejoin:round;stroke-miterlimit:4;stroke-dasharray:none;stroke-dashoffset:0;stroke-opacity:1;color-rendering:auto;image-rendering:auto;shape-rendering:auto;text-rendering:auto;enable-background:accumulate"
     d="M 8.1503906,3.1503906 V 21.849609 H 9.8496094 V 3.1503906 H 9.1503906 V 3.984375 a 0.15001501,0.15001501 0 0 1 0,0.015625 v 17 a 0.15001501,0.15001501 0 0 1 0,0.0098 0.15001501,0.15001501 0 0 1 -0.00586,0.03125 0.15001501,0.15001501 0 0 1 -0.017578,0.04102 0.15001501,0.15001501 0 0 1 -0.00781,0.01172 0.15001501,0.15001501 0 0 1 -0.00977,0.01172 0.15001501,0.15001501 0 0 1 -0.048828,0.0332 0.15001501,0.15001501 0 0 1 -0.029297,0.0098 0.15001501,0.15001501 0 0 1 -0.029297,0.0039 0.15001501,0.15001501 0 0 1 -0.044922,-0.0059 0.15001501,0.15001501 0 0 1 -0.013672,-0.0059 0.15001501,0.15001501 0 0 1 -0.013672,-0.0059 0.15001501,0.15001501 0 0 1 -0.011719,-0.0078 0.15001501,0.15001501 0 0 1 -0.023438,-0.01953 A 0.15001501,0.15001501 0 0 1 8.875,21.085938 0.15001501,0.15001501 0 0 1 8.8535156,21.029297 0.15001501,0.15001501 0 0 1 8.8496094,21 V 4 a 0.15001501,0.15001501 0 0 1 0,-0.00977 V 3.1503906 Z M 2.984375,1.8496094 a 0.15001501,0.15001501 0 0 1 0.015625,0 h 12 a 0.1503906,0.1503906 0 1 1 0,0.3007812 H 3 A 0.15059339,0.15059339 0 0 1 2.984375,1.8496094 Z M 2.1503906,1.1503906 v 1.6992188 h 5.8320313 a 0.15001501,0.15001501 0 0 1 0.044922,0 h 0.9550781 a 0.15001501,0.15001501 0 0 1 0.044922,0 h 0.9550781 a 0.15001501,0.15001501 0 0 1 0.044922,0 h 5.822265 V 1.1503906 H 15.015625 15 2.9902344 Z M 1.9980469,0.84765625 a 0.15001501,0.15001501 0 0 1 0.029297,0.001953 H 2.984375 15 15.009766 16 A 0.15001501,0.15001501 0 0 1 16.150391,1 v 1.9824219 a 0.15001501,0.15001501 0 0 1 -0.0098,0.072266 0.15001501,0.15001501 0 0 1 0,0.00195 0.15001501,0.15001501 0 0 1 -0.0059,0.011719 0.15001501,0.15001501 0 0 1 -0.0078,0.013672 0.15001501,0.15001501 0 0 1 -0.0078,0.011719 0.15001501,0.15001501 0 0 1 0,0.00195 0.15001501,0.15001501 0 0 1 -0.0059,0.00391 0.15001501,0.15001501 0 0 1 -0.06836,0.044922 0.15001501,0.15001501 0 0 1 -0.02734,0.00586 0.15001501,0.15001501 0 0 1 -0.002,0 0.15001501,0.15001501 0 0 1 -0.04297,0 H 10.150391 V 22 A 0.15001501,0.15001501 0 0 1 10,22.150391 H 8 A 0.15001501,0.15001501 0 0 1 7.8496094,22 V 3.1503906 H 2 A 0.15001501,0.15001501 0 0 1 1.8496094,3 V 1.0175781 a 0.15001501,0.15001501 0 0 1 0.00977,-0.0722656 0.15001501,0.15001501 0 0 1 0,-0.001953 0.15001501,0.15001501 0 0 1 0.00586,-0.0117188 0.15001501,0.15001501 0 0 1 0,-0.001953 0.15001501,0.15001501 0 0 1 0.015625,-0.0234375 0.15001501,0.15001501 0 0 1 0,-0.001953 0.15001501,0.15001501 0 0 1 0.00586,-0.003906 0.15001501,0.15001501 0 0 1 0.015625,-0.015625 0.15001501,0.15001501 0 0 1 0.011719,-0.009766 0.15001501,0.15001501 0 0 1 0.041016,-0.0195313 0.15001501,0.15001501 0 0 1 0.027344,-0.005859 0.15001501,0.15001501 0 0 1 0.00195,0 0.15001501,0.15001501 0 0 1 0.013672,-0.001953 z"
     id="path2" />
</svg>
