<?xml version="1.0" encoding="UTF-8" standalone="no"?>
<svg
   xmlns:dc="http://purl.org/dc/elements/1.1/"
   xmlns:cc="http://creativecommons.org/ns#"
   xmlns:rdf="http://www.w3.org/1999/02/22-rdf-syntax-ns#"
   xmlns:svg="http://www.w3.org/2000/svg"
   xmlns="http://www.w3.org/2000/svg"
   xmlns:sodipodi="http://sodipodi.sourceforge.net/DTD/sodipodi-0.dtd"
   xmlns:inkscape="http://www.inkscape.org/namespaces/inkscape"
   data-dec="72"
   width="26"
   height="40"
   version="1.1"
   id="svg4"
   sodipodi:docname="72.svg"
   inkscape:version="0.92.4 (unknown)">
  <metadata
     id="metadata10">
    <rdf:RDF>
      <cc:Work
         rdf:about="">
        <dc:format>image/svg+xml</dc:format>
        <dc:type
           rdf:resource="http://purl.org/dc/dcmitype/StillImage" />
      </cc:Work>
    </rdf:RDF>
  </metadata>
  <defs
     id="defs8" />
  <sodipodi:namedview
     pagecolor="#ffffff"
     bordercolor="#666666"
     borderopacity="1"
     objecttolerance="10"
     gridtolerance="10"
     guidetolerance="10"
     inkscape:pageopacity="0"
     inkscape:pageshadow="2"
     inkscape:window-width="640"
     inkscape:window-height="480"
     id="namedview6"
     showgrid="false"
     inkscape:zoom="5.9"
     inkscape:cx="13"
     inkscape:cy="20"
     inkscape:window-x="0"
     inkscape:window-y="27"
     inkscape:window-maximized="0"
     inkscape:current-layer="svg4" />
  <path
     style="color:#000000;font-style:normal;font-variant:normal;font-weight:normal;font-stretch:normal;font-size:medium;line-height:normal;font-family:sans-serif;font-variant-ligatures:normal;font-variant-position:normal;font-variant-caps:normal;font-variant-numeric:normal;font-variant-alternates:normal;font-feature-settings:normal;text-indent:0;text-align:start;text-decoration:none;text-decoration-line:none;text-decoration-style:solid;text-decoration-color:#000000;letter-spacing:normal;word-spacing:normal;text-transform:none;writing-mode:lr-tb;direction:ltr;text-orientation:mixed;dominant-baseline:auto;baseline-shift:baseline;text-anchor:start;white-space:normal;shape-padding:0;clip-rule:nonzero;display:inline;overflow:visible;visibility:visible;opacity:1;isolation:auto;mix-blend-mode:normal;color-interpolation:sRGB;color-interpolation-filters:linearRGB;solid-color:#000000;solid-opacity:1;vector-effect:none;fill:#013272;fill-opacity:1;fill-rule:nonzero;stroke:none;stroke-width:1.5;stroke-linecap:round;stroke-linejoin:round;stroke-miterlimit:4;stroke-dasharray:none;stroke-dashoffset:0;stroke-opacity:1;color-rendering:auto;image-rendering:auto;shape-rendering:auto;text-rendering:auto;enable-background:accumulate"
     d="M 8.9746094,0.24023438 A 0.750075,0.750075 0 0 1 9.125,0.25 H 9.8789062 A 0.750075,0.750075 0 0 1 10.125,0.25 H 13 a 0.750075,0.750075 0 1 1 0,1.5 h -2.435547 l -2.4277342,8.5 H 18.578125 l 2.427734,-8.5 H 19 a 0.750075,0.750075 0 1 1 0,-1.5 h 2.878906 a 0.750075,0.750075 0 0 1 0.246094,0 h 0.753906 a 0.750075,0.750075 0 0 1 0.246094,0 H 26 a 0.750075,0.750075 0 1 1 0,1.5 h -2.435547 l -5.570312,19.5 H 20 a 0.750075,0.750075 0 1 1 0,1.5 h -2.878906 a 0.750075,0.750075 0 0 1 -0.246094,0 h -0.753906 a 0.750075,0.750075 0 0 1 -0.246094,0 H 13 a 0.750075,0.750075 0 1 1 0,-1.5 h 2.435547 l 2.712891,-9.5 H 7.7070312 l -2.7128906,9.5 H 7 a 0.750075,0.750075 0 1 1 0,1.5 H 4.1210938 A 0.750075,0.750075 0 0 1 3.875,22.75 H 3.1210938 A 0.750075,0.750075 0 0 1 2.875,22.75 H 0 a 0.750075,0.750075 0 1 1 0,-1.5 H 2.4355469 L 8.0058594,1.75 H 6 a 0.750075,0.750075 0 1 1 0,-1.5 h 2.8789062 a 0.750075,0.750075 0 0 1 0.095703,-0.009766 z"
     id="path2" />
</svg>
