<?xml version="1.0" encoding="UTF-8" standalone="no"?>
<svg
   xmlns:dc="http://purl.org/dc/elements/1.1/"
   xmlns:cc="http://creativecommons.org/ns#"
   xmlns:rdf="http://www.w3.org/1999/02/22-rdf-syntax-ns#"
   xmlns:svg="http://www.w3.org/2000/svg"
   xmlns="http://www.w3.org/2000/svg"
   xmlns:sodipodi="http://sodipodi.sourceforge.net/DTD/sodipodi-0.dtd"
   xmlns:inkscape="http://www.inkscape.org/namespaces/inkscape"
   data-dec="79"
   width="22"
   height="40"
   version="1.1"
   id="svg4"
   sodipodi:docname="79.svg"
   inkscape:version="0.92.4 (unknown)">
  <metadata
     id="metadata10">
    <rdf:RDF>
      <cc:Work
         rdf:about="">
        <dc:format>image/svg+xml</dc:format>
        <dc:type
           rdf:resource="http://purl.org/dc/dcmitype/StillImage" />
      </cc:Work>
    </rdf:RDF>
  </metadata>
  <defs
     id="defs8" />
  <sodipodi:namedview
     pagecolor="#ffffff"
     bordercolor="#666666"
     borderopacity="1"
     objecttolerance="10"
     gridtolerance="10"
     guidetolerance="10"
     inkscape:pageopacity="0"
     inkscape:pageshadow="2"
     inkscape:window-width="640"
     inkscape:window-height="480"
     id="namedview6"
     showgrid="false"
     inkscape:zoom="5.9"
     inkscape:cx="11"
     inkscape:cy="20"
     inkscape:window-x="0"
     inkscape:window-y="27"
     inkscape:window-maximized="0"
     inkscape:current-layer="svg4" />
  <path
     style="color:#000000;font-style:normal;font-variant:normal;font-weight:normal;font-stretch:normal;font-size:medium;line-height:normal;font-family:sans-serif;font-variant-ligatures:normal;font-variant-position:normal;font-variant-caps:normal;font-variant-numeric:normal;font-variant-alternates:normal;font-feature-settings:normal;text-indent:0;text-align:start;text-decoration:none;text-decoration-line:none;text-decoration-style:solid;text-decoration-color:#000000;letter-spacing:normal;word-spacing:normal;text-transform:none;writing-mode:lr-tb;direction:ltr;text-orientation:mixed;dominant-baseline:auto;baseline-shift:baseline;text-anchor:start;white-space:normal;shape-padding:0;clip-rule:nonzero;display:inline;overflow:visible;visibility:visible;opacity:1;isolation:auto;mix-blend-mode:normal;color-interpolation:sRGB;color-interpolation-filters:linearRGB;solid-color:#000000;solid-opacity:1;vector-effect:none;fill:#000000;fill-opacity:1;fill-rule:nonzero;stroke:none;stroke-width:0.30000001;stroke-linecap:round;stroke-linejoin:round;stroke-miterlimit:4;stroke-dasharray:none;stroke-dashoffset:0;stroke-opacity:1;color-rendering:auto;image-rendering:auto;shape-rendering:auto;text-rendering:auto;enable-background:accumulate"
     d="M 9.0351562,3.1503906 7.1113281,4.1113281 6.1386719,6.0566406 5.1503906,9.0234375 v 4.9531245 l 0.9882813,2.966797 0.9726562,1.945313 1.9238281,0.960937 h 4.9296878 l 1.923828,-0.960937 0.972656,-1.945313 0.988281,-2.966797 V 9.0234375 L 16.861328,6.0566406 15.888672,4.1113281 13.964844,3.1503906 Z M 8.984375,2.8496094 a 0.15001501,0.15001501 0 0 1 0.015625,0 h 5 a 0.15001501,0.15001501 0 0 1 0.06641,0.015625 l 1.980469,0.9902344 a 0.15001501,0.15001501 0 0 1 0.01367,0.00586 l 0.0059,0.00391 a 0.15001501,0.15001501 0 0 1 0.01758,0.011719 0.15001501,0.15001501 0 0 1 0.0059,0.00195 0.15001501,0.15001501 0 0 1 0.0078,0.00586 0.15001501,0.15001501 0 0 1 0.0039,0.00391 0.15001501,0.15001501 0 0 1 0.0078,0.00781 0.15001501,0.15001501 0 0 1 0.002,0.00195 0.15001501,0.15001501 0 0 1 0.0078,0.00977 0.15001501,0.15001501 0 0 1 0.002,0.00195 0.15001501,0.15001501 0 0 1 0.0059,0.00977 0.15001501,0.15001501 0 0 1 0.002,0.00195 0.15001501,0.15001501 0 0 1 0.0059,0.011719 0.15001501,0.15001501 0 0 1 0.0078,0.015625 l 0.992188,1.984375 a 0.15001501,0.15001501 0 0 1 0.0078,0.019531 l 1,3 A 0.15001501,0.15001501 0 0 1 18.150391,9 v 5 a 0.15001501,0.15001501 0 0 1 -0.0078,0.04687 l -1,3 a 0.15001501,0.15001501 0 0 1 -0.0078,0.01953 l -1,2 a 0.15001501,0.15001501 0 0 1 -0.06836,0.06836 l -2,1 A 0.15001501,0.15001501 0 0 1 14,20.150391 H 9 a 0.15001501,0.15001501 0 0 1 -0.066406,-0.01563 l -2,-1 a 0.15001501,0.15001501 0 0 1 -0.068359,-0.06836 l -1,-2 a 0.15001501,0.15001501 0 0 1 -0.00781,-0.01953 l -1,-3 A 0.15001501,0.15001501 0 0 1 4.8496094,14 V 9 a 0.15001501,0.15001501 0 0 1 0.00781,-0.046875 l 1,-3 a 0.15001501,0.15001501 0 0 1 0.00781,-0.019531 l 1,-2 a 0.15001501,0.15001501 0 0 1 0.068359,-0.068359 l 2,-1 A 0.15001501,0.15001501 0 0 1 8.984375,2.8496094 Z M 9.0351562,2.1503906 7.1035156,3.1171875 5.1367188,6.0664062 4.1503906,9.0234375 v 4.9531245 l 0.9882813,2.966797 0.9785156,1.953125 2.9277344,1.953125 h 4.9101561 l 2.927734,-1.953125 0.97461,-1.943359 0.0039,-0.0098 0.988281,-2.966797 V 9.0234375 L 17.861328,6.0566406 16.882812,4.1035156 13.955078,2.1503906 H 13.015625 13 12.990234 10 9.9902344 Z M 8.9824219,1.8496094 a 0.15001501,0.15001501 0 0 1 0.017578,0 H 9.015625 9.984375 10 12.984375 13 a 0.15001501,0.15001501 0 0 1 0.0098,0 H 14 A 0.15001501,0.15001501 0 0 1 14.083984,1.875 l 3,2 a 0.15001501,0.15001501 0 0 1 0.05078,0.058594 l 1,2 a 0.15001501,0.15001501 0 0 1 0.0078,0.019531 l 0.990234,2.9746094 a 0.15001501,0.15001501 0 0 1 0.0059,0.013672 l 0.0039,0.011719 a 0.15001501,0.15001501 0 0 1 0,0.00195 0.15001501,0.15001501 0 0 1 0.0039,0.015625 A 0.15001501,0.15001501 0 0 1 19.150391,9 v 5 a 0.15001501,0.15001501 0 0 1 0,0.0039 0.15001501,0.15001501 0 0 1 -0.0039,0.0293 0.15001501,0.15001501 0 0 1 -0.0039,0.01367 l -1,3 a 0.15001501,0.15001501 0 0 1 -0.002,0.0059 0.15001501,0.15001501 0 0 1 -0.002,0.0039 0.15001501,0.15001501 0 0 1 -0.0039,0.0098 0.15001501,0.15001501 0 0 1 -0.0098,0.01758 l -0.990234,1.982422 a 0.15001501,0.15001501 0 0 1 -0.05078,0.05859 l -3,2 A 0.15001501,0.15001501 0 0 1 14,21.150391 H 9 A 0.15001501,0.15001501 0 0 1 8.9160156,21.125 l -3,-2 a 0.15001501,0.15001501 0 0 1 -0.050781,-0.05859 l -1,-2 a 0.15001501,0.15001501 0 0 1 -0.00781,-0.01953 L 3.8671875,14.072266 a 0.15001501,0.15001501 0 0 1 -0.00977,-0.02539 0.15001501,0.15001501 0 0 1 -0.00195,-0.0098 0.15001501,0.15001501 0 0 1 -0.00195,-0.0078 0.15001501,0.15001501 0 0 1 -0.00195,-0.0059 0.15001501,0.15001501 0 0 1 0,-0.002 0.15001501,0.15001501 0 0 1 -0.00195,-0.01367 0.15001501,0.15001501 0 0 1 0,-0.0078 v -0.0078 -4.9804692 a 0.15001501,0.15001501 0 0 1 0,-0.011719 0.15001501,0.15001501 0 0 1 0.00195,-0.017578 0.15001501,0.15001501 0 0 1 0.00586,-0.029297 l 1,-3 a 0.15001501,0.15001501 0 0 1 0.00391,-0.00977 0.15001501,0.15001501 0 0 1 0.00586,-0.013672 0.15001501,0.15001501 0 0 1 0.00781,-0.013672 0.15001501,0.15001501 0 0 1 0.00781,-0.011719 L 6.875,2.9160156 a 0.15001501,0.15001501 0 0 1 0.058594,-0.050781 L 8.9140625,1.875 a 0.15001501,0.15001501 0 0 1 0.019531,-0.00977 0.15001501,0.15001501 0 0 1 0.00781,-0.00391 0.15001501,0.15001501 0 0 1 0.015625,-0.00586 0.15001501,0.15001501 0 0 1 0.00195,0 0.15001501,0.15001501 0 0 1 0.023437,-0.00586 z M 9.0351562,1.1503906 7.0878906,2.1230469 5.1230469,4.0878906 4.1386719,6.0566406 3.1503906,9.0234375 v 4.9531245 l 0.9882813,2.966797 0.984375,1.96875 1.9648437,1.964844 1.9472656,0.972656 h 4.9296878 l 1.947265,-0.972656 1.964844,-1.964844 0.984375,-1.96875 0.988281,-2.966797 V 9.0234375 L 18.861328,6.0566406 17.876953,4.0878906 15.912109,2.1230469 13.964844,1.1503906 Z M 8.9824219,0.84960938 a 0.15001501,0.15001501 0 0 1 0.017578,0 H 9.015625 14 a 0.15001501,0.15001501 0 0 1 0.06641,0.015625 l 2,1.00000002 a 0.15001501,0.15001501 0 0 1 0.03906,0.029297 l 2,2 a 0.15001501,0.15001501 0 0 1 0.0293,0.039063 l 1,2 a 0.15001501,0.15001501 0 0 1 0.0078,0.019531 l 1,3 A 0.15001501,0.15001501 0 0 1 20.150391,9 v 5 a 0.15001501,0.15001501 0 0 1 -0.0078,0.04687 l -1,3 a 0.15001501,0.15001501 0 0 1 -0.0078,0.01953 l -1,2 a 0.15001501,0.15001501 0 0 1 -0.0293,0.03906 l -2,2 a 0.15001501,0.15001501 0 0 1 -0.03906,0.0293 l -1.980468,0.990234 -0.01953,0.0098 a 0.15001501,0.15001501 0 0 1 -0.02539,0.0098 0.15001501,0.15001501 0 0 1 -0.02344,0.0059 0.15001501,0.15001501 0 0 1 -0.002,0 0.15001501,0.15001501 0 0 1 -0.01563,0 H 13.984375 9 a 0.15001501,0.15001501 0 0 1 -0.066406,-0.01563 l -2,-1 a 0.15001501,0.15001501 0 0 1 -0.039063,-0.0293 l -2,-2 a 0.15001501,0.15001501 0 0 1 -0.029297,-0.03906 l -1,-2 a 0.15001501,0.15001501 0 0 1 -0.00781,-0.01953 l -1,-3 A 0.15001501,0.15001501 0 0 1 2.8496094,14 V 9 a 0.15001501,0.15001501 0 0 1 0.00781,-0.046875 l 1,-3 a 0.15001501,0.15001501 0 0 1 0.00781,-0.019531 l 1,-2 a 0.15001501,0.15001501 0 0 1 0.029297,-0.039063 l 2,-2 a 0.15001501,0.15001501 0 0 1 0.039063,-0.029297 L 8.9140625,0.875 a 0.15001501,0.15001501 0 0 1 0.019531,-0.009766 0.15001501,0.15001501 0 0 1 0.00781,-0.003906 0.15001501,0.15001501 0 0 1 0.015625,-0.005859 0.15001501,0.15001501 0 0 1 0.00195,0 0.15001501,0.15001501 0 0 1 0.023437,-0.005859 z"
     id="path2" />
</svg>
