<?xml version="1.0" encoding="UTF-8"?>
<glyph name="B" format="1">
  <advance width="694"/>
  <unicode hex="0042"/>
  <outline>
    <contour>
      <point x="498" y="300" type="line"/>
      <point x="528" y="242" type="line"/>
      <point x="528" y="239" type="line"/>
      <point x="528" y="182" type="line"/>
      <point x="528" y="179" type="line"/>
      <point x="499" y="92" type="line" smooth="yes"/>
      <point x="499" y="91"/>
      <point x="498" y="90"/>
      <point x="497" y="89" type="curve" smooth="yes"/>
      <point x="448" y="41" type="line"/>
      <point x="460" y="43" type="line"/>
      <point x="515" y="98" type="line"/>
      <point x="542" y="183" type="line"/>
      <point x="542" y="238" type="line"/>
      <point x="516" y="292" type="line"/>
    </contour>
    <contour>
      <point x="212" y="319" type="line"/>
      <point x="125" y="14" type="line"/>
      <point x="346" y="14" type="line"/>
      <point x="430" y="43" type="line"/>
      <point x="486" y="98" type="line"/>
      <point x="514" y="183" type="line"/>
      <point x="514" y="238" type="line"/>
      <point x="486" y="293" type="line"/>
      <point x="460" y="319" type="line"/>
    </contour>
    <contour>
      <point x="559" y="585" type="line"/>
      <point x="585" y="532" type="line" smooth="yes"/>
      <point x="585" y="531"/>
      <point x="586" y="530"/>
      <point x="586" y="529" type="curve" smooth="yes"/>
      <point x="586" y="471" type="line"/>
      <point x="586" y="469" type="line"/>
      <point x="557" y="382" type="line" smooth="yes"/>
      <point x="557" y="381"/>
      <point x="557" y="379"/>
      <point x="556" y="378" type="curve" smooth="yes"/>
      <point x="534" y="358" type="line"/>
      <point x="546" y="361" type="line"/>
      <point x="573" y="388" type="line"/>
      <point x="601" y="472" type="line"/>
      <point x="601" y="527" type="line"/>
      <point x="574" y="581" type="line"/>
    </contour>
    <contour>
      <point x="295" y="608" type="line"/>
      <point x="217" y="333" type="line"/>
      <point x="462" y="333" type="line"/>
      <point x="517" y="361" type="line"/>
      <point x="543" y="388" type="line"/>
      <point x="572" y="472" type="line"/>
      <point x="572" y="527" type="line"/>
      <point x="544" y="581" type="line"/>
      <point x="491" y="608" type="line"/>
    </contour>
    <contour>
      <point x="266" y="608" type="line"/>
      <point x="97" y="14" type="line"/>
      <point x="110" y="14" type="line"/>
      <point x="198" y="320" type="line" smooth="yes"/>
      <point x="197" y="321"/>
      <point x="196" y="324"/>
      <point x="196" y="326" type="curve" smooth="yes"/>
      <point x="196" y="329"/>
      <point x="198" y="332"/>
      <point x="201" y="333" type="curve" smooth="yes"/>
      <point x="279" y="608" type="line"/>
    </contour>
    <contour>
      <point x="261" y="623" type="line"/>
      <point x="262" y="623" type="line"/>
      <point x="288" y="623" type="line"/>
      <point x="289" y="623" type="line"/>
      <point x="290" y="623" type="line"/>
      <point x="491" y="623" type="line"/>
      <point x="492" y="623" type="line"/>
      <point x="493" y="623" type="line"/>
      <point x="494" y="623" type="line"/>
      <point x="495" y="623" type="line"/>
      <point x="581" y="593" type="line" smooth="yes"/>
      <point x="582" y="593"/>
      <point x="584" y="591"/>
      <point x="585" y="590" type="curve" smooth="yes"/>
      <point x="614" y="532" type="line" smooth="yes"/>
      <point x="614" y="531"/>
      <point x="615" y="530"/>
      <point x="615" y="529" type="curve" smooth="yes"/>
      <point x="615" y="471" type="line"/>
      <point x="615" y="469" type="line"/>
      <point x="586" y="382" type="line" smooth="yes"/>
      <point x="586" y="381"/>
      <point x="585" y="379"/>
      <point x="584" y="378" type="curve" smooth="yes"/>
      <point x="556" y="350" type="line" smooth="yes"/>
      <point x="555" y="349"/>
      <point x="553" y="348"/>
      <point x="552" y="348" type="curve" smooth="yes"/>
      <point x="482" y="324" type="line"/>
      <point x="525" y="304" type="line"/>
      <point x="528" y="300" type="line"/>
      <point x="557" y="242" type="line" smooth="yes"/>
      <point x="557" y="241"/>
      <point x="558" y="240"/>
      <point x="558" y="239" type="curve" smooth="yes"/>
      <point x="558" y="182" type="line" smooth="yes"/>
      <point x="558" y="181"/>
      <point x="557" y="180"/>
      <point x="557" y="179" type="curve" smooth="yes"/>
      <point x="528" y="92" type="line" smooth="yes"/>
      <point x="528" y="91"/>
      <point x="527" y="90"/>
      <point x="526" y="89" type="curve" smooth="yes"/>
      <point x="469" y="32" type="line" smooth="yes"/>
      <point x="468" y="31"/>
      <point x="466" y="30"/>
      <point x="465" y="30" type="curve" smooth="yes"/>
      <point x="350" y="1" type="line"/>
      <point x="349" y="1" type="line"/>
      <point x="349" y="0" type="line"/>
      <point x="348" y="0" type="line"/>
      <point x="346" y="0" type="line"/>
      <point x="117" y="0" type="line"/>
      <point x="116" y="0" type="line"/>
      <point x="114" y="0" type="line"/>
      <point x="88" y="0" type="line"/>
      <point x="87" y="0" type="line"/>
      <point x="86" y="0" type="line"/>
      <point x="0" y="0" type="line" smooth="yes"/>
      <point x="-4" y="0"/>
      <point x="-8" y="4"/>
      <point x="-8" y="8" type="curve" smooth="yes"/>
      <point x="-8" y="12"/>
      <point x="-4" y="14"/>
      <point x="0" y="14" type="curve" smooth="yes"/>
      <point x="81" y="14" type="line"/>
      <point x="251" y="608" type="line"/>
      <point x="174" y="608" type="line" smooth="yes"/>
      <point x="170" y="608"/>
      <point x="166" y="612"/>
      <point x="166" y="616" type="curve" smooth="yes"/>
      <point x="166" y="620"/>
      <point x="170" y="623"/>
      <point x="174" y="623" type="curve" smooth="yes"/>
      <point x="260" y="623" type="line"/>
    </contour>
  </outline>
  <lib>
    <dict>
      <key>com.fontlab.hintData</key>
      <dict>
        <key>hhints</key>
        <array>
          <dict>
            <key>position</key>
            <integer>0</integer>
            <key>width</key>
            <integer>14</integer>
          </dict>
          <dict>
            <key>position</key>
            <integer>319</integer>
            <key>width</key>
            <integer>14</integer>
          </dict>
          <dict>
            <key>position</key>
            <integer>608</integer>
            <key>width</key>
            <integer>14</integer>
          </dict>
        </array>
        <key>vhints</key>
        <array>
          <dict>
            <key>position</key>
            <integer>514</integer>
            <key>width</key>
            <integer>14</integer>
          </dict>
          <dict>
            <key>position</key>
            <integer>542</integer>
            <key>width</key>
            <integer>15</integer>
          </dict>
          <dict>
            <key>position</key>
            <integer>572</integer>
            <key>width</key>
            <integer>14</integer>
          </dict>
          <dict>
            <key>position</key>
            <integer>601</integer>
            <key>width</key>
            <integer>14</integer>
          </dict>
        </array>
      </dict>
    </dict>
  </lib>
</glyph>
