<?xml version="1.0" encoding="UTF-8" standalone="no"?>
<svg
   xmlns:dc="http://purl.org/dc/elements/1.1/"
   xmlns:cc="http://creativecommons.org/ns#"
   xmlns:rdf="http://www.w3.org/1999/02/22-rdf-syntax-ns#"
   xmlns:svg="http://www.w3.org/2000/svg"
   xmlns="http://www.w3.org/2000/svg"
   xmlns:sodipodi="http://sodipodi.sourceforge.net/DTD/sodipodi-0.dtd"
   xmlns:inkscape="http://www.inkscape.org/namespaces/inkscape"
   data-dec="104"
   width="19"
   height="40"
   version="1.1"
   id="svg4"
   sodipodi:docname="104.svg"
   inkscape:version="0.92.4 5da689c313, 2019-01-14">
  <metadata
     id="metadata10">
    <rdf:RDF>
      <cc:Work
         rdf:about="">
        <dc:format>image/svg+xml</dc:format>
        <dc:type
           rdf:resource="http://purl.org/dc/dcmitype/StillImage" />
        <dc:title></dc:title>
      </cc:Work>
    </rdf:RDF>
  </metadata>
  <defs
     id="defs8" />
  <sodipodi:namedview
     pagecolor="#ffffff"
     bordercolor="#666666"
     borderopacity="1"
     objecttolerance="10"
     gridtolerance="10"
     guidetolerance="10"
     inkscape:pageopacity="0"
     inkscape:pageshadow="2"
     inkscape:window-width="1920"
     inkscape:window-height="1043"
     id="namedview6"
     showgrid="false"
     inkscape:zoom="5.9"
     inkscape:cx="9.5"
     inkscape:cy="20"
     inkscape:window-x="0"
     inkscape:window-y="37"
     inkscape:window-maximized="0"
     inkscape:current-layer="svg4" />
  <path
     style="color:#000000;font-style:normal;font-variant:normal;font-weight:normal;font-stretch:normal;font-size:medium;line-height:normal;font-family:sans-serif;font-variant-ligatures:normal;font-variant-position:normal;font-variant-caps:normal;font-variant-numeric:normal;font-variant-alternates:normal;font-feature-settings:normal;text-indent:0;text-align:start;text-decoration:none;text-decoration-line:none;text-decoration-style:solid;text-decoration-color:#000000;letter-spacing:normal;word-spacing:normal;text-transform:none;writing-mode:lr-tb;direction:ltr;text-orientation:mixed;dominant-baseline:auto;baseline-shift:baseline;text-anchor:start;white-space:normal;shape-padding:0;clip-rule:nonzero;display:inline;overflow:visible;visibility:visible;opacity:1;isolation:auto;mix-blend-mode:normal;color-interpolation:sRGB;color-interpolation-filters:linearRGB;solid-color:#000000;solid-opacity:1;vector-effect:none;fill:#000000;fill-opacity:1;fill-rule:nonzero;stroke:none;stroke-width:0.5;stroke-linecap:round;stroke-linejoin:round;stroke-miterlimit:4;stroke-dasharray:none;stroke-dashoffset:0;stroke-opacity:1;color-rendering:auto;image-rendering:auto;shape-rendering:auto;text-rendering:auto;enable-background:accumulate"
     d="M 15.25,21.605469 V 21.75 h 0.144531 z m -1.5,0 L 13.605469,21.75 H 13.75 Z m -8.5,0 V 21.75 h 0.1445312 z m -1.5,0 L 3.6054688,21.75 H 3.75 Z M 13.292969,9.0292969 14.222656,10.888672 A 0.250025,0.250025 0 0 1 14.25,11 v 9.960938 a 0.250025,0.250025 0 0 1 0,0.07422 V 21.75 h 0.5 v -0.720703 a 0.250025,0.250025 0 0 1 0,-0.06055 V 11.058594 L 13.822266,9.2050781 Z M 4.75,1.3457031 3.2128906,1.8574219 3.75,2.3945312 V 2 a 0.250025,0.250025 0 1 1 0.5,0 v 0.9707031 a 0.250025,0.250025 0 0 1 0,0.060547 v 17.929688 a 0.250025,0.250025 0 0 1 0,0.07422 V 21.75 h 0.5 v -0.720703 a 0.250025,0.250025 0 0 1 0,-0.06055 v -8.941406 a 0.250025,0.250025 0 0 1 0,-0.05078 z M 4.9960938,0.74609375 a 0.250025,0.250025 0 0 1 0.015625,0.001953 0.250025,0.250025 0 0 1 0.070312,0.0136719 0.250025,0.250025 0 0 1 0.00391,0 0.250025,0.250025 0 0 1 0.00781,0.003906 0.250025,0.250025 0 0 1 0.015625,0.005859 0.250025,0.250025 0 0 1 0.00781,0.003906 0.250025,0.250025 0 0 1 0.013672,0.007813 0.250025,0.250025 0 0 1 0.00781,0.003906 0.250025,0.250025 0 0 1 0.013672,0.009766 0.250025,0.250025 0 0 1 0.00586,0.005859 0.250025,0.250025 0 0 1 0.011719,0.009766 0.250025,0.250025 0 0 1 0.039063,0.0449219 A 0.250025,0.250025 0 0 1 5.25,1.0390625 V 11.171875 L 6.7910156,8.8613281 a 0.250025,0.250025 0 0 1 0.097656,-0.083984 l 2,-1 A 0.250025,0.250025 0 0 1 9,7.75 h 1.966797 a 0.250025,0.250025 0 0 1 0.03906,0 0.250025,0.250025 0 0 1 0.0098,0 0.250025,0.250025 0 0 1 0.01563,0.00195 0.250025,0.250025 0 0 1 0.02344,0.00391 0.250025,0.250025 0 0 1 0.0098,0.00195 0.250025,0.250025 0 0 1 0.03516,0.013672 l 2.978516,0.9921875 a 0.250025,0.250025 0 0 1 0.144531,0.125 l 1,2.0000001 A 0.250025,0.250025 0 0 1 15.25,11 v 9.894531 L 16.103516,21.75 H 17 a 0.250025,0.250025 0 0 1 0,0.5 h -1.021484 -0.9375 a 0.250025,0.250025 0 0 1 -0.08789,0 h -0.912109 a 0.250025,0.250025 0 0 1 -0.08789,0 H 13 12 a 0.250025,0.250025 0 0 1 0,-0.5 h 0.896484 L 13.75,20.894531 V 11.058594 L 12.814453,9.1855469 10.943359,8.25 H 9.0585938 L 7.171875,9.1933594 5.25,12.076172 v 8.818359 L 6.1035156,21.75 H 7 a 0.250025,0.250025 0 0 1 0,0.5 h -1.0214844 -0.9375 a 0.250025,0.250025 0 0 1 -0.087891,0 H 4.0410156 a 0.250025,0.250025 0 0 1 -0.087891,0 H 3 2 a 0.250025,0.250025 0 0 1 0,-0.5 H 2.8964844 L 3.75,20.894531 V 3.1054688 L 2.8964844,2.25 H 2 A 0.250025,0.250025 0 0 1 1.921875,1.7636719 L 4.8769531,0.77929688 a 0.250025,0.250025 0 0 1 0.00391,-0.001953 0.250025,0.250025 0 0 1 0.1152344,-0.03125 z"
     id="path2" />
</svg>
