<?xml version="1.0" encoding="UTF-8" standalone="no"?>
<svg
   xmlns:dc="http://purl.org/dc/elements/1.1/"
   xmlns:cc="http://creativecommons.org/ns#"
   xmlns:rdf="http://www.w3.org/1999/02/22-rdf-syntax-ns#"
   xmlns:svg="http://www.w3.org/2000/svg"
   xmlns="http://www.w3.org/2000/svg"
   xmlns:sodipodi="http://sodipodi.sourceforge.net/DTD/sodipodi-0.dtd"
   xmlns:inkscape="http://www.inkscape.org/namespaces/inkscape"
   data-dec="34"
   width="18"
   height="40"
   version="1.1"
   id="svg4"
   sodipodi:docname="34.svg"
   inkscape:version="0.92.4 5da689c313, 2019-01-14">
  <metadata
     id="metadata10">
    <rdf:RDF>
      <cc:Work
         rdf:about="">
        <dc:format>image/svg+xml</dc:format>
        <dc:type
           rdf:resource="http://purl.org/dc/dcmitype/StillImage" />
        <dc:title></dc:title>
      </cc:Work>
    </rdf:RDF>
  </metadata>
  <defs
     id="defs8" />
  <sodipodi:namedview
     pagecolor="#ffffff"
     bordercolor="#666666"
     borderopacity="1"
     objecttolerance="10"
     gridtolerance="10"
     guidetolerance="10"
     inkscape:pageopacity="0"
     inkscape:pageshadow="2"
     inkscape:window-width="1920"
     inkscape:window-height="1043"
     id="namedview6"
     showgrid="false"
     inkscape:zoom="5.9"
     inkscape:cx="9"
     inkscape:cy="20"
     inkscape:window-x="0"
     inkscape:window-y="37"
     inkscape:window-maximized="0"
     inkscape:current-layer="svg4" />
  <path
     style="color:#000000;font-style:normal;font-variant:normal;font-weight:normal;font-stretch:normal;font-size:medium;line-height:normal;font-family:sans-serif;font-variant-ligatures:normal;font-variant-position:normal;font-variant-caps:normal;font-variant-numeric:normal;font-variant-alternates:normal;font-feature-settings:normal;text-indent:0;text-align:start;text-decoration:none;text-decoration-line:none;text-decoration-style:solid;text-decoration-color:#000000;letter-spacing:normal;word-spacing:normal;text-transform:none;writing-mode:lr-tb;direction:ltr;text-orientation:mixed;dominant-baseline:auto;baseline-shift:baseline;text-anchor:start;white-space:normal;shape-padding:0;clip-rule:nonzero;display:inline;overflow:visible;visibility:visible;opacity:1;isolation:auto;mix-blend-mode:normal;color-interpolation:sRGB;color-interpolation-filters:linearRGB;solid-color:#000000;solid-opacity:1;vector-effect:none;fill:#000000;fill-opacity:1;fill-rule:nonzero;stroke:none;stroke-width:2.5;stroke-linecap:round;stroke-linejoin:round;stroke-miterlimit:4;stroke-dasharray:none;stroke-dashoffset:0;stroke-opacity:1;color-rendering:auto;image-rendering:auto;shape-rendering:auto;text-rendering:auto;enable-background:accumulate"
     d="m 4.9746094,-0.26171875 a 1.250125,1.250125 0 0 1 0.017578,0 1.250125,1.250125 0 0 1 1.0332031,0.51757813 L 6.8847656,1.1152344 A 1.250125,1.250125 0 0 1 7.1855469,2.3945312 L 5.2148438,8.3085938 a 1.250125,1.250125 0 0 1 -0.03125,0.1035156 1.250125,1.250125 0 0 1 -0.1699219,0.3320312 1.250125,1.250125 0 0 1 -0.1640625,0.1875 1.250125,1.250125 0 0 1 -0.085937,0.074219 1.250125,1.250125 0 0 1 -0.00977,0.00781 1.250125,1.250125 0 0 1 -0.00586,0.00391 1.250125,1.250125 0 0 1 -0.083984,0.056641 1.250125,1.250125 0 0 1 -0.013672,0.00977 1.250125,1.250125 0 0 1 -0.00781,0.00391 1.250125,1.250125 0 0 1 -0.1015625,0.054687 1.250125,1.250125 0 0 1 -0.1152344,0.048828 1.250125,1.250125 0 0 1 -0.109375,0.033203 1.250125,1.250125 0 0 1 -0.00977,0.00391 1.250125,1.250125 0 0 1 -0.00781,0.00195 1.250125,1.250125 0 0 1 -0.0625,0.013672 1.250125,1.250125 0 0 1 -0.017578,0.00195 1.250125,1.250125 0 0 1 -0.050781,0.00977 1.250125,1.250125 0 0 1 -0.056641,0.00586 1.250125,1.250125 0 0 1 -0.035156,0.00195 1.250125,1.250125 0 0 1 -0.025391,0.00195 A 1.250125,1.250125 0 0 1 4,9.2675781 a 1.250125,1.250125 0 0 1 -0.042969,-0.00195 1.250125,1.250125 0 0 1 -0.00391,0 1.250125,1.250125 0 0 1 -0.03125,-0.00195 1.250125,1.250125 0 0 1 -0.050781,-0.00391 1.250125,1.250125 0 0 1 -0.00977,0 1.250125,1.250125 0 0 1 -0.00586,-0.00195 1.250125,1.250125 0 0 1 -0.037109,-0.00391 1.250125,1.250125 0 0 1 -0.039063,-0.00586 1.250125,1.250125 0 0 1 -0.00977,-0.00195 1.250125,1.250125 0 0 1 -0.017578,-0.00391 1.250125,1.250125 0 0 1 -0.037109,-0.00781 1.250125,1.250125 0 0 1 -0.052734,-0.013672 1.250125,1.250125 0 0 1 -0.00781,-0.00195 1.250125,1.250125 0 0 1 -0.017578,-0.00586 A 1.250125,1.250125 0 0 1 3.5839844,9.1972656 1.250125,1.250125 0 0 1 3.5410156,9.1796875 1.250125,1.250125 0 0 1 3.53125,9.1757812 1.250125,1.250125 0 0 1 3.4765625,9.1523438 1.250125,1.250125 0 0 1 3.4179688,9.1230469 1.250125,1.250125 0 0 1 3.3886719,9.109375 1.250125,1.250125 0 0 1 3.3730469,9.0996094 1.250125,1.250125 0 0 1 3.3144531,9.0625 1.250125,1.250125 0 0 1 3.3105469,9.0605469 1.250125,1.250125 0 0 1 3.25,9.0175781 1.250125,1.250125 0 0 1 3.2265625,9 1.250125,1.250125 0 0 1 3.2167969,8.9921875 1.250125,1.250125 0 0 1 3.2089844,8.9863281 1.250125,1.250125 0 0 1 3.1582031,8.9433594 1.250125,1.250125 0 0 1 3.1308594,8.9179688 1.250125,1.250125 0 0 1 3.0585938,8.8417969 1.250125,1.250125 0 0 1 2.9804688,8.7441406 1.250125,1.250125 0 0 1 2.9121094,8.6386719 1.250125,1.250125 0 0 1 2.8554688,8.5273438 1.250125,1.250125 0 0 1 2.8105469,8.4121094 1.250125,1.250125 0 0 1 2.7773438,8.2910156 1.250125,1.250125 0 0 1 2.7558594,8.1679688 a 1.250125,1.250125 0 0 1 -0.00586,-0.25 1.250125,1.250125 0 0 1 0,-0.00781 V 2 A 1.250125,1.250125 0 0 1 3.1152344,1.1152344 L 3.9785156,0.25195312 a 1.250125,1.250125 0 0 1 0.9785156,-0.51171874 1.250125,1.250125 0 0 1 0.017578,-0.001953 z"
     id="path2" />
</svg>
