<?xml version="1.0" encoding="UTF-8" standalone="no"?>
<svg
   xmlns:dc="http://purl.org/dc/elements/1.1/"
   xmlns:cc="http://creativecommons.org/ns#"
   xmlns:rdf="http://www.w3.org/1999/02/22-rdf-syntax-ns#"
   xmlns:svg="http://www.w3.org/2000/svg"
   xmlns="http://www.w3.org/2000/svg"
   xmlns:sodipodi="http://sodipodi.sourceforge.net/DTD/sodipodi-0.dtd"
   xmlns:inkscape="http://www.inkscape.org/namespaces/inkscape"
   data-dec="105"
   width="10"
   height="40"
   version="1.1"
   id="svg4"
   sodipodi:docname="105.svg"
   inkscape:version="0.92.4 5da689c313, 2019-01-14">
  <metadata
     id="metadata10">
    <rdf:RDF>
      <cc:Work
         rdf:about="">
        <dc:format>image/svg+xml</dc:format>
        <dc:type
           rdf:resource="http://purl.org/dc/dcmitype/StillImage" />
        <dc:title></dc:title>
      </cc:Work>
    </rdf:RDF>
  </metadata>
  <defs
     id="defs8" />
  <sodipodi:namedview
     pagecolor="#ffffff"
     bordercolor="#666666"
     borderopacity="1"
     objecttolerance="10"
     gridtolerance="10"
     guidetolerance="10"
     inkscape:pageopacity="0"
     inkscape:pageshadow="2"
     inkscape:window-width="1920"
     inkscape:window-height="1043"
     id="namedview6"
     showgrid="false"
     inkscape:zoom="5.9"
     inkscape:cx="5"
     inkscape:cy="20"
     inkscape:window-x="0"
     inkscape:window-y="37"
     inkscape:window-maximized="0"
     inkscape:current-layer="svg4" />
  <path
     style="color:#000000;font-style:normal;font-variant:normal;font-weight:normal;font-stretch:normal;font-size:medium;line-height:normal;font-family:sans-serif;font-variant-ligatures:normal;font-variant-position:normal;font-variant-caps:normal;font-variant-numeric:normal;font-variant-alternates:normal;font-feature-settings:normal;text-indent:0;text-align:start;text-decoration:none;text-decoration-line:none;text-decoration-style:solid;text-decoration-color:#000000;letter-spacing:normal;word-spacing:normal;text-transform:none;writing-mode:lr-tb;direction:ltr;text-orientation:mixed;dominant-baseline:auto;baseline-shift:baseline;text-anchor:start;white-space:normal;shape-padding:0;clip-rule:nonzero;display:inline;overflow:visible;visibility:visible;opacity:1;isolation:auto;mix-blend-mode:normal;color-interpolation:sRGB;color-interpolation-filters:linearRGB;solid-color:#000000;solid-opacity:1;vector-effect:none;fill:#000000;fill-opacity:1;fill-rule:nonzero;stroke:none;stroke-width:0.5;stroke-linecap:round;stroke-linejoin:round;stroke-miterlimit:4;stroke-dasharray:none;stroke-dashoffset:0;stroke-opacity:1;color-rendering:auto;image-rendering:auto;shape-rendering:auto;text-rendering:auto;enable-background:accumulate"
     d="m 4.25,8.25 v 13.5 h 0.5 V 8.25 Z M 3.9960938,7.7460938 A 0.250025,0.250025 0 0 1 4.046875,7.75 H 5 A 0.250025,0.250025 0 0 1 5.25,8 v 13.958984 a 0.250025,0.250025 0 0 1 -0.052734,0.197266 0.250025,0.250025 0 0 1 0,0.002 0.250025,0.250025 0 0 1 -0.00781,0.0078 0.250025,0.250025 0 0 1 -0.00977,0.0098 0.250025,0.250025 0 0 1 -0.015625,0.01563 0.250025,0.250025 0 0 1 -0.00195,0.002 0.250025,0.250025 0 0 1 -0.017578,0.01367 0.250025,0.250025 0 0 1 -0.00195,0.002 0.250025,0.250025 0 0 1 -0.00781,0.0039 0.250025,0.250025 0 0 1 -0.013672,0.0078 A 0.250025,0.250025 0 0 1 4.953125,22.25 H 4 A 0.250025,0.250025 0 0 1 3.75,22 V 8.0410156 a 0.250025,0.250025 0 0 1 0.052734,-0.1972656 0.250025,0.250025 0 0 1 0,-0.00195 0.250025,0.250025 0 0 1 0.00781,-0.00781 0.250025,0.250025 0 0 1 0.027344,-0.027344 0.250025,0.250025 0 0 1 0.017578,-0.013672 0.250025,0.250025 0 0 1 0.00195,-0.00195 0.250025,0.250025 0 0 1 0.00781,-0.00391 0.250025,0.250025 0 0 1 0.013672,-0.00781 0.250025,0.250025 0 0 1 0.1171876,-0.033203 z M 4.25,2.25 v 0.5 h 0.5 V 2.25 Z M 3.9960938,1.7460938 A 0.250025,0.250025 0 0 1 4.046875,1.75 H 5 A 0.250025,0.250025 0 0 1 5.25,2 V 3 A 0.250025,0.250025 0 0 1 5,3.25 H 4 A 0.250025,0.250025 0 0 1 3.75,3 V 2.0410156 a 0.250025,0.250025 0 0 1 0.052734,-0.1972656 0.250025,0.250025 0 0 1 0,-0.00195 0.250025,0.250025 0 0 1 0.00781,-0.00781 0.250025,0.250025 0 0 1 0.027344,-0.027344 0.250025,0.250025 0 0 1 0.017578,-0.013672 0.250025,0.250025 0 0 1 0.00195,-0.00195 0.250025,0.250025 0 0 1 0.00781,-0.00391 0.250025,0.250025 0 0 1 0.013672,-0.00781 0.250025,0.250025 0 0 1 0.1171876,-0.033203 z M 4.1054688,1.25 3.25,2.1035156 V 2.8964844 L 4.1035156,3.75 H 4.8964844 L 5.75,2.8964844 V 2.1035156 L 4.8964844,1.25 Z M 3.9941406,0.74804688 A 0.250025,0.250025 0 0 1 4.03125,0.75 H 5 a 0.250025,0.250025 0 0 1 0.1777344,0.0722656 l 1,0.99999998 A 0.250025,0.250025 0 0 1 6.25,2 v 1 a 0.250025,0.250025 0 0 1 -0.072266,0.1777344 l -1,1 A 0.250025,0.250025 0 0 1 5,4.25 H 4 A 0.250025,0.250025 0 0 1 3.8222656,4.1777344 l -1,-1 A 0.250025,0.250025 0 0 1 2.75,3 V 2 A 0.250025,0.250025 0 0 1 2.8222656,1.8222656 L 3.8027344,0.84179688 a 0.250025,0.250025 0 0 1 0.019531,-0.0195313 0.250025,0.250025 0 0 1 0.013672,-0.0117187 0.250025,0.250025 0 0 1 0.041016,-0.0292969 0.250025,0.250025 0 0 1 0.00195,-0.001953 0.250025,0.250025 0 0 1 0.019531,-0.009766 0.250025,0.250025 0 0 1 0.00391,-0.001953 0.250025,0.250025 0 0 1 0.019531,-0.005859 0.250025,0.250025 0 0 1 0.00391,-0.001953 0.250025,0.250025 0 0 1 0.00586,-0.001953 0.250025,0.250025 0 0 1 0.019531,-0.003906 0.250025,0.250025 0 0 1 0.023437,-0.003906 0.250025,0.250025 0 0 1 0.019531,-0.001953 z"
     id="path2" />
</svg>
