<?xml version="1.0" encoding="UTF-8"?>
<glyph name="five" format="1">
  <advance width="520"/>
  <unicode hex="0035"/>
  <outline>
    <contour>
      <point x="116" y="696" type="curve" smooth="yes"/>
      <point x="118" y="696"/>
      <point x="121" y="695"/>
      <point x="123" y="695" type="curve" smooth="yes"/>
      <point x="405" y="695" type="line"/>
      <point x="406" y="695" type="line" smooth="yes"/>
      <point x="430" y="695"/>
      <point x="449" y="676"/>
      <point x="449" y="652" type="curve" smooth="yes"/>
      <point x="449" y="628"/>
      <point x="430" y="608"/>
      <point x="406" y="608" type="curve" smooth="yes"/>
      <point x="405" y="608" type="line"/>
      <point x="152" y="608" type="line"/>
      <point x="123" y="469" type="line"/>
      <point x="189" y="491" type="line" smooth="yes"/>
      <point x="192" y="492"/>
      <point x="198" y="493"/>
      <point x="202" y="493" type="curve" smooth="yes"/>
      <point x="289" y="493" type="line" smooth="yes"/>
      <point x="293" y="493"/>
      <point x="301" y="492"/>
      <point x="304" y="491" type="curve" smooth="yes"/>
      <point x="390" y="461" type="line" smooth="yes"/>
      <point x="396" y="459"/>
      <point x="403" y="455"/>
      <point x="407" y="451" type="curve" smooth="yes"/>
      <point x="465" y="393" type="line" smooth="yes"/>
      <point x="469" y="389"/>
      <point x="473" y="382"/>
      <point x="475" y="376" type="curve" smooth="yes"/>
      <point x="505" y="289" type="line" smooth="yes"/>
      <point x="506" y="286"/>
      <point x="507" y="279"/>
      <point x="507" y="275" type="curve" smooth="yes"/>
      <point x="507" y="218" type="line" smooth="yes"/>
      <point x="507" y="214"/>
      <point x="506" y="207"/>
      <point x="505" y="204" type="curve" smooth="yes"/>
      <point x="475" y="117" type="line" smooth="yes"/>
      <point x="473" y="111"/>
      <point x="469" y="104"/>
      <point x="465" y="100" type="curve" smooth="yes"/>
      <point x="407" y="42" type="line" smooth="yes"/>
      <point x="403" y="38"/>
      <point x="396" y="34"/>
      <point x="390" y="32" type="curve" smooth="yes"/>
      <point x="304" y="2" type="line" smooth="yes"/>
      <point x="301" y="1"/>
      <point x="293" y="0"/>
      <point x="289" y="0" type="curve" smooth="yes"/>
      <point x="202" y="0" type="line" smooth="yes"/>
      <point x="198" y="0"/>
      <point x="192" y="1"/>
      <point x="189" y="2" type="curve" smooth="yes"/>
      <point x="102" y="32" type="line" smooth="yes"/>
      <point x="96" y="34"/>
      <point x="89" y="38"/>
      <point x="85" y="42" type="curve" smooth="yes"/>
      <point x="56" y="72" type="line" smooth="yes"/>
      <point x="54" y="74"/>
      <point x="50" y="79"/>
      <point x="48" y="82" type="curve" smooth="yes"/>
      <point x="19" y="141" type="line" smooth="yes"/>
      <point x="17" y="147"/>
      <point x="14" y="154"/>
      <point x="14" y="160" type="curve" smooth="yes"/>
      <point x="14" y="182" type="line"/>
      <point x="14" y="188" type="line" smooth="yes"/>
      <point x="14" y="200"/>
      <point x="21" y="215"/>
      <point x="31" y="223" type="curve" smooth="yes"/>
      <point x="56" y="249" type="line" smooth="yes"/>
      <point x="63" y="256"/>
      <point x="77" y="261"/>
      <point x="87" y="261" type="curve" smooth="yes"/>
      <point x="111" y="261"/>
      <point x="130" y="242"/>
      <point x="130" y="218" type="curve" smooth="yes"/>
      <point x="130" y="188" type="line" smooth="yes"/>
      <point x="130" y="175"/>
      <point x="121" y="159"/>
      <point x="110" y="152" type="curve"/>
      <point x="122" y="128" type="line"/>
      <point x="140" y="111" type="line"/>
      <point x="210" y="87" type="line"/>
      <point x="283" y="87" type="line"/>
      <point x="353" y="111" type="line"/>
      <point x="396" y="154" type="line"/>
      <point x="420" y="224" type="line"/>
      <point x="420" y="268" type="line"/>
      <point x="396" y="339" type="line"/>
      <point x="353" y="383" type="line"/>
      <point x="283" y="406" type="line"/>
      <point x="210" y="406" type="line"/>
      <point x="140" y="383" type="line"/>
      <point x="92" y="336" type="line"/>
      <point x="92" y="334" type="line"/>
      <point x="84" y="325"/>
      <point x="70" y="318"/>
      <point x="58" y="318" type="curve" smooth="yes"/>
      <point x="54" y="318"/>
      <point x="46" y="319"/>
      <point x="42" y="321" type="curve" smooth="yes"/>
      <point x="41" y="321"/>
      <point x="39" y="323"/>
      <point x="38" y="323" type="curve" smooth="yes"/>
      <point x="37" y="323" type="line"/>
      <point x="36" y="324" type="line" smooth="yes"/>
      <point x="35" y="324"/>
      <point x="35" y="326"/>
      <point x="34" y="326" type="curve" smooth="yes"/>
      <point x="23" y="333"/>
      <point x="14" y="349"/>
      <point x="14" y="362" type="curve" smooth="yes"/>
      <point x="14" y="365"/>
      <point x="15" y="372"/>
      <point x="16" y="375" type="curve" smooth="yes"/>
      <point x="72" y="653" type="line" smooth="yes"/>
      <point x="72" y="664"/>
      <point x="79" y="678"/>
      <point x="87" y="685" type="curve"/>
      <point x="88" y="685" type="line"/>
      <point x="95" y="691"/>
      <point x="107" y="696"/>
    </contour>
  </outline>
  <lib>
    <dict>
      <key>com.fontlab.hintData</key>
      <dict>
        <key>hhints</key>
        <array>
          <dict>
            <key>position</key>
            <integer>0</integer>
            <key>width</key>
            <integer>87</integer>
          </dict>
          <dict>
            <key>position</key>
            <integer>406</integer>
            <key>width</key>
            <integer>87</integer>
          </dict>
          <dict>
            <key>position</key>
            <integer>608</integer>
            <key>width</key>
            <integer>87</integer>
          </dict>
        </array>
        <key>vhints</key>
        <array>
          <dict>
            <key>position</key>
            <integer>14</integer>
            <key>width</key>
            <integer>116</integer>
          </dict>
          <dict>
            <key>position</key>
            <integer>420</integer>
            <key>width</key>
            <integer>87</integer>
          </dict>
        </array>
      </dict>
    </dict>
  </lib>
</glyph>
