<?xml version="1.0" encoding="UTF-8" standalone="no"?>
<svg
   xmlns:dc="http://purl.org/dc/elements/1.1/"
   xmlns:cc="http://creativecommons.org/ns#"
   xmlns:rdf="http://www.w3.org/1999/02/22-rdf-syntax-ns#"
   xmlns:svg="http://www.w3.org/2000/svg"
   xmlns="http://www.w3.org/2000/svg"
   xmlns:sodipodi="http://sodipodi.sourceforge.net/DTD/sodipodi-0.dtd"
   xmlns:inkscape="http://www.inkscape.org/namespaces/inkscape"
   data-dec="110"
   width="22"
   height="40"
   version="1.1"
   id="svg4"
   sodipodi:docname="110.svg"
   inkscape:version="0.92.4 (unknown)">
  <metadata
     id="metadata10">
    <rdf:RDF>
      <cc:Work
         rdf:about="">
        <dc:format>image/svg+xml</dc:format>
        <dc:type
           rdf:resource="http://purl.org/dc/dcmitype/StillImage" />
      </cc:Work>
    </rdf:RDF>
  </metadata>
  <defs
     id="defs8" />
  <sodipodi:namedview
     pagecolor="#ffffff"
     bordercolor="#666666"
     borderopacity="1"
     objecttolerance="10"
     gridtolerance="10"
     guidetolerance="10"
     inkscape:pageopacity="0"
     inkscape:pageshadow="2"
     inkscape:window-width="640"
     inkscape:window-height="480"
     id="namedview6"
     showgrid="false"
     inkscape:zoom="5.9"
     inkscape:cx="11"
     inkscape:cy="20"
     inkscape:window-x="0"
     inkscape:window-y="27"
     inkscape:window-maximized="0"
     inkscape:current-layer="svg4" />
  <path
     style="color:#000000;font-style:normal;font-variant:normal;font-weight:normal;font-stretch:normal;font-size:medium;line-height:normal;font-family:sans-serif;font-variant-ligatures:normal;font-variant-position:normal;font-variant-caps:normal;font-variant-numeric:normal;font-variant-alternates:normal;font-feature-settings:normal;text-indent:0;text-align:start;text-decoration:none;text-decoration-line:none;text-decoration-style:solid;text-decoration-color:#000000;letter-spacing:normal;word-spacing:normal;text-transform:none;writing-mode:lr-tb;direction:ltr;text-orientation:mixed;dominant-baseline:auto;baseline-shift:baseline;text-anchor:start;white-space:normal;shape-padding:0;clip-rule:nonzero;display:inline;overflow:visible;visibility:visible;opacity:1;isolation:auto;mix-blend-mode:normal;color-interpolation:sRGB;color-interpolation-filters:linearRGB;solid-color:#000000;solid-opacity:1;vector-effect:none;fill:#013272;fill-opacity:1;fill-rule:nonzero;stroke:none;stroke-width:1.5;stroke-linecap:round;stroke-linejoin:round;stroke-miterlimit:4;stroke-dasharray:none;stroke-dashoffset:0;stroke-opacity:1;color-rendering:auto;image-rendering:auto;shape-rendering:auto;text-rendering:auto;enable-background:accumulate"
     d="M 5.9921875,7.2421875 A 0.750075,0.750075 0 0 1 6.0917969,7.25 H 7 a 0.750075,0.750075 0 0 1 0.53125,0.21875 l 1,1 A 0.750075,0.750075 0 0 1 8.75,9 v 1.1875 l 1.71875,-1.71875 a 0.750075,0.750075 0 0 1 0.195312,-0.1386719 l 2,-1 A 0.750075,0.750075 0 0 1 13,7.25 h 1.892578 a 0.750075,0.750075 0 0 1 0.496094,0.1054688 l 1.947266,0.9746093 A 0.750075,0.750075 0 0 1 17.53125,8.46875 l 1,1 A 0.750075,0.750075 0 0 1 18.75,10 v 2 a 0.750075,0.750075 0 0 1 -0.03906,0.236328 L 16.75,18.121094 v 2.568359 L 17.3125,21.25 h 1.376953 l 1.693359,-1.693359 0.947266,-1.892579 a 0.750075,0.750075 0 1 1 1.339844,0.671876 l -1,2 A 0.750075,0.750075 0 0 1 21.53125,20.53125 l -2,2 A 0.750075,0.750075 0 0 1 19,22.75 h -1.892578 a 0.750075,0.750075 0 0 1 -0.199219,0 H 16 a 0.750075,0.750075 0 0 1 -0.53125,-0.21875 l -1,-1 A 0.750075,0.750075 0 0 1 14.25,21 v -3 a 0.750075,0.750075 0 0 1 0.03906,-0.236328 L 16.25,11.878906 V 10.310547 L 14.6875,8.75 h -1.509766 l -1.734375,0.8671875 -1.8261715,1.8261715 -1.9160156,3.830079 -1.9804688,6.93164 a 0.750075,0.750075 0 0 1 -1.2226562,0.365234 0.750075,0.750075 0 0 1 -1.21875,-0.77539 L 5.2753906,14.806641 6.25,10.908203 V 9.3105469 L 5.6875,8.75 H 4.3105469 L 2.6171875,10.443359 1.6699219,12.335938 A 0.750075,0.750075 0 1 1 0.33007812,11.664062 L 1.3300781,9.6640625 A 0.750075,0.750075 0 0 1 1.46875,9.46875 l 2,-2 A 0.750075,0.750075 0 0 1 4,7.25 h 1.8925781 a 0.750075,0.750075 0 0 1 0.099609,-0.00781 z"
     id="path2" />
</svg>
