<?xml version="1.0" encoding="UTF-8" standalone="no"?>
<svg
   xmlns:dc="http://purl.org/dc/elements/1.1/"
   xmlns:cc="http://creativecommons.org/ns#"
   xmlns:rdf="http://www.w3.org/1999/02/22-rdf-syntax-ns#"
   xmlns:svg="http://www.w3.org/2000/svg"
   xmlns="http://www.w3.org/2000/svg"
   xmlns:sodipodi="http://sodipodi.sourceforge.net/DTD/sodipodi-0.dtd"
   xmlns:inkscape="http://www.inkscape.org/namespaces/inkscape"
   data-dec="34"
   width="18"
   height="40"
   version="1.1"
   id="svg4"
   sodipodi:docname="34.svg"
   inkscape:version="0.92.4 (unknown)">
  <metadata
     id="metadata10">
    <rdf:RDF>
      <cc:Work
         rdf:about="">
        <dc:format>image/svg+xml</dc:format>
        <dc:type
           rdf:resource="http://purl.org/dc/dcmitype/StillImage" />
      </cc:Work>
    </rdf:RDF>
  </metadata>
  <defs
     id="defs8" />
  <sodipodi:namedview
     pagecolor="#ffffff"
     bordercolor="#666666"
     borderopacity="1"
     objecttolerance="10"
     gridtolerance="10"
     guidetolerance="10"
     inkscape:pageopacity="0"
     inkscape:pageshadow="2"
     inkscape:window-width="615"
     inkscape:window-height="417"
     id="namedview6"
     showgrid="false"
     inkscape:zoom="5.9"
     inkscape:cx="9"
     inkscape:cy="20"
     inkscape:window-x="0"
     inkscape:window-y="27"
     inkscape:window-maximized="0"
     inkscape:current-layer="svg4" />
  <path
     style="color:#000000;font-style:normal;font-variant:normal;font-weight:normal;font-stretch:normal;font-size:medium;line-height:normal;font-family:sans-serif;font-variant-ligatures:normal;font-variant-position:normal;font-variant-caps:normal;font-variant-numeric:normal;font-variant-alternates:normal;font-feature-settings:normal;text-indent:0;text-align:start;text-decoration:none;text-decoration-line:none;text-decoration-style:solid;text-decoration-color:#000000;letter-spacing:normal;word-spacing:normal;text-transform:none;writing-mode:lr-tb;direction:ltr;text-orientation:mixed;dominant-baseline:auto;baseline-shift:baseline;text-anchor:start;white-space:normal;shape-padding:0;clip-rule:nonzero;display:inline;overflow:visible;visibility:visible;opacity:1;isolation:auto;mix-blend-mode:normal;color-interpolation:sRGB;color-interpolation-filters:linearRGB;solid-color:#000000;solid-opacity:1;vector-effect:none;fill:#013272;fill-opacity:1;fill-rule:nonzero;stroke:none;stroke-width:0.30000001;stroke-linecap:round;stroke-linejoin:round;stroke-miterlimit:4;stroke-dasharray:none;stroke-dashoffset:0;stroke-opacity:1;color-rendering:auto;image-rendering:auto;shape-rendering:auto;text-rendering:auto;enable-background:accumulate"
     d="M 14,1.2109375 13.150391,2.0625 v 4.1191406 l 0.701171,-4.2070312 a 0.1505939,0.1505939 0 1 1 0.296876,0.050781 l -0.685547,4.109375 1.365234,-4.09375 z m -9,0 L 4.1503906,2.0625 V 6.1816406 L 4.8515625,1.9746094 a 0.15059341,0.15059341 0 1 1 0.296875,0.050781 l -0.6855469,4.109375 1.3652344,-4.09375 z m 8.996094,-0.36328125 a 0.15001501,0.15001501 0 0 1 0.01563,0.001953 0.15001501,0.15001501 0 0 1 0.002,0 0.15001501,0.15001501 0 0 1 0.01367,0.001953 0.15001501,0.15001501 0 0 1 0.01563,0.003906 0.15001501,0.15001501 0 0 1 0.01367,0.003906 0.15001501,0.15001501 0 0 1 0.02539,0.0136719 0.15001501,0.15001501 0 0 1 0.002,0.001953 0.15001501,0.15001501 0 0 1 0.0098,0.005859 0.15001501,0.15001501 0 0 1 0.002,0.001953 0.15001501,0.15001501 0 0 1 0.01953,0.0195313 0.15001501,0.15001501 0 0 1 0.0098,0.0117188 l 0.980469,0.9804687 a 0.15001501,0.15001501 0 0 1 0.03711,0.1523438 l -1.992187,5.9785156 a 0.15001501,0.15001501 0 0 1 -0.002,0.00977 l -0.0039,0.011719 a 0.15001501,0.15001501 0 0 1 0,0.00195 0.15001501,0.15001501 0 0 1 0,0.00195 0.15001501,0.15001501 0 0 1 -0.002,0.00391 0.15001501,0.15001501 0 0 1 -0.0059,0.011719 0.15001501,0.15001501 0 0 1 -0.002,0.00391 0.15001501,0.15001501 0 0 1 -0.0039,0.00586 0.15001501,0.15001501 0 0 1 -0.002,0.00586 0.15001501,0.15001501 0 0 1 -0.0059,0.00781 0.15001501,0.15001501 0 0 1 -0.002,0.00391 0.15001501,0.15001501 0 0 1 -0.0059,0.00781 0.15001501,0.15001501 0 0 1 -0.002,0.00195 0.15001501,0.15001501 0 0 1 -0.002,0.00195 0.15001501,0.15001501 0 0 1 -0.0039,0.00195 0.15001501,0.15001501 0 0 1 -0.0039,0.00391 0.15001501,0.15001501 0 0 1 -0.0039,0.00391 0.15001501,0.15001501 0 0 1 -0.002,0.00195 0.15001501,0.15001501 0 0 1 -0.0059,0.00391 0.15001501,0.15001501 0 0 1 -0.0039,0.00391 0.15001501,0.15001501 0 0 1 -0.0039,0.00195 0.15001501,0.15001501 0 0 1 -0.0039,0.00195 0.15001501,0.15001501 0 0 1 -0.002,0.00195 0.15001501,0.15001501 0 0 1 -0.0078,0.00391 0.15001501,0.15001501 0 0 1 -0.0098,0.00391 0.15001501,0.15001501 0 0 1 -0.0039,0.00195 0.15001501,0.15001501 0 0 1 -0.0059,0.00195 0.15001501,0.15001501 0 0 1 -0.0039,0.00195 0.15001501,0.15001501 0 0 1 -0.0098,0.00195 0.15001501,0.15001501 0 0 1 -0.0059,0.00195 0.15001501,0.15001501 0 0 1 -0.0039,0 0.15001501,0.15001501 0 0 1 -0.0098,0.00195 0.15001501,0.15001501 0 0 1 -0.0039,0.00195 0.15001501,0.15001501 0 0 1 -0.0059,0 0.15001501,0.15001501 0 0 1 -0.0059,0 0.15001501,0.15001501 0 0 1 -0.0098,0 0.15001501,0.15001501 0 0 1 -0.0059,0 0.15001501,0.15001501 0 0 1 -0.0098,-0.00195 0.15001501,0.15001501 0 0 1 -0.0039,0 0.15001501,0.15001501 0 0 1 -0.0039,-0.00195 0.15001501,0.15001501 0 0 1 -0.01172,-0.00195 0.15001501,0.15001501 0 0 1 -0.0039,-0.00195 0.15001501,0.15001501 0 0 1 -0.0039,-0.00195 0.15001501,0.15001501 0 0 1 -0.0059,-0.00195 0.15001501,0.15001501 0 0 1 -0.0039,0 0.15001501,0.15001501 0 0 1 -0.0059,-0.00391 0.15001501,0.15001501 0 0 1 -0.0078,-0.00391 0.15001501,0.15001501 0 0 1 -0.0039,-0.00195 0.15001501,0.15001501 0 0 1 -0.0039,-0.00391 0.15001501,0.15001501 0 0 1 -0.0078,-0.00391 0.15001501,0.15001501 0 0 1 -0.002,-0.00195 0.15001501,0.15001501 0 0 1 -0.0059,-0.00586 0.15001501,0.15001501 0 0 1 -0.0059,-0.00391 0.15001501,0.15001501 0 0 1 -0.002,-0.00391 0.15001501,0.15001501 0 0 1 -0.0078,-0.00586 0.15001501,0.15001501 0 0 1 -0.002,-0.00391 0.15001501,0.15001501 0 0 1 -0.0039,-0.00391 0.15001501,0.15001501 0 0 1 -0.0039,-0.00391 0.15001501,0.15001501 0 0 1 -0.002,-0.00391 0.15001501,0.15001501 0 0 1 -0.002,-0.00391 0.15001501,0.15001501 0 0 1 -0.0039,-0.00586 0.15001501,0.15001501 0 0 1 -0.0059,-0.013672 0.15001501,0.15001501 0 0 1 -0.002,-0.00391 0.15001501,0.15001501 0 0 1 -0.0059,-0.019531 0.15001501,0.15001501 0 0 1 -0.002,-0.00391 0.15001501,0.15001501 0 0 1 0,-0.00195 0.15001501,0.15001501 0 0 1 -0.002,-0.00586 0.15001501,0.15001501 0 0 1 0,-0.00195 0.15001501,0.15001501 0 0 1 0,-0.00586 0.15001501,0.15001501 0 0 1 -0.002,-0.00781 0.15001501,0.15001501 0 0 1 0,-0.00586 0.15001501,0.15001501 0 0 1 0,-0.00586 v -0.00391 a 0.15001501,0.15001501 0 0 1 0,-0.00586 V 2 a 0.15001501,0.15001501 0 0 1 0.04492,-0.1054688 l 0.978516,-0.97656245 a 0.15001501,0.15001501 0 0 1 0.0078,-0.0117188 0.15001501,0.15001501 0 0 1 0.05859,-0.0449219 0.15001501,0.15001501 0 0 1 0.02539,-0.007813 0.15001501,0.15001501 0 0 1 0.03125,-0.005859 z m -9.0000002,0 a 0.15001501,0.15001501 0 0 1 0.015625,0.001953 0.15001501,0.15001501 0 0 1 0.00195,0 0.15001501,0.15001501 0 0 1 0.013672,0.001953 0.15001501,0.15001501 0 0 1 0.015625,0.003906 0.15001501,0.15001501 0 0 1 0.013672,0.003906 0.15001501,0.15001501 0 0 1 0.025391,0.0136719 0.15001501,0.15001501 0 0 1 0.00195,0.001953 0.15001501,0.15001501 0 0 1 0.00977,0.005859 0.15001501,0.15001501 0 0 1 0.00195,0.001953 0.15001501,0.15001501 0 0 1 0.019531,0.0195313 A 0.15001501,0.15001501 0 0 1 5.125,0.9140625 L 6.1054688,1.8945312 A 0.15001501,0.15001501 0 0 1 6.1425781,2.046875 L 4.1484375,8.0253906 a 0.15001501,0.15001501 0 0 1 -0.00391,0.015625 l -0.00195,0.00586 a 0.15001501,0.15001501 0 0 1 0,0.00195 0.15001501,0.15001501 0 0 1 0,0.00195 0.15001501,0.15001501 0 0 1 -0.00195,0.00391 0.15001501,0.15001501 0 0 1 -0.00586,0.011719 0.15001501,0.15001501 0 0 1 -0.00195,0.00391 0.15001501,0.15001501 0 0 1 -0.00391,0.00586 0.15001501,0.15001501 0 0 1 -0.00195,0.00586 0.15001501,0.15001501 0 0 1 -0.00586,0.00781 0.15001501,0.15001501 0 0 1 -0.00195,0.00391 0.15001501,0.15001501 0 0 1 -0.00586,0.00781 0.15001501,0.15001501 0 0 1 -0.00195,0.00195 0.15001501,0.15001501 0 0 1 -0.00977,0.00781 0.15001501,0.15001501 0 0 1 -0.00391,0.00391 0.15001501,0.15001501 0 0 1 -0.00195,0.00195 0.15001501,0.15001501 0 0 1 -0.00586,0.00391 0.15001501,0.15001501 0 0 1 -0.00977,0.00781 0.15001501,0.15001501 0 0 1 -0.00195,0.00195 0.15001501,0.15001501 0 0 1 -0.00391,0.00195 0.15001501,0.15001501 0 0 1 -0.00391,0.00195 0.15001501,0.15001501 0 0 1 -0.00977,0.00391 0.15001501,0.15001501 0 0 1 -0.00391,0.00195 0.15001501,0.15001501 0 0 1 -0.00586,0.00195 0.15001501,0.15001501 0 0 1 -0.00391,0.00195 0.15001501,0.15001501 0 0 1 -0.00977,0.00195 0.15001501,0.15001501 0 0 1 -0.00586,0.00195 0.15001501,0.15001501 0 0 1 -0.013672,0.00195 0.15001501,0.15001501 0 0 1 -0.00391,0.00195 0.15001501,0.15001501 0 0 1 -0.00586,0 0.15001501,0.15001501 0 0 1 -0.00586,0 0.15001501,0.15001501 0 0 1 -0.00977,0 0.15001501,0.15001501 0 0 1 -0.00586,0 0.15001501,0.15001501 0 0 1 -0.00977,-0.00195 0.15001501,0.15001501 0 0 1 -0.00391,0 0.15001501,0.15001501 0 0 1 -0.00391,-0.00195 0.15001501,0.15001501 0 0 1 -0.011719,-0.00195 0.15001501,0.15001501 0 0 1 -0.00391,-0.00195 0.15001501,0.15001501 0 0 1 -0.00195,0 0.15001501,0.15001501 0 0 1 -0.00391,-0.00195 0.15001501,0.15001501 0 0 1 -0.00391,-0.00195 0.15001501,0.15001501 0 0 1 -0.00391,0 0.15001501,0.15001501 0 0 1 -0.00586,-0.00391 0.15001501,0.15001501 0 0 1 -0.00391,-0.00195 0.15001501,0.15001501 0 0 1 -0.00781,-0.00391 0.15001501,0.15001501 0 0 1 -0.00391,-0.00391 0.15001501,0.15001501 0 0 1 -0.00977,-0.00586 0.15001501,0.15001501 0 0 1 -0.00391,-0.00195 0.15001501,0.15001501 0 0 1 -0.00195,-0.00391 0.15001501,0.15001501 0 0 1 -0.00391,-0.00391 0.15001501,0.15001501 0 0 1 -0.00195,0 0.15001501,0.15001501 0 0 1 -0.00195,-0.00391 0.15001501,0.15001501 0 0 1 -0.00391,-0.00195 0.15001501,0.15001501 0 0 1 -0.00391,-0.00391 0.15001501,0.15001501 0 0 1 -0.00195,-0.00391 0.15001501,0.15001501 0 0 1 -0.00391,-0.00391 0.15001501,0.15001501 0 0 1 -0.00391,-0.00391 0.15001501,0.15001501 0 0 1 -0.00195,-0.00391 0.15001501,0.15001501 0 0 1 -0.00195,-0.00391 0.15001501,0.15001501 0 0 1 -0.00391,-0.00586 0.15001501,0.15001501 0 0 1 0,-0.00195 0.15001501,0.15001501 0 0 1 -0.00195,-0.00391 0.15001501,0.15001501 0 0 1 -0.00391,-0.00781 0.15001501,0.15001501 0 0 1 -0.00195,-0.00391 0.15001501,0.15001501 0 0 1 -0.00195,-0.00391 0.15001501,0.15001501 0 0 1 0,-0.00195 0.15001501,0.15001501 0 0 1 -0.00195,-0.00195 0.15001501,0.15001501 0 0 1 -0.00195,-0.00586 0.15001501,0.15001501 0 0 1 0,-0.00391 0.15001501,0.15001501 0 0 1 0,-0.00195 0.15001501,0.15001501 0 0 1 -0.00195,-0.00391 0.15001501,0.15001501 0 0 1 0,-0.00195 0.15001501,0.15001501 0 0 1 -0.00195,-0.00586 0.15001501,0.15001501 0 0 1 0,-0.00195 0.15001501,0.15001501 0 0 1 0,-0.00586 0.15001501,0.15001501 0 0 1 -0.00195,-0.00781 0.15001501,0.15001501 0 0 1 0,-0.00586 0.15001501,0.15001501 0 0 1 0,-0.00586 v -0.00391 a 0.15001501,0.15001501 0 0 1 0,-0.00586 V 2 A 0.15001501,0.15001501 0 0 1 3.8945312,1.8945312 L 4.8730469,0.91796875 a 0.15001501,0.15001501 0 0 1 0.00781,-0.0117188 0.15001501,0.15001501 0 0 1 0.058594,-0.0449219 0.15001501,0.15001501 0 0 1 0.025391,-0.007813 0.15001501,0.15001501 0 0 1 0.03125,-0.005859 z"
     id="path2" />
</svg>
