<svg xmlns:dc="http://purl.org/dc/elements/1.1/" xmlns:cc="http://creativecommons.org/ns#" xmlns:rdf="http://www.w3.org/1999/02/22-rdf-syntax-ns#" xmlns:svg="http://www.w3.org/2000/svg" xmlns="http://www.w3.org/2000/svg" xmlns:sodipodi="http://sodipodi.sourceforge.net/DTD/sodipodi-0.dtd" xmlns:inkscape="http://www.inkscape.org/namespaces/inkscape" data-dec="338" id="dec_79" width="32" height="40" version="1.1" sodipodi:docname="338.svg" inkscape:version="0.92.2 2405546, 2018-03-11">
  <metadata id="metadata9">
    <rdf:RDF>
      <cc:Work rdf:about="">
        <dc:format>image/svg+xml</dc:format>
        <dc:type rdf:resource="http://purl.org/dc/dcmitype/StillImage"/>
        <dc:title/>
      </cc:Work>
    </rdf:RDF>
  </metadata>
  <defs id="defs7"/>
  <sodipodi:namedview pagecolor="#ffffff" bordercolor="#666666" borderopacity="1" objecttolerance="10" gridtolerance="10" guidetolerance="10" inkscape:pageopacity="0" inkscape:pageshadow="2" inkscape:window-width="1364" inkscape:window-height="730" id="namedview5" showgrid="true" inkscape:zoom="18.542849" inkscape:cx="12.195204" inkscape:cy="24.994944" inkscape:window-x="0" inkscape:window-y="18" inkscape:window-maximized="0" inkscape:current-layer="dec_79" showguides="false">
    <inkscape:grid type="xygrid" id="grid844"/>
  </sodipodi:namedview>
  <path id="path2-6" style="fill:none;stroke:#000000;stroke-width:1;stroke-linecap:round;stroke-linejoin:round" d="M 18,1 12,22 M 19,1 13,22 M 20,1 14,22 M 24,7 22,15 M 15,1 h 15 l -1,6 M 17,11 h 6 M 9,22 h 15 l 2,-5 M 16,1 l 3,1 m -2,-1 1,2 m 3,-2 -2,2 m 3,-2 -3,1 m 7,-1 3,1 m -2,-1 2,2 m -1,-2 1,3 m 0,-3 v 6 m -5,0 L 22,11 v 4 M 23,9 21,11 l 1,2 m 1,-3 -3,1 2,1 m -9,9 -3,1 m 3,-2 -2,2 m 3,-2 1,2 m -2,-1 3,1 m 3,0 5,-1 m -3,1 3,-2 m 0,0 2,-3 M 11,1 l -3,1 -2,2 -2,3 L 3,10 2,14 v 3 l 1,3 1,1 2,1 H 9 M 15,1 h -4 m -4,3 -2,3 L 4,10 3,14 v 4 l 1,2 m 7,-19 -2,1 -2,3 -1,2 L 5,10 4,14 v 5 l 1,2 1,1 " inkscape:connector-curvature="0"/>
</svg>