<?xml version="1.0" encoding="UTF-8" standalone="no"?>
<svg
   xmlns:dc="http://purl.org/dc/elements/1.1/"
   xmlns:cc="http://creativecommons.org/ns#"
   xmlns:rdf="http://www.w3.org/1999/02/22-rdf-syntax-ns#"
   xmlns:svg="http://www.w3.org/2000/svg"
   xmlns="http://www.w3.org/2000/svg"
   xmlns:sodipodi="http://sodipodi.sourceforge.net/DTD/sodipodi-0.dtd"
   xmlns:inkscape="http://www.inkscape.org/namespaces/inkscape"
   data-dec="78"
   width="22"
   height="40"
   version="1.1"
   id="svg4"
   sodipodi:docname="78.svg"
   inkscape:version="0.92.4 (unknown)">
  <metadata
     id="metadata10">
    <rdf:RDF>
      <cc:Work
         rdf:about="">
        <dc:format>image/svg+xml</dc:format>
        <dc:type
           rdf:resource="http://purl.org/dc/dcmitype/StillImage" />
      </cc:Work>
    </rdf:RDF>
  </metadata>
  <defs
     id="defs8" />
  <sodipodi:namedview
     pagecolor="#ffffff"
     bordercolor="#666666"
     borderopacity="1"
     objecttolerance="10"
     gridtolerance="10"
     guidetolerance="10"
     inkscape:pageopacity="0"
     inkscape:pageshadow="2"
     inkscape:window-width="615"
     inkscape:window-height="417"
     id="namedview6"
     showgrid="false"
     inkscape:zoom="5.9"
     inkscape:cx="11"
     inkscape:cy="20"
     inkscape:window-x="0"
     inkscape:window-y="27"
     inkscape:window-maximized="0"
     inkscape:current-layer="svg4" />
  <path
     style="color:#000000;font-style:normal;font-variant:normal;font-weight:normal;font-stretch:normal;font-size:medium;line-height:normal;font-family:sans-serif;font-variant-ligatures:normal;font-variant-position:normal;font-variant-caps:normal;font-variant-numeric:normal;font-variant-alternates:normal;font-feature-settings:normal;text-indent:0;text-align:start;text-decoration:none;text-decoration-line:none;text-decoration-style:solid;text-decoration-color:#000000;letter-spacing:normal;word-spacing:normal;text-transform:none;writing-mode:lr-tb;direction:ltr;text-orientation:mixed;dominant-baseline:auto;baseline-shift:baseline;text-anchor:start;white-space:normal;shape-padding:0;clip-rule:nonzero;display:inline;overflow:visible;visibility:visible;opacity:1;isolation:auto;mix-blend-mode:normal;color-interpolation:sRGB;color-interpolation-filters:linearRGB;solid-color:#000000;solid-opacity:1;vector-effect:none;fill:#013272;fill-opacity:1;fill-rule:nonzero;stroke:none;stroke-width:3;stroke-linecap:round;stroke-linejoin:round;stroke-miterlimit:4;stroke-dasharray:none;stroke-dashoffset:0;stroke-opacity:1;color-rendering:auto;image-rendering:auto;shape-rendering:auto;text-rendering:auto;enable-background:accumulate"
     d="m 4.9765625,-0.52148438 a 1.50015,1.50015 0 0 1 1.0605469,0.41796876 1.50015,1.50015 0 0 1 0.013672,0.01171875 1.50015,1.50015 0 0 1 0.00977,0.0097656 1.50015,1.50015 0 0 1 0.00391,0.0058594 1.50015,1.50015 0 0 1 0.3535157,0.53515625 L 15.5,16.351562 V 2.5 H 14 a 1.50015,1.50015 0 1 1 0,-3 h 2.759766 a 1.50015,1.50015 0 0 1 0.486328,0 H 20 a 1.50015,1.50015 0 1 1 0,3 h -1.5 v 19.357422 a 1.50015,1.50015 0 0 1 -0.761719,1.46875 1.50015,1.50015 0 0 1 -0.126953,0.06445 1.50015,1.50015 0 0 1 -0.0059,0.0039 1.50015,1.50015 0 0 1 -0.02344,0.0098 1.50015,1.50015 0 0 1 -0.109375,0.04102 1.50015,1.50015 0 0 1 -0.0078,0.002 1.50015,1.50015 0 0 1 -0.01758,0.0039 1.50015,1.50015 0 0 1 -0.119141,0.0332 1.50015,1.50015 0 0 1 -0.0078,0.002 1.50015,1.50015 0 0 1 -0.109374,0.01953 1.50015,1.50015 0 0 1 -0.0098,0 1.50015,1.50015 0 0 1 -1.580078,-0.894531 L 6.5,6.6484375 V 20.5 H 8 a 1.50015,1.50015 0 1 1 0,3 H 5.2402344 a 1.50015,1.50015 0 0 1 -0.4863282,0 H 2 a 1.50015,1.50015 0 1 1 0,-3 H 3.5 V 2.5 H 2 a 1.50015,1.50015 0 1 1 0,-3 h 2.7578125 a 1.50015,1.50015 0 0 1 0.00195,0 1.50015,1.50015 0 0 1 0.029297,-0.005859 1.50015,1.50015 0 0 1 0.00977,0 1.50015,1.50015 0 0 1 0.1777344,-0.015625 z"
     id="path2" />
</svg>
