<?xml version="1.0" encoding="UTF-8" standalone="no"?>
<svg
   xmlns:dc="http://purl.org/dc/elements/1.1/"
   xmlns:cc="http://creativecommons.org/ns#"
   xmlns:rdf="http://www.w3.org/1999/02/22-rdf-syntax-ns#"
   xmlns:svg="http://www.w3.org/2000/svg"
   xmlns="http://www.w3.org/2000/svg"
   xmlns:sodipodi="http://sodipodi.sourceforge.net/DTD/sodipodi-0.dtd"
   xmlns:inkscape="http://www.inkscape.org/namespaces/inkscape"
   data-dec="78"
   width="24"
   height="40"
   version="1.1"
   id="svg4"
   sodipodi:docname="78.svg"
   inkscape:version="0.92.4 (unknown)">
  <metadata
     id="metadata10">
    <rdf:RDF>
      <cc:Work
         rdf:about="">
        <dc:format>image/svg+xml</dc:format>
        <dc:type
           rdf:resource="http://purl.org/dc/dcmitype/StillImage" />
      </cc:Work>
    </rdf:RDF>
  </metadata>
  <defs
     id="defs8" />
  <sodipodi:namedview
     pagecolor="#ffffff"
     bordercolor="#666666"
     borderopacity="1"
     objecttolerance="10"
     gridtolerance="10"
     guidetolerance="10"
     inkscape:pageopacity="0"
     inkscape:pageshadow="2"
     inkscape:window-width="615"
     inkscape:window-height="417"
     id="namedview6"
     showgrid="false"
     inkscape:zoom="5.9"
     inkscape:cx="12"
     inkscape:cy="20"
     inkscape:window-x="0"
     inkscape:window-y="27"
     inkscape:window-maximized="0"
     inkscape:current-layer="svg4" />
  <path
     style="color:#000000;font-style:normal;font-variant:normal;font-weight:normal;font-stretch:normal;font-size:medium;line-height:normal;font-family:sans-serif;font-variant-ligatures:normal;font-variant-position:normal;font-variant-caps:normal;font-variant-numeric:normal;font-variant-alternates:normal;font-feature-settings:normal;text-indent:0;text-align:start;text-decoration:none;text-decoration-line:none;text-decoration-style:solid;text-decoration-color:#000000;letter-spacing:normal;word-spacing:normal;text-transform:none;writing-mode:lr-tb;direction:ltr;text-orientation:mixed;dominant-baseline:auto;baseline-shift:baseline;text-anchor:start;white-space:normal;shape-padding:0;clip-rule:nonzero;display:inline;overflow:visible;visibility:visible;opacity:1;isolation:auto;mix-blend-mode:normal;color-interpolation:sRGB;color-interpolation-filters:linearRGB;solid-color:#000000;solid-opacity:1;vector-effect:none;fill:#013272;fill-opacity:1;fill-rule:nonzero;stroke:none;stroke-width:0.30000001;stroke-linecap:round;stroke-linejoin:round;stroke-miterlimit:4;stroke-dasharray:none;stroke-dashoffset:0;stroke-opacity:1;color-rendering:auto;image-rendering:auto;shape-rendering:auto;text-rendering:auto;enable-background:accumulate"
     d="m 5,21.167969 -1.3632812,0.68164 H 6.3632812 Z M 17.636719,1.1503906 19,1.8320312 20.363281,1.1503906 Z m -12.355469,0 13.568359,20.3535154 V 19.046875 L 6.9199219,1.1503906 H 6.28125 L 18.125,18.916016 a 0.1505932,0.1505932 0 1 1 -0.25,0.167968 L 5.9199219,1.1503906 Z m -1.6445312,0 1.2128906,0.6074219 V 1.1503906 Z M 4.9980469,0.84765625 a 0.15001501,0.15001501 0 0 1 0.029297,0.001953 h 0.9550781 a 0.15001501,0.15001501 0 0 1 0.03125,0 h 0.96875 a 0.15001501,0.15001501 0 0 1 0.027344,0 0.15001501,0.15001501 0 0 1 0.015625,0.001953 0.15001501,0.15001501 0 0 1 0.00195,0 0.15001501,0.15001501 0 0 1 0.013672,0.003906 0.15001501,0.15001501 0 0 1 0.00195,0 0.15001501,0.15001501 0 0 1 0.011719,0.003906 0.15001501,0.15001501 0 0 1 0.00195,0 0.15001501,0.15001501 0 0 1 0.011719,0.005859 0.15001501,0.15001501 0 0 1 0.00195,0.001953 0.15001501,0.15001501 0 0 1 0.023437,0.0136719 0.15001501,0.15001501 0 0 1 0.00195,0.001953 0.15001501,0.15001501 0 0 1 0.00977,0.007813 0.15001501,0.15001501 0 0 1 0,0.001953 0.15001501,0.15001501 0 0 1 0.00977,0.009766 0.15001501,0.15001501 0 0 1 0,0.001953 0.15001501,0.15001501 0 0 1 0.00977,0.009766 0.15001501,0.15001501 0 0 1 0,0.001953 0.15001501,0.15001501 0 0 1 0.00781,0.009766 l 0.00195,0.005859 L 18.849609,18.503906 V 2.09375 L 16.964844,1.1503906 H 16 a 0.15039061,0.15039061 0 1 1 0,-0.30078122 h 0.980469 0.0293 3.976562 0.0293 H 22 A 0.15039061,0.15039061 0 1 1 22,1.1503906 H 21.035156 L 19.150391,2.09375 v 16.888672 a 0.15001501,0.15001501 0 0 1 0,0.0293 v 2.970703 a 0.15001501,0.15001501 0 0 1 0,0.01758 0.15001501,0.15001501 0 0 1 0,0.0098 0.15001501,0.15001501 0 0 1 0,0.002 0.15001501,0.15001501 0 0 1 -0.002,0.01367 0.15001501,0.15001501 0 0 1 0,0.002 0.15001501,0.15001501 0 0 1 -0.0078,0.02734 0.15001501,0.15001501 0 0 1 0,0.002 0.15001501,0.15001501 0 0 1 -0.0059,0.01172 0.15001501,0.15001501 0 0 1 0,0.002 0.15001501,0.15001501 0 0 1 -0.0078,0.01172 0.15001501,0.15001501 0 0 1 -0.01758,0.02344 0.15001501,0.15001501 0 0 1 -0.03516,0.02734 0.15001501,0.15001501 0 0 1 -0.02734,0.01172 0.15001501,0.15001501 0 0 1 -0.04492,0.0078 0.15001501,0.15001501 0 0 1 -0.05859,-0.01172 0.15001501,0.15001501 0 0 1 -0.02539,-0.01367 0.15001501,0.15001501 0 0 1 -0.002,-0.002 0.15001501,0.15001501 0 0 1 -0.01172,-0.0078 0.15001501,0.15001501 0 0 1 -0.01953,-0.01953 0.15001501,0.15001501 0 0 1 -0.0098,-0.01367 l -0.0078,-0.01172 L 5.1503906,1.4960938 v 0.4824218 a 0.15001501,0.15001501 0 0 1 0,0.044922 V 20.90625 l 1.8847656,0.943359 H 8 a 0.150391,0.150391 0 1 1 0,0.300782 H 7.0195312 6.9902344 3.0136719 2.984375 2 A 0.150391,0.150391 0 0 1 2,21.849609 H 2.9648438 L 4.8496094,20.90625 V 2.09375 L 2.9648438,1.1503906 H 2 A 0.15039068,0.15039068 0 1 1 2,0.84960938 h 0.9804688 0.029297 1.9726563 a 0.15001501,0.15001501 0 0 1 0.015625,-0.001953 z"
     id="path2" />
</svg>
