<?xml version="1.0" encoding="UTF-8"?>
<glyph name="acircumflex" format="1">
  <advance width="635"/>
  <unicode hex="00E2"/>
  <outline>
    <component base="asciicircum" xOffset="1" yOffset="284"/>
    <component base="a"/>
  </outline>
  <lib>
    <dict>
      <key>com.fontlab.hintData</key>
      <dict>
        <key>hhints</key>
        <array>
          <dict>
            <key>position</key>
            <integer>0</integer>
            <key>width</key>
            <integer>14</integer>
          </dict>
          <dict>
            <key>position</key>
            <integer>406</integer>
            <key>width</key>
            <integer>14</integer>
          </dict>
          <dict>
            <key>position</key>
            <integer>479</integer>
            <key>width</key>
            <integer>12</integer>
          </dict>
        </array>
        <key>vhints</key>
        <array>
          <dict>
            <key>position</key>
            <integer>79</integer>
            <key>width</key>
            <integer>15</integer>
          </dict>
          <dict>
            <key>position</key>
            <integer>109</integer>
            <key>width</key>
            <integer>14</integer>
          </dict>
          <dict>
            <key>position</key>
            <integer>370</integer>
            <key>width</key>
            <integer>14</integer>
          </dict>
          <dict>
            <key>position</key>
            <integer>398</integer>
            <key>width</key>
            <integer>14</integer>
          </dict>
          <dict>
            <key>position</key>
            <integer>485</integer>
            <key>width</key>
            <integer>14</integer>
          </dict>
          <dict>
            <key>position</key>
            <integer>572</integer>
            <key>width</key>
            <integer>14</integer>
          </dict>
        </array>
      </dict>
    </dict>
  </lib>
</glyph>
