<svg xmlns:dc="http://purl.org/dc/elements/1.1/" xmlns:cc="http://creativecommons.org/ns#" xmlns:rdf="http://www.w3.org/1999/02/22-rdf-syntax-ns#" xmlns:svg="http://www.w3.org/2000/svg" xmlns="http://www.w3.org/2000/svg" xmlns:sodipodi="http://sodipodi.sourceforge.net/DTD/sodipodi-0.dtd" xmlns:inkscape="http://www.inkscape.org/namespaces/inkscape" data-dec="44" id="dec_44" width="12" height="40" version="1.1" sodipodi:docname="44.svg" inkscape:version="0.92.2 5c3e80d, 2017-08-06">
  <metadata id="metadata9">
    <rdf:RDF>
      <cc:Work rdf:about="">
        <dc:format>image/svg+xml</dc:format>
        <dc:type rdf:resource="http://purl.org/dc/dcmitype/StillImage"/>
      </cc:Work>
    </rdf:RDF>
  </metadata>
  <defs id="defs7"/>
  <sodipodi:namedview pagecolor="#ffffff" bordercolor="#666666" borderopacity="1" objecttolerance="10" gridtolerance="10" guidetolerance="10" inkscape:pageopacity="0" inkscape:pageshadow="2" inkscape:window-width="1399" inkscape:window-height="806" id="namedview5" showgrid="true" inkscape:zoom="23.6" inkscape:cx="-5.2288136" inkscape:cy="19.682204" inkscape:window-x="0" inkscape:window-y="841" inkscape:window-maximized="0" inkscape:current-layer="dec_44">
    <inkscape:grid type="xygrid" id="grid11"/>
  </sodipodi:namedview>
  <path id="path17" style="fill:none;stroke:#000000;stroke-width:1px;stroke-linecap:round;stroke-linejoin:round;stroke-opacity:1" d="m 7,23 v 2 l -2,2 v 0 m 0,-7 2,2 m 0,-2 -2,2 m 3,0 -1,1 H 5 L 4,22 v -2 l 1,-1 h 2 l 1,1 v 4 l -1,2 -2,1 m 0,-7 v 2 H 7 V 20 H 5 m 2,3 1,1 m 0,-2 -1,4 "/>
</svg>