<?xml version="1.0" encoding="UTF-8" standalone="no"?>
<svg
   xmlns:dc="http://purl.org/dc/elements/1.1/"
   xmlns:cc="http://creativecommons.org/ns#"
   xmlns:rdf="http://www.w3.org/1999/02/22-rdf-syntax-ns#"
   xmlns:svg="http://www.w3.org/2000/svg"
   xmlns="http://www.w3.org/2000/svg"
   xmlns:sodipodi="http://sodipodi.sourceforge.net/DTD/sodipodi-0.dtd"
   xmlns:inkscape="http://www.inkscape.org/namespaces/inkscape"
   data-dec="110"
   width="19"
   height="40"
   version="1.1"
   id="svg4"
   sodipodi:docname="110.svg"
   inkscape:version="0.92.4 5da689c313, 2019-01-14">
  <metadata
     id="metadata10">
    <rdf:RDF>
      <cc:Work
         rdf:about="">
        <dc:format>image/svg+xml</dc:format>
        <dc:type
           rdf:resource="http://purl.org/dc/dcmitype/StillImage" />
        <dc:title></dc:title>
      </cc:Work>
    </rdf:RDF>
  </metadata>
  <defs
     id="defs8" />
  <sodipodi:namedview
     pagecolor="#ffffff"
     bordercolor="#666666"
     borderopacity="1"
     objecttolerance="10"
     gridtolerance="10"
     guidetolerance="10"
     inkscape:pageopacity="0"
     inkscape:pageshadow="2"
     inkscape:window-width="960"
     inkscape:window-height="1061"
     id="namedview6"
     showgrid="false"
     inkscape:zoom="5.9"
     inkscape:cx="9.5"
     inkscape:cy="20"
     inkscape:window-x="960"
     inkscape:window-y="19"
     inkscape:window-maximized="0"
     inkscape:current-layer="svg4" />
  <path
     style="color:#000000;font-style:normal;font-variant:normal;font-weight:normal;font-stretch:normal;font-size:medium;line-height:normal;font-family:sans-serif;font-variant-ligatures:normal;font-variant-position:normal;font-variant-caps:normal;font-variant-numeric:normal;font-variant-alternates:normal;font-feature-settings:normal;text-indent:0;text-align:start;text-decoration:none;text-decoration-line:none;text-decoration-style:solid;text-decoration-color:#000000;letter-spacing:normal;word-spacing:normal;text-transform:none;writing-mode:lr-tb;direction:ltr;text-orientation:mixed;dominant-baseline:auto;baseline-shift:baseline;text-anchor:start;white-space:normal;shape-padding:0;clip-rule:nonzero;display:inline;overflow:visible;visibility:visible;opacity:1;isolation:auto;mix-blend-mode:normal;color-interpolation:sRGB;color-interpolation-filters:linearRGB;solid-color:#000000;solid-opacity:1;vector-effect:none;fill:#000000;fill-opacity:1;fill-rule:nonzero;stroke:none;stroke-width:1.5;stroke-linecap:round;stroke-linejoin:round;stroke-miterlimit:4;stroke-dasharray:none;stroke-dashoffset:0;stroke-opacity:1;color-rendering:auto;image-rendering:auto;shape-rendering:auto;text-rendering:auto;enable-background:accumulate"
     d="m 4.9882812,7.2402344 a 0.750075,0.750075 0 0 1 0.3378907,0.076172 0.750075,0.750075 0 0 1 0.066406,0.035156 0.750075,0.750075 0 0 1 0.048828,0.033203 0.750075,0.750075 0 0 1 0.013672,0.00781 0.750075,0.750075 0 0 1 0.019531,0.015625 0.750075,0.750075 0 0 1 0.00586,0.00586 A 0.750075,0.750075 0 0 1 5.75,8.1191406 v 1.4023438 l 0.625,-0.9375 A 0.750075,0.750075 0 0 1 6.6640625,8.3300781 l 2,-1 A 0.750075,0.750075 0 0 1 9,7.25 h 1.898438 a 0.750075,0.750075 0 0 1 0.265624,0.017578 0.750075,0.750075 0 0 1 0.07227,0.021484 0.750075,0.750075 0 0 1 0.03125,0.00977 l 0.0059,0.00195 2.96289,0.9882813 a 0.750075,0.750075 0 0 1 0.433594,0.375 l 1,1.9999995 A 0.750075,0.750075 0 0 1 15.75,11 v 9.6875 L 16.310547,21.25 H 17 a 0.750075,0.750075 0 0 1 0,1.5 h -1 -0.876953 a 0.750075,0.750075 0 0 1 -0.246094,0 h -0.753906 a 0.750075,0.750075 0 0 1 -0.246094,0 H 13 12 a 0.750075,0.750075 0 0 1 0,-1.5 h 0.689453 L 13.25,20.6875 V 11.177734 L 12.441406,9.5585938 10.824219,8.75 H 9.1777344 L 7.5136719,9.5820312 5.75,12.228516 V 20.6875 L 6.3105469,21.25 H 7 a 0.750075,0.750075 0 0 1 0,1.5 H 6 5.1230469 a 0.750075,0.750075 0 0 1 -0.2460938,0 H 4.1230469 a 0.750075,0.750075 0 0 1 -0.2460938,0 H 3 2 a 0.750075,0.750075 0 0 1 0,-1.5 H 2.6894531 L 3.25,20.6875 V 10.3125 L 2.6894531,9.75 H 2 A 0.750075,0.750075 0 0 1 1.7636719,8.2890625 L 4.6464844,7.328125 a 0.750075,0.750075 0 0 1 0.3417968,-0.087891 z"
     id="path2" />
</svg>
