<?xml version="1.0" encoding="UTF-8" standalone="no"?>
<svg
   xmlns:dc="http://purl.org/dc/elements/1.1/"
   xmlns:cc="http://creativecommons.org/ns#"
   xmlns:rdf="http://www.w3.org/1999/02/22-rdf-syntax-ns#"
   xmlns:svg="http://www.w3.org/2000/svg"
   xmlns="http://www.w3.org/2000/svg"
   xmlns:sodipodi="http://sodipodi.sourceforge.net/DTD/sodipodi-0.dtd"
   xmlns:inkscape="http://www.inkscape.org/namespaces/inkscape"
   data-dec="48"
   width="19"
   height="40"
   version="1.1"
   id="svg4"
   sodipodi:docname="48.svg"
   inkscape:version="0.92.4 5da689c313, 2019-01-14">
  <metadata
     id="metadata10">
    <rdf:RDF>
      <cc:Work
         rdf:about="">
        <dc:format>image/svg+xml</dc:format>
        <dc:type
           rdf:resource="http://purl.org/dc/dcmitype/StillImage" />
        <dc:title></dc:title>
      </cc:Work>
    </rdf:RDF>
  </metadata>
  <defs
     id="defs8" />
  <sodipodi:namedview
     pagecolor="#ffffff"
     bordercolor="#666666"
     borderopacity="1"
     objecttolerance="10"
     gridtolerance="10"
     guidetolerance="10"
     inkscape:pageopacity="0"
     inkscape:pageshadow="2"
     inkscape:window-width="1920"
     inkscape:window-height="1043"
     id="namedview6"
     showgrid="false"
     inkscape:zoom="5.9"
     inkscape:cx="9.5"
     inkscape:cy="20"
     inkscape:window-x="0"
     inkscape:window-y="37"
     inkscape:window-maximized="0"
     inkscape:current-layer="svg4" />
  <path
     style="color:#000000;font-style:normal;font-variant:normal;font-weight:normal;font-stretch:normal;font-size:medium;line-height:normal;font-family:sans-serif;font-variant-ligatures:normal;font-variant-position:normal;font-variant-caps:normal;font-variant-numeric:normal;font-variant-alternates:normal;font-feature-settings:normal;text-indent:0;text-align:start;text-decoration:none;text-decoration-line:none;text-decoration-style:solid;text-decoration-color:#000000;letter-spacing:normal;word-spacing:normal;text-transform:none;writing-mode:lr-tb;direction:ltr;text-orientation:mixed;dominant-baseline:auto;baseline-shift:baseline;text-anchor:start;white-space:normal;shape-padding:0;clip-rule:nonzero;display:inline;overflow:visible;visibility:visible;opacity:1;isolation:auto;mix-blend-mode:normal;color-interpolation:sRGB;color-interpolation-filters:linearRGB;solid-color:#000000;solid-opacity:1;vector-effect:none;fill:#000000;fill-opacity:1;fill-rule:nonzero;stroke:none;stroke-width:0.5;stroke-linecap:round;stroke-linejoin:round;stroke-miterlimit:4;stroke-dasharray:none;stroke-dashoffset:0;stroke-opacity:1;color-rendering:auto;image-rendering:auto;shape-rendering:auto;text-rendering:auto;enable-background:accumulate"
     d="m 15.613281,5.7871094 0.632813,3.1640625 A 0.250025,0.250025 0 0 1 16.25,9 v 5 a 0.250025,0.250025 0 0 1 -0.0039,0.04883 L 15.611328,17.21875 15.769531,16.904297 16.75,13.958984 V 9.0410156 L 15.767578,6.0957031 Z m -12.2265622,0 L 3.2324219,6.0957031 2.25,9.0410156 v 4.9179684 l 0.9824219,2.945313 0.1542969,0.308594 -0.6328126,-3.164063 A 0.250025,0.250025 0 0 1 2.75,14 V 9 a 0.250025,0.250025 0 0 1 0.00391,-0.048828 z M 9.0410156,1.25 6.1347656,2.21875 4.2304688,4.1230469 3.25,9.0253906 v 4.9492184 l 0.9804688,4.902344 1.9042968,1.904297 2.90625,0.96875 H 9.9589844 L 12.865234,20.78125 14.769531,18.876953 15.75,13.974609 V 9.0253906 L 14.769531,4.1230469 12.865234,2.21875 9.9589844,1.25 Z M 9.0117188,0.74804688 A 0.250025,0.250025 0 0 1 9.0234375,0.75 h 0.9570313 a 0.250025,0.250025 0 0 1 0.050781,0.001953 0.250025,0.250025 0 0 1 0.02344,0.003906 0.250025,0.250025 0 0 1 0.02344,0.007813 l 3,1.00000002 a 0.250025,0.250025 0 0 1 0.09961,0.058594 l 2,2 a 0.250025,0.250025 0 0 1 0.0098,0.013672 0.250025,0.250025 0 0 1 0.0039,0.00391 0.250025,0.250025 0 0 1 0.0059,0.00586 0.250025,0.250025 0 0 1 0.0098,0.013672 0.250025,0.250025 0 0 1 0.0039,0.00781 0.250025,0.250025 0 0 1 0.0078,0.013672 0.250025,0.250025 0 0 1 0.0039,0.00781 0.250025,0.250025 0 0 1 0.0078,0.013672 l 0.002,0.00586 0.990234,1.9804688 a 0.250025,0.250025 0 0 1 0.01367,0.033203 l 1,3 A 0.250025,0.250025 0 0 1 17.25,9 v 5 a 0.250025,0.250025 0 0 1 -0.01367,0.07813 l -0.988281,2.962891 a 0.250025,0.250025 0 0 1 -0.0059,0.02344 0.250025,0.250025 0 0 1 -0.01172,0.03125 0.250025,0.250025 0 0 1 -0.002,0.0059 0.250025,0.250025 0 0 1 -0.0059,0.0098 0.250025,0.250025 0 0 1 -0.01367,0.0293 l -0.002,0.0039 -0.972656,1.94336 a 0.250025,0.250025 0 0 1 -0.002,0.0059 l -0.0098,0.01758 a 0.250025,0.250025 0 0 1 -0.0293,0.04687 0.250025,0.250025 0 0 1 -0.01563,0.01953 l -2,2 a 0.250025,0.250025 0 0 1 -0.01172,0.0098 0.250025,0.250025 0 0 1 -0.04102,0.0293 0.250025,0.250025 0 0 1 -0.02344,0.01172 0.250025,0.250025 0 0 1 -0.02344,0.0078 l -3,1 a 0.250025,0.250025 0 0 1 -0.01563,0.0059 0.250025,0.250025 0 0 1 -0.01367,0.002 0.250025,0.250025 0 0 1 -0.02344,0.0039 0.250025,0.250025 0 0 1 -0.01172,0.002 0.250025,0.250025 0 0 1 -0.01367,0 0.250025,0.250025 0 0 1 -0.023437,0 H 9.0195312 a 0.250025,0.250025 0 0 1 -0.050781,-0.002 0.250025,0.250025 0 0 1 -0.023437,-0.0039 0.250025,0.250025 0 0 1 -0.023437,-0.0078 l -3,-1 a 0.250025,0.250025 0 0 1 -0.039063,-0.01563 0.250025,0.250025 0 0 1 -0.041016,-0.02734 0.250025,0.250025 0 0 1 -0.019531,-0.01563 l -2,-2 a 0.250025,0.250025 0 0 1 -0.00195,-0.0039 0.250025,0.250025 0 0 1 -0.011719,-0.01367 0.250025,0.250025 0 0 1 -0.00586,-0.0059 0.250025,0.250025 0 0 1 -0.00391,-0.0078 0.250025,0.250025 0 0 1 -0.00977,-0.01367 0.250025,0.250025 0 0 1 -0.00781,-0.01367 0.250025,0.250025 0 0 1 -0.00391,-0.0078 l -0.00781,-0.01367 a 0.250025,0.250025 0 0 1 -0.00195,-0.0059 L 2.7773438,17.111328 a 0.250025,0.250025 0 0 1 -0.013672,-0.0332 l -1,-3 A 0.250025,0.250025 0 0 1 1.75,14 V 9 a 0.250025,0.250025 0 0 1 0.013672,-0.078125 l 1,-3 a 0.250025,0.250025 0 0 1 0.013672,-0.033203 L 3.765625,3.9121094 a 0.250025,0.250025 0 0 1 0.011719,-0.023437 0.250025,0.250025 0 0 1 0.00195,-0.00586 0.250025,0.250025 0 0 1 0.011719,-0.021484 0.250025,0.250025 0 0 1 0.015625,-0.019531 0.250025,0.250025 0 0 1 0.015625,-0.019531 l 2,-2 A 0.250025,0.250025 0 0 1 5.8339844,1.8125 0.250025,0.250025 0 0 1 5.921875,1.7636719 l 3,-1.00000002 a 0.250025,0.250025 0 0 1 0.00391,-0.001953 0.250025,0.250025 0 0 1 0.025391,-0.005859 0.250025,0.250025 0 0 1 0.023437,-0.003906 A 0.250025,0.250025 0 0 1 9,0.75 a 0.250025,0.250025 0 0 1 0.011719,-0.001953 z"
     id="path2" />
</svg>
