<?xml version="1.0" encoding="UTF-8" standalone="no"?>
<svg
   xmlns:dc="http://purl.org/dc/elements/1.1/"
   xmlns:cc="http://creativecommons.org/ns#"
   xmlns:rdf="http://www.w3.org/1999/02/22-rdf-syntax-ns#"
   xmlns:svg="http://www.w3.org/2000/svg"
   xmlns="http://www.w3.org/2000/svg"
   xmlns:sodipodi="http://sodipodi.sourceforge.net/DTD/sodipodi-0.dtd"
   xmlns:inkscape="http://www.inkscape.org/namespaces/inkscape"
   data-dec="71"
   width="22"
   height="40"
   version="1.1"
   id="svg4"
   sodipodi:docname="71.svg"
   inkscape:version="0.92.4 (unknown)">
  <metadata
     id="metadata10">
    <rdf:RDF>
      <cc:Work
         rdf:about="">
        <dc:format>image/svg+xml</dc:format>
        <dc:type
           rdf:resource="http://purl.org/dc/dcmitype/StillImage" />
      </cc:Work>
    </rdf:RDF>
  </metadata>
  <defs
     id="defs8" />
  <sodipodi:namedview
     pagecolor="#ffffff"
     bordercolor="#666666"
     borderopacity="1"
     objecttolerance="10"
     gridtolerance="10"
     guidetolerance="10"
     inkscape:pageopacity="0"
     inkscape:pageshadow="2"
     inkscape:window-width="640"
     inkscape:window-height="480"
     id="namedview6"
     showgrid="false"
     inkscape:zoom="5.9"
     inkscape:cx="11"
     inkscape:cy="20"
     inkscape:window-x="0"
     inkscape:window-y="27"
     inkscape:window-maximized="0"
     inkscape:current-layer="svg4" />
  <path
     style="color:#000000;font-style:normal;font-variant:normal;font-weight:normal;font-stretch:normal;font-size:medium;line-height:normal;font-family:sans-serif;font-variant-ligatures:normal;font-variant-position:normal;font-variant-caps:normal;font-variant-numeric:normal;font-variant-alternates:normal;font-feature-settings:normal;text-indent:0;text-align:start;text-decoration:none;text-decoration-line:none;text-decoration-style:solid;text-decoration-color:#000000;letter-spacing:normal;word-spacing:normal;text-transform:none;writing-mode:lr-tb;direction:ltr;text-orientation:mixed;dominant-baseline:auto;baseline-shift:baseline;text-anchor:start;white-space:normal;shape-padding:0;clip-rule:nonzero;display:inline;overflow:visible;visibility:visible;opacity:1;isolation:auto;mix-blend-mode:normal;color-interpolation:sRGB;color-interpolation-filters:linearRGB;solid-color:#000000;solid-opacity:1;vector-effect:none;fill:#000000;fill-opacity:1;fill-rule:nonzero;stroke:none;stroke-width:2;stroke-linecap:round;stroke-linejoin:round;stroke-miterlimit:4;stroke-dasharray:none;stroke-dashoffset:0;stroke-opacity:1;color-rendering:auto;image-rendering:auto;shape-rendering:auto;text-rendering:auto;enable-background:accumulate"
     d="m 13.964844,-0.00585938 a 1.0001,1.0001 0 0 1 0.205078,0.01757813 1.0001,1.0001 0 0 1 0.0918,0.01953125 1.0001,1.0001 0 0 1 0.0059,0.0019531 1.0001,1.0001 0 0 1 0.283203,0.125 l 1.896485,0.94726568 a 1.0001,1.0001 0 0 1 0.259765,0.1875 l 2,2 a 1.0001,1.0001 0 0 1 0.1875,0.2597656 l 0.935547,1.8710937 a 1.0001,1.0001 0 0 1 0.06055,1.0566407 1.0001,1.0001 0 0 1 -0.01953,0.03125 1.0001,1.0001 0 0 1 -0.0293,0.048828 1.0001,1.0001 0 0 1 -0.0059,0.00977 1.0001,1.0001 0 0 1 -0.04883,0.064453 A 1.0001,1.0001 0 0 1 18.851562,7 H 18.15625 A 1.0001,1.0001 0 0 1 17.851562,7 H 17 A 1.0001,1.0001 0 0 1 16.105469,6.4472656 L 15.253906,4.7460938 13.763672,4 H 13 10 9.2363281 L 7.7460938,4.7460938 6.9257812,6.3828125 6,9.1621094 V 13.837891 L 6.9257812,16.617188 7.7460938,18.253906 9.2363281,19 H 13 13.763672 L 15.253906,18.253906 16,16.763672 V 16 h -3 a 1.0001,1.0001 0 0 1 -1,-1 v -1.841797 a 1.0001,1.0001 0 0 1 0.263672,-0.849609 1.0001,1.0001 0 0 1 0.01367,-0.01367 1.0001,1.0001 0 0 1 0.0059,-0.0059 A 1.0001,1.0001 0 0 1 13.167969,12 H 14 19 a 1.0001,1.0001 0 0 1 1,1 v 4 a 1.0001,1.0001 0 0 1 -0.105469,0.447266 l -1,2 a 1.0001,1.0001 0 0 1 -0.1875,0.259765 l -2,2 a 1.0001,1.0001 0 0 1 -0.259765,0.1875 l -2,1 A 1.0001,1.0001 0 0 1 14,23 H 10 9 A 1.0001,1.0001 0 0 1 8.5527344,22.894531 l -2,-1 a 1.0001,1.0001 0 0 1 -0.2597656,-0.1875 l -2,-2 a 1.0001,1.0001 0 0 1 -0.1875,-0.259765 l -1,-2 a 1.0001,1.0001 0 0 1 -0.054688,-0.13086 l -1,-3 A 1.0001,1.0001 0 0 1 2,14 V 9 a 1.0001,1.0001 0 0 1 0.050781,-0.3164062 l 1,-3 a 1.0001,1.0001 0 0 1 0.054688,-0.1308594 l 1,-2 a 1.0001,1.0001 0 0 1 0.1875,-0.2597656 l 2,-2 a 1.0001,1.0001 0 0 1 0.2597656,-0.1875 l 2,-1.00000005 A 1.0001,1.0001 0 0 1 9,0 h 4.890625 a 1.0001,1.0001 0 0 1 0.07422,-0.00585938 z"
     id="path2" />
</svg>
