<?xml version="1.0" encoding="UTF-8" standalone="no"?>
<svg
   xmlns:dc="http://purl.org/dc/elements/1.1/"
   xmlns:cc="http://creativecommons.org/ns#"
   xmlns:rdf="http://www.w3.org/1999/02/22-rdf-syntax-ns#"
   xmlns:svg="http://www.w3.org/2000/svg"
   xmlns="http://www.w3.org/2000/svg"
   xmlns:sodipodi="http://sodipodi.sourceforge.net/DTD/sodipodi-0.dtd"
   xmlns:inkscape="http://www.inkscape.org/namespaces/inkscape"
   data-dec="95"
   width="20"
   height="40"
   version="1.1"
   id="svg4"
   sodipodi:docname="95.svg"
   inkscape:version="0.92.4 (unknown)">
  <metadata
     id="metadata10">
    <rdf:RDF>
      <cc:Work
         rdf:about="">
        <dc:format>image/svg+xml</dc:format>
        <dc:type
           rdf:resource="http://purl.org/dc/dcmitype/StillImage" />
      </cc:Work>
    </rdf:RDF>
  </metadata>
  <defs
     id="defs8" />
  <sodipodi:namedview
     pagecolor="#ffffff"
     bordercolor="#666666"
     borderopacity="1"
     objecttolerance="10"
     gridtolerance="10"
     guidetolerance="10"
     inkscape:pageopacity="0"
     inkscape:pageshadow="2"
     inkscape:window-width="640"
     inkscape:window-height="480"
     id="namedview6"
     showgrid="false"
     inkscape:zoom="5.9"
     inkscape:cx="10"
     inkscape:cy="20"
     inkscape:window-x="0"
     inkscape:window-y="27"
     inkscape:window-maximized="0"
     inkscape:current-layer="svg4" />
  <path
     style="color:#000000;font-style:normal;font-variant:normal;font-weight:normal;font-stretch:normal;font-size:medium;line-height:normal;font-family:sans-serif;font-variant-ligatures:normal;font-variant-position:normal;font-variant-caps:normal;font-variant-numeric:normal;font-variant-alternates:normal;font-feature-settings:normal;text-indent:0;text-align:start;text-decoration:none;text-decoration-line:none;text-decoration-style:solid;text-decoration-color:#000000;letter-spacing:normal;word-spacing:normal;text-transform:none;writing-mode:lr-tb;direction:ltr;text-orientation:mixed;dominant-baseline:auto;baseline-shift:baseline;text-anchor:start;white-space:normal;shape-padding:0;clip-rule:nonzero;display:inline;overflow:visible;visibility:visible;opacity:1;isolation:auto;mix-blend-mode:normal;color-interpolation:sRGB;color-interpolation-filters:linearRGB;solid-color:#000000;solid-opacity:1;vector-effect:none;fill:#000000;fill-opacity:1;fill-rule:nonzero;stroke:none;stroke-width:0.30000001;stroke-linecap:round;stroke-linejoin:round;stroke-miterlimit:4;stroke-dasharray:none;stroke-dashoffset:0;stroke-opacity:1;color-rendering:auto;image-rendering:auto;shape-rendering:auto;text-rendering:auto;enable-background:accumulate"
     d="m 0.15039062,27.150391 v 0.699218 H 19.849609 v -0.699218 z m -0.15234375,-0.302735 a 0.15001501,0.15001501 0 0 1 0.02929688,0.002 H 19.982422 a 0.15001501,0.15001501 0 0 1 0.07227,0.0098 0.15001501,0.15001501 0 0 1 0.002,0 0.15001501,0.15001501 0 0 1 0.01172,0.0059 0.15001501,0.15001501 0 0 1 0.002,0 0.15001501,0.15001501 0 0 1 0.02344,0.01563 0.15001501,0.15001501 0 0 1 0.002,0 0.15001501,0.15001501 0 0 1 0.0098,0.0098 0.15001501,0.15001501 0 0 1 0,0.002 0.15001501,0.15001501 0 0 1 0.0098,0.0098 0.15001501,0.15001501 0 0 1 0.0098,0.01172 0.15001501,0.15001501 0 0 1 0.0078,0.01172 0.15001501,0.15001501 0 0 1 0,0.002 0.15001501,0.15001501 0 0 1 0.0059,0.01172 0.15001501,0.15001501 0 0 1 0,0.002 0.15001501,0.15001501 0 0 1 0.0059,0.01172 0.15001501,0.15001501 0 0 1 0,0.002 0.15001501,0.15001501 0 0 1 0.0059,0.02734 0.15001501,0.15001501 0 0 1 0,0.002 0.15001501,0.15001501 0 0 1 0,0.04297 v 0.955078 a 0.15001501,0.15001501 0 0 1 -0.0098,0.07227 0.15001501,0.15001501 0 0 1 0,0.002 0.15001501,0.15001501 0 0 1 -0.0059,0.01172 0.15001501,0.15001501 0 0 1 -0.0078,0.01367 0.15001501,0.15001501 0 0 1 -0.0078,0.01172 0.15001501,0.15001501 0 0 1 0,0.002 0.15001501,0.15001501 0 0 1 -0.0059,0.0039 0.15001501,0.15001501 0 0 1 -0.06836,0.04492 0.15001501,0.15001501 0 0 1 -0.02734,0.0059 0.15001501,0.15001501 0 0 1 -0.002,0 0.15001501,0.15001501 0 0 1 -0.04297,0 H 0.01757813 a 0.15001501,0.15001501 0 0 1 -0.07226563,-0.0098 0.15001501,0.15001501 0 0 1 -0.0019531,0 0.15001501,0.15001501 0 0 1 -0.01171875,-0.0059 0.15001501,0.15001501 0 0 1 -0.0019531,0 0.15001501,0.15001501 0 0 1 -0.0234375,-0.01563 0.15001501,0.15001501 0 0 1 -0.0019531,0 0.15001501,0.15001501 0 0 1 -0.0039063,-0.0059 0.15001501,0.15001501 0 0 1 -0.0058594,-0.0059 0.15001501,0.15001501 0 0 1 -0.009766,-0.0098 0.15001501,0.15001501 0 0 1 -0.009766,-0.01172 0.15001501,0.15001501 0 0 1 -0.007813,-0.01172 0.15001501,0.15001501 0 0 1 0,-0.002 0.15001501,0.15001501 0 0 1 -0.005859,-0.01172 0.15001501,0.15001501 0 0 1 0,-0.002 0.15001501,0.15001501 0 0 1 -0.005859,-0.01172 0.15001501,0.15001501 0 0 1 0,-0.002 0.15001501,0.15001501 0 0 1 -0.005859,-0.02734 0.15001501,0.15001501 0 0 1 0,-0.002 0.15001501,0.15001501 0 0 1 0,-0.04297 v -0.955078 a 0.15001501,0.15001501 0 0 1 0.009766,-0.07227 0.15001501,0.15001501 0 0 1 0,-0.002 0.15001501,0.15001501 0 0 1 0.005859,-0.01172 0.15001501,0.15001501 0 0 1 0,-0.002 0.15001501,0.15001501 0 0 1 0.015625,-0.02344 0.15001501,0.15001501 0 0 1 0,-0.002 0.15001501,0.15001501 0 0 1 0.005859,-0.0039 0.15001501,0.15001501 0 0 1 0.02734375,-0.02539 0.15001501,0.15001501 0 0 1 0.01171875,-0.0078 0.15001501,0.15001501 0 0 1 0.02929688,-0.01172 0.15001501,0.15001501 0 0 1 0.02734374,-0.0059 0.15001501,0.15001501 0 0 1 0.0019531,0 0.15001501,0.15001501 0 0 1 0.01367187,-0.002 z"
     id="path2" />
</svg>
