{
  "fontname": "Futura-Simplex",
  "height": 40,
  "data-date": "la date",
  "chars": [
    {
      "dec": "111",
      "width": "20",
      "d": "M8,8 L6,9 4,11 3,14 3,16 4,19 6,21 8,22 11,22 13,21 15,19 16,16 16,14 15,11 13,9 11,8 8,8"
    },
    {
      "dec": "83",
      "width": "20",
      "d": "M17,4 L15,2 12,1 8,1 5,2 3,4 3,6 4,8 5,9 7,10 13,12 15,13 16,14 17,16 17,19 15,21 12,22 8,22 5,21 3,19"
    },
    {
      "dec": "43",
      "width": "26",
      "d": "M13,4 L13,22 M4,13 L22,13"
    },
    {
      "dec": "81",
      "width": "22",
      "d": "M9,1 L7,2 5,4 4,6 3,9 3,14 4,17 5,19 7,21 9,22 13,22 15,21 17,19 18,17 19,14 19,9 18,6 17,4 15,2 13,1 9,1 M12,18 L18,24"
    },
    {
      "dec": "86",
      "width": "18",
      "d": "M1,1 L9,22 M17,1 L9,22"
    },
    {
      "dec": "70",
      "width": "16",
      "d": "M4,1 L4,22 M4,1 L17,1 M4,11 L12,11"
    },
    {
      "dec": "50",
      "width": "20",
      "d": "M4,6 L4,5 5,3 6,2 8,1 12,1 14,2 15,3 16,5 16,7 15,9 13,12 3,22 17,22"
    },
    {
      "dec": "180",
      "width": "12",
      "d": "M 9,2 3,7"
    },
    {
      "dec": "100",
      "width": "20",
      "d": "M15,1 L15,22 M15,11 L13,9 11,8 8,8 6,9 4,11 3,14 3,16 4,19 6,21 8,22 11,22 13,21 15,19"
    },
    {
      "dec": "102",
      "width": "12",
      "d": "M 10,1 H 8 L 6,2 5,5 V 22 M 2,8 h 7"
    },
    {
      "dec": "121",
      "width": "16",
      "d": "M2,8 L8,22 M14,8 L8,22 6,26 4,28 2,29 1,29"
    },
    {
      "dec": "93",
      "width": "14",
      "d": "M 10,-3 V 29 M 3,-3 h 7 M 3,29 h 7"
    },
    {
      "dec": "109",
      "width": "30",
      "d": "M4,8 L4,22 M4,12 L7,9 9,8 12,8 14,9 15,12 15,22 M15,12 L18,9 20,8 23,8 25,9 26,12 26,22"
    },
    {
      "dec": "45",
      "width": "26",
      "d": "M4,13 L22,13"
    },
    {
      "dec": "184",
      "width": "6",
      "d": "M 2,26 H 3 L 4,25 3,24 H 2 l 2,-2"
    },
    {
      "dec": "120",
      "width": "18",
      "d": "M3,8 L14,22 M14,8 L3,22"
    },
    {
      "dec": "71",
      "width": "22",
      "d": "M18,6 L17,4 15,2 13,1 9,1 7,2 5,4 4,6 3,9 3,14 4,17 5,19 7,21 9,22 13,22 15,21 17,19 18,17 18,14 M13,14 L18,14"
    },
    {
      "dec": "65",
      "width": "18",
      "d": "M9,1 L1,22 M9,1 L17,22 M4,15 L14,15"
    },
    {
      "dec": "104",
      "width": "19",
      "d": "M 4,1 V 22 M 4,12 7,9 9,8 h 3 l 2,1 1,3 v 10"
    },
    {
      "dec": "60",
      "width": "24",
      "d": "M20,4 L4,13 20,22"
    },
    {
      "dec": "49",
      "width": "20",
      "d": "M6,5 L8,4 11,1 11,22"
    },
    {
      "dec": "97",
      "width": "19",
      "d": "M 15,8 V 22 M 15,11 13,9 11,8 H 8 L 6,9 4,11 3,14 v 2 l 1,3 2,2 2,1 h 3 l 2,-1 2,-2"
    },
    {
      "dec": "187",
      "width": "14",
      "d": "M 7,20 13,14 7,8 M 1,20 7,14 1,8"
    },
    {
      "dec": "171",
      "width": "14",
      "d": "M 7,20 1,14 7,8 m 6,12 -6,-6 6,-6"
    },
    {
      "dec": "79",
      "width": "22",
      "d": "M9,1 L7,2 5,4 4,6 3,9 3,14 4,17 5,19 7,21 9,22 13,22 15,21 17,19 18,17 19,14 19,9 18,6 17,4 15,2 13,1 9,1"
    },
    {
      "dec": "44",
      "width": "8",
      "d": "M5,18 L4,19 3,18 4,17 5,18 5,20 3,22"
    },
    {
      "dec": "66",
      "width": "20",
      "d": "M4,1 L4,22 M4,1 L13,1 16,2 17,3 18,5 18,7 17,9 16,10 13,11 M4,11 L13,11 16,12 17,13 18,15 18,18 17,20 16,21 13,22 4,22"
    },
    {
      "dec": "101",
      "width": "17",
      "d": "M 2,14 H 14 V 12 L 13,10 12,9 10,8 H 7 L 5,9 3,11 2,14 v 2 l 1,3 2,2 2,1 h 3 l 2,-1 2,-2"
    },
    {
      "dec": "87",
      "width": "24",
      "d": "M2,1 L7,22 M12,1 L7,22 M12,1 L17,22 M22,1 L17,22"
    },
    {
      "dec": "85",
      "width": "22",
      "d": "M4,1 L4,16 5,19 7,21 10,22 12,22 15,21 17,19 18,16 18,1"
    },
    {
      "dec": "110",
      "width": "20",
      "d": "M4,8 L4,22 M4,12 L7,9 9,8 12,8 14,9 15,12 15,22"
    },
    {
      "dec": "119",
      "width": "22",
      "d": "M3,8 L7,22 M11,8 L7,22 M11,8 L15,22 M19,8 L15,22"
    },
    {
      "dec": "47",
      "width": "22",
      "d": "M20,-3 L2,29"
    },
    {
      "dec": "125",
      "width": "14",
      "d": "m 5,-3 2,1 1,1 1,2 V 3 L 8,5 7,6 6,8 v 2 l 2,2 m 0,0 2,1 -2,1 m 0,0 -2,2 v 2 l 1,2 1,1 1,2 v 2 l -1,2 -1,1 -2,1"
    },
    {
      "dec": "55",
      "width": "20",
      "d": "M17,1 L7,22 M3,1 L17,1"
    },
    {
      "dec": "339",
      "width": "30",
      "d": "M 8,8 6,9 4,11 3,14 v 2 l 1,3 2,2 2,1 h 3 l 2,-1 2,-2 1,-3 V 14 L 15,11 13,9 11,8 H 8 m 8,6 H 28 V 12 L 27,10 26,9 24,8 h -3 l -2,1 -2,2 -1,3 v 2 l 1,3 2,2 2,1 h 3 l 2,-1 2,-2"
    },
    {
      "dec": "62",
      "width": "24",
      "d": "M4,4 L20,13 4,22"
    },
    {
      "dec": "95",
      "width": "20",
      "d": "M 0,28 H 20"
    },
    {
      "dec": "69",
      "width": "18",
      "d": "M4,1 L4,22 M4,1 L17,1 M4,11 L12,11 M4,22 L17,22"
    },
    {
      "dec": "8212",
      "width": "26",
      "d": "M 0,13 H 26"
    },
    {
      "dec": "103",
      "width": "20",
      "d": "M15,8 L15,24 14,27 13,28 11,29 8,29 6,28 M15,11 L13,9 11,8 8,8 6,9 4,11 3,14 3,16 4,19 6,21 8,22 11,22 13,21 15,19"
    },
    {
      "dec": "33",
      "width": "10",
      "d": "M5,1 L5,15 M5,20 L4,21 5,22 6,21 5,20"
    },
    {
      "dec": "169",
      "width": "24",
      "d": "M 8,10 9,8 11,7 h 2 l 2,1 2,3 v 5 l -2,3 -2,1 H 11 L 9,19 8,18 m 6,-15 3,1 2,2 1,2 1,4 v 3 l -1,4 -1,2 -2,2 -3,1 H 10 L 7,23 5,21 4,19 3,15 V 12 L 4,8 5,6 7,4 10,3 h 4"
    },
    {
      "dec": "56",
      "width": "20",
      "d": "M8,1 L5,2 4,4 4,6 5,8 7,9 11,10 14,11 16,13 17,15 17,18 16,20 15,21 12,22 8,22 5,21 4,20 3,18 3,15 4,13 6,11 9,10 13,9 15,8 16,6 16,4 15,2 12,1 8,1"
    },
    {
      "dec": "48",
      "width": "20",
      "d": "M9,1 L6,2 4,5 3,10 3,13 4,18 6,21 9,22 11,22 14,21 16,18 17,13 17,10 16,5 14,2 11,1 9,1"
    },
    {
      "dec": "90",
      "width": "20",
      "d": "M17,1 L3,22 M3,1 L17,1 M3,22 L17,22"
    },
    {
      "dec": "35",
      "width": "22",
      "d": "M11,-3 L4,29 M17,-3 L10,29 M4,10 L18,10 M3,16 L17,16"
    },
    {
      "dec": "61",
      "width": "26",
      "d": "M4,10 L22,10 M4,16 L22,16"
    },
    {
      "dec": "80",
      "width": "20",
      "d": "M4,1 L4,22 M4,1 L13,1 16,2 17,3 18,5 18,8 17,10 16,11 13,12 4,12"
    },
    {
      "dec": "169",
      "width": "24",
      "d": "M 16,10 15,8 13,7 H 11 L 9,8 7,11 v 5 l 2,3 2,1 h 2 l 2,-1 1,-1 M 10,3 7,4 5,6 4,8 3,12 v 3 l 1,4 1,2 2,2 3,1 h 4 l 3,-1 2,-2 1,-2 1,-4 V 12 L 20,8 19,6 17,4 14,3 h -4"
    },
    {
      "dec": "38",
      "width": "26",
      "d": "M23,10 L23,9 22,8 21,8 20,9 19,11 17,16 15,19 13,21 11,22 7,22 5,21 4,20 3,18 3,16 4,14 5,13 12,9 13,8 14,6 14,4 13,2 11,1 9,2 8,4 8,6 9,9 11,12 16,19 18,21 20,22 22,22 23,21 23,20"
    },
    {
      "dec": "115",
      "width": "18",
      "d": "M14,11 L13,9 10,8 7,8 4,9 3,11 4,13 6,14 11,15 13,16 14,18 14,19 13,21 10,22 7,22 4,21 3,19"
    },
    {
      "dec": "76",
      "width": "17",
      "d": "m 3,1 v 21 m 0,0 h 12"
    },
    {
      "dec": "46",
      "width": "8",
      "d": "M4,17 L3,18 4,19 5,18 4,17"
    },
    {
      "dec": "122",
      "width": "18",
      "d": "M14,8 L3,22 M3,8 L14,8 M3,22 L14,22"
    },
    {
      "dec": "64",
      "width": "27",
      "d": "M 18,10 17,7 15,6 H 12 L 10,7 9,8 8,11 v 3 l 1,2 2,1 h 2 l 2,-1 2,-2 m 2,-8 -2,8 2,3 h 2 l 2,-2 1,-3 V 10 L 23,7 22,5 20,3 18,2 15,1 H 12 L 9,2 7,3 5,5 4,7 3,10 v 3 l 1,3 1,2 2,2 2,1 3,1 h 3 l 3,-1 2,-1 1,-1"
    },
    {
      "dec": "82",
      "width": "20",
      "d": "M4,1 L4,22 M4,1 L13,1 16,2 17,3 18,5 18,7 17,9 16,10 13,11 4,11 M11,11 L18,22"
    },
    {
      "dec": "94",
      "width": "16",
      "d": "m 8,5 -6,6 m 6,-6 6,6"
    },
    {
      "dec": "8208",
      "width": "26",
      "d": "M 4,13 H 22"
    },
    {
      "dec": "630",
      "width": "30",
      "d": "M 9,1 7,2 5,4 4,6 3,9 v 5 l 1,3 1,2 2,2 2,1 h 5 M 14,1 H 9 m 5,0 V 22 M 14,1 H 27 M 14,11 h 8 m -8,11 h 13"
    },
    {
      "dec": "8220",
      "width": "14",
      "d": "M 3,7 4,6 5,7 4,8 3,7 V 5 L 5,3 M 9,7 10,6 11,7 10,8 9,7 V 5 l 2,-2"
    },
    {
      "dec": "37",
      "width": "24",
      "d": "M21,1 L3,22 M8,1 L10,3 10,5 9,7 7,8 5,8 3,6 3,4 4,2 6,1 8,1 10,2 13,3 16,3 19,2 21,1 M17,15 L15,16 14,18 14,20 16,22 18,22 20,21 21,19 21,17 19,15 17,15"
    },
    {
      "dec": "68",
      "width": "20",
      "d": "M4,1 L4,22 M4,1 L11,1 14,2 16,4 17,6 18,9 18,14 17,17 16,19 14,21 11,22 4,22"
    },
    {
      "dec": "36",
      "width": "20",
      "d": "M8,-3 L8,26 M12,-3 L12,26 M17,4 L15,2 12,1 8,1 5,2 3,4 3,6 4,8 5,9 7,10 13,12 15,13 16,14 17,16 17,19 15,21 12,22 8,22 5,21 3,19"
    },
    {
      "dec": "105",
      "width": "8",
      "d": "M3,1 L4,2 5,1 4,0 3,1 M4,8 L4,22"
    },
    {
      "dec": "75",
      "width": "20",
      "d": "M4,1 L4,22 M18,1 L4,15 M9,10 L18,22"
    },
    {
      "dec": "51",
      "width": "20",
      "d": "M5,1 L16,1 10,9 13,9 15,10 16,11 17,14 17,16 16,19 14,21 11,22 8,22 5,21 4,20 3,18"
    },
    {
      "dec": "34",
      "width": "16",
      "d": "M4,1 L4,8 M12,1 L12,8"
    },
    {
      "dec": "98",
      "width": "18",
      "d": "M4,1 L4,22 M4,11 L6,9 8,8 11,8 13,9 15,11 16,14 16,16 15,19 13,21 11,22 8,22 6,21 4,19"
    },
    {
      "dec": "96",
      "width": "12",
      "d": "M 3,2 9,7"
    },
    {
      "dec": "74",
      "width": "16",
      "d": "M12,1 L12,17 11,20 10,21 8,22 6,22 4,21 3,20 2,17 2,15"
    },
    {
      "dec": "58",
      "width": "8",
      "d": "M4,10 L3,11 4,12 5,11 4,10 M4,17 L3,18 4,19 5,18 4,17"
    },
    {
      "dec": "57",
      "width": "20",
      "d": "M16,8 L15,11 13,13 10,14 9,14 6,13 4,11 3,8 3,7 4,4 6,2 9,1 10,1 13,2 15,4 16,8 16,13 15,18 13,21 10,22 8,22 5,21 4,19"
    },
    {
      "dec": "73",
      "width": "8",
      "d": "M4,1 L4,22"
    },
    {
      "dec": "84",
      "width": "16",
      "d": "M8,1 L8,22 M1,1 L15,1"
    },
    {
      "dec": "108",
      "width": "8",
      "d": "M4,1 L4,22"
    },
    {
      "dec": "63",
      "width": "18",
      "d": "M3,6 L3,5 4,3 5,2 7,1 11,1 13,2 14,3 15,5 15,7 14,9 13,10 9,12 9,15 M9,20 L8,21 9,22 10,21 9,20"
    },
    {
      "dec": "8221",
      "width": "14",
      "d": "M 11,4 10,5 9,4 10,3 11,4 V 6 L 9,8 M 5,4 4,5 3,4 4,3 5,4 V 6 L 3,8"
    },
    {
      "dec": "118",
      "width": "16",
      "d": "M2,8 L8,22 M14,8 L8,22"
    },
    {
      "dec": "126",
      "width": "24",
      "d": "m 3,16 v -2 l 1,-3 2,-1 h 2 l 2,1 4,3 2,1 h 2 l 2,-1 1,-2 m 0,0 v -2"
    },
    {
      "dec": "42",
      "width": "16",
      "d": "M8,7 L8,19 M3,10 L13,16 M13,10 L3,16"
    },
    {
      "dec": "106",
      "width": "10",
      "d": "M5,1 L6,2 7,1 6,0 5,1 M6,8 L6,25 5,28 3,29 1,29"
    },
    {
      "dec": "91",
      "width": "14",
      "d": "M 4,-3 V 29 M 4,-3 h 7 M 4,29 h 7"
    },
    {
      "dec": "112",
      "width": "18",
      "d": "M4,8 L4,29 M4,11 L6,9 8,8 11,8 13,9 15,11 16,14 16,16 15,19 13,21 11,22 8,22 6,21 4,19"
    },
    {
      "dec": "41",
      "width": "14",
      "d": "M3,-3 L5,-1 7,2 9,6 10,11 10,15 9,20 7,24 5,27 3,29"
    },
    {
      "dec": "78",
      "width": "22",
      "d": "M4,1 L4,22 M4,1 L18,22 M18,1 L18,22"
    },
    {
      "dec": "59",
      "width": "8",
      "d": "M4,10 L3,11 4,12 5,11 4,10 M5,18 L4,19 3,18 4,17 5,18 5,20 3,22"
    },
    {
      "dec": "168",
      "width": "15",
      "d": "M 4 3 L 3 4 L 4 5 L 5 4 L 4 3 z M 11 3 L 10 4 L 11 5 L 12 4 L 11 3 z "
    },
    {
      "dec": "88",
      "width": "20",
      "d": "M3,1 L17,22 M17,1 L3,22"
    },
    {
      "dec": "89",
      "width": "18",
      "d": "M1,1 L9,11 9,22 M17,1 L9,11"
    },
    {
      "dec": "114",
      "width": "12",
      "d": "M4,8 L4,22 M4,14 L5,11 7,9 9,8 12,8"
    },
    {
      "dec": "116",
      "width": "14",
      "d": "M5,1 L5,18 6,21 8,22 10,22 M2,8 L9,8"
    },
    {
      "dec": "54",
      "width": "20",
      "d": "M16,4 L15,2 12,1 10,1 7,2 5,5 4,10 4,15 5,19 7,21 10,22 11,22 14,21 16,19 17,16 17,15 16,12 14,10 11,9 10,9 7,10 5,12 4,15"
    },
    {
      "dec": "117",
      "width": "20",
      "d": "M4,8 L4,18 5,21 7,22 10,22 12,21 15,18 M15,8 L15,22"
    },
    {
      "dec": "124",
      "width": "8",
      "d": "M4,-3 L4,29"
    },
    {
      "dec": "77",
      "width": "24",
      "d": "M4,1 L4,22 M4,1 L12,22 M20,1 L12,22 M20,1 L20,22"
    },
    {
      "dec": "123",
      "width": "14",
      "d": "M 9,-3 7,-2 6,-1 5,1 v 2 l 1,2 1,1 1,2 v 2 l -2,2 m 0,0 -2,1 2,1 m 0,0 2,2 v 2 l -1,2 -1,1 -1,2 v 2 l 1,2 1,1 2,1"
    },
    {
      "dec": "72",
      "width": "22",
      "d": "M4,1 L4,22 M18,1 L18,22 M4,11 L18,11"
    },
    {
      "dec": "53",
      "width": "20",
      "d": "M15,1 L5,1 4,10 5,9 8,8 11,8 14,9 16,11 17,14 17,16 16,19 14,21 11,22 8,22 5,21 4,20 3,18"
    },
    {
      "dec": "52",
      "width": "20",
      "d": "M13,1 L3,15 18,15 M13,1 L13,22"
    },
    {
      "dec": "40",
      "width": "14",
      "d": "M11,-3 L9,-1 7,2 5,6 4,11 4,15 5,20 7,24 9,27 11,29"
    },
    {
      "dec": "99",
      "width": "18",
      "d": "M15,11 L13,9 11,8 8,8 6,9 4,11 3,14 3,16 4,19 6,21 8,22 11,22 13,21 15,19"
    },
    {
      "dec": "127",
      "width": "16",
      "d": "M0,1 L0,22 1,22 1,1 2,1 2,22 3,22 3,1 4,1 4,22 5,22 5,1 6,1 6,22 7,22 7,1 8,1 8,22 9,22 9,1 10,1 10,22 11,22 11,1 12,1 12,22 13,22 13,1 14,1 14,22 15,22 15,1 16,1 16,22"
    },
    {
      "dec": "39",
      "width": "10",
      "d": "M5,3 L4,2 5,1 6,2 6,4 5,6 4,7"
    },
    {
      "dec": "92",
      "width": "14",
      "d": "M0,1 L14,25"
    },
    {
      "dec": "107",
      "width": "16",
      "d": "M4,1 L4,22 M14,8 L4,18 M8,14 L15,22"
    },
    {
      "dec": "113",
      "width": "20",
      "d": "M15,8 L15,29 M15,11 L13,9 11,8 8,8 6,9 4,11 3,14 3,16 4,19 6,21 8,22 11,22 13,21 15,19"
    },
    {
      "dec": "67",
      "width": "22",
      "d": "M18,6 L17,4 15,2 13,1 9,1 7,2 5,4 4,6 3,9 3,14 4,17 5,19 7,21 9,22 13,22 15,21 17,19 18,17"
    }
  ]
}