<?xml version="1.0" encoding="UTF-8" standalone="no"?>
<svg
   xmlns:dc="http://purl.org/dc/elements/1.1/"
   xmlns:cc="http://creativecommons.org/ns#"
   xmlns:rdf="http://www.w3.org/1999/02/22-rdf-syntax-ns#"
   xmlns:svg="http://www.w3.org/2000/svg"
   xmlns="http://www.w3.org/2000/svg"
   xmlns:sodipodi="http://sodipodi.sourceforge.net/DTD/sodipodi-0.dtd"
   xmlns:inkscape="http://www.inkscape.org/namespaces/inkscape"
   data-dec="83"
   width="17"
   height="40"
   version="1.1"
   id="svg4"
   sodipodi:docname="83.svg"
   inkscape:version="0.92.4 5da689c313, 2019-01-14">
  <metadata
     id="metadata10">
    <rdf:RDF>
      <cc:Work
         rdf:about="">
        <dc:format>image/svg+xml</dc:format>
        <dc:type
           rdf:resource="http://purl.org/dc/dcmitype/StillImage" />
        <dc:title></dc:title>
      </cc:Work>
    </rdf:RDF>
  </metadata>
  <defs
     id="defs8" />
  <sodipodi:namedview
     pagecolor="#ffffff"
     bordercolor="#666666"
     borderopacity="1"
     objecttolerance="10"
     gridtolerance="10"
     guidetolerance="10"
     inkscape:pageopacity="0"
     inkscape:pageshadow="2"
     inkscape:window-width="1920"
     inkscape:window-height="1043"
     id="namedview6"
     showgrid="false"
     inkscape:zoom="5.9"
     inkscape:cx="8.5"
     inkscape:cy="20"
     inkscape:window-x="0"
     inkscape:window-y="37"
     inkscape:window-maximized="0"
     inkscape:current-layer="svg4" />
  <path
     style="color:#000000;font-style:normal;font-variant:normal;font-weight:normal;font-stretch:normal;font-size:medium;line-height:normal;font-family:sans-serif;font-variant-ligatures:normal;font-variant-position:normal;font-variant-caps:normal;font-variant-numeric:normal;font-variant-alternates:normal;font-feature-settings:normal;text-indent:0;text-align:start;text-decoration:none;text-decoration-line:none;text-decoration-style:solid;text-decoration-color:#000000;letter-spacing:normal;word-spacing:normal;text-transform:none;writing-mode:lr-tb;direction:ltr;text-orientation:mixed;dominant-baseline:auto;baseline-shift:baseline;text-anchor:start;white-space:normal;shape-padding:0;clip-rule:nonzero;display:inline;overflow:visible;visibility:visible;opacity:1;isolation:auto;mix-blend-mode:normal;color-interpolation:sRGB;color-interpolation-filters:linearRGB;solid-color:#000000;solid-opacity:1;vector-effect:none;fill:#000000;fill-opacity:1;fill-rule:nonzero;stroke:none;stroke-width:0.5;stroke-linecap:round;stroke-linejoin:round;stroke-miterlimit:4;stroke-dasharray:none;stroke-dashoffset:0;stroke-opacity:1;color-rendering:auto;image-rendering:auto;shape-rendering:auto;text-rendering:auto;enable-background:accumulate"
     d="m 2.25,17.537109 v 1.359375 l 0.8984375,0.898438 0.5820313,0.291016 -0.9082032,-0.908204 a 0.250025,0.250025 0 0 1 -0.058594,-0.09961 z m 0.6445312,-9.3066402 0.2988282,0.5976562 2.9042968,1.935547 4.9511718,0.990234 a 0.250025,0.250025 0 0 1 0.08984,0.03711 l 2.966797,1.978515 -0.298828,-0.597656 -2.904297,-1.935547 -4.9511721,-0.990234 a 0.250025,0.250025 0 0 1 -0.089844,-0.03711 z m 9.5351568,-6.15625 0.748046,0.7480468 a 0.250025,0.250025 0 0 1 0.05859,0.099609 L 13.75,4.4628906 V 3.1035156 L 12.865234,2.21875 Z M 9.9921875,0.74804688 A 0.250025,0.250025 0 0 1 10.005859,0.75 a 0.250025,0.250025 0 0 1 0.0098,0 0.250025,0.250025 0 0 1 0.01563,0.001953 0.250025,0.250025 0 0 1 0.02344,0.003906 0.250025,0.250025 0 0 1 0.0098,0.001953 0.250025,0.250025 0 0 1 0.03516,0.0136719 l 2.978516,0.99218752 a 0.250025,0.250025 0 0 1 0.09961,0.058594 l 1,1 A 0.250025,0.250025 0 0 1 14.25,3 V 6 A 0.250025,0.250025 0 0 1 13.763672,6.078125 L 12.78125,3.1347656 11.851562,2.2050781 9.9433594,1.25 H 6.0585938 L 4.1484375,2.2050781 3.2050781,3.1484375 2.25,5.0585938 V 5.9433594 L 3.1933594,7.828125 6.0976562,9.7636719 11.048828,10.753906 a 0.250025,0.250025 0 0 1 0.08984,0.03711 l 3,2 a 0.250025,0.250025 0 0 1 0.08398,0.09766 l 1,2 A 0.250025,0.250025 0 0 1 15.25,15 v 0.976562 a 0.250025,0.250025 0 0 1 0,0.04883 V 18 a 0.250025,0.250025 0 0 1 -0.02734,0.111328 l -1,2 a 0.250025,0.250025 0 0 1 -0.04492,0.06641 l -1,1 a 0.250025,0.250025 0 0 1 -0.09961,0.05859 l -3,1 A 0.250025,0.250025 0 0 1 10,22.25 H 8 A 0.250025,0.250025 0 0 1 7.921875,22.236328 L 4.9609375,21.25 a 0.250025,0.250025 0 0 1 -0.00781,-0.002 0.250025,0.250025 0 0 1 -0.042969,-0.01367 0.250025,0.250025 0 0 1 -0.00586,-0.002 0.250025,0.250025 0 0 1 -0.042969,-0.02344 L 2.8886719,20.222656 a 0.250025,0.250025 0 0 1 -0.066406,-0.04492 l -1,-1 A 0.250025,0.250025 0 0 1 1.75,19 v -3 a 0.250025,0.250025 0 0 1 0.4863281,-0.07813 L 3.21875,18.865234 5.1367188,20.78125 8.0410156,21.75 H 9.9589844 L 12.865234,20.78125 13.794922,19.851562 14.75,17.941406 V 16.056641 L 13.806641,14.171875 10.902344,12.236328 5.9511719,11.246094 a 0.250025,0.250025 0 0 1 -0.089844,-0.03711 l -3,-1.9999996 a 0.250025,0.250025 0 0 1 -0.083984,-0.097656 l -1,-2 A 0.250025,0.250025 0 0 1 1.75,7 V 6.0234375 a 0.250025,0.250025 0 0 1 0,-0.048828 V 5 a 0.250025,0.250025 0 0 1 0.027344,-0.1113281 l 1,-2 a 0.250025,0.250025 0 0 1 0.044922,-0.066406 l 1,-1 a 0.250025,0.250025 0 0 1 0.066406,-0.044922 l 2,-1.00000005 A 0.250025,0.250025 0 0 1 6,0.75 h 3.9667969 a 0.250025,0.250025 0 0 1 0.025391,-0.001953 z"
     id="path2" />
</svg>
