<?xml version="1.0" encoding="UTF-8" standalone="no"?>
<svg
   xmlns:dc="http://purl.org/dc/elements/1.1/"
   xmlns:cc="http://creativecommons.org/ns#"
   xmlns:rdf="http://www.w3.org/1999/02/22-rdf-syntax-ns#"
   xmlns:svg="http://www.w3.org/2000/svg"
   xmlns="http://www.w3.org/2000/svg"
   xmlns:sodipodi="http://sodipodi.sourceforge.net/DTD/sodipodi-0.dtd"
   xmlns:inkscape="http://www.inkscape.org/namespaces/inkscape"
   data-dec="126"
   width="24"
   height="40"
   version="1.1"
   id="svg4"
   sodipodi:docname="126.svg"
   inkscape:version="0.92.4 (unknown)">
  <metadata
     id="metadata10">
    <rdf:RDF>
      <cc:Work
         rdf:about="">
        <dc:format>image/svg+xml</dc:format>
        <dc:type
           rdf:resource="http://purl.org/dc/dcmitype/StillImage" />
      </cc:Work>
    </rdf:RDF>
  </metadata>
  <defs
     id="defs8" />
  <sodipodi:namedview
     pagecolor="#ffffff"
     bordercolor="#666666"
     borderopacity="1"
     objecttolerance="10"
     gridtolerance="10"
     guidetolerance="10"
     inkscape:pageopacity="0"
     inkscape:pageshadow="2"
     inkscape:window-width="640"
     inkscape:window-height="480"
     id="namedview6"
     showgrid="false"
     inkscape:zoom="5.9"
     inkscape:cx="12"
     inkscape:cy="20"
     inkscape:window-x="0"
     inkscape:window-y="27"
     inkscape:window-maximized="0"
     inkscape:current-layer="svg4" />
  <path
     style="color:#000000;font-style:normal;font-variant:normal;font-weight:normal;font-stretch:normal;font-size:medium;line-height:normal;font-family:sans-serif;font-variant-ligatures:normal;font-variant-position:normal;font-variant-caps:normal;font-variant-numeric:normal;font-variant-alternates:normal;font-feature-settings:normal;text-indent:0;text-align:start;text-decoration:none;text-decoration-line:none;text-decoration-style:solid;text-decoration-color:#000000;letter-spacing:normal;word-spacing:normal;text-transform:none;writing-mode:lr-tb;direction:ltr;text-orientation:mixed;dominant-baseline:auto;baseline-shift:baseline;text-anchor:start;white-space:normal;shape-padding:0;clip-rule:nonzero;display:inline;overflow:visible;visibility:visible;opacity:1;isolation:auto;mix-blend-mode:normal;color-interpolation:sRGB;color-interpolation-filters:linearRGB;solid-color:#000000;solid-opacity:1;vector-effect:none;fill:#013272;fill-opacity:1;fill-rule:nonzero;stroke:none;stroke-width:0.30000001;stroke-linecap:round;stroke-linejoin:round;stroke-miterlimit:4;stroke-dasharray:none;stroke-dashoffset:0;stroke-opacity:1;color-rendering:auto;image-rendering:auto;shape-rendering:auto;text-rendering:auto;enable-background:accumulate"
     d="m 6.0351562,10.150391 -1.9121093,0.955078 -0.3125,0.9375 0.054687,-0.109375 a 0.15001501,0.15001501 0 0 1 0.068359,-0.06836 l 2,-1 A 0.15001501,0.15001501 0 0 1 6,10.849609 h 2 a 0.15001501,0.15001501 0 0 1 0.066406,0.01563 l 1.9999998,1 a 0.15001501,0.15001501 0 0 1 0.02344,0.01563 l 3.990234,2.990235 1.955078,0.978515 h 1.929688 l 1.912109,-0.955078 0.3125,-0.9375 -0.05469,0.109375 a 0.15001501,0.15001501 0 0 1 -0.06836,0.06836 l -2,1 A 0.15001501,0.15001501 0 0 1 18,15.150391 h -2 a 0.15001501,0.15001501 0 0 1 -0.06641,-0.01563 l -2,-1 a 0.15001501,0.15001501 0 0 1 -0.02344,-0.01563 L 9.9199219,11.128906 7.9648438,10.150391 Z M 20.982422,9.8476562 a 0.15001501,0.15001501 0 0 1 0.01563,0 A 0.15001501,0.15001501 0 0 1 21.150391,10 v 1.980469 a 0.15001501,0.15001501 0 0 1 0,0.01367 V 12 a 0.15001501,0.15001501 0 0 1 0,0.0039 0.15001501,0.15001501 0 0 1 0,0.0059 0.15001501,0.15001501 0 0 1 -0.002,0.0078 0.15001501,0.15001501 0 0 1 0,0.0078 0.15001501,0.15001501 0 0 1 -0.002,0.0078 0.15001501,0.15001501 0 0 1 -0.002,0.0059 0.15001501,0.15001501 0 0 1 -0.002,0.0078 0.15001501,0.15001501 0 0 1 -0.0078,0.01953 l -0.992188,2.980469 a 0.15001501,0.15001501 0 0 1 -0.07617,0.08789 l -2,1 A 0.15001501,0.15001501 0 0 1 18,16.150391 h -2 a 0.15001501,0.15001501 0 0 1 -0.06641,-0.01563 l -2,-1 a 0.15001501,0.15001501 0 0 1 -0.02344,-0.01563 L 9.9199219,12.128906 7.9648438,11.150391 H 6.0351562 L 4.1113281,12.111328 3.1503906,14.035156 V 16 a 0.1503906,0.1503906 0 1 1 -0.3007812,0 v -1.980469 a 0.15001501,0.15001501 0 0 1 0,-0.01953 0.15001501,0.15001501 0 0 1 0,-0.0098 0.15001501,0.15001501 0 0 1 0.00195,-0.0078 0.15001501,0.15001501 0 0 1 0,-0.0078 0.15001501,0.15001501 0 0 1 0.00195,-0.0059 0.15001501,0.15001501 0 0 1 0.00195,-0.0078 0.15001501,0.15001501 0 0 1 0.00195,-0.0078 l 0.00195,-0.0059 a 0.15001501,0.15001501 0 0 1 0.00586,-0.01367 l 0.9921875,-2.980469 a 0.15001501,0.15001501 0 0 1 0.076172,-0.08789 l 2,-0.9999996 A 0.15001501,0.15001501 0 0 1 6,9.8496094 h 2 a 0.15001501,0.15001501 0 0 1 0.066406,0.015625 l 1.9999998,0.9999996 a 0.15001501,0.15001501 0 0 1 0.02344,0.01563 l 3.990234,2.990235 1.955078,0.978515 h 1.929688 l 1.923828,-0.960937 0.960937,-1.923828 V 10 a 0.15001501,0.15001501 0 0 1 0.132813,-0.1523438 z"
     id="path2" />
</svg>
