<?xml version="1.0" encoding="UTF-8" standalone="no"?>
<svg
   xmlns:dc="http://purl.org/dc/elements/1.1/"
   xmlns:cc="http://creativecommons.org/ns#"
   xmlns:rdf="http://www.w3.org/1999/02/22-rdf-syntax-ns#"
   xmlns:svg="http://www.w3.org/2000/svg"
   xmlns="http://www.w3.org/2000/svg"
   xmlns:sodipodi="http://sodipodi.sourceforge.net/DTD/sodipodi-0.dtd"
   xmlns:inkscape="http://www.inkscape.org/namespaces/inkscape"
   data-dec="41"
   width="14"
   height="40"
   version="1.1"
   id="svg4"
   sodipodi:docname="41.svg"
   inkscape:version="0.92.4 (unknown)">
  <metadata
     id="metadata10">
    <rdf:RDF>
      <cc:Work
         rdf:about="">
        <dc:format>image/svg+xml</dc:format>
        <dc:type
           rdf:resource="http://purl.org/dc/dcmitype/StillImage" />
      </cc:Work>
    </rdf:RDF>
  </metadata>
  <defs
     id="defs8" />
  <sodipodi:namedview
     pagecolor="#ffffff"
     bordercolor="#666666"
     borderopacity="1"
     objecttolerance="10"
     gridtolerance="10"
     guidetolerance="10"
     inkscape:pageopacity="0"
     inkscape:pageshadow="2"
     inkscape:window-width="640"
     inkscape:window-height="480"
     id="namedview6"
     showgrid="false"
     inkscape:zoom="5.9"
     inkscape:cx="7"
     inkscape:cy="20"
     inkscape:window-x="0"
     inkscape:window-y="27"
     inkscape:window-maximized="0"
     inkscape:current-layer="svg4" />
  <path
     style="color:#000000;font-style:normal;font-variant:normal;font-weight:normal;font-stretch:normal;font-size:medium;line-height:normal;font-family:sans-serif;font-variant-ligatures:normal;font-variant-position:normal;font-variant-caps:normal;font-variant-numeric:normal;font-variant-alternates:normal;font-feature-settings:normal;text-indent:0;text-align:start;text-decoration:none;text-decoration-line:none;text-decoration-style:solid;text-decoration-color:#000000;letter-spacing:normal;word-spacing:normal;text-transform:none;writing-mode:lr-tb;direction:ltr;text-orientation:mixed;dominant-baseline:auto;baseline-shift:baseline;text-anchor:start;white-space:normal;shape-padding:0;clip-rule:nonzero;display:inline;overflow:visible;visibility:visible;opacity:1;isolation:auto;mix-blend-mode:normal;color-interpolation:sRGB;color-interpolation-filters:linearRGB;solid-color:#000000;solid-opacity:1;vector-effect:none;fill:#000000;fill-opacity:1;fill-rule:nonzero;stroke:none;stroke-width:2;stroke-linecap:round;stroke-linejoin:round;stroke-miterlimit:4;stroke-dasharray:none;stroke-dashoffset:0;stroke-opacity:1;color-rendering:auto;image-rendering:auto;shape-rendering:auto;text-rendering:auto;enable-background:accumulate"
     d="m 2.9902344,-4.0097656 a 1.0001,1.0001 0 0 1 0.6074218,0.2070312 l 2.8515626,1.9003906 a 1.0001,1.0001 0 0 1 0.3828124,0.3476563 l 0.017578,0.025391 1.9824218,2.9746094 a 1.0001,1.0001 0 0 1 0.0625,0.1074219 l 1.9999998,4 a 1.0001,1.0001 0 0 1 0.08594,0.2519531 l 1,5.0000005 A 1.0001,1.0001 0 0 1 12,11 v 4 a 1.0001,1.0001 0 0 1 -0.01953,0.195312 l -1,5 a 1.0001,1.0001 0 0 1 -0.08594,0.251954 l -1.9999998,4 a 1.0001,1.0001 0 0 1 -0.0625,0.107422 l -1.9707031,2.955078 a 1.0001,1.0001 0 0 1 -0.029297,0.04492 1.0001,1.0001 0 0 1 -0.3789062,0.34375 L 3.59375,29.806641 a 1.0001,1.0001 0 0 1 -0.9648438,0.134765 1.0001,1.0001 0 0 1 -0.1777343,-0.08984 1.0001,1.0001 0 0 1 -0.00195,0 1.0001,1.0001 0 0 1 -0.080078,-0.05859 1.0001,1.0001 0 0 1 -0.076172,-0.06641 1.0001,1.0001 0 0 1 -0.1289063,-0.152343 1.0001,1.0001 0 0 1 -0.095703,-0.173828 1.0001,1.0001 0 0 1 -0.074219,-0.289063 1.0001,1.0001 0 0 1 0,-0.002 1.0001,1.0001 0 0 1 0.3320313,-0.849609 L 4.1777344,26.408203 6.0742188,22.617188 7.03125,19.742188 8,14.900391 V 11.099609 L 7.03125,6.2578125 6.0742188,3.3828125 4.1777344,-0.40820312 2.3320312,-2.2539062 a 1.0001,1.0001 0 0 1 -0.2890624,-0.4316407 1.0001,1.0001 0 0 1 -0.039063,-0.4941406 1.0001,1.0001 0 0 1 0.021484,-0.097656 1.0001,1.0001 0 0 1 0.072266,-0.1855468 1.0001,1.0001 0 0 1 0.109375,-0.1679688 1.0001,1.0001 0 0 1 0.064453,-0.076172 1.0001,1.0001 0 0 1 0.2382812,-0.1796876 1.0001,1.0001 0 0 1 0.1835938,-0.078125 1.0001,1.0001 0 0 1 0.00195,0 1.0001,1.0001 0 0 1 0.2949219,-0.044922 z"
     id="path2" />
</svg>
