<?xml version="1.0" encoding="UTF-8" standalone="no"?>
<svg
   xmlns:dc="http://purl.org/dc/elements/1.1/"
   xmlns:cc="http://creativecommons.org/ns#"
   xmlns:rdf="http://www.w3.org/1999/02/22-rdf-syntax-ns#"
   xmlns:svg="http://www.w3.org/2000/svg"
   xmlns="http://www.w3.org/2000/svg"
   xmlns:sodipodi="http://sodipodi.sourceforge.net/DTD/sodipodi-0.dtd"
   xmlns:inkscape="http://www.inkscape.org/namespaces/inkscape"
   data-dec="76"
   width="20"
   height="40"
   version="1.1"
   id="svg4"
   sodipodi:docname="76.svg"
   inkscape:version="0.92.4 (unknown)">
  <metadata
     id="metadata10">
    <rdf:RDF>
      <cc:Work
         rdf:about="">
        <dc:format>image/svg+xml</dc:format>
        <dc:type
           rdf:resource="http://purl.org/dc/dcmitype/StillImage" />
      </cc:Work>
    </rdf:RDF>
  </metadata>
  <defs
     id="defs8" />
  <sodipodi:namedview
     pagecolor="#ffffff"
     bordercolor="#666666"
     borderopacity="1"
     objecttolerance="10"
     gridtolerance="10"
     guidetolerance="10"
     inkscape:pageopacity="0"
     inkscape:pageshadow="2"
     inkscape:window-width="640"
     inkscape:window-height="480"
     id="namedview6"
     showgrid="false"
     inkscape:zoom="5.9"
     inkscape:cx="10"
     inkscape:cy="20"
     inkscape:window-x="0"
     inkscape:window-y="27"
     inkscape:window-maximized="0"
     inkscape:current-layer="svg4" />
  <path
     style="color:#000000;font-style:normal;font-variant:normal;font-weight:normal;font-stretch:normal;font-size:medium;line-height:normal;font-family:sans-serif;font-variant-ligatures:normal;font-variant-position:normal;font-variant-caps:normal;font-variant-numeric:normal;font-variant-alternates:normal;font-feature-settings:normal;text-indent:0;text-align:start;text-decoration:none;text-decoration-line:none;text-decoration-style:solid;text-decoration-color:#000000;letter-spacing:normal;word-spacing:normal;text-transform:none;writing-mode:lr-tb;direction:ltr;text-orientation:mixed;dominant-baseline:auto;baseline-shift:baseline;text-anchor:start;white-space:normal;shape-padding:0;clip-rule:nonzero;display:inline;overflow:visible;visibility:visible;opacity:1;isolation:auto;mix-blend-mode:normal;color-interpolation:sRGB;color-interpolation-filters:linearRGB;solid-color:#000000;solid-opacity:1;vector-effect:none;fill:#013272;fill-opacity:1;fill-rule:nonzero;stroke:none;stroke-width:2;stroke-linecap:round;stroke-linejoin:round;stroke-miterlimit:4;stroke-dasharray:none;stroke-dashoffset:0;stroke-opacity:1;color-rendering:auto;image-rendering:auto;shape-rendering:auto;text-rendering:auto;enable-background:accumulate"
     d="M 8.9667969,-0.01367188 A 1.0001,1.0001 0 0 1 9.1660156,0 h 0.6796875 a 1.0001,1.0001 0 0 1 0.3203129,0 h 0.679687 a 1.0001,1.0001 0 0 1 0.320313,0 h 0.703125 a 1.0001,1.0001 0 0 1 0.277343,0 h 0.783204 a 1.0001,1.0001 0 0 1 0.167968,0 H 14 a 1.0001,1.0001 0 1 1 0,2 h -0.835938 l -1.125,0.375 L 11.490234,2.9238281 6.4316406,20.626953 6.5097656,20.78125 7.1640625,21 h 2.7382813 l 2.4042972,-0.480469 2.105468,-1.578125 1.66211,-3.324218 a 1.0001,1.0001 0 0 1 0.03125,-0.06445 1.0001,1.0001 0 0 1 0.0332,-0.0625 1.0001,1.0001 0 0 1 0.05273,-0.08398 1.0001,1.0001 0 0 1 0.0625,-0.07813 1.0001,1.0001 0 0 1 0.07031,-0.07227 1.0001,1.0001 0 0 1 0.07617,-0.06445 1.0001,1.0001 0 0 1 0.07422,-0.05078 1.0001,1.0001 0 0 1 0.01563,-0.0098 1.0001,1.0001 0 0 1 0.08008,-0.04297 1.0001,1.0001 0 0 1 0.0918,-0.03906 1.0001,1.0001 0 0 1 0.0957,-0.0293 1.0001,1.0001 0 0 1 0.08008,-0.01758 1.0001,1.0001 0 0 1 0.03516,-0.0059 1.0001,1.0001 0 0 1 0.07813,-0.0078 1.0001,1.0001 0 0 1 0.0039,0 1.0001,1.0001 0 0 1 0.0059,0 1.0001,1.0001 0 0 1 0.08398,0 1.0001,1.0001 0 0 1 0.02539,0.002 1.0001,1.0001 0 0 1 0.06836,0.0059 1.0001,1.0001 0 0 1 0.07031,0.01172 1.0001,1.0001 0 0 1 0.01953,0.0059 1.0001,1.0001 0 0 1 0.05469,0.01367 1.0001,1.0001 0 0 1 0.02344,0.0059 1.0001,1.0001 0 0 1 0.01563,0.0059 1.0001,1.0001 0 0 1 0.05859,0.02149 1.0001,1.0001 0 0 1 0.01953,0.0078 1.0001,1.0001 0 0 1 0.03906,0.01758 1.0001,1.0001 0 0 1 0.01367,0.0078 1.0001,1.0001 0 0 1 0.07422,0.04102 1.0001,1.0001 0 0 1 0.04687,0.0293 1.0001,1.0001 0 0 1 0.0098,0.0078 1.0001,1.0001 0 0 1 0.07031,0.05469 1.0001,1.0001 0 0 1 0.07031,0.06641 1.0001,1.0001 0 0 1 0.002,0.002 1.0001,1.0001 0 0 1 0.0039,0.0039 1.0001,1.0001 0 0 1 0.04883,0.05664 1.0001,1.0001 0 0 1 0.01367,0.01563 1.0001,1.0001 0 0 1 0.0098,0.01172 1.0001,1.0001 0 0 1 0.03711,0.05469 1.0001,1.0001 0 0 1 0.0098,0.01367 1.0001,1.0001 0 0 1 0.0039,0.0078 1.0001,1.0001 0 0 1 0.04492,0.08008 1.0001,1.0001 0 0 1 0.03906,0.08789 1.0001,1.0001 0 0 1 0.002,0.0039 1.0001,1.0001 0 0 1 0,0.002 1.0001,1.0001 0 0 1 0.0293,0.08594 1.0001,1.0001 0 0 1 0.002,0.0059 1.0001,1.0001 0 0 1 0,0.0039 1.0001,1.0001 0 0 1 0.01953,0.09375 1.0001,1.0001 0 0 1 0.01172,0.09961 1.0001,1.0001 0 0 1 0.002,0.101563 1.0001,1.0001 0 0 1 -0.0078,0.0957 1.0001,1.0001 0 0 1 0,0.0039 1.0001,1.0001 0 0 1 0,0.0039 1.0001,1.0001 0 0 1 -0.04687,0.189453 l -0.002,0.0078 a 1.0001,1.0001 0 0 1 -0.01172,0.03125 l -0.947266,2.839843 a 1.0001,1.0001 0 0 1 -0.07227,0.222657 l -0.002,0.0039 -0.964843,2.894531 A 1.0001,1.0001 0 0 1 15,23 h -0.845703 a 1.0001,1.0001 0 0 1 -0.318359,0 h -1.730469 a 1.0001,1.0001 0 0 1 -0.240235,0 H 10.046875 A 1.0001,1.0001 0 0 1 9.9101562,23 H 7.09375 A 1.0001,1.0001 0 0 1 6.9257812,23 H 6.15625 A 1.0001,1.0001 0 0 1 5.8515625,23 H 5.1542969 A 1.0001,1.0001 0 0 1 4.8339844,23 H 4.1542969 A 1.0001,1.0001 0 0 1 3.8339844,23 H 3.1542969 A 1.0001,1.0001 0 0 1 2.8339844,23 H 2.1308594 A 1.0001,1.0001 0 0 1 1.8535156,23 H 1.0703125 A 1.0001,1.0001 0 0 1 0.90234375,23 H 0 a 1.0001,1.0001 0 1 1 0,-2 h 0.8359375 l 1.125,-0.375 L 2.5097656,20.076172 7.5683594,2.3730469 7.4902344,2.21875 6.8359375,2 H 6 A 1.0001,1.0001 0 1 1 6,0 H 6.90625 A 1.0001,1.0001 0 0 1 7.0742188,0 H 7.84375 a 1.0001,1.0001 0 0 1 0.3046875,0 h 0.6972656 a 1.0001,1.0001 0 0 1 0.1210938,-0.01367188 z"
     id="path2" />
</svg>
