<?xml version="1.0" encoding="UTF-8" standalone="no"?>
<svg
   xmlns:dc="http://purl.org/dc/elements/1.1/"
   xmlns:cc="http://creativecommons.org/ns#"
   xmlns:rdf="http://www.w3.org/1999/02/22-rdf-syntax-ns#"
   xmlns:svg="http://www.w3.org/2000/svg"
   xmlns="http://www.w3.org/2000/svg"
   xmlns:sodipodi="http://sodipodi.sourceforge.net/DTD/sodipodi-0.dtd"
   xmlns:inkscape="http://www.inkscape.org/namespaces/inkscape"
   data-dec="103"
   width="15"
   height="40"
   version="1.1"
   id="svg4"
   sodipodi:docname="103.svg"
   inkscape:version="0.92.4 5da689c313, 2019-01-14">
  <metadata
     id="metadata10">
    <rdf:RDF>
      <cc:Work
         rdf:about="">
        <dc:format>image/svg+xml</dc:format>
        <dc:type
           rdf:resource="http://purl.org/dc/dcmitype/StillImage" />
        <dc:title></dc:title>
      </cc:Work>
    </rdf:RDF>
  </metadata>
  <defs
     id="defs8" />
  <sodipodi:namedview
     pagecolor="#ffffff"
     bordercolor="#666666"
     borderopacity="1"
     objecttolerance="10"
     gridtolerance="10"
     guidetolerance="10"
     inkscape:pageopacity="0"
     inkscape:pageshadow="2"
     inkscape:window-width="1920"
     inkscape:window-height="1043"
     id="namedview6"
     showgrid="false"
     inkscape:zoom="5.9"
     inkscape:cx="7.5"
     inkscape:cy="20"
     inkscape:window-x="0"
     inkscape:window-y="37"
     inkscape:window-maximized="0"
     inkscape:current-layer="svg4" />
  <path
     style="color:#000000;font-style:normal;font-variant:normal;font-weight:normal;font-stretch:normal;font-size:medium;line-height:normal;font-family:sans-serif;font-variant-ligatures:normal;font-variant-position:normal;font-variant-caps:normal;font-variant-numeric:normal;font-variant-alternates:normal;font-feature-settings:normal;text-indent:0;text-align:start;text-decoration:none;text-decoration-line:none;text-decoration-style:solid;text-decoration-color:#000000;letter-spacing:normal;word-spacing:normal;text-transform:none;writing-mode:lr-tb;direction:ltr;text-orientation:mixed;dominant-baseline:auto;baseline-shift:baseline;text-anchor:start;white-space:normal;shape-padding:0;clip-rule:nonzero;display:inline;overflow:visible;visibility:visible;opacity:1;isolation:auto;mix-blend-mode:normal;color-interpolation:sRGB;color-interpolation-filters:linearRGB;solid-color:#000000;solid-opacity:1;vector-effect:none;fill:#000000;fill-opacity:1;fill-rule:nonzero;stroke:none;stroke-width:1.5;stroke-linecap:round;stroke-linejoin:round;stroke-miterlimit:4;stroke-dasharray:none;stroke-dashoffset:0;stroke-opacity:1;color-rendering:auto;image-rendering:auto;shape-rendering:auto;text-rendering:auto;enable-background:accumulate"
     d="m 4.9980469,24.064453 -0.34375,0.34375 L 3.75,27.121094 v 0.701172 L 4.6171875,29.556641 5.3125,30.25 H 9.8222656 L 11.441406,29.441406 12.25,27.822266 V 27.310547 L 10.607422,25.667969 Z M 6.1757812,8.75 l -1.5625,0.78125 v 0.00195 L 3.75,12.121094 v 2.757812 l 0.8632812,2.587891 v 0.002 L 6.1777344,18.25 H 6.8222656 L 8.3886719,17.466797 9.25,14.878906 V 12.121094 L 8.3867188,9.5332031 6.8242188,8.75 Z M 6.0039062,7.2460938 A 0.750075,0.750075 0 0 1 6.0898438,7.25 h 0.8085937 a 0.750075,0.750075 0 0 1 0.2285156,0.00977 0.750075,0.750075 0 0 1 0.035156,0.00586 0.750075,0.750075 0 0 1 0.033203,0.00781 0.750075,0.750075 0 0 1 0.2207031,0.097656 l 1.9199219,0.9589843 a 0.750075,0.750075 0 0 1 0.013672,0.00586 0.750075,0.750075 0 0 1 0.041016,0.023437 0.750075,0.750075 0 0 1 0.023437,0.015625 0.750075,0.750075 0 0 1 0.039063,0.027344 0.750075,0.750075 0 0 1 0.021484,0.017578 0.750075,0.750075 0 0 1 0.035156,0.03125 A 0.750075,0.750075 0 0 1 9.53125,8.46875 L 10,8.9375 11.46875,7.46875 a 0.750075,0.750075 0 0 1 1.0625,0 l 1,1 A 0.750075,0.750075 0 0 1 13.75,9 v 1 a 0.750075,0.750075 0 0 1 -1.28125,0.53125 L 11.5,9.5625 l -0.587891,0.587891 0.757813,1.513671 A 0.750075,0.750075 0 0 1 11.75,12 v 3 a 0.750075,0.750075 0 0 1 -0.08008,0.335938 l -1,2 A 0.750075,0.750075 0 0 1 10.53125,17.53125 L 9.5820312,18.480469 A 0.750075,0.750075 0 0 1 9.234375,18.720703 L 7.3359375,19.669922 A 0.750075,0.750075 0 0 1 7,19.75 H 6.1015625 a 0.750075,0.750075 0 0 1 -0.1660156,0 H 4.3125 l -0.4003906,0.398438 0.6113281,1.220703 6.6816405,1.910156 a 0.750075,0.750075 0 0 1 0.326172,0.189453 l 1,1 a 0.750075,0.750075 0 0 1 0.138672,0.195312 l 0.988281,1.976563 0.01172,0.02344 a 0.750075,0.750075 0 0 1 0.02148,0.04297 0.750075,0.750075 0 0 1 0.0039,0.01172 0.750075,0.750075 0 0 1 0.02149,0.06055 0.750075,0.750075 0 0 1 0.0332,0.310547 V 28 a 0.750075,0.750075 0 0 1 -0.08008,0.335938 l -1,2 a 0.750075,0.750075 0 0 1 -0.333984,0.333984 l -2,1 A 0.750075,0.750075 0 0 1 10,31.75 H 5.1074219 A 0.750075,0.750075 0 0 1 4.6113281,31.644531 L 2.6640625,30.669922 A 0.750075,0.750075 0 0 1 2.3300781,30.335938 l -1,-2 A 0.750075,0.750075 0 0 1 1.25,28 v -1 a 0.750075,0.750075 0 0 1 0.080078,-0.335938 l 1,-2 A 0.750075,0.750075 0 0 1 2.46875,24.46875 l 0.9492188,-0.949219 a 0.750075,0.750075 0 0 1 0.017578,-0.02148 L 2.46875,22.53125 A 0.750075,0.750075 0 0 1 2.25,22 V 20.011719 A 0.750075,0.750075 0 0 1 2.25,20 0.750075,0.750075 0 0 1 2.28125,19.789062 0.750075,0.750075 0 0 1 2.3046875,19.71875 0.750075,0.750075 0 0 1 2.4199219,19.525391 0.750075,0.750075 0 0 1 2.46875,19.46875 l 0.9277344,-0.927734 a 0.750075,0.750075 0 0 1 0.037109,-0.04492 L 2.46875,17.53125 A 0.750075,0.750075 0 0 1 2.3300781,17.335938 l -1,-2 A 0.750075,0.750075 0 0 1 1.25,15 v -3 a 0.750075,0.750075 0 0 1 0.080078,-0.335938 l 1,-1.9999995 A 0.750075,0.750075 0 0 1 2.46875,9.46875 l 1,-1 a 0.750075,0.750075 0 0 1 0.011719,-0.00977 0.750075,0.750075 0 0 1 0.056641,-0.048828 0.750075,0.750075 0 0 1 0.0625,-0.044922 0.750075,0.750075 0 0 1 0.064453,-0.035156 L 5.5742188,7.375 A 0.750075,0.750075 0 0 1 5.78125,7.28125 a 0.750075,0.750075 0 0 1 0.035156,-0.00977 0.750075,0.750075 0 0 1 0.035156,-0.00781 0.750075,0.750075 0 0 1 0.1523437,-0.017578 z"
     id="path2" />
</svg>
