<?xml version="1.0" encoding="UTF-8"?>
<glyph name="J" format="1">
  <advance width="376"/>
  <unicode hex="004A"/>
  <outline>
    <contour>
      <point x="267" y="608" type="line"/>
      <point x="267" y="604" type="line"/>
      <point x="272" y="608" type="line"/>
    </contour>
    <contour>
      <point x="239" y="608" type="line"/>
      <point x="239" y="587" type="line"/>
      <point x="239" y="586" type="line"/>
      <point x="239" y="585" type="line"/>
      <point x="239" y="95" type="line"/>
      <point x="239" y="94" type="line"/>
      <point x="239" y="92" type="line"/>
      <point x="239" y="91" type="line"/>
      <point x="210" y="-23" type="line" smooth="yes"/>
      <point x="210" y="-24"/>
      <point x="209" y="-24"/>
      <point x="209" y="-25" type="curve" smooth="yes"/>
      <point x="191" y="-52" type="line"/>
      <point x="226" y="-18" type="line"/>
      <point x="253" y="96" type="line"/>
      <point x="253" y="585" type="line"/>
      <point x="253" y="586" type="line"/>
      <point x="253" y="587" type="line"/>
      <point x="253" y="608" type="line"/>
    </contour>
    <contour>
      <point x="220" y="608" type="line"/>
      <point x="224" y="604" type="line"/>
      <point x="224" y="608" type="line"/>
    </contour>
    <contour>
      <point x="231" y="623" type="line"/>
      <point x="232" y="623" type="line"/>
      <point x="233" y="623" type="line"/>
      <point x="260" y="623" type="line"/>
      <point x="261" y="623" type="line"/>
      <point x="262" y="623" type="line"/>
      <point x="289" y="623" type="line"/>
      <point x="318" y="623" type="line" smooth="yes"/>
      <point x="322" y="623"/>
      <point x="326" y="620"/>
      <point x="326" y="616" type="curve" smooth="yes"/>
      <point x="326" y="612"/>
      <point x="322" y="608"/>
      <point x="318" y="608" type="curve" smooth="yes"/>
      <point x="293" y="608" type="line"/>
      <point x="267" y="583" type="line"/>
      <point x="267" y="95" type="line"/>
      <point x="267" y="94" type="line"/>
      <point x="267" y="92" type="line"/>
      <point x="267" y="91" type="line"/>
      <point x="239" y="-23" type="line" smooth="yes"/>
      <point x="239" y="-24"/>
      <point x="237" y="-25"/>
      <point x="236" y="-26" type="curve" smooth="yes"/>
      <point x="179" y="-85" type="line"/>
      <point x="150" y="-113" type="line"/>
      <point x="148" y="-114" type="line"/>
      <point x="147" y="-114" type="line"/>
      <point x="147" y="-116" type="line"/>
      <point x="60" y="-144" type="line"/>
      <point x="59" y="-144" type="line"/>
      <point x="58" y="-144" type="line"/>
      <point x="57" y="-144" type="line"/>
      <point x="55" y="-144" type="line"/>
      <point x="54" y="-143" type="line"/>
      <point x="53" y="-143" type="line"/>
      <point x="53" y="-142" type="line"/>
      <point x="52" y="-142" type="line"/>
      <point x="52" y="-141" type="line"/>
      <point x="51" y="-140" type="line"/>
      <point x="51" y="-138" type="line"/>
      <point x="51" y="-136" type="line" smooth="yes"/>
      <point x="51" y="-135"/>
      <point x="52" y="-134"/>
      <point x="52" y="-133" type="curve" smooth="yes"/>
      <point x="53" y="-132" type="line" smooth="yes"/>
      <point x="54" y="-132"/>
      <point x="55" y="-130"/>
      <point x="56" y="-130" type="curve" smooth="yes"/>
      <point x="140" y="-102" type="line"/>
      <point x="196" y="-19" type="line"/>
      <point x="224" y="96" type="line"/>
      <point x="224" y="583" type="line"/>
      <point x="199" y="608" type="line"/>
      <point x="174" y="608" type="line" smooth="yes"/>
      <point x="170" y="608"/>
      <point x="166" y="612"/>
      <point x="166" y="616" type="curve" smooth="yes"/>
      <point x="166" y="620"/>
      <point x="170" y="623"/>
      <point x="174" y="623" type="curve" smooth="yes"/>
      <point x="202" y="623" type="line"/>
      <point x="204" y="623" type="line"/>
      <point x="230" y="623" type="line"/>
    </contour>
  </outline>
  <lib>
    <dict>
      <key>com.fontlab.hintData</key>
      <dict>
        <key>hhints</key>
        <array>
          <dict>
            <key>position</key>
            <integer>-143</integer>
            <key>width</key>
            <integer>11</integer>
          </dict>
          <dict>
            <key>position</key>
            <integer>608</integer>
            <key>width</key>
            <integer>14</integer>
          </dict>
        </array>
        <key>vhints</key>
        <array>
          <dict>
            <key>position</key>
            <integer>224</integer>
            <key>width</key>
            <integer>14</integer>
          </dict>
          <dict>
            <key>position</key>
            <integer>253</integer>
            <key>width</key>
            <integer>14</integer>
          </dict>
        </array>
      </dict>
    </dict>
  </lib>
</glyph>
