<?xml version="1.0" encoding="UTF-8" standalone="no"?>
<svg
   xmlns:dc="http://purl.org/dc/elements/1.1/"
   xmlns:cc="http://creativecommons.org/ns#"
   xmlns:rdf="http://www.w3.org/1999/02/22-rdf-syntax-ns#"
   xmlns:svg="http://www.w3.org/2000/svg"
   xmlns="http://www.w3.org/2000/svg"
   xmlns:sodipodi="http://sodipodi.sourceforge.net/DTD/sodipodi-0.dtd"
   xmlns:inkscape="http://www.inkscape.org/namespaces/inkscape"
   data-dec="90"
   width="12"
   height="40"
   version="1.1"
   id="svg4"
   sodipodi:docname="90.svg"
   inkscape:version="0.92.4 5da689c313, 2019-01-14">
  <metadata
     id="metadata10">
    <rdf:RDF>
      <cc:Work
         rdf:about="">
        <dc:format>image/svg+xml</dc:format>
        <dc:type
           rdf:resource="http://purl.org/dc/dcmitype/StillImage" />
        <dc:title></dc:title>
      </cc:Work>
    </rdf:RDF>
  </metadata>
  <defs
     id="defs8" />
  <sodipodi:namedview
     pagecolor="#ffffff"
     bordercolor="#666666"
     borderopacity="1"
     objecttolerance="10"
     gridtolerance="10"
     guidetolerance="10"
     inkscape:pageopacity="0"
     inkscape:pageshadow="2"
     inkscape:window-width="1920"
     inkscape:window-height="1043"
     id="namedview6"
     showgrid="false"
     inkscape:zoom="5.9"
     inkscape:cx="6"
     inkscape:cy="20"
     inkscape:window-x="0"
     inkscape:window-y="37"
     inkscape:window-maximized="0"
     inkscape:current-layer="svg4" />
  <path
     style="color:#000000;font-style:normal;font-variant:normal;font-weight:normal;font-stretch:normal;font-size:medium;line-height:normal;font-family:sans-serif;font-variant-ligatures:normal;font-variant-position:normal;font-variant-caps:normal;font-variant-numeric:normal;font-variant-alternates:normal;font-feature-settings:normal;text-indent:0;text-align:start;text-decoration:none;text-decoration-line:none;text-decoration-style:solid;text-decoration-color:#000000;letter-spacing:normal;word-spacing:normal;text-transform:none;writing-mode:lr-tb;direction:ltr;text-orientation:mixed;dominant-baseline:auto;baseline-shift:baseline;text-anchor:start;white-space:normal;shape-padding:0;clip-rule:nonzero;display:inline;overflow:visible;visibility:visible;opacity:1;isolation:auto;mix-blend-mode:normal;color-interpolation:sRGB;color-interpolation-filters:linearRGB;solid-color:#000000;solid-opacity:1;vector-effect:none;fill:#000000;fill-opacity:1;fill-rule:nonzero;stroke:none;stroke-width:1.5;stroke-linecap:round;stroke-linejoin:round;stroke-miterlimit:4;stroke-dasharray:none;stroke-dashoffset:0;stroke-opacity:1;color-rendering:auto;image-rendering:auto;shape-rendering:auto;text-rendering:auto;enable-background:accumulate"
     d="m 10.177734,0.24023438 a 0.750075,0.750075 0 0 1 0.597657,0.26367187 0.750075,0.750075 0 0 1 0.002,0.003906 0.750075,0.750075 0 0 1 0.04297,0.0546875 0.750075,0.750075 0 0 1 0.0098,0.0175781 0.750075,0.750075 0 0 1 0.0293,0.046875 0.750075,0.750075 0 0 1 -0.0039,0.75585938 L 2.9082031,21.25 H 9.4492188 V 18 a 0.750075,0.750075 0 1 1 1.5000002,0 v 4 a 0.750075,0.750075 0 0 1 -0.75,0.75 H 1.9179688 a 0.750075,0.750075 0 0 1 -0.6933594,-0.253906 0.750075,0.750075 0 0 1 -0.00195,-0.0039 0.750075,0.750075 0 0 1 -0.042969,-0.05469 0.750075,0.750075 0 0 1 -0.00195,-0.0039 0.750075,0.750075 0 0 1 -0.037109,-0.06055 0.750075,0.750075 0 0 1 0.00391,-0.755859 L 9.0917969,1.75 H 2.5507812 V 5 a 0.750075,0.750075 0 1 1 -1.5,0 V 1 a 0.750075,0.750075 0 0 1 0.75,-0.75 h 8.2812498 a 0.750075,0.750075 0 0 1 0.0957,-0.009766 z"
     id="path2" />
</svg>
