<?xml version="1.0" encoding="UTF-8" standalone="no"?>
<svg
   xmlns:dc="http://purl.org/dc/elements/1.1/"
   xmlns:cc="http://creativecommons.org/ns#"
   xmlns:rdf="http://www.w3.org/1999/02/22-rdf-syntax-ns#"
   xmlns:svg="http://www.w3.org/2000/svg"
   xmlns="http://www.w3.org/2000/svg"
   xmlns:sodipodi="http://sodipodi.sourceforge.net/DTD/sodipodi-0.dtd"
   xmlns:inkscape="http://www.inkscape.org/namespaces/inkscape"
   data-dec="75"
   width="20"
   height="40"
   version="1.1"
   id="svg4"
   sodipodi:docname="75.svg"
   inkscape:version="0.92.4 (unknown)">
  <metadata
     id="metadata10">
    <rdf:RDF>
      <cc:Work
         rdf:about="">
        <dc:format>image/svg+xml</dc:format>
        <dc:type
           rdf:resource="http://purl.org/dc/dcmitype/StillImage" />
      </cc:Work>
    </rdf:RDF>
  </metadata>
  <defs
     id="defs8" />
  <sodipodi:namedview
     pagecolor="#ffffff"
     bordercolor="#666666"
     borderopacity="1"
     objecttolerance="10"
     gridtolerance="10"
     guidetolerance="10"
     inkscape:pageopacity="0"
     inkscape:pageshadow="2"
     inkscape:window-width="640"
     inkscape:window-height="480"
     id="namedview6"
     showgrid="false"
     inkscape:zoom="5.9"
     inkscape:cx="10"
     inkscape:cy="20"
     inkscape:window-x="0"
     inkscape:window-y="27"
     inkscape:window-maximized="0"
     inkscape:current-layer="svg4" />
  <path
     style="color:#000000;font-style:normal;font-variant:normal;font-weight:normal;font-stretch:normal;font-size:medium;line-height:normal;font-family:sans-serif;font-variant-ligatures:normal;font-variant-position:normal;font-variant-caps:normal;font-variant-numeric:normal;font-variant-alternates:normal;font-feature-settings:normal;text-indent:0;text-align:start;text-decoration:none;text-decoration-line:none;text-decoration-style:solid;text-decoration-color:#000000;letter-spacing:normal;word-spacing:normal;text-transform:none;writing-mode:lr-tb;direction:ltr;text-orientation:mixed;dominant-baseline:auto;baseline-shift:baseline;text-anchor:start;white-space:normal;shape-padding:0;clip-rule:nonzero;display:inline;overflow:visible;visibility:visible;opacity:1;isolation:auto;mix-blend-mode:normal;color-interpolation:sRGB;color-interpolation-filters:linearRGB;solid-color:#000000;solid-opacity:1;vector-effect:none;fill:#013272;fill-opacity:1;fill-rule:nonzero;stroke:none;stroke-width:0.30000001;stroke-linecap:round;stroke-linejoin:round;stroke-miterlimit:4;stroke-dasharray:none;stroke-dashoffset:0;stroke-opacity:1;color-rendering:auto;image-rendering:auto;shape-rendering:auto;text-rendering:auto;enable-background:accumulate"
     d="m 8.0019531,21.669922 0.091797,0.179687 h 0.2695312 z m -4.0039062,0 -0.3613281,0.179687 H 3.90625 Z M 18.789062,21.375 l 0.292969,0.474609 h 0.421875 z M 7.1503906,21.242188 v 0.607421 h 0.6074219 l -0.203125,-0.404297 z m -2.3007812,0 -0.4042969,0.203124 -0.203125,0.404297 h 0.6074219 z m 11.3457026,-0.226563 -0.833984,0.833984 h 1.365234 z M 7.1503906,20.636719 v 0.269531 l 0.1796875,0.0918 z m -2.3007812,0 -0.1796875,0.361328 0.1796875,-0.0918 z m 11.9570316,-0.232422 -0.394532,0.394531 0.669922,1.050781 h 0.644531 z m 0.228515,-0.199219 1.046875,1.644531 h 0.650391 L 18.197266,20.978516 Z M 7.3300781,2.0019531 7.1503906,2.09375 v 0.2695312 z m -2.6601562,0 0.1796875,0.3613281 V 2.09375 Z m 1.3125,-0.1542969 a 0.15001501,0.15001501 0 0 1 0.015625,0 A 0.15001501,0.15001501 0 0 1 6.1503906,2 V 21 A 0.1503906,0.1503906 0 0 1 5.8496094,21 V 2 A 0.15001501,0.15001501 0 0 1 5.9824219,1.8476562 Z M 17.361328,1.1503906 18.029297,1.8183594 19.363281,1.1503906 Z m -9.267578,0 -0.091797,0.1796875 0.3613281,-0.1796875 z m -0.9433594,0 v 0.6074219 l 0.4042969,-0.203125 0.203125,-0.4042969 z m -2,0 v 0.828125 a 0.15001501,0.15001501 0 0 1 0,0.044922 v 0.9628906 a 0.15001501,0.15001501 0 0 1 0,0.029297 v 16.964844 a 0.15001501,0.15001501 0 0 1 0,0.0293 v 0.96289 a 0.15001501,0.15001501 0 0 1 0,0.04492 v 0.832031 h 1.6992188 v -0.828125 a 0.15001501,0.15001501 0 0 1 0,-0.04492 v -0.96289 a 0.15001501,0.15001501 0 0 1 0,-0.0293 v -6.96875 a 0.15001501,0.15001501 0 0 1 0,-0.0293 V 3.0195312 a 0.15001501,0.15001501 0 0 1 0,-0.029297 V 2.0273438 a 0.15001501,0.15001501 0 0 1 0,-0.044922 V 1.1503906 Z m -0.9082031,0 0.203125,0.4042969 0.4042969,0.203125 V 1.1503906 Z m -0.6054687,0 L 3.9980469,1.3300781 3.90625,1.1503906 Z M 3.9863281,0.84765625 a 0.15001501,0.15001501 0 0 1 0.03125,0.001953 h 0.9648438 a 0.15001501,0.15001501 0 0 1 0.044922,0 h 1.9550781 a 0.15001501,0.15001501 0 0 1 0.044922,0 h 0.9511718 a 0.15001501,0.15001501 0 0 1 0.044922,0 H 8.9863281 9.015625 10 A 0.15039061,0.15039061 0 1 1 10,1.1503906 H 9.0351562 L 7.7792969,1.7792969 7.1503906,3.0351562 V 12.638672 L 10.873047,8.9160156 a 0.15001501,0.15001501 0 0 1 0.002,-0.00391 0.15001501,0.15001501 0 0 1 0.03125,-0.03125 0.15001501,0.15001501 0 0 1 0.01172,-0.00977 L 17.789062,2 16.939453,1.1503906 H 15 a 0.15039061,0.15039061 0 1 1 0,-0.30078122 h 1.984375 a 0.15001501,0.15001501 0 0 1 0.0293,0 h 2.972656 0.0293 H 21 A 0.15039061,0.15039061 0 1 1 21,1.1503906 H 20.035156 L 18.085938,2.125 11.189453,9.0214844 18.412109,20.759766 20.046875,21.849609 H 21 a 0.150391,0.150391 0 1 1 0,0.300782 h -0.984375 -0.0293 -0.960937 a 0.15001501,0.15001501 0 0 1 -0.04492,0 h -0.966797 a 0.15001501,0.15001501 0 0 1 -0.0293,0 h -0.970703 a 0.15001501,0.15001501 0 0 1 -0.0293,0 h -1.966797 a 0.15001501,0.15001501 0 0 1 -0.0293,0 H 14 a 0.150391,0.150391 0 0 1 0,-0.300782 h 0.939453 L 16.03125,20.757812 9.8730469,11.080078 a 0.15009851,0.15009851 0 1 1 0.2539061,-0.160156 l 6.121094,9.621094 0.394531,-0.394532 -5.769531,-9.066406 a 0.15009847,0.15009847 0 1 1 0.253906,-0.160156 l 5.732422,9.009766 0.01367,-0.01172 a 0.15001501,0.15001501 0 0 1 0.0078,-0.01172 0.15001501,0.15001501 0 0 1 0.05859,-0.04492 0.15001501,0.15001501 0 0 1 0.01563,-0.0059 0.15001501,0.15001501 0 0 1 0.0078,-0.002 0.15001501,0.15001501 0 0 1 0.02148,-0.0039 0.15001501,0.15001501 0 0 1 0.02734,0 0.15001501,0.15001501 0 0 1 0.002,0 0.15001501,0.15001501 0 0 1 0.01367,0.002 0.15001501,0.15001501 0 0 1 0.002,0 0.15001501,0.15001501 0 0 1 0.002,0 0.15001501,0.15001501 0 0 1 0.01172,0.0039 0.15001501,0.15001501 0 0 1 0.03906,0.01758 0.15001501,0.15001501 0 0 1 0.002,0.002 0.15001501,0.15001501 0 0 1 0.0098,0.0059 l 0.0039,0.0039 a 0.15001501,0.15001501 0 0 1 0.0078,0.0059 l 0.71289,0.474609 L 10.972656,9.2382812 7.1503906,13.060547 v 6.904297 l 0.6289063,1.255859 1.2558593,0.628906 H 10 a 0.150391,0.150391 0 1 1 0,0.300782 H 9.0195312 8.9902344 8.0273438 a 0.15001501,0.15001501 0 0 1 -0.044922,0 H 7.0175781 a 0.15001501,0.15001501 0 0 1 -0.044922,0 H 5.0175781 a 0.15001501,0.15001501 0 0 1 -0.044922,0 H 4.0214844 a 0.15001501,0.15001501 0 0 1 -0.044922,0 H 3.0136719 2.984375 2 A 0.150391,0.150391 0 0 1 2,21.849609 H 2.9648438 L 4.2207031,21.220703 4.8496094,19.964844 V 3.0351562 L 4.2207031,1.7792969 2.9648438,1.1503906 H 2 A 0.15039068,0.15039068 0 1 1 2,0.84960938 h 0.9804688 0.029297 0.9628906 a 0.15001501,0.15001501 0 0 1 0.013672,-0.001953 z"
     id="path2" />
</svg>
