<?xml version="1.0" encoding="UTF-8" standalone="no"?>
<svg
   xmlns:dc="http://purl.org/dc/elements/1.1/"
   xmlns:cc="http://creativecommons.org/ns#"
   xmlns:rdf="http://www.w3.org/1999/02/22-rdf-syntax-ns#"
   xmlns:svg="http://www.w3.org/2000/svg"
   xmlns="http://www.w3.org/2000/svg"
   xmlns:sodipodi="http://sodipodi.sourceforge.net/DTD/sodipodi-0.dtd"
   xmlns:inkscape="http://www.inkscape.org/namespaces/inkscape"
   data-dec="96"
   width="12"
   height="40"
   version="1.1"
   id="svg4"
   sodipodi:docname="96.svg"
   inkscape:version="0.92.4 (unknown)">
  <metadata
     id="metadata10">
    <rdf:RDF>
      <cc:Work
         rdf:about="">
        <dc:format>image/svg+xml</dc:format>
        <dc:type
           rdf:resource="http://purl.org/dc/dcmitype/StillImage" />
      </cc:Work>
    </rdf:RDF>
  </metadata>
  <defs
     id="defs8" />
  <sodipodi:namedview
     pagecolor="#ffffff"
     bordercolor="#666666"
     borderopacity="1"
     objecttolerance="10"
     gridtolerance="10"
     guidetolerance="10"
     inkscape:pageopacity="0"
     inkscape:pageshadow="2"
     inkscape:window-width="615"
     inkscape:window-height="417"
     id="namedview6"
     showgrid="false"
     inkscape:zoom="5.9"
     inkscape:cx="6"
     inkscape:cy="20"
     inkscape:window-x="0"
     inkscape:window-y="27"
     inkscape:window-maximized="0"
     inkscape:current-layer="svg4" />
  <path
     style="color:#000000;font-style:normal;font-variant:normal;font-weight:normal;font-stretch:normal;font-size:medium;line-height:normal;font-family:sans-serif;font-variant-ligatures:normal;font-variant-position:normal;font-variant-caps:normal;font-variant-numeric:normal;font-variant-alternates:normal;font-feature-settings:normal;text-indent:0;text-align:start;text-decoration:none;text-decoration-line:none;text-decoration-style:solid;text-decoration-color:#000000;letter-spacing:normal;word-spacing:normal;text-transform:none;writing-mode:lr-tb;direction:ltr;text-orientation:mixed;dominant-baseline:auto;baseline-shift:baseline;text-anchor:start;white-space:normal;shape-padding:0;clip-rule:nonzero;display:inline;overflow:visible;visibility:visible;opacity:1;isolation:auto;mix-blend-mode:normal;color-interpolation:sRGB;color-interpolation-filters:linearRGB;solid-color:#000000;solid-opacity:1;vector-effect:none;fill:#013272;fill-opacity:1;fill-rule:nonzero;stroke:none;stroke-width:0.5;stroke-linecap:round;stroke-linejoin:round;stroke-miterlimit:4;stroke-dasharray:none;stroke-dashoffset:0;stroke-opacity:1;color-rendering:auto;image-rendering:auto;shape-rendering:auto;text-rendering:auto;enable-background:accumulate"
     d="M 3.984375,1.3710938 3.3710938,1.984375 7.0507812,5.0507812 Z M 3.9707031,0.74804688 a 0.250025,0.250025 0 0 1 0.023437,0 0.250025,0.250025 0 0 1 0.00195,0 0.250025,0.250025 0 0 1 0.048828,0.003906 0.250025,0.250025 0 0 1 0.1777343,0.125 L 9.1738281,6.8203125 a 0.250025,0.250025 0 0 1 0.017578,0.017578 v 0.00195 a 0.250025,0.250025 0 0 1 0.011719,0.013672 0.250025,0.250025 0 0 1 0.00391,0.00391 0.250025,0.250025 0 0 1 0.00977,0.017578 0.250025,0.250025 0 0 1 0.00195,0.00391 0.250025,0.250025 0 0 1 0.00977,0.017578 0.250025,0.250025 0 0 1 0.00195,0.00391 0.250025,0.250025 0 0 1 0.00781,0.019531 0.250025,0.250025 0 0 1 0.00195,0.00391 0.250025,0.250025 0 0 1 0.00586,0.019531 0.250025,0.250025 0 0 1 0,0.00391 0.250025,0.250025 0 0 1 0.00391,0.021484 0.250025,0.250025 0 0 1 0,0.00391 0.250025,0.250025 0 0 1 0.00195,0.019531 0.250025,0.250025 0 0 1 0,0.00586 0.250025,0.250025 0 0 1 0,0.019531 0.250025,0.250025 0 0 1 0,0.00391 0.250025,0.250025 0 0 1 0,0.00391 0.250025,0.250025 0 0 1 -0.00391,0.021484 0.250025,0.250025 0 0 1 -0.00391,0.019531 0.250025,0.250025 0 0 1 -0.00195,0.00391 0.250025,0.250025 0 0 1 -0.00586,0.021484 0.250025,0.250025 0 0 1 -0.00195,0.00391 0.250025,0.250025 0 0 1 -0.00781,0.017578 0.250025,0.250025 0 0 1 -0.00195,0.00391 0.250025,0.250025 0 0 1 -0.00977,0.017578 0.250025,0.250025 0 0 1 -0.011719,0.015625 0.250025,0.250025 0 0 1 -0.019531,0.025391 0.250025,0.250025 0 0 1 -0.017578,0.015625 0.250025,0.250025 0 0 1 -0.021484,0.015625 0.250025,0.250025 0 0 1 -0.00195,0.00195 0.250025,0.250025 0 0 1 -0.00977,0.00586 0.250025,0.250025 0 0 1 -0.03125,0.017578 0.250025,0.250025 0 0 1 -0.035156,0.011719 0.250025,0.250025 0 0 1 -0.0625,0.00781 0.250025,0.250025 0 0 1 -0.00391,0 0.250025,0.250025 0 0 1 -0.025391,-0.00195 0.250025,0.250025 0 0 1 -0.023437,-0.00391 0.250025,0.250025 0 0 1 -0.019531,-0.00391 0.250025,0.250025 0 0 1 -0.00586,-0.00195 0.250025,0.250025 0 0 1 -0.019531,-0.00586 0.250025,0.250025 0 0 1 -0.00391,-0.00195 0.250025,0.250025 0 0 1 -0.017578,-0.00977 0.250025,0.250025 0 0 1 -0.00391,-0.00195 0.250025,0.250025 0 0 1 -0.00195,-0.00195 0.250025,0.250025 0 0 1 -0.019531,-0.011719 0.250025,0.250025 0 0 1 -0.015625,-0.011719 0.250025,0.250025 0 0 1 -0.00391,-0.00391 L 8.8242188,7.1777344 2.8398438,2.1914062 A 0.250025,0.250025 0 0 1 2.8222656,1.8222656 L 3.8007812,0.84375 a 0.250025,0.250025 0 0 1 0.1699219,-0.0957031 z"
     id="path2" />
</svg>
