<?xml version="1.0" encoding="UTF-8" standalone="no"?>
<svg
   xmlns:dc="http://purl.org/dc/elements/1.1/"
   xmlns:cc="http://creativecommons.org/ns#"
   xmlns:rdf="http://www.w3.org/1999/02/22-rdf-syntax-ns#"
   xmlns:svg="http://www.w3.org/2000/svg"
   xmlns="http://www.w3.org/2000/svg"
   xmlns:sodipodi="http://sodipodi.sourceforge.net/DTD/sodipodi-0.dtd"
   xmlns:inkscape="http://www.inkscape.org/namespaces/inkscape"
   data-dec="96"
   width="12"
   height="40"
   version="1.1"
   id="svg4"
   sodipodi:docname="96.svg"
   inkscape:version="0.92.4 (unknown)">
  <metadata
     id="metadata10">
    <rdf:RDF>
      <cc:Work
         rdf:about="">
        <dc:format>image/svg+xml</dc:format>
        <dc:type
           rdf:resource="http://purl.org/dc/dcmitype/StillImage" />
      </cc:Work>
    </rdf:RDF>
  </metadata>
  <defs
     id="defs8" />
  <sodipodi:namedview
     pagecolor="#ffffff"
     bordercolor="#666666"
     borderopacity="1"
     objecttolerance="10"
     gridtolerance="10"
     guidetolerance="10"
     inkscape:pageopacity="0"
     inkscape:pageshadow="2"
     inkscape:window-width="640"
     inkscape:window-height="480"
     id="namedview6"
     showgrid="false"
     inkscape:zoom="5.9"
     inkscape:cx="6"
     inkscape:cy="20"
     inkscape:window-x="0"
     inkscape:window-y="27"
     inkscape:window-maximized="0"
     inkscape:current-layer="svg4" />
  <path
     style="color:#000000;font-style:normal;font-variant:normal;font-weight:normal;font-stretch:normal;font-size:medium;line-height:normal;font-family:sans-serif;font-variant-ligatures:normal;font-variant-position:normal;font-variant-caps:normal;font-variant-numeric:normal;font-variant-alternates:normal;font-feature-settings:normal;text-indent:0;text-align:start;text-decoration:none;text-decoration-line:none;text-decoration-style:solid;text-decoration-color:#000000;letter-spacing:normal;word-spacing:normal;text-transform:none;writing-mode:lr-tb;direction:ltr;text-orientation:mixed;dominant-baseline:auto;baseline-shift:baseline;text-anchor:start;white-space:normal;shape-padding:0;clip-rule:nonzero;display:inline;overflow:visible;visibility:visible;opacity:1;isolation:auto;mix-blend-mode:normal;color-interpolation:sRGB;color-interpolation-filters:linearRGB;solid-color:#000000;solid-opacity:1;vector-effect:none;fill:#013272;fill-opacity:1;fill-rule:nonzero;stroke:none;stroke-width:0.30000001;stroke-linecap:round;stroke-linejoin:round;stroke-miterlimit:4;stroke-dasharray:none;stroke-dashoffset:0;stroke-opacity:1;color-rendering:auto;image-rendering:auto;shape-rendering:auto;text-rendering:auto;enable-background:accumulate"
     d="m 3.9902344,1.2207031 -0.7695313,0.7695313 4.609375,3.8398437 z m 0.00586,-0.37304685 a 0.15001501,0.15001501 0 0 1 0.03125,0.003906 0.15001501,0.15001501 0 0 1 0.029297,0.007813 0.15001501,0.15001501 0 0 1 0.011719,0.005859 0.15001501,0.15001501 0 0 1 0.013672,0.007813 0.15001501,0.15001501 0 0 1 0.023438,0.0195312 0.15001501,0.15001501 0 0 1 0.00977,0.009766 0.15001501,0.15001501 0 0 1 0,0.001953 0.15001501,0.15001501 0 0 1 0.00977,0.009766 l 0.00586,0.009766 a 0.15001501,0.15001501 0 0 1 0.00195,0.001953 L 9.109375,6.8984375 a 0.15001501,0.15001501 0 0 1 0.00586,0.00391 v 0.00195 a 0.15001501,0.15001501 0 0 1 0.00586,0.00781 0.15001501,0.15001501 0 0 1 0.00195,0.00195 0.15001501,0.15001501 0 0 1 0,0.00195 0.15001501,0.15001501 0 0 1 0.011719,0.019531 0.15001501,0.15001501 0 0 1 0.00195,0.00195 0.15001501,0.15001501 0 0 1 0.00195,0.00195 0.15001501,0.15001501 0 0 1 0.00391,0.011719 0.15001501,0.15001501 0 0 1 0.00195,0.00391 0.15001501,0.15001501 0 0 1 0.00586,0.023437 0.15001501,0.15001501 0 0 1 0,0.00195 0.15001501,0.15001501 0 0 1 0,0.00195 0.15001501,0.15001501 0 0 1 0,0.029297 0.15001501,0.15001501 0 0 1 0,0.00195 0.15001501,0.15001501 0 0 1 -0.00391,0.025391 0.15001501,0.15001501 0 0 1 0,0.00195 0.15001501,0.15001501 0 0 1 0,0.00195 0.15001501,0.15001501 0 0 1 -0.00391,0.011719 0.15001501,0.15001501 0 0 1 -0.00391,0.00781 0.15001501,0.15001501 0 0 1 -0.00391,0.00586 0.15001501,0.15001501 0 0 1 0,0.00195 0.15001501,0.15001501 0 0 1 -0.00586,0.011719 0.15001501,0.15001501 0 0 1 -0.00391,0.00391 0.15001501,0.15001501 0 0 1 -0.029297,0.033203 0.15001501,0.15001501 0 0 1 -0.021484,0.013672 0.15001501,0.15001501 0 0 1 -0.00195,0 0.15001501,0.15001501 0 0 1 -0.00586,0.00391 0.15001501,0.15001501 0 0 1 -0.015625,0.00586 0.15001501,0.15001501 0 0 1 -0.035156,0.00781 0.15001501,0.15001501 0 0 1 -0.027344,0 0.15001501,0.15001501 0 0 1 -0.00391,0 0.15001501,0.15001501 0 0 1 -0.011719,-0.00195 0.15001501,0.15001501 0 0 1 -0.00195,0 0.15001501,0.15001501 0 0 1 -0.011719,-0.00391 0.15001501,0.15001501 0 0 1 -0.00391,0 0.15001501,0.15001501 0 0 1 -0.00586,-0.00195 0.15001501,0.15001501 0 0 1 -0.00781,-0.00391 0.15001501,0.15001501 0 0 1 -0.00977,-0.00391 0.15001501,0.15001501 0 0 1 -0.00391,-0.00195 0.15001501,0.15001501 0 0 1 -0.00195,-0.00195 0.15001501,0.15001501 0 0 1 -0.00977,-0.00586 0.15001501,0.15001501 0 0 1 -0.00977,-0.00781 0.15001501,0.15001501 0 0 1 -0.00195,-0.00195 l -0.00977,-0.00781 a 0.15001501,0.15001501 0 0 1 0,-0.00195 L 2.9042969,2.1152344 A 0.15001501,0.15001501 0 0 1 2.8945312,1.8945312 L 3.8710938,0.91796875 a 0.15001501,0.15001501 0 0 1 0.00977,-0.0117188 0.15001501,0.15001501 0 0 1 0.058594,-0.0449219 0.15001501,0.15001501 0 0 1 0.027344,-0.009766 0.15001501,0.15001501 0 0 1 0.015625,-0.001953 0.15001501,0.15001501 0 0 1 0.013672,-0.001953 z"
     id="path2" />
</svg>
