<?xml version="1.0" encoding="UTF-8" standalone="no"?>
<svg
   xmlns:dc="http://purl.org/dc/elements/1.1/"
   xmlns:cc="http://creativecommons.org/ns#"
   xmlns:rdf="http://www.w3.org/1999/02/22-rdf-syntax-ns#"
   xmlns:svg="http://www.w3.org/2000/svg"
   xmlns="http://www.w3.org/2000/svg"
   xmlns:sodipodi="http://sodipodi.sourceforge.net/DTD/sodipodi-0.dtd"
   xmlns:inkscape="http://www.inkscape.org/namespaces/inkscape"
   data-dec="67"
   width="22"
   height="40"
   version="1.1"
   id="svg4"
   sodipodi:docname="67.svg"
   inkscape:version="0.92.4 5da689c313, 2019-01-14">
  <metadata
     id="metadata10">
    <rdf:RDF>
      <cc:Work
         rdf:about="">
        <dc:format>image/svg+xml</dc:format>
        <dc:type
           rdf:resource="http://purl.org/dc/dcmitype/StillImage" />
        <dc:title></dc:title>
      </cc:Work>
    </rdf:RDF>
  </metadata>
  <defs
     id="defs8" />
  <sodipodi:namedview
     pagecolor="#ffffff"
     bordercolor="#666666"
     borderopacity="1"
     objecttolerance="10"
     gridtolerance="10"
     guidetolerance="10"
     inkscape:pageopacity="0"
     inkscape:pageshadow="2"
     inkscape:window-width="1920"
     inkscape:window-height="1043"
     id="namedview6"
     showgrid="false"
     inkscape:zoom="5.9"
     inkscape:cx="11"
     inkscape:cy="20"
     inkscape:window-x="0"
     inkscape:window-y="37"
     inkscape:window-maximized="0"
     inkscape:current-layer="svg4" />
  <path
     style="color:#000000;font-style:normal;font-variant:normal;font-weight:normal;font-stretch:normal;font-size:medium;line-height:normal;font-family:sans-serif;font-variant-ligatures:normal;font-variant-position:normal;font-variant-caps:normal;font-variant-numeric:normal;font-variant-alternates:normal;font-feature-settings:normal;text-indent:0;text-align:start;text-decoration:none;text-decoration-line:none;text-decoration-style:solid;text-decoration-color:#000000;letter-spacing:normal;word-spacing:normal;text-transform:none;writing-mode:lr-tb;direction:ltr;text-orientation:mixed;dominant-baseline:auto;baseline-shift:baseline;text-anchor:start;white-space:normal;shape-padding:0;clip-rule:nonzero;display:inline;overflow:visible;visibility:visible;opacity:1;isolation:auto;mix-blend-mode:normal;color-interpolation:sRGB;color-interpolation-filters:linearRGB;solid-color:#000000;solid-opacity:1;vector-effect:none;fill:#000000;fill-opacity:1;fill-rule:nonzero;stroke:none;stroke-width:0.5;stroke-linecap:round;stroke-linejoin:round;stroke-miterlimit:4;stroke-dasharray:none;stroke-dashoffset:0;stroke-opacity:1;color-rendering:auto;image-rendering:auto;shape-rendering:auto;text-rendering:auto;enable-background:accumulate"
     d="M 9.0585938,1.25 7.1484375,2.2050781 5.2050781,4.1484375 4.2324219,6.0957031 3.25,9.0410156 v 4.9179684 l 0.9824219,2.945313 0.9726562,1.947265 1.9433594,1.94336 L 9.0585938,21.75 h 3.8828122 l 1.910156,-0.955078 1.94336,-1.94336 L 17.595703,17.25 h -0.441406 l -0.931641,1.861328 a 0.250025,0.250025 0 0 1 -0.04492,0.06641 l -1,1 a 0.250025,0.250025 0 0 1 -0.06641,0.04492 l -2,1 A 0.250025,0.250025 0 0 1 13,21.25 H 9 a 0.250025,0.250025 0 0 1 -0.1113281,-0.02734 l -2,-1 a 0.250025,0.250025 0 0 1 -0.097656,-0.08398 l -2,-3 a 0.250025,0.250025 0 0 1 -0.027344,-0.06055 l -1,-3 A 0.250025,0.250025 0 0 1 3.75,14 V 9 a 0.250025,0.250025 0 0 1 0.013672,-0.078125 l 1,-3 a 0.250025,0.250025 0 0 1 0.027344,-0.060547 l 2,-3 a 0.250025,0.250025 0 0 1 0.097656,-0.083984 l 2,-1 A 0.250025,0.250025 0 0 1 9,1.75 h 4 a 0.250025,0.250025 0 0 1 0.111328,0.027344 l 2,1 a 0.250025,0.250025 0 0 1 0.06641,0.044922 l 1,1 a 0.250025,0.250025 0 0 1 0.04492,0.066406 L 17.154297,5.75 h 0.441406 L 16.794922,4.1484375 14.851562,2.2050781 12.941406,1.25 Z M 9,0.75 h 4 a 0.250025,0.250025 0 0 1 0.111328,0.0273438 l 2,1.00000005 a 0.250025,0.250025 0 0 1 0.06641,0.044922 l 2,2 a 0.250025,0.250025 0 0 1 0.04492,0.066406 l 0.982422,1.9628906 a 0.250025,0.250025 0 0 1 0.002,0.00391 0.250025,0.250025 0 0 1 0.02734,0.2382812 0.250025,0.250025 0 0 1 -0.002,0.00586 0.250025,0.250025 0 0 1 -0.0078,0.017578 0.250025,0.250025 0 0 1 -0.002,0.00391 0.250025,0.250025 0 0 1 -0.0098,0.017578 0.250025,0.250025 0 0 1 -0.0039,0.00391 0.250025,0.250025 0 0 1 -0.01172,0.015625 0.250025,0.250025 0 0 1 -0.0039,0.00391 0.250025,0.250025 0 0 1 -0.03125,0.03125 0.250025,0.250025 0 0 1 -0.0039,0.00391 0.250025,0.250025 0 0 1 -0.01563,0.011719 A 0.250025,0.250025 0 0 1 17.958984,6.25 H 17 A 0.250025,0.250025 0 0 1 16.777344,6.1113281 L 15.794922,4.1484375 14.851562,3.2050781 12.941406,2.25 H 9.0585938 L 7.171875,3.1933594 5.2265625,6.1113281 4.25,9.0410156 V 13.958984 L 5.2265625,16.888672 7.171875,19.806641 9.0585938,20.75 h 3.8828122 l 1.910156,-0.955078 0.94336,-0.94336 0.982422,-1.96289 A 0.250025,0.250025 0 0 1 17,16.75 h 0.964844 a 0.250025,0.250025 0 0 1 0.207031,0.06445 0.250025,0.250025 0 0 1 0.04883,0.0625 0.250025,0.250025 0 0 1 0.0098,0.01758 0.250025,0.250025 0 0 1 0.002,0.0039 0.250025,0.250025 0 0 1 0.01367,0.04297 0.250025,0.250025 0 0 1 0.002,0.0059 0.250025,0.250025 0 0 1 -0.04492,0.205078 l -0.980469,1.958984 a 0.250025,0.250025 0 0 1 -0.04492,0.06641 l -2,2 a 0.250025,0.250025 0 0 1 -0.06641,0.04492 l -2,1 A 0.250025,0.250025 0 0 1 13,22.25 H 9 a 0.250025,0.250025 0 0 1 -0.1113281,-0.02734 l -2,-1 a 0.250025,0.250025 0 0 1 -0.066406,-0.04492 l -2,-2 a 0.250025,0.250025 0 0 1 -0.044922,-0.06641 l -1,-2 a 0.250025,0.250025 0 0 1 -0.013672,-0.0332 l -1,-3 A 0.250025,0.250025 0 0 1 2.75,14 V 9 a 0.250025,0.250025 0 0 1 0.013672,-0.078125 l 1,-3 a 0.250025,0.250025 0 0 1 0.013672,-0.033203 l 1,-2 a 0.250025,0.250025 0 0 1 0.044922,-0.066406 l 2,-2 a 0.250025,0.250025 0 0 1 0.066406,-0.044922 l 2,-1.00000005 A 0.250025,0.250025 0 0 1 9,0.75 Z"
     id="path2" />
</svg>
