<?xml version="1.0" encoding="UTF-8" standalone="no"?>
<svg
   xmlns:dc="http://purl.org/dc/elements/1.1/"
   xmlns:cc="http://creativecommons.org/ns#"
   xmlns:rdf="http://www.w3.org/1999/02/22-rdf-syntax-ns#"
   xmlns:svg="http://www.w3.org/2000/svg"
   xmlns="http://www.w3.org/2000/svg"
   xmlns:sodipodi="http://sodipodi.sourceforge.net/DTD/sodipodi-0.dtd"
   xmlns:inkscape="http://www.inkscape.org/namespaces/inkscape"
   data-dec="56"
   width="20"
   height="40"
   version="1.1"
   id="svg4"
   sodipodi:docname="56.svg"
   inkscape:version="0.92.4 5da689c313, 2019-01-14">
  <metadata
     id="metadata10">
    <rdf:RDF>
      <cc:Work
         rdf:about="">
        <dc:format>image/svg+xml</dc:format>
        <dc:type
           rdf:resource="http://purl.org/dc/dcmitype/StillImage" />
        <dc:title></dc:title>
      </cc:Work>
    </rdf:RDF>
  </metadata>
  <defs
     id="defs8" />
  <sodipodi:namedview
     pagecolor="#ffffff"
     bordercolor="#666666"
     borderopacity="1"
     objecttolerance="10"
     gridtolerance="10"
     guidetolerance="10"
     inkscape:pageopacity="0"
     inkscape:pageshadow="2"
     inkscape:window-width="1920"
     inkscape:window-height="1043"
     id="namedview6"
     showgrid="false"
     inkscape:zoom="5.9"
     inkscape:cx="10"
     inkscape:cy="20"
     inkscape:window-x="0"
     inkscape:window-y="37"
     inkscape:window-maximized="0"
     inkscape:current-layer="svg4" />
  <path
     style="color:#000000;font-style:normal;font-variant:normal;font-weight:normal;font-stretch:normal;font-size:medium;line-height:normal;font-family:sans-serif;font-variant-ligatures:normal;font-variant-position:normal;font-variant-caps:normal;font-variant-numeric:normal;font-variant-alternates:normal;font-feature-settings:normal;text-indent:0;text-align:start;text-decoration:none;text-decoration-line:none;text-decoration-style:solid;text-decoration-color:#000000;letter-spacing:normal;word-spacing:normal;text-transform:none;writing-mode:lr-tb;direction:ltr;text-orientation:mixed;dominant-baseline:auto;baseline-shift:baseline;text-anchor:start;white-space:normal;shape-padding:0;clip-rule:nonzero;display:inline;overflow:visible;visibility:visible;opacity:1;isolation:auto;mix-blend-mode:normal;color-interpolation:sRGB;color-interpolation-filters:linearRGB;solid-color:#000000;solid-opacity:1;vector-effect:none;fill:#000000;fill-opacity:1;fill-rule:nonzero;stroke:none;stroke-width:1.5;stroke-linecap:round;stroke-linejoin:round;stroke-miterlimit:4;stroke-dasharray:none;stroke-dashoffset:0;stroke-opacity:1;color-rendering:auto;image-rendering:auto;shape-rendering:auto;text-rendering:auto;enable-background:accumulate"
     d="M 10,11.273438 8.2617188,11.707031 6.4433594,12.617188 5.6171875,13.443359 4.75,15.177734 v 2.644532 L 5.3300781,18.984375 6.3359375,19.654297 8.1210938,20.25 h 3.7578122 l 1.785156,-0.595703 1.00586,-0.669922 L 15.25,17.822266 v -2.644532 l -0.867188,-1.734375 -0.826171,-0.826171 -1.81836,-0.910157 z M 8.1210938,2.75 6.1328125,3.4121094 5.75,4.1777344 V 5.8222656 L 6.5585938,7.4414062 8.2617188,8.2929688 10,8.7265625 11.738281,8.2929688 13.441406,7.4414062 14.25,5.8222656 V 4.1777344 L 13.867188,3.4121094 11.878906,2.75 Z M 8.0351562,0.24609375 A 0.750075,0.750075 0 0 1 8.0722656,0.25 H 12 a 0.750075,0.750075 0 0 1 0.236328,0.0390625 l 3,1 a 0.750075,0.750075 0 0 1 0.433594,0.375 l 1,2 A 0.750075,0.750075 0 0 1 16.75,4 v 2 a 0.750075,0.750075 0 0 1 -0.08008,0.3359375 l -1,2 A 0.750075,0.750075 0 0 1 15.53125,8.53125 l -1,1 A 0.750075,0.750075 0 0 1 14.335938,9.6699219 L 13.675781,10 l 0.660157,0.330078 a 0.750075,0.750075 0 0 1 0.195312,0.138672 l 2,2 a 0.750075,0.750075 0 0 1 0.138672,0.195312 l 1,2 A 0.750075,0.750075 0 0 1 17.75,15 v 3 a 0.750075,0.750075 0 0 1 -0.08008,0.335938 l -1,2 A 0.750075,0.750075 0 0 1 16.53125,20.53125 l -1,1 a 0.750075,0.750075 0 0 1 -0.294922,0.179688 l -3,1 A 0.750075,0.750075 0 0 1 12,22.75 H 8 a 0.750075,0.750075 0 0 1 -0.2363281,-0.03906 l -3,-1 A 0.750075,0.750075 0 0 1 4.46875,21.53125 l -1,-1 A 0.750075,0.750075 0 0 1 3.3300781,20.335938 l -1,-2 A 0.750075,0.750075 0 0 1 2.25,18 v -3 a 0.750075,0.750075 0 0 1 0.080078,-0.335938 l 1,-2 A 0.750075,0.750075 0 0 1 3.46875,12.46875 l 2,-2 A 0.750075,0.750075 0 0 1 5.6640625,10.330078 L 6.3242188,10 5.6640625,9.6699219 A 0.750075,0.750075 0 0 1 5.46875,9.53125 l -1,-1 A 0.750075,0.750075 0 0 1 4.3300781,8.3359375 l -1,-2 A 0.750075,0.750075 0 0 1 3.25,6 V 4 a 0.750075,0.750075 0 0 1 0.080078,-0.3359375 l 1,-2 a 0.750075,0.750075 0 0 1 0.4335938,-0.375 L 7.6816406,0.31640625 A 0.750075,0.750075 0 0 1 7.8125,0.2734375 a 0.750075,0.750075 0 0 1 0.068359,-0.0136719 0.750075,0.750075 0 0 1 0.017578,-0.003906 0.750075,0.750075 0 0 1 0.027344,-0.003906 0.750075,0.750075 0 0 1 0.00781,0 0.750075,0.750075 0 0 1 0.1015624,-0.005859 z"
     id="path2" />
</svg>
