<?xml version="1.0" encoding="UTF-8"?>
<glyph name="Y" format="1">
  <advance width="635"/>
  <unicode hex="0059"/>
  <outline>
    <contour>
      <point x="174" y="637" type="line"/>
      <point x="176" y="637" type="line"/>
      <point x="200" y="637" type="line"/>
      <point x="202" y="637" type="line"/>
      <point x="205" y="637" type="line"/>
      <point x="229" y="637" type="line"/>
      <point x="231" y="637" type="line"/>
      <point x="233" y="637" type="line"/>
      <point x="258" y="637" type="line"/>
      <point x="261" y="637" type="line"/>
      <point x="263" y="637" type="line"/>
      <point x="288" y="637" type="line"/>
      <point x="289" y="637" type="line"/>
      <point x="290" y="637" type="line"/>
      <point x="318" y="637" type="line"/>
      <point x="319" y="637" type="line" smooth="yes"/>
      <point x="327" y="637"/>
      <point x="333" y="631"/>
      <point x="333" y="623" type="curve" smooth="yes"/>
      <point x="333" y="615"/>
      <point x="327" y="607"/>
      <point x="319" y="607" type="curve" smooth="yes"/>
      <point x="318" y="607" type="line"/>
      <point x="292" y="607" type="line"/>
      <point x="265" y="598" type="line"/>
      <point x="261" y="590" type="line"/>
      <point x="353" y="359" type="line"/>
      <point x="583" y="590" type="line"/>
      <point x="547" y="607" type="line"/>
      <point x="521" y="607" type="line" smooth="yes"/>
      <point x="513" y="607"/>
      <point x="506" y="615"/>
      <point x="506" y="623" type="curve" smooth="yes"/>
      <point x="506" y="631"/>
      <point x="513" y="637"/>
      <point x="521" y="637" type="curve" smooth="yes"/>
      <point x="548" y="637" type="line"/>
      <point x="550" y="637" type="line"/>
      <point x="551" y="637" type="line"/>
      <point x="664" y="637" type="line"/>
      <point x="666" y="637" type="line"/>
      <point x="668" y="637" type="line"/>
      <point x="695" y="637" type="line" smooth="yes"/>
      <point x="703" y="637"/>
      <point x="710" y="631"/>
      <point x="710" y="623" type="curve" smooth="yes"/>
      <point x="710" y="615"/>
      <point x="703" y="607"/>
      <point x="695" y="607" type="curve" smooth="yes"/>
      <point x="669" y="607" type="line"/>
      <point x="616" y="581" type="line"/>
      <point x="361" y="326" type="line"/>
      <point x="286" y="53" type="line"/>
      <point x="294" y="37" type="line"/>
      <point x="321" y="29" type="line"/>
      <point x="348" y="29" type="line" smooth="yes"/>
      <point x="356" y="29"/>
      <point x="362" y="22"/>
      <point x="362" y="14" type="curve" smooth="yes"/>
      <point x="362" y="6"/>
      <point x="356" y="0"/>
      <point x="348" y="0" type="curve" smooth="yes"/>
      <point x="320" y="0" type="line"/>
      <point x="319" y="0" type="line"/>
      <point x="318" y="0" type="line"/>
      <point x="292" y="0" type="line"/>
      <point x="289" y="0" type="line"/>
      <point x="287" y="0" type="line"/>
      <point x="263" y="0" type="line"/>
      <point x="261" y="0" type="line"/>
      <point x="258" y="0" type="line"/>
      <point x="234" y="0" type="line"/>
      <point x="231" y="0" type="line"/>
      <point x="229" y="0" type="line"/>
      <point x="205" y="0" type="line"/>
      <point x="202" y="0" type="line"/>
      <point x="200" y="0" type="line"/>
      <point x="175" y="0" type="line"/>
      <point x="174" y="0" type="line"/>
      <point x="172" y="0" type="line"/>
      <point x="146" y="0" type="line"/>
      <point x="145" y="0" type="line"/>
      <point x="143" y="0" type="line"/>
      <point x="116" y="0" type="line" smooth="yes"/>
      <point x="108" y="0"/>
      <point x="101" y="6"/>
      <point x="101" y="14" type="curve" smooth="yes"/>
      <point x="101" y="22"/>
      <point x="108" y="29"/>
      <point x="116" y="29" type="curve" smooth="yes"/>
      <point x="142" y="29" type="line"/>
      <point x="180" y="42" type="line"/>
      <point x="200" y="62" type="line"/>
      <point x="274" y="332" type="line"/>
      <point x="169" y="594" type="line"/>
      <point x="141" y="607" type="line"/>
      <point x="116" y="607" type="line" smooth="yes"/>
      <point x="108" y="607"/>
      <point x="101" y="615"/>
      <point x="101" y="623" type="curve" smooth="yes"/>
      <point x="101" y="631"/>
      <point x="108" y="637"/>
      <point x="116" y="637" type="curve" smooth="yes"/>
      <point x="143" y="637" type="line"/>
      <point x="144" y="637" type="line"/>
      <point x="146" y="637" type="line"/>
      <point x="172" y="637" type="line"/>
    </contour>
  </outline>
  <lib>
    <dict>
      <key>com.fontlab.hintData</key>
      <dict>
        <key>hhints</key>
        <array>
          <dict>
            <key>position</key>
            <integer>0</integer>
            <key>width</key>
            <integer>29</integer>
          </dict>
          <dict>
            <key>position</key>
            <integer>607</integer>
            <key>width</key>
            <integer>30</integer>
          </dict>
        </array>
      </dict>
    </dict>
  </lib>
</glyph>
