<?xml version="1.0" encoding="UTF-8" standalone="no"?>
<svg
   xmlns:dc="http://purl.org/dc/elements/1.1/"
   xmlns:cc="http://creativecommons.org/ns#"
   xmlns:rdf="http://www.w3.org/1999/02/22-rdf-syntax-ns#"
   xmlns:svg="http://www.w3.org/2000/svg"
   xmlns="http://www.w3.org/2000/svg"
   xmlns:sodipodi="http://sodipodi.sourceforge.net/DTD/sodipodi-0.dtd"
   xmlns:inkscape="http://www.inkscape.org/namespaces/inkscape"
   data-dec="67"
   width="22"
   height="40"
   version="1.1"
   id="svg4"
   sodipodi:docname="67.svg"
   inkscape:version="0.92.4 5da689c313, 2019-01-14">
  <metadata
     id="metadata10">
    <rdf:RDF>
      <cc:Work
         rdf:about="">
        <dc:format>image/svg+xml</dc:format>
        <dc:type
           rdf:resource="http://purl.org/dc/dcmitype/StillImage" />
        <dc:title></dc:title>
      </cc:Work>
    </rdf:RDF>
  </metadata>
  <defs
     id="defs8" />
  <sodipodi:namedview
     pagecolor="#ffffff"
     bordercolor="#666666"
     borderopacity="1"
     objecttolerance="10"
     gridtolerance="10"
     guidetolerance="10"
     inkscape:pageopacity="0"
     inkscape:pageshadow="2"
     inkscape:window-width="1920"
     inkscape:window-height="1043"
     id="namedview6"
     showgrid="false"
     inkscape:zoom="5.9"
     inkscape:cx="11"
     inkscape:cy="20"
     inkscape:window-x="0"
     inkscape:window-y="37"
     inkscape:window-maximized="0"
     inkscape:current-layer="svg4" />
  <path
     style="color:#000000;font-style:normal;font-variant:normal;font-weight:normal;font-stretch:normal;font-size:medium;line-height:normal;font-family:sans-serif;font-variant-ligatures:normal;font-variant-position:normal;font-variant-caps:normal;font-variant-numeric:normal;font-variant-alternates:normal;font-feature-settings:normal;text-indent:0;text-align:start;text-decoration:none;text-decoration-line:none;text-decoration-style:solid;text-decoration-color:#000000;letter-spacing:normal;word-spacing:normal;text-transform:none;writing-mode:lr-tb;direction:ltr;text-orientation:mixed;dominant-baseline:auto;baseline-shift:baseline;text-anchor:start;white-space:normal;shape-padding:0;clip-rule:nonzero;display:inline;overflow:visible;visibility:visible;opacity:1;isolation:auto;mix-blend-mode:normal;color-interpolation:sRGB;color-interpolation-filters:linearRGB;solid-color:#000000;solid-opacity:1;vector-effect:none;fill:#000000;fill-opacity:1;fill-rule:nonzero;stroke:none;stroke-width:1.5;stroke-linecap:round;stroke-linejoin:round;stroke-miterlimit:4;stroke-dasharray:none;stroke-dashoffset:0;stroke-opacity:1;color-rendering:auto;image-rendering:auto;shape-rendering:auto;text-rendering:auto;enable-background:accumulate"
     d="m 9,0.25 h 4 a 0.750075,0.750075 0 0 1 0.335938,0.0800781 l 2,0.99999998 A 0.750075,0.750075 0 0 1 15.53125,1.46875 l 2,2 a 0.750075,0.750075 0 0 1 0.138672,0.1953125 l 0.947266,1.8964844 a 0.750075,0.750075 0 0 1 0.08008,0.7363281 0.750075,0.750075 0 0 1 -0.02344,0.052734 0.750075,0.750075 0 0 1 -0.0078,0.013672 0.750075,0.750075 0 0 1 -0.0293,0.050781 0.750075,0.750075 0 0 1 -0.0098,0.013672 0.750075,0.750075 0 0 1 -0.03516,0.046875 A 0.750075,0.750075 0 0 1 17.888672,6.75 H 17 A 0.750075,0.750075 0 0 1 16.330078,6.3359375 L 15.382812,4.4433594 14.556641,3.6171875 12.822266,2.75 H 9.1777344 l -1.6640625,0.8320312 -1.8339844,2.75 L 4.75,9.1210938 v 4.7578122 l 0.9296875,2.789063 1.8339844,2.75 L 9.1777344,20.25 h 3.6445316 l 1.734375,-0.867188 0.826171,-0.826171 0.947266,-1.892579 A 0.750075,0.750075 0 0 1 17,16.25 h 0.882812 a 0.750075,0.750075 0 0 1 0.730469,0.302734 0.750075,0.750075 0 0 1 0.0098,0.01367 0.750075,0.750075 0 0 1 0.03125,0.05078 0.750075,0.750075 0 0 1 0.03516,0.06641 0.750075,0.750075 0 0 1 -0.07031,0.753906 l -0.949219,1.898438 A 0.750075,0.750075 0 0 1 17.53125,19.53125 l -2,2 a 0.750075,0.750075 0 0 1 -0.195312,0.138672 l -2,1 A 0.750075,0.750075 0 0 1 13,22.75 H 9 a 0.750075,0.750075 0 0 1 -0.3359375,-0.08008 l -2,-1 A 0.750075,0.750075 0 0 1 6.46875,21.53125 l -2,-2 A 0.750075,0.750075 0 0 1 4.3300781,19.335938 l -1,-2 a 0.750075,0.750075 0 0 1 -0.041016,-0.09961 l -1,-3 A 0.750075,0.750075 0 0 1 2.25,14 V 9 a 0.750075,0.750075 0 0 1 0.039063,-0.2363281 l 1,-3 a 0.750075,0.750075 0 0 1 0.041016,-0.099609 l 1,-2 A 0.750075,0.750075 0 0 1 4.46875,3.46875 l 2,-2 A 0.750075,0.750075 0 0 1 6.6640625,1.3300781 l 2,-0.99999998 A 0.750075,0.750075 0 0 1 9,0.25 Z"
     id="path2" />
</svg>
