<?xml version="1.0" encoding="UTF-8" standalone="no"?>
<svg
   xmlns:dc="http://purl.org/dc/elements/1.1/"
   xmlns:cc="http://creativecommons.org/ns#"
   xmlns:rdf="http://www.w3.org/1999/02/22-rdf-syntax-ns#"
   xmlns:svg="http://www.w3.org/2000/svg"
   xmlns="http://www.w3.org/2000/svg"
   xmlns:sodipodi="http://sodipodi.sourceforge.net/DTD/sodipodi-0.dtd"
   xmlns:inkscape="http://www.inkscape.org/namespaces/inkscape"
   data-dec="71"
   width="23"
   height="40"
   version="1.1"
   id="svg4"
   sodipodi:docname="71.svg"
   inkscape:version="0.92.4 (unknown)">
  <metadata
     id="metadata10">
    <rdf:RDF>
      <cc:Work
         rdf:about="">
        <dc:format>image/svg+xml</dc:format>
        <dc:type
           rdf:resource="http://purl.org/dc/dcmitype/StillImage" />
      </cc:Work>
    </rdf:RDF>
  </metadata>
  <defs
     id="defs8" />
  <sodipodi:namedview
     pagecolor="#ffffff"
     bordercolor="#666666"
     borderopacity="1"
     objecttolerance="10"
     gridtolerance="10"
     guidetolerance="10"
     inkscape:pageopacity="0"
     inkscape:pageshadow="2"
     inkscape:window-width="640"
     inkscape:window-height="480"
     id="namedview6"
     showgrid="false"
     inkscape:zoom="5.9"
     inkscape:cx="11.5"
     inkscape:cy="20"
     inkscape:window-x="0"
     inkscape:window-y="27"
     inkscape:window-maximized="0"
     inkscape:current-layer="svg4" />
  <path
     style="color:#000000;font-style:normal;font-variant:normal;font-weight:normal;font-stretch:normal;font-size:medium;line-height:normal;font-family:sans-serif;font-variant-ligatures:normal;font-variant-position:normal;font-variant-caps:normal;font-variant-numeric:normal;font-variant-alternates:normal;font-feature-settings:normal;text-indent:0;text-align:start;text-decoration:none;text-decoration-line:none;text-decoration-style:solid;text-decoration-color:#000000;letter-spacing:normal;word-spacing:normal;text-transform:none;writing-mode:lr-tb;direction:ltr;text-orientation:mixed;dominant-baseline:auto;baseline-shift:baseline;text-anchor:start;white-space:normal;shape-padding:0;clip-rule:nonzero;display:inline;overflow:visible;visibility:visible;opacity:1;isolation:auto;mix-blend-mode:normal;color-interpolation:sRGB;color-interpolation-filters:linearRGB;solid-color:#000000;solid-opacity:1;vector-effect:none;fill:#000000;fill-opacity:1;fill-rule:nonzero;stroke:none;stroke-width:1.5;stroke-linecap:round;stroke-linejoin:round;stroke-miterlimit:4;stroke-dasharray:none;stroke-dashoffset:0;stroke-opacity:1;color-rendering:auto;image-rendering:auto;shape-rendering:auto;text-rendering:auto;enable-background:accumulate"
     d="M 10.035156,0.24609375 A 0.750075,0.750075 0 0 1 10.072266,0.25 h 3.849609 a 0.750075,0.750075 0 0 1 0.185547,0.007813 0.750075,0.750075 0 0 1 0.05859,0.009766 0.750075,0.750075 0 0 1 0.01563,0.003906 l 4,1.00000002 a 0.750075,0.750075 0 0 1 0.154297,0.058594 l 2,1 A 0.750075,0.750075 0 0 1 20.75,3 V 5 A 0.750075,0.750075 0 0 1 19.46875,5.53125 L 16.595703,2.65625 13.880859,1.75 H 10.119141 L 7.4042969,2.65625 5.6171875,4.4433594 4.6953125,6.2871094 3.75,9.1210938 v 4.7578122 l 0.9453125,2.833985 0.921875,1.84375 1.7871094,1.787109 2.7148441,0.90625 h 3.761718 L 16.595703,20.34375 18.25,18.689453 V 14.3125 L 17.689453,13.75 H 17 a 0.750075,0.750075 0 0 1 0,-1.5 h 1 0.876953 a 0.750075,0.750075 0 0 1 0.246094,0 h 0.753906 a 0.750075,0.750075 0 0 1 0.246094,0 H 21 22 a 0.750075,0.750075 0 0 1 0,1.5 H 21.310547 L 20.75,14.3125 v 3.474609 l 0.914062,-0.457031 a 0.750075,0.750075 0 0 1 0.867188,1.201172 l -1.9375,1.9375 a 0.750075,0.750075 0 0 1 -0.375,0.259766 l -1.882812,0.941406 a 0.750075,0.750075 0 0 1 -0.154297,0.05859 l -3.994141,0.998046 -0.0059,0.002 a 0.750075,0.750075 0 0 1 -0.02149,0.0039 0.750075,0.750075 0 0 1 -0.01172,0.002 0.750075,0.750075 0 0 1 -0.220704,0.01563 h -3.849609 a 0.750075,0.750075 0 0 1 -0.1855469,-0.0078 0.750075,0.750075 0 0 1 -0.058594,-0.0098 0.750075,0.750075 0 0 1 -0.00781,-0.002 0.750075,0.750075 0 0 1 -0.00781,-0.002 l -4,-1 A 0.750075,0.750075 0 0 1 5.46875,21.53125 l -2,-2 A 0.750075,0.750075 0 0 1 3.3300781,19.335938 l -1,-2 a 0.750075,0.750075 0 0 1 -0.041016,-0.09961 l -1,-3 A 0.750075,0.750075 0 0 1 1.25,14 V 9 a 0.750075,0.750075 0 0 1 0.039063,-0.2363281 l 1,-3 a 0.750075,0.750075 0 0 1 0.041016,-0.099609 l 1,-2 A 0.750075,0.750075 0 0 1 3.46875,3.46875 l 2,-2 A 0.750075,0.750075 0 0 1 5.8183594,1.2714844 L 9.8125,0.2734375 a 0.750075,0.750075 0 0 1 0.00586,-0.001953 0.750075,0.750075 0 0 1 0.033203,-0.005859 0.750075,0.750075 0 0 1 0.1835935,-0.0195313 z"
     id="path2" />
</svg>
