<?xml version="1.0" encoding="UTF-8"?>
<glyph name="h" format="1">
  <advance width="346"/>
  <unicode hex="0068"/>
  <outline>
    <contour>
      <point x="87" y="652" type="curve" smooth="yes"/>
      <point x="91" y="652"/>
      <point x="99" y="649"/>
      <point x="102" y="646" type="curve" smooth="yes"/>
      <point x="103" y="644" type="line" smooth="yes"/>
      <point x="106" y="641"/>
      <point x="109" y="634"/>
      <point x="109" y="630" type="curve" smooth="yes"/>
      <point x="109" y="626" type="line"/>
      <point x="109" y="416" type="line"/>
      <point x="142" y="443" type="line" smooth="yes"/>
      <point x="145" y="446"/>
      <point x="152" y="449"/>
      <point x="156" y="449" type="curve" smooth="yes"/>
      <point x="208" y="449" type="line" smooth="yes"/>
      <point x="212" y="449"/>
      <point x="219" y="446"/>
      <point x="222" y="443" type="curve" smooth="yes"/>
      <point x="257" y="415" type="line" smooth="yes"/>
      <point x="260" y="413"/>
      <point x="263" y="408"/>
      <point x="264" y="405" type="curve" smooth="yes"/>
      <point x="282" y="346" type="line" smooth="yes"/>
      <point x="282" y="344"/>
      <point x="283" y="342"/>
      <point x="283" y="340" type="curve" smooth="yes"/>
      <point x="283" y="44" type="line"/>
      <point x="312" y="44" type="line"/>
      <point x="314" y="44" type="line" smooth="yes"/>
      <point x="326" y="44"/>
      <point x="334" y="34"/>
      <point x="334" y="22" type="curve" smooth="yes"/>
      <point x="334" y="10"/>
      <point x="326" y="0"/>
      <point x="314" y="0" type="curve" smooth="yes"/>
      <point x="312" y="0" type="line"/>
      <point x="264" y="0" type="line"/>
      <point x="261" y="0" type="line"/>
      <point x="257" y="0" type="line"/>
      <point x="208" y="0" type="line" smooth="yes"/>
      <point x="196" y="0"/>
      <point x="186" y="10"/>
      <point x="186" y="22" type="curve" smooth="yes"/>
      <point x="186" y="34"/>
      <point x="196" y="44"/>
      <point x="208" y="44" type="curve" smooth="yes"/>
      <point x="239" y="44" type="line"/>
      <point x="239" y="337" type="line"/>
      <point x="224" y="386" type="line"/>
      <point x="200" y="406" type="line"/>
      <point x="164" y="406" type="line"/>
      <point x="140" y="385" type="line"/>
      <point x="109" y="307" type="line"/>
      <point x="109" y="44" type="line"/>
      <point x="139" y="44" type="line"/>
      <point x="140" y="44" type="line" smooth="yes"/>
      <point x="152" y="44"/>
      <point x="161" y="34"/>
      <point x="161" y="22" type="curve" smooth="yes"/>
      <point x="161" y="10"/>
      <point x="152" y="0"/>
      <point x="140" y="0" type="curve" smooth="yes"/>
      <point x="139" y="0" type="line"/>
      <point x="90" y="0" type="line"/>
      <point x="87" y="0" type="line"/>
      <point x="84" y="0" type="line"/>
      <point x="35" y="0" type="line"/>
      <point x="34" y="0" type="line" smooth="yes"/>
      <point x="22" y="0"/>
      <point x="13" y="10"/>
      <point x="13" y="22" type="curve" smooth="yes"/>
      <point x="13" y="34"/>
      <point x="22" y="44"/>
      <point x="34" y="44" type="curve" smooth="yes"/>
      <point x="35" y="44" type="line"/>
      <point x="65" y="44" type="line"/>
      <point x="65" y="309" type="line"/>
      <point x="65" y="311" type="line"/>
      <point x="65" y="314" type="line"/>
      <point x="65" y="608" type="line"/>
      <point x="35" y="608" type="line"/>
      <point x="34" y="608" type="line" smooth="yes"/>
      <point x="22" y="608"/>
      <point x="13" y="618"/>
      <point x="13" y="630" type="curve" smooth="yes"/>
      <point x="13" y="642"/>
      <point x="22" y="651"/>
      <point x="34" y="651" type="curve" smooth="yes"/>
      <point x="35" y="651" type="line"/>
      <point x="84" y="651" type="line" smooth="yes"/>
      <point x="85" y="651"/>
      <point x="86" y="652"/>
    </contour>
  </outline>
  <lib>
    <dict>
      <key>com.fontlab.hintData</key>
      <dict>
        <key>hhints</key>
        <array>
          <dict>
            <key>position</key>
            <integer>0</integer>
            <key>width</key>
            <integer>44</integer>
          </dict>
          <dict>
            <key>position</key>
            <integer>406</integer>
            <key>width</key>
            <integer>43</integer>
          </dict>
          <dict>
            <key>position</key>
            <integer>608</integer>
            <key>width</key>
            <integer>43</integer>
          </dict>
        </array>
        <key>vhints</key>
        <array>
          <dict>
            <key>position</key>
            <integer>13</integer>
            <key>width</key>
            <integer>96</integer>
          </dict>
          <dict>
            <key>position</key>
            <integer>65</integer>
            <key>width</key>
            <integer>44</integer>
          </dict>
          <dict>
            <key>position</key>
            <integer>239</integer>
            <key>width</key>
            <integer>44</integer>
          </dict>
        </array>
      </dict>
    </dict>
  </lib>
</glyph>
