<?xml version="1.0" encoding="UTF-8" standalone="no"?>
<svg
   xmlns:dc="http://purl.org/dc/elements/1.1/"
   xmlns:cc="http://creativecommons.org/ns#"
   xmlns:rdf="http://www.w3.org/1999/02/22-rdf-syntax-ns#"
   xmlns:svg="http://www.w3.org/2000/svg"
   xmlns="http://www.w3.org/2000/svg"
   xmlns:sodipodi="http://sodipodi.sourceforge.net/DTD/sodipodi-0.dtd"
   xmlns:inkscape="http://www.inkscape.org/namespaces/inkscape"
   data-dec="93"
   width="14"
   height="40"
   version="1.1"
   id="svg4"
   sodipodi:docname="93.svg"
   inkscape:version="0.92.4 (unknown)">
  <metadata
     id="metadata10">
    <rdf:RDF>
      <cc:Work
         rdf:about="">
        <dc:format>image/svg+xml</dc:format>
        <dc:type
           rdf:resource="http://purl.org/dc/dcmitype/StillImage" />
      </cc:Work>
    </rdf:RDF>
  </metadata>
  <defs
     id="defs8" />
  <sodipodi:namedview
     pagecolor="#ffffff"
     bordercolor="#666666"
     borderopacity="1"
     objecttolerance="10"
     gridtolerance="10"
     guidetolerance="10"
     inkscape:pageopacity="0"
     inkscape:pageshadow="2"
     inkscape:window-width="615"
     inkscape:window-height="417"
     id="namedview6"
     showgrid="false"
     inkscape:zoom="5.9"
     inkscape:cx="7"
     inkscape:cy="20"
     inkscape:window-x="0"
     inkscape:window-y="27"
     inkscape:window-maximized="0"
     inkscape:current-layer="svg4" />
  <path
     style="color:#000000;font-style:normal;font-variant:normal;font-weight:normal;font-stretch:normal;font-size:medium;line-height:normal;font-family:sans-serif;font-variant-ligatures:normal;font-variant-position:normal;font-variant-caps:normal;font-variant-numeric:normal;font-variant-alternates:normal;font-feature-settings:normal;text-indent:0;text-align:start;text-decoration:none;text-decoration-line:none;text-decoration-style:solid;text-decoration-color:#000000;letter-spacing:normal;word-spacing:normal;text-transform:none;writing-mode:lr-tb;direction:ltr;text-orientation:mixed;dominant-baseline:auto;baseline-shift:baseline;text-anchor:start;white-space:normal;shape-padding:0;clip-rule:nonzero;display:inline;overflow:visible;visibility:visible;opacity:1;isolation:auto;mix-blend-mode:normal;color-interpolation:sRGB;color-interpolation-filters:linearRGB;solid-color:#000000;solid-opacity:1;vector-effect:none;fill:#013272;fill-opacity:1;fill-rule:nonzero;stroke:none;stroke-width:1;stroke-linecap:round;stroke-linejoin:round;stroke-miterlimit:4;stroke-dasharray:none;stroke-dashoffset:0;stroke-opacity:1;color-rendering:auto;image-rendering:auto;shape-rendering:auto;text-rendering:auto;enable-background:accumulate"
     d="M 8.9921875,-3.5078125 A 0.50005,0.50005 0 0 1 9.0800781,-3.5 h 0.8378907 a 0.50005,0.50005 0 0 1 0.3945312,0.1035156 0.50005,0.50005 0 0 1 0.0039,0.00195 0.50005,0.50005 0 0 1 0.0332,0.03125 0.50005,0.50005 0 0 1 0.0039,0.00195 0.50005,0.50005 0 0 1 0.03125,0.033203 0.50005,0.50005 0 0 1 0.002,0.00391 A 0.50005,0.50005 0 0 1 10.5,-2.9199219 V 28.917969 a 0.50005,0.50005 0 0 1 -0.103516,0.394531 0.50005,0.50005 0 0 1 -0.002,0.0039 0.50005,0.50005 0 0 1 -0.03125,0.0332 0.50005,0.50005 0 0 1 -0.002,0.0039 0.50005,0.50005 0 0 1 -0.0332,0.03125 0.50005,0.50005 0 0 1 -0.0039,0.002 A 0.50005,0.50005 0 0 1 9.9199219,29.5 H 9.0820312 a 0.50005,0.50005 0 0 1 -0.1621093,0 H 3 a 0.50005,0.50005 0 1 1 0,-1 h 5.5 v -31 H 3 a 0.50005,0.50005 0 1 1 0,-1 h 5.9179688 a 0.50005,0.50005 0 0 1 0.074219,-0.00781 z"
     id="path2" />
</svg>
