<?xml version="1.0" encoding="UTF-8"?>
<glyph name="y" format="1">
  <advance width="463"/>
  <unicode hex="0079"/>
  <outline>
    <contour>
      <point x="248" y="23" type="line"/>
      <point x="152" y="-194" type="line"/>
      <point x="170" y="-194" type="line"/>
      <point x="256" y="4" type="line"/>
    </contour>
    <contour>
      <point x="219" y="23" type="line"/>
      <point x="122" y="-194" type="line"/>
      <point x="142" y="-194" type="line"/>
      <point x="227" y="4" type="line"/>
    </contour>
    <contour>
      <point x="233" y="56" type="line"/>
      <point x="223" y="34" type="line"/>
      <point x="232" y="15" type="line"/>
      <point x="241" y="38" type="line"/>
    </contour>
    <contour>
      <point x="246" y="86" type="line"/>
      <point x="239" y="67" type="line"/>
      <point x="246" y="50" type="line"/>
      <point x="254" y="67" type="line"/>
    </contour>
    <contour>
      <point x="408" y="405" type="line"/>
      <point x="265" y="60" type="line"/>
      <point x="264" y="60" type="line"/>
      <point x="264" y="59" type="line"/>
      <point x="253" y="34" type="line"/>
      <point x="261" y="15" type="line"/>
      <point x="428" y="405" type="line"/>
    </contour>
    <contour>
      <point x="380" y="405" type="line"/>
      <point x="251" y="97" type="line"/>
      <point x="258" y="78" type="line"/>
      <point x="398" y="405" type="line"/>
    </contour>
    <contour>
      <point x="94" y="405" type="line"/>
      <point x="233" y="78" type="line"/>
      <point x="241" y="97" type="line"/>
      <point x="113" y="405" type="line"/>
    </contour>
    <contour>
      <point x="65" y="405" type="line"/>
      <point x="219" y="45" type="line"/>
      <point x="227" y="63" type="line"/>
      <point x="84" y="405" type="line"/>
    </contour>
    <contour>
      <point x="58" y="414" type="line"/>
      <point x="86" y="414" type="line"/>
      <point x="87" y="414" type="line"/>
      <point x="88" y="414" type="line"/>
      <point x="116" y="414" type="line" smooth="yes"/>
      <point x="117" y="414"/>
      <point x="119" y="412"/>
      <point x="120" y="411" type="curve" smooth="yes"/>
      <point x="246" y="108" type="line"/>
      <point x="372" y="411" type="line" smooth="yes"/>
      <point x="373" y="412"/>
      <point x="375" y="414"/>
      <point x="376" y="414" type="curve" smooth="yes"/>
      <point x="405" y="414" type="line"/>
      <point x="406" y="414" type="line"/>
      <point x="433" y="414" type="line"/>
      <point x="434" y="414" type="line"/>
      <point x="436" y="414" type="line"/>
      <point x="437" y="414" type="line"/>
      <point x="437" y="412" type="line"/>
      <point x="438" y="412" type="line"/>
      <point x="438" y="411" type="line"/>
      <point x="439" y="411" type="line"/>
      <point x="439" y="410" type="line"/>
      <point x="439" y="409" type="line"/>
      <point x="438" y="408" type="line"/>
      <point x="438" y="407" type="line"/>
      <point x="265" y="3" type="line"/>
      <point x="264" y="2" type="line"/>
      <point x="178" y="-200" type="line" smooth="yes"/>
      <point x="177" y="-201"/>
      <point x="175" y="-202"/>
      <point x="174" y="-202" type="curve" smooth="yes"/>
      <point x="145" y="-202" type="line"/>
      <point x="144" y="-202" type="line"/>
      <point x="117" y="-202" type="line"/>
      <point x="116" y="-202" type="line"/>
      <point x="114" y="-202" type="line"/>
      <point x="113" y="-202" type="line"/>
      <point x="113" y="-201" type="line"/>
      <point x="112" y="-201" type="line"/>
      <point x="112" y="-200" type="line"/>
      <point x="111" y="-199" type="line"/>
      <point x="111" y="-198" type="line" smooth="yes"/>
      <point x="111" y="-197"/>
      <point x="112" y="-197"/>
      <point x="112" y="-196" type="curve" smooth="yes"/>
      <point x="214" y="34" type="line"/>
      <point x="54" y="407" type="line"/>
      <point x="54" y="408" type="line"/>
      <point x="54" y="409" type="line"/>
      <point x="54" y="410" type="line"/>
      <point x="54" y="411" type="line"/>
      <point x="54" y="412" type="line"/>
      <point x="55" y="412" type="line"/>
      <point x="55" y="414" type="line"/>
      <point x="56" y="414" type="line"/>
      <point x="57" y="414" type="line"/>
    </contour>
  </outline>
  <lib>
    <dict>
      <key>com.fontlab.hintData</key>
      <dict>
        <key>hhints</key>
        <array>
          <dict>
            <key>position</key>
            <integer>-202</integer>
            <key>width</key>
            <integer>9</integer>
          </dict>
          <dict>
            <key>position</key>
            <integer>405</integer>
            <key>width</key>
            <integer>9</integer>
          </dict>
        </array>
      </dict>
    </dict>
  </lib>
</glyph>
