<?xml version="1.0" encoding="UTF-8" standalone="no"?>
<svg
   xmlns:dc="http://purl.org/dc/elements/1.1/"
   xmlns:cc="http://creativecommons.org/ns#"
   xmlns:rdf="http://www.w3.org/1999/02/22-rdf-syntax-ns#"
   xmlns:svg="http://www.w3.org/2000/svg"
   xmlns="http://www.w3.org/2000/svg"
   xmlns:sodipodi="http://sodipodi.sourceforge.net/DTD/sodipodi-0.dtd"
   xmlns:inkscape="http://www.inkscape.org/namespaces/inkscape"
   data-dec="70"
   width="20"
   height="40"
   version="1.1"
   id="svg4"
   sodipodi:docname="70.svg"
   inkscape:version="0.92.4 (unknown)">
  <metadata
     id="metadata10">
    <rdf:RDF>
      <cc:Work
         rdf:about="">
        <dc:format>image/svg+xml</dc:format>
        <dc:type
           rdf:resource="http://purl.org/dc/dcmitype/StillImage" />
      </cc:Work>
    </rdf:RDF>
  </metadata>
  <defs
     id="defs8" />
  <sodipodi:namedview
     pagecolor="#ffffff"
     bordercolor="#666666"
     borderopacity="1"
     objecttolerance="10"
     gridtolerance="10"
     guidetolerance="10"
     inkscape:pageopacity="0"
     inkscape:pageshadow="2"
     inkscape:window-width="615"
     inkscape:window-height="417"
     id="namedview6"
     showgrid="false"
     inkscape:zoom="5.9"
     inkscape:cx="10"
     inkscape:cy="20"
     inkscape:window-x="0"
     inkscape:window-y="27"
     inkscape:window-maximized="0"
     inkscape:current-layer="svg4" />
  <path
     style="color:#000000;font-style:normal;font-variant:normal;font-weight:normal;font-stretch:normal;font-size:medium;line-height:normal;font-family:sans-serif;font-variant-ligatures:normal;font-variant-position:normal;font-variant-caps:normal;font-variant-numeric:normal;font-variant-alternates:normal;font-feature-settings:normal;text-indent:0;text-align:start;text-decoration:none;text-decoration-line:none;text-decoration-style:solid;text-decoration-color:#000000;letter-spacing:normal;word-spacing:normal;text-transform:none;writing-mode:lr-tb;direction:ltr;text-orientation:mixed;dominant-baseline:auto;baseline-shift:baseline;text-anchor:start;white-space:normal;shape-padding:0;clip-rule:nonzero;display:inline;overflow:visible;visibility:visible;opacity:1;isolation:auto;mix-blend-mode:normal;color-interpolation:sRGB;color-interpolation-filters:linearRGB;solid-color:#000000;solid-opacity:1;vector-effect:none;fill:#013272;fill-opacity:1;fill-rule:nonzero;stroke:none;stroke-width:0.5;stroke-linecap:round;stroke-linejoin:round;stroke-miterlimit:4;stroke-dasharray:none;stroke-dashoffset:0;stroke-opacity:1;color-rendering:auto;image-rendering:auto;shape-rendering:auto;text-rendering:auto;enable-background:accumulate"
     d="M 20.25,1.25 V 3.9824219 L 20.705078,1.25 Z m -11.0625,0 -5.8554688,20.5 H 3.8125 L 6.8300781,11.185547 A 0.250025,0.250025 0 0 1 6.953125,10.753906 L 9.6679688,1.25 Z M 8.9921875,0.74609375 A 0.250025,0.250025 0 0 1 9.0410156,0.75 h 0.9179688 a 0.250025,0.250025 0 0 1 0.082032,0 h 9.917968 a 0.250025,0.250025 0 0 1 0.08789,0 H 21 a 0.250025,0.250025 0 0 1 0.246094,0.2910156 l -1,6 A 0.250025,0.250025 0 0 1 19.75,7 V 1.25 h -9.5625 l -2.7128906,9.5 h 5.3300786 l 0.953124,-3.8105469 a 0.250025,0.250025 0 1 1 0.484376,0.1210938 l -0.990235,3.9609371 a 0.250025,0.250025 0 0 1 -0.01758,0.07227 l -0.002,0.0039 -0.990234,3.962891 A 0.250025,0.250025 0 1 1 11.757812,14.939453 L 12.679688,11.25 H 7.3320312 l -3,10.5 H 7 a 0.250025,0.250025 0 1 1 0,0.5 H 4.0410156 a 0.250025,0.250025 0 0 1 -0.082031,0 H 3.0410156 a 0.250025,0.250025 0 0 1 -0.082031,0 H 0 a 0.250025,0.250025 0 1 1 0,-0.5 H 2.8125 L 8.6679688,1.25 H 6 a 0.250025,0.250025 0 1 1 0,-0.5 h 2.9589844 a 0.250025,0.250025 0 0 1 0.033203,-0.003906 z"
     id="path2" />
</svg>
