<?xml version="1.0" encoding="UTF-8" standalone="no"?>
<svg
   xmlns:dc="http://purl.org/dc/elements/1.1/"
   xmlns:cc="http://creativecommons.org/ns#"
   xmlns:rdf="http://www.w3.org/1999/02/22-rdf-syntax-ns#"
   xmlns:svg="http://www.w3.org/2000/svg"
   xmlns="http://www.w3.org/2000/svg"
   xmlns:sodipodi="http://sodipodi.sourceforge.net/DTD/sodipodi-0.dtd"
   xmlns:inkscape="http://www.inkscape.org/namespaces/inkscape"
   data-dec="168"
   width="15"
   height="40"
   version="1.1"
   id="svg4"
   sodipodi:docname="168.svg"
   inkscape:version="0.92.4 5da689c313, 2019-01-14">
  <metadata
     id="metadata10">
    <rdf:RDF>
      <cc:Work
         rdf:about="">
        <dc:format>image/svg+xml</dc:format>
        <dc:type
           rdf:resource="http://purl.org/dc/dcmitype/StillImage" />
        <dc:title></dc:title>
      </cc:Work>
    </rdf:RDF>
  </metadata>
  <defs
     id="defs8" />
  <sodipodi:namedview
     pagecolor="#ffffff"
     bordercolor="#666666"
     borderopacity="1"
     objecttolerance="10"
     gridtolerance="10"
     guidetolerance="10"
     inkscape:pageopacity="0"
     inkscape:pageshadow="2"
     inkscape:window-width="1920"
     inkscape:window-height="1043"
     id="namedview6"
     showgrid="false"
     inkscape:zoom="5.9"
     inkscape:cx="7.5"
     inkscape:cy="20"
     inkscape:window-x="0"
     inkscape:window-y="37"
     inkscape:window-maximized="0"
     inkscape:current-layer="svg4" />
  <path
     style="color:#000000;font-style:normal;font-variant:normal;font-weight:normal;font-stretch:normal;font-size:medium;line-height:normal;font-family:sans-serif;font-variant-ligatures:normal;font-variant-position:normal;font-variant-caps:normal;font-variant-numeric:normal;font-variant-alternates:normal;font-feature-settings:normal;text-indent:0;text-align:start;text-decoration:none;text-decoration-line:none;text-decoration-style:solid;text-decoration-color:#000000;letter-spacing:normal;word-spacing:normal;text-transform:none;writing-mode:lr-tb;direction:ltr;text-orientation:mixed;dominant-baseline:auto;baseline-shift:baseline;text-anchor:start;white-space:normal;shape-padding:0;clip-rule:nonzero;display:inline;overflow:visible;visibility:visible;opacity:1;isolation:auto;mix-blend-mode:normal;color-interpolation:sRGB;color-interpolation-filters:linearRGB;solid-color:#000000;solid-opacity:1;vector-effect:none;fill:#000000;fill-opacity:1;fill-rule:nonzero;stroke:none;stroke-width:0.5;stroke-linecap:round;stroke-linejoin:round;stroke-miterlimit:4;stroke-dasharray:none;stroke-dashoffset:0;stroke-opacity:1;color-rendering:auto;image-rendering:auto;shape-rendering:auto;text-rendering:auto;enable-background:accumulate"
     d="m 10.25,3.25 v 0.5 h 0.5 v -0.5 z m -6,0 v 0.5 h 0.5 V 3.25 Z M 9.9960938,2.7460938 A 0.250025,0.250025 0 0 1 10.046875,2.75 H 11 A 0.250025,0.250025 0 0 1 11.25,3 V 4 A 0.250025,0.250025 0 0 1 11,4.25 H 10 A 0.250025,0.250025 0 0 1 9.75,4 V 3.0410156 a 0.250025,0.250025 0 0 1 0.052734,-0.1972656 0.250025,0.250025 0 0 1 0,-0.00195 0.250025,0.250025 0 0 1 0.00781,-0.00781 0.250025,0.250025 0 0 1 0.027344,-0.027344 0.250025,0.250025 0 0 1 0.017578,-0.013672 0.250025,0.250025 0 0 1 0.00195,-0.00195 0.250025,0.250025 0 0 1 0.00781,-0.00391 0.250025,0.250025 0 0 1 0.013672,-0.00781 0.250025,0.250025 0 0 1 0.1171876,-0.033203 z m -6,0 A 0.250025,0.250025 0 0 1 4.046875,2.75 H 5 A 0.250025,0.250025 0 0 1 5.25,3 V 4 A 0.250025,0.250025 0 0 1 5,4.25 H 4 A 0.250025,0.250025 0 0 1 3.75,4 V 3.0410156 a 0.250025,0.250025 0 0 1 0.052734,-0.1972656 0.250025,0.250025 0 0 1 0,-0.00195 0.250025,0.250025 0 0 1 0.00781,-0.00781 0.250025,0.250025 0 0 1 0.027344,-0.027344 0.250025,0.250025 0 0 1 0.017578,-0.013672 0.250025,0.250025 0 0 1 0.00195,-0.00195 0.250025,0.250025 0 0 1 0.00781,-0.00391 0.250025,0.250025 0 0 1 0.013672,-0.00781 0.250025,0.250025 0 0 1 0.1171876,-0.033203 z M 10.105469,2.25 9.25,3.1035156 V 3.8964844 L 10.103516,4.75 h 0.792968 L 11.75,3.8964844 V 3.1035156 L 10.896484,2.25 Z M 4.1054688,2.25 3.25,3.1035156 V 3.8964844 L 4.1035156,4.75 H 4.8964844 L 5.75,3.8964844 V 3.1035156 L 4.8964844,2.25 Z M 9.9941406,1.7480469 A 0.250025,0.250025 0 0 1 10.03125,1.75 H 11 a 0.250025,0.250025 0 0 1 0.177734,0.072266 l 1,1 A 0.250025,0.250025 0 0 1 12.25,3 v 1 a 0.250025,0.250025 0 0 1 -0.07227,0.1777344 l -1,1 A 0.250025,0.250025 0 0 1 11,5.25 H 10 A 0.250025,0.250025 0 0 1 9.8222656,5.1777344 l -1,-1 A 0.250025,0.250025 0 0 1 8.75,4 V 3 A 0.250025,0.250025 0 0 1 8.8222656,2.8222656 L 9.8027344,1.8417969 a 0.250025,0.250025 0 0 1 0.033203,-0.03125 0.250025,0.250025 0 0 1 0.041016,-0.029297 0.250025,0.250025 0 0 1 0.00195,-0.00195 0.250025,0.250025 0 0 1 0.019531,-0.00977 0.250025,0.250025 0 0 1 0.00391,-0.00195 0.250025,0.250025 0 0 1 0.019531,-0.00586 0.250025,0.250025 0 0 1 0.00391,-0.00195 0.250025,0.250025 0 0 1 0.00586,-0.00195 0.250025,0.250025 0 0 1 0.019531,-0.00391 0.250025,0.250025 0 0 1 0.019531,-0.00391 0.250025,0.250025 0 0 1 0.00391,0 0.250025,0.250025 0 0 1 0.019531,-0.00195 z m -6,0 A 0.250025,0.250025 0 0 1 4.03125,1.75 H 5 a 0.250025,0.250025 0 0 1 0.1777344,0.072266 l 1,1 A 0.250025,0.250025 0 0 1 6.25,3 v 1 a 0.250025,0.250025 0 0 1 -0.072266,0.1777344 l -1,1 A 0.250025,0.250025 0 0 1 5,5.25 H 4 A 0.250025,0.250025 0 0 1 3.8222656,5.1777344 l -1,-1 A 0.250025,0.250025 0 0 1 2.75,4 V 3 A 0.250025,0.250025 0 0 1 2.8222656,2.8222656 L 3.8027344,1.8417969 a 0.250025,0.250025 0 0 1 0.019531,-0.019531 0.250025,0.250025 0 0 1 0.013672,-0.011719 0.250025,0.250025 0 0 1 0.041016,-0.029297 0.250025,0.250025 0 0 1 0.00195,-0.00195 0.250025,0.250025 0 0 1 0.019531,-0.00977 0.250025,0.250025 0 0 1 0.00391,-0.00195 0.250025,0.250025 0 0 1 0.019531,-0.00586 0.250025,0.250025 0 0 1 0.00391,-0.00195 0.250025,0.250025 0 0 1 0.00586,-0.00195 0.250025,0.250025 0 0 1 0.019531,-0.00391 0.250025,0.250025 0 0 1 0.023437,-0.00391 0.250025,0.250025 0 0 1 0.019531,-0.00195 z"
     id="path2" />
</svg>
