<?xml version="1.0" encoding="UTF-8" standalone="no"?>
<svg
   xmlns:dc="http://purl.org/dc/elements/1.1/"
   xmlns:cc="http://creativecommons.org/ns#"
   xmlns:rdf="http://www.w3.org/1999/02/22-rdf-syntax-ns#"
   xmlns:svg="http://www.w3.org/2000/svg"
   xmlns="http://www.w3.org/2000/svg"
   xmlns:sodipodi="http://sodipodi.sourceforge.net/DTD/sodipodi-0.dtd"
   xmlns:inkscape="http://www.inkscape.org/namespaces/inkscape"
   data-dec="110"
   width="22"
   height="40"
   version="1.1"
   id="svg4"
   sodipodi:docname="110.svg"
   inkscape:version="0.92.4 (unknown)">
  <metadata
     id="metadata10">
    <rdf:RDF>
      <cc:Work
         rdf:about="">
        <dc:format>image/svg+xml</dc:format>
        <dc:type
           rdf:resource="http://purl.org/dc/dcmitype/StillImage" />
      </cc:Work>
    </rdf:RDF>
  </metadata>
  <defs
     id="defs8" />
  <sodipodi:namedview
     pagecolor="#ffffff"
     bordercolor="#666666"
     borderopacity="1"
     objecttolerance="10"
     gridtolerance="10"
     guidetolerance="10"
     inkscape:pageopacity="0"
     inkscape:pageshadow="2"
     inkscape:window-width="640"
     inkscape:window-height="480"
     id="namedview6"
     showgrid="false"
     inkscape:zoom="5.9"
     inkscape:cx="11"
     inkscape:cy="20"
     inkscape:window-x="0"
     inkscape:window-y="27"
     inkscape:window-maximized="0"
     inkscape:current-layer="svg4" />
  <path
     style="color:#000000;font-style:normal;font-variant:normal;font-weight:normal;font-stretch:normal;font-size:medium;line-height:normal;font-family:sans-serif;font-variant-ligatures:normal;font-variant-position:normal;font-variant-caps:normal;font-variant-numeric:normal;font-variant-alternates:normal;font-feature-settings:normal;text-indent:0;text-align:start;text-decoration:none;text-decoration-line:none;text-decoration-style:solid;text-decoration-color:#000000;letter-spacing:normal;word-spacing:normal;text-transform:none;writing-mode:lr-tb;direction:ltr;text-orientation:mixed;dominant-baseline:auto;baseline-shift:baseline;text-anchor:start;white-space:normal;shape-padding:0;clip-rule:nonzero;display:inline;overflow:visible;visibility:visible;opacity:1;isolation:auto;mix-blend-mode:normal;color-interpolation:sRGB;color-interpolation-filters:linearRGB;solid-color:#000000;solid-opacity:1;vector-effect:none;fill:#013272;fill-opacity:1;fill-rule:nonzero;stroke:none;stroke-width:0.5;stroke-linecap:round;stroke-linejoin:round;stroke-miterlimit:4;stroke-dasharray:none;stroke-dashoffset:0;stroke-opacity:1;color-rendering:auto;image-rendering:auto;shape-rendering:auto;text-rendering:auto;enable-background:accumulate"
     d="m 16.269531,8.9140625 0.908203,0.9082031 A 0.250025,0.250025 0 0 1 17.25,10 v 2 a 0.250025,0.250025 0 0 1 -0.01367,0.07813 L 15.25,18.041016 v 2.855468 L 16.103516,21.75 h 0.291015 L 15.822266,21.177734 A 0.250025,0.250025 0 0 1 15.75,21 v -3 a 0.250025,0.250025 0 0 1 0.01367,-0.07813 L 17.75,11.958984 V 10.103516 L 16.851562,9.2050781 Z M 5.9726562,7.7480469 A 0.250025,0.250025 0 0 1 6.0351562,7.75 H 7 a 0.250025,0.250025 0 0 1 0.1777344,0.072266 l 1,1 A 0.250025,0.250025 0 0 1 8.25,9 v 2 a 0.250025,0.250025 0 0 1 -0.00781,0.06055 l -0.4492187,1.796875 0.984375,-1.96875 a 0.250025,0.250025 0 0 1 0.044922,-0.06641 L 10.822266,8.8222656 a 0.250025,0.250025 0 0 1 0.06641,-0.044922 l 2,-1 A 0.250025,0.250025 0 0 1 13,7.75 h 1.960938 a 0.250025,0.250025 0 0 1 0.128906,0.015625 0.250025,0.250025 0 0 1 0.0059,0.00195 0.250025,0.250025 0 0 1 0.04297,0.023437 l 1.972656,0.9863282 a 0.250025,0.250025 0 0 1 0.06641,0.044922 l 1,1 A 0.250025,0.250025 0 0 1 18.25,10 v 2 a 0.250025,0.250025 0 0 1 -0.01367,0.07813 L 16.25,18.041016 v 2.855468 L 17.105469,21.75 h 1.791015 l 1.898438,-1.898438 0.982422,-1.96289 a 0.250025,0.250025 0 1 1 0.445312,0.222656 l -1,2 a 0.250025,0.250025 0 0 1 -0.04492,0.06641 l -2,2 A 0.250025,0.250025 0 0 1 19,22.25 h -1.960938 a 0.250025,0.250025 0 0 1 -0.07422,0 H 16 a 0.250025,0.250025 0 0 1 -0.177734,-0.07227 l -1,-1 A 0.250025,0.250025 0 0 1 14.75,21 v -3 a 0.250025,0.250025 0 0 1 0.01367,-0.07813 L 16.75,11.958984 V 10.103516 L 14.894531,8.25 H 13.058594 L 11.148438,9.2050781 9.2050781,11.148438 7.234375,15.085938 5.2402344,22.068359 A 0.250025,0.250025 0 1 1 4.7597656,21.931641 l 1.9921875,-6.972657 a 0.250025,0.250025 0 0 1 0.00586,-0.02344 L 7.75,10.96875 V 9.1035156 L 6.8964844,8.25 H 6.6054688 L 7.1777344,8.8222656 A 0.250025,0.250025 0 0 1 7.25,9 v 2 a 0.250025,0.250025 0 0 1 -0.00781,0.06055 l -1,4 a 0.250025,0.250025 0 0 1 -0.00195,0.0078 l -2,7 A 0.250025,0.250025 0 1 1 3.7597656,21.931641 L 5.7578125,14.935547 6.75,10.96875 V 9.1035156 L 5.8945312,8.25 H 4.1035156 l -1.8984375,1.898438 -0.9824219,1.96289 A 0.250025,0.250025 0 1 1 0.77734375,11.888672 L 1.7773438,9.8886719 a 0.250025,0.250025 0 0 1 0.044922,-0.066406 l 2,-2 A 0.250025,0.250025 0 0 1 4,7.75 h 1.9609375 a 0.250025,0.250025 0 0 1 0.011719,-0.00195 z"
     id="path2" />
</svg>
