<?xml version="1.0" encoding="UTF-8" standalone="no"?>
<svg
   xmlns:dc="http://purl.org/dc/elements/1.1/"
   xmlns:cc="http://creativecommons.org/ns#"
   xmlns:rdf="http://www.w3.org/1999/02/22-rdf-syntax-ns#"
   xmlns:svg="http://www.w3.org/2000/svg"
   xmlns="http://www.w3.org/2000/svg"
   xmlns:sodipodi="http://sodipodi.sourceforge.net/DTD/sodipodi-0.dtd"
   xmlns:inkscape="http://www.inkscape.org/namespaces/inkscape"
   data-dec="109"
   width="34"
   height="40"
   version="1.1"
   id="svg4"
   sodipodi:docname="109.svg"
   inkscape:version="0.92.4 (unknown)">
  <metadata
     id="metadata10">
    <rdf:RDF>
      <cc:Work
         rdf:about="">
        <dc:format>image/svg+xml</dc:format>
        <dc:type
           rdf:resource="http://purl.org/dc/dcmitype/StillImage" />
      </cc:Work>
    </rdf:RDF>
  </metadata>
  <defs
     id="defs8" />
  <sodipodi:namedview
     pagecolor="#ffffff"
     bordercolor="#666666"
     borderopacity="1"
     objecttolerance="10"
     gridtolerance="10"
     guidetolerance="10"
     inkscape:pageopacity="0"
     inkscape:pageshadow="2"
     inkscape:window-width="615"
     inkscape:window-height="417"
     id="namedview6"
     showgrid="false"
     inkscape:zoom="5.9"
     inkscape:cx="17"
     inkscape:cy="20"
     inkscape:window-x="0"
     inkscape:window-y="27"
     inkscape:window-maximized="0"
     inkscape:current-layer="svg4" />
  <path
     style="color:#000000;font-style:normal;font-variant:normal;font-weight:normal;font-stretch:normal;font-size:medium;line-height:normal;font-family:sans-serif;font-variant-ligatures:normal;font-variant-position:normal;font-variant-caps:normal;font-variant-numeric:normal;font-variant-alternates:normal;font-feature-settings:normal;text-indent:0;text-align:start;text-decoration:none;text-decoration-line:none;text-decoration-style:solid;text-decoration-color:#000000;letter-spacing:normal;word-spacing:normal;text-transform:none;writing-mode:lr-tb;direction:ltr;text-orientation:mixed;dominant-baseline:auto;baseline-shift:baseline;text-anchor:start;white-space:normal;shape-padding:0;clip-rule:nonzero;display:inline;overflow:visible;visibility:visible;opacity:1;isolation:auto;mix-blend-mode:normal;color-interpolation:sRGB;color-interpolation-filters:linearRGB;solid-color:#000000;solid-opacity:1;vector-effect:none;fill:#013272;fill-opacity:1;fill-rule:nonzero;stroke:none;stroke-width:1;stroke-linecap:round;stroke-linejoin:round;stroke-miterlimit:4;stroke-dasharray:none;stroke-dashoffset:0;stroke-opacity:1;color-rendering:auto;image-rendering:auto;shape-rendering:auto;text-rendering:auto;enable-background:accumulate"
     d="M 28.498047,21.060547 A 0.50005,0.50005 0 0 1 28.082031,21.5 H 28.5 v -0.427734 a 0.50005,0.50005 0 0 1 -0.002,-0.01172 z m -11,0 A 0.50005,0.50005 0 0 1 17.082031,21.5 H 17.5 v -0.427734 a 0.50005,0.50005 0 0 1 -0.002,-0.01172 z m -11.0000001,0 A 0.50005,0.50005 0 0 1 6.0820312,21.5 H 6.5 v -0.427734 a 0.50005,0.50005 0 0 1 -0.00195,-0.01172 z m 21.0039061,-0.0039 A 0.50005,0.50005 0 0 1 27.5,21.070312 V 21.5 h 0.414062 a 0.50005,0.50005 0 0 1 -0.412109,-0.443359 z m -11,0 A 0.50005,0.50005 0 0 1 16.5,21.070312 V 21.5 h 0.414062 a 0.50005,0.50005 0 0 1 -0.412109,-0.443359 z m -10.9999999,0 A 0.50005,0.50005 0 0 1 5.5,21.070312 V 21.5 H 5.9140625 A 0.50005,0.50005 0 0 1 5.5019531,21.056641 Z M 26.65625,9.3867188 26.720703,9.578125 a 0.50005,0.50005 0 0 1 0.09961,-0.050781 L 26.703125,9.4101562 Z m -11,0 0.06445,0.1914062 a 0.50005,0.50005 0 0 1 0.09961,-0.050781 L 15.703125,9.4101562 Z M 6.0800781,8.5 A 0.50005,0.50005 0 0 1 6.5,9 V 8.5 Z M 5.5,8.5 v 0.4277344 a 0.50005,0.50005 0 0 1 0.00195,0.011719 A 0.50005,0.50005 0 0 1 5.9179688,8.5 Z M 4.9921875,7.4921875 A 0.50005,0.50005 0 0 1 5.0800781,7.5 H 7 A 0.50005,0.50005 0 0 1 7.5,8 v 1.8828125 l 0.052734,-0.1054687 a 0.50005,0.50005 0 0 1 0.09375,-0.1308594 l 1,-1 a 0.50005,0.50005 0 0 1 0.1308594,-0.09375 l 2.0000002,-1 A 0.50005,0.50005 0 0 1 11,7.5 h 2.933594 a 0.50005,0.50005 0 0 1 0.322265,0.070312 l 1.966797,0.9824219 a 0.50005,0.50005 0 0 1 0.13086,0.09375 l 1,1 a 0.50005,0.50005 0 0 1 0.121093,0.1953125 l 0.417969,1.2558591 0.660156,-1.3203122 a 0.50005,0.50005 0 0 1 0.09375,-0.1308594 l 1,-1 a 0.50005,0.50005 0 0 1 0.13086,-0.09375 l 2,-1 A 0.50005,0.50005 0 0 1 22,7.5 h 2.933594 a 0.50005,0.50005 0 0 1 0.322265,0.070312 l 1.966797,0.9824219 a 0.50005,0.50005 0 0 1 0.13086,0.09375 l 1,1 a 0.50005,0.50005 0 0 1 0.121093,0.1953125 l 1,3.0000001 A 0.50005,0.50005 0 0 1 29.5,13 v 6.882812 L 30.039062,20.960938 31.117188,21.5 H 32 a 0.50005,0.50005 0 1 1 0,1 h -0.933594 a 0.50005,0.50005 0 0 1 -0.115234,0 h -0.875 a 0.50005,0.50005 0 0 1 -0.146484,0 h -0.847657 a 0.50005,0.50005 0 0 1 -0.162109,0 h -1.837891 a 0.50005,0.50005 0 0 1 -0.162109,0 h -0.847656 a 0.50005,0.50005 0 0 1 -0.150391,0 h -0.875 a 0.50005,0.50005 0 0 1 -0.111328,0 H 24 a 0.50005,0.50005 0 1 1 0,-1 h 0.882812 L 25.960938,20.960938 26.5,19.882812 V 12.082031 L 25.5625,9.2695312 24.792969,8.5 h -2.675781 l -1.820313,0.9101562 -0.886719,0.8867188 -0.96289,1.925781 a 0.50005,0.50005 0 0 1 -0.125,0.16211 l 0.152343,0.457031 A 0.50005,0.50005 0 0 1 18.5,13 v 6.882812 L 19.039062,20.960938 20.117188,21.5 H 21 a 0.50005,0.50005 0 1 1 0,1 h -0.933594 a 0.50005,0.50005 0 0 1 -0.115234,0 h -0.875 a 0.50005,0.50005 0 0 1 -0.146484,0 h -0.847657 a 0.50005,0.50005 0 0 1 -0.162109,0 h -1.837891 a 0.50005,0.50005 0 0 1 -0.162109,0 h -0.847656 a 0.50005,0.50005 0 0 1 -0.150391,0 h -0.875 a 0.50005,0.50005 0 0 1 -0.111328,0 H 13 a 0.50005,0.50005 0 1 1 0,-1 h 0.882812 L 14.960938,20.960938 15.5,19.882812 V 12.082031 L 14.5625,9.2695312 13.792969,8.5 H 11.117188 L 9.296875,9.4101562 8.4101562,10.296875 7.5,12.117188 v 7.765624 L 8.0390625,20.960938 9.1171875,21.5 H 10 a 0.50005,0.50005 0 1 1 0,1 H 9.0664062 a 0.50005,0.50005 0 0 1 -0.1152343,0 h -0.875 a 0.50005,0.50005 0 0 1 -0.1464844,0 H 7.0820312 a 0.50005,0.50005 0 0 1 -0.1621093,0 H 5.0820312 a 0.50005,0.50005 0 0 1 -0.1621093,0 H 4.0722656 a 0.50005,0.50005 0 0 1 -0.1503906,0 h -0.875 a 0.50005,0.50005 0 0 1 -0.1113281,0 H 2 a 0.50005,0.50005 0 1 1 0,-1 H 2.8828125 L 3.9609375,20.960938 4.5,19.882812 V 10.117188 L 3.9609375,9.0390625 2.8828125,8.5 H 2 a 0.50005,0.50005 0 1 1 0,-1 h 0.9335938 a 0.50005,0.50005 0 0 1 0.1152343,0 h 0.875 a 0.50005,0.50005 0 0 1 0.1464844,0 h 0.8476563 a 0.50005,0.50005 0 0 1 0.074219,-0.00781 z"
     id="path2" />
</svg>
