<?xml version="1.0" encoding="UTF-8" standalone="no"?>
<svg
   xmlns:dc="http://purl.org/dc/elements/1.1/"
   xmlns:cc="http://creativecommons.org/ns#"
   xmlns:rdf="http://www.w3.org/1999/02/22-rdf-syntax-ns#"
   xmlns:svg="http://www.w3.org/2000/svg"
   xmlns="http://www.w3.org/2000/svg"
   xmlns:sodipodi="http://sodipodi.sourceforge.net/DTD/sodipodi-0.dtd"
   xmlns:inkscape="http://www.inkscape.org/namespaces/inkscape"
   data-dec="90"
   width="20"
   height="40"
   version="1.1"
   id="svg4"
   sodipodi:docname="90.svg"
   inkscape:version="0.92.4 (unknown)">
  <metadata
     id="metadata10">
    <rdf:RDF>
      <cc:Work
         rdf:about="">
        <dc:format>image/svg+xml</dc:format>
        <dc:type
           rdf:resource="http://purl.org/dc/dcmitype/StillImage" />
      </cc:Work>
    </rdf:RDF>
  </metadata>
  <defs
     id="defs8" />
  <sodipodi:namedview
     pagecolor="#ffffff"
     bordercolor="#666666"
     borderopacity="1"
     objecttolerance="10"
     gridtolerance="10"
     guidetolerance="10"
     inkscape:pageopacity="0"
     inkscape:pageshadow="2"
     inkscape:window-width="640"
     inkscape:window-height="480"
     id="namedview6"
     showgrid="false"
     inkscape:zoom="5.9"
     inkscape:cx="10"
     inkscape:cy="20"
     inkscape:window-x="0"
     inkscape:window-y="27"
     inkscape:window-maximized="0"
     inkscape:current-layer="svg4" />
  <path
     style="color:#000000;font-style:normal;font-variant:normal;font-weight:normal;font-stretch:normal;font-size:medium;line-height:normal;font-family:sans-serif;font-variant-ligatures:normal;font-variant-position:normal;font-variant-caps:normal;font-variant-numeric:normal;font-variant-alternates:normal;font-feature-settings:normal;text-indent:0;text-align:start;text-decoration:none;text-decoration-line:none;text-decoration-style:solid;text-decoration-color:#000000;letter-spacing:normal;word-spacing:normal;text-transform:none;writing-mode:lr-tb;direction:ltr;text-orientation:mixed;dominant-baseline:auto;baseline-shift:baseline;text-anchor:start;white-space:normal;shape-padding:0;clip-rule:nonzero;display:inline;overflow:visible;visibility:visible;opacity:1;isolation:auto;mix-blend-mode:normal;color-interpolation:sRGB;color-interpolation-filters:linearRGB;solid-color:#000000;solid-opacity:1;vector-effect:none;fill:#013272;fill-opacity:1;fill-rule:nonzero;stroke:none;stroke-width:0.30000001;stroke-linecap:round;stroke-linejoin:round;stroke-miterlimit:4;stroke-dasharray:none;stroke-dashoffset:0;stroke-opacity:1;color-rendering:auto;image-rendering:auto;shape-rendering:auto;text-rendering:auto;enable-background:accumulate"
     d="m 14.142578,21.724609 -0.628906,0.125 h 0.439453 z m 0.992188,-0.199218 -0.216797,0.04297 -0.421875,0.28125 h 0.423828 z m 0.818359,-0.164063 -0.400391,0.08008 -0.271484,0.408203 h 0.591797 z m 0.896484,-0.179687 -0.580078,0.117187 -0.0918,0.550781 h 0.671875 z m -0.804687,-0.363282 -0.136719,0.08984 -0.121094,0.181641 0.21875,-0.04297 z m 0.804687,-0.537109 -0.460937,0.308594 -0.06641,0.392578 0.527343,-0.105469 z m 0,-0.785156 -0.373047,0.560547 -0.02148,0.125 0.394531,-0.261719 z m 0,-1.677735 -0.251953,1.513672 0.251953,-0.378906 z M 3.4023438,3.6679688 3.1503906,4.046875 V 5.1816406 Z M 3.5449219,2.8183594 3.1503906,3.0800781 V 3.5039062 L 3.5234375,2.9433594 Z M 3.6777344,2.0175781 3.1503906,2.1230469 V 2.71875 L 3.6113281,2.4101562 Z M 4.2128906,1.9101562 3.9941406,1.953125 3.9550781,2.1816406 4.0917969,2.0917969 Z M 16.087891,1.1503906 4.2597656,21.849609 H 4.9121094 L 16.740234,1.1503906 Z m -1,0 L 3.2597656,21.849609 H 3.9121094 L 15.740234,1.1503906 Z m -9.041016,0 -0.1894531,0.125 0.6289062,-0.125 z m -0.9667969,0 -0.2148437,0.3242188 0.2167968,-0.042969 0.421875,-0.28125 z m -0.953125,0 L 4.046875,1.6386719 4.4472656,1.5585938 4.71875,1.1503906 Z m -0.9765625,0 V 1.8183594 L 3.7304688,1.7011719 3.8222656,1.1503906 Z M 3.9921875,0.84765625 a 0.15001501,0.15001501 0 0 1 0.03125,0.001953 h 0.9589844 a 0.15001501,0.15001501 0 0 1 0.044922,0 h 0.9550781 0.029297 1.984375 0.015625 6.9746092 a 0.15001501,0.15001501 0 0 1 0.03125,0 h 0.96875 a 0.15001501,0.15001501 0 0 1 0.03125,0 h 0.96875 a 0.15001501,0.15001501 0 0 1 0.02344,0 0.15001501,0.15001501 0 0 1 0.0078,0 0.15001501,0.15001501 0 0 1 0.0078,0.001953 0.15001501,0.15001501 0 0 1 0.04297,0.0136719 0.15001501,0.15001501 0 0 1 0.01367,0.007813 0.15001501,0.15001501 0 0 1 0.0039,0.001953 0.15001501,0.15001501 0 0 1 0.0078,0.005859 0.15001501,0.15001501 0 0 1 0.0039,0.003906 0.15001501,0.15001501 0 0 1 0.0078,0.005859 0.15001501,0.15001501 0 0 1 0.0039,0.003906 0.15001501,0.15001501 0 0 1 0.0059,0.007813 0.15001501,0.15001501 0 0 1 0.0039,0.003906 0.15001501,0.15001501 0 0 1 0.0059,0.007813 0.15001501,0.15001501 0 0 1 0.0098,0.015625 0.15001501,0.15001501 0 0 1 0.0039,0.009766 0.15001501,0.15001501 0 0 1 0.002,0.005859 0.15001501,0.15001501 0 0 1 0.0039,0.007813 0.15001501,0.15001501 0 0 1 0.002,0.005859 0.15001501,0.15001501 0 0 1 0.002,0.009766 0.15001501,0.15001501 0 0 1 0,0.003906 0.15001501,0.15001501 0 0 1 0.002,0.009766 0.15001501,0.15001501 0 0 1 0,0.005859 0.15001501,0.15001501 0 0 1 -0.01953,0.0859375 0.15001501,0.15001501 0 0 1 -0.01172,0.021484 h -0.002 L 5.2597656,21.849609 h 6.7304684 l 2.804688,-0.560547 0.896484,-0.597656 0.498047,-0.748047 0.660156,-3.953125 a 0.15001501,0.15001501 0 0 1 0.0039,-0.02539 0.15001501,0.15001501 0 0 1 0.002,-0.0059 0.15001501,0.15001501 0 0 1 0.002,-0.0078 0.15001501,0.15001501 0 0 1 0,-0.002 0.15001501,0.15001501 0 0 1 0.0059,-0.01172 0.15001501,0.15001501 0 0 1 0.002,-0.0059 0.15001501,0.15001501 0 0 1 0.0059,-0.0078 0.15001501,0.15001501 0 0 1 0.002,-0.0059 0.15001501,0.15001501 0 0 1 0.0059,-0.0078 0.15001501,0.15001501 0 0 1 0.002,-0.0039 0.15001501,0.15001501 0 0 1 0.0039,-0.0039 0.15001501,0.15001501 0 0 1 0.0039,-0.0059 0.15001501,0.15001501 0 0 1 0.0098,-0.0078 0.15001501,0.15001501 0 0 1 0.0039,-0.0039 0.15001501,0.15001501 0 0 1 0.0078,-0.0059 0.15001501,0.15001501 0 0 1 0.0039,-0.0039 0.15001501,0.15001501 0 0 1 0.0039,-0.002 0.15001501,0.15001501 0 0 1 0.0078,-0.0059 0.15001501,0.15001501 0 0 1 0.0098,-0.0039 0.15001501,0.15001501 0 0 1 0.0039,-0.002 0.15001501,0.15001501 0 0 1 0.0098,-0.0039 0.15001501,0.15001501 0 0 1 0.0039,-0.002 0.15001501,0.15001501 0 0 1 0.0098,-0.002 0.15001501,0.15001501 0 0 1 0.04492,-0.0059 0.15001501,0.15001501 0 0 1 0.0059,0 0.15001501,0.15001501 0 0 1 0.0098,0.002 0.15001501,0.15001501 0 0 1 0.0039,0 0.15001501,0.15001501 0 0 1 0.02344,0.0078 0.15001501,0.15001501 0 0 1 0.002,0 0.15001501,0.15001501 0 0 1 0.03711,0.01953 0.15001501,0.15001501 0 0 1 0.002,0.002 0.15001501,0.15001501 0 0 1 0.04102,0.04883 0.15001501,0.15001501 0 0 1 0.0039,0.0098 0.15001501,0.15001501 0 0 1 0.0078,0.01758 0.15001501,0.15001501 0 0 1 0,0.0059 0.15001501,0.15001501 0 0 1 0.0039,0.01367 0.15001501,0.15001501 0 0 1 0,0.0059 0.15001501,0.15001501 0 0 1 0.002,0.01367 0.15001501,0.15001501 0 0 1 0,0.01562 v 2.974609 a 0.15001501,0.15001501 0 0 1 0,0.0293 v 0.96875 a 0.15001501,0.15001501 0 0 1 0,0.03125 v 0.96875 a 0.15001501,0.15001501 0 0 1 0,0.04492 V 22 A 0.15001501,0.15001501 0 0 1 17,22.150391 h -0.978516 a 0.15001501,0.15001501 0 0 1 -0.04492,0 h -0.958984 a 0.15001501,0.15001501 0 0 1 -0.04492,0 h -0.955078 -0.0293 -1.984375 -0.01563 -6.9746091 a 0.15001501,0.15001501 0 0 1 -0.03125,0 h -0.96875 a 0.15001501,0.15001501 0 0 1 -0.03125,0 h -0.96875 a 0.15001501,0.15001501 0 0 1 -0.023437,0 0.15001501,0.15001501 0 0 1 -0.00781,0 0.15001501,0.15001501 0 0 1 -0.00781,-0.002 0.15001501,0.15001501 0 0 1 -0.042969,-0.01367 0.15001501,0.15001501 0 0 1 -0.00586,-0.002 0.15001501,0.15001501 0 0 1 -0.00781,-0.0059 0.15001501,0.15001501 0 0 1 -0.00391,-0.002 0.15001501,0.15001501 0 0 1 -0.00391,-0.0039 0.15001501,0.15001501 0 0 1 -0.00781,-0.0059 0.15001501,0.15001501 0 0 1 -0.00781,-0.0059 0.15001501,0.15001501 0 0 1 -0.00195,-0.002 0.15001501,0.15001501 0 0 1 -0.00781,-0.0098 0.15001501,0.15001501 0 0 1 -0.00391,-0.0039 0.15001501,0.15001501 0 0 1 -0.00195,-0.0039 0.15001501,0.15001501 0 0 1 -0.00586,-0.0078 0.15001501,0.15001501 0 0 1 -0.00586,-0.0078 0.15001501,0.15001501 0 0 1 -0.00195,-0.002 0.15001501,0.15001501 0 0 1 -0.00195,-0.0078 0.15001501,0.15001501 0 0 1 -0.00391,-0.0098 0.15001501,0.15001501 0 0 1 -0.00391,-0.0078 0.15001501,0.15001501 0 0 1 0,-0.0039 0.15001501,0.15001501 0 0 1 -0.00195,-0.0059 0.15001501,0.15001501 0 0 1 -0.00195,-0.0098 0.15001501,0.15001501 0 0 1 -0.00195,-0.0098 0.15001501,0.15001501 0 0 1 0,-0.0059 0.15001501,0.15001501 0 0 1 0.019531,-0.08594 l 0.00391,-0.0078 a 0.15001501,0.15001501 0 0 1 0.00781,-0.01367 h 0.00195 L 14.740234,1.1503906 H 8.0097656 L 5.2050781,1.7109375 4.3085938,2.3085938 3.8105469,3.0566406 3.1503906,7.0097656 a 0.15001501,0.15001501 0 0 1 -0.00977,0.044922 0.15001501,0.15001501 0 0 1 -0.00391,0.00781 0.15001501,0.15001501 0 0 1 -0.017578,0.03125 0.15001501,0.15001501 0 0 1 -0.00391,0.00391 0.15001501,0.15001501 0 0 1 -0.013672,0.013672 0.15001501,0.15001501 0 0 1 -0.011719,0.00977 0.15001501,0.15001501 0 0 1 -0.00391,0.00391 0.15001501,0.15001501 0 0 1 -0.00391,0.00195 0.15001501,0.15001501 0 0 1 -0.035156,0.017578 0.15001501,0.15001501 0 0 1 -0.00977,0.00195 0.15001501,0.15001501 0 0 1 -0.00586,0.00195 0.15001501,0.15001501 0 0 1 -0.00391,0 0.15001501,0.15001501 0 0 1 -0.035156,0.00391 0.15001501,0.15001501 0 0 1 -0.00586,0 0.15001501,0.15001501 0 0 1 -0.00977,-0.00195 0.15001501,0.15001501 0 0 1 -0.00391,0 0.15001501,0.15001501 0 0 1 -0.023437,-0.00781 0.15001501,0.15001501 0 0 1 -0.00195,0 0.15001501,0.15001501 0 0 1 -0.00391,-0.00195 0.15001501,0.15001501 0 0 1 -0.00977,-0.00391 0.15001501,0.15001501 0 0 1 -0.00391,-0.00195 0.15001501,0.15001501 0 0 1 -0.00781,-0.00391 0.15001501,0.15001501 0 0 1 -0.00391,-0.00391 0.15001501,0.15001501 0 0 1 -0.00977,-0.00586 0.15001501,0.15001501 0 0 1 -0.00391,-0.00195 0.15001501,0.15001501 0 0 1 -0.00391,-0.00391 0.15001501,0.15001501 0 0 1 -0.00586,-0.00781 0.15001501,0.15001501 0 0 1 -0.00781,-0.00586 0.15001501,0.15001501 0 0 1 -0.00195,-0.00391 0.15001501,0.15001501 0 0 1 -0.00781,-0.00781 0.15001501,0.15001501 0 0 1 -0.00195,-0.00391 0.15001501,0.15001501 0 0 1 -0.00586,-0.00977 0.15001501,0.15001501 0 0 1 0,-0.00195 0.15001501,0.15001501 0 0 1 -0.00586,-0.011719 0.15001501,0.15001501 0 0 1 -0.00195,-0.00391 0.15001501,0.15001501 0 0 1 -0.00391,-0.00977 0.15001501,0.15001501 0 0 1 -0.00195,-0.00391 0.15001501,0.15001501 0 0 1 0,-0.00586 0.15001501,0.15001501 0 0 1 -0.00195,-0.00977 0.15001501,0.15001501 0 0 1 -0.00195,-0.00977 0.15001501,0.15001501 0 0 1 -0.00195,-0.013672 0.15001501,0.15001501 0 0 1 0,-0.00586 V 6.9902344 4.015625 a 0.15001501,0.15001501 0 0 1 0,-0.029297 v -0.96875 a 0.15001501,0.15001501 0 0 1 0,-0.03125 v -0.96875 a 0.15001501,0.15001501 0 0 1 0,-0.044922 V 1 A 0.15001501,0.15001501 0 0 1 3,0.84960938 h 0.9785156 a 0.15001501,0.15001501 0 0 1 0.013672,-0.001953 z"
     id="path2" />
</svg>
