<?xml version="1.0" encoding="UTF-8" standalone="no"?>
<svg
   xmlns:dc="http://purl.org/dc/elements/1.1/"
   xmlns:cc="http://creativecommons.org/ns#"
   xmlns:rdf="http://www.w3.org/1999/02/22-rdf-syntax-ns#"
   xmlns:svg="http://www.w3.org/2000/svg"
   xmlns="http://www.w3.org/2000/svg"
   xmlns:sodipodi="http://sodipodi.sourceforge.net/DTD/sodipodi-0.dtd"
   xmlns:inkscape="http://www.inkscape.org/namespaces/inkscape"
   data-dec="113"
   width="20"
   height="40"
   version="1.1"
   id="svg4"
   sodipodi:docname="113.svg"
   inkscape:version="0.92.4 (unknown)">
  <metadata
     id="metadata10">
    <rdf:RDF>
      <cc:Work
         rdf:about="">
        <dc:format>image/svg+xml</dc:format>
        <dc:type
           rdf:resource="http://purl.org/dc/dcmitype/StillImage" />
      </cc:Work>
    </rdf:RDF>
  </metadata>
  <defs
     id="defs8" />
  <sodipodi:namedview
     pagecolor="#ffffff"
     bordercolor="#666666"
     borderopacity="1"
     objecttolerance="10"
     gridtolerance="10"
     guidetolerance="10"
     inkscape:pageopacity="0"
     inkscape:pageshadow="2"
     inkscape:window-width="615"
     inkscape:window-height="417"
     id="namedview6"
     showgrid="false"
     inkscape:zoom="5.9"
     inkscape:cx="10"
     inkscape:cy="20"
     inkscape:window-x="0"
     inkscape:window-y="27"
     inkscape:window-maximized="0"
     inkscape:current-layer="svg4" />
  <path
     style="color:#000000;font-style:normal;font-variant:normal;font-weight:normal;font-stretch:normal;font-size:medium;line-height:normal;font-family:sans-serif;font-variant-ligatures:normal;font-variant-position:normal;font-variant-caps:normal;font-variant-numeric:normal;font-variant-alternates:normal;font-feature-settings:normal;text-indent:0;text-align:start;text-decoration:none;text-decoration-line:none;text-decoration-style:solid;text-decoration-color:#000000;letter-spacing:normal;word-spacing:normal;text-transform:none;writing-mode:lr-tb;direction:ltr;text-orientation:mixed;dominant-baseline:auto;baseline-shift:baseline;text-anchor:start;white-space:normal;shape-padding:0;clip-rule:nonzero;display:inline;overflow:visible;visibility:visible;opacity:1;isolation:auto;mix-blend-mode:normal;color-interpolation:sRGB;color-interpolation-filters:linearRGB;solid-color:#000000;solid-opacity:1;vector-effect:none;fill:#013272;fill-opacity:1;fill-rule:nonzero;stroke:none;stroke-width:0.30000001;stroke-linecap:round;stroke-linejoin:round;stroke-miterlimit:4;stroke-dasharray:none;stroke-dashoffset:0;stroke-opacity:1;color-rendering:auto;image-rendering:auto;shape-rendering:auto;text-rendering:auto;enable-background:accumulate"
     d="m 8.9453125,28.84375 -0.019531,0.0059 h 0.013672 z m 3.3300785,-0.259766 -0.07617,0.265625 h 0.558593 l -0.06445,-0.126953 z M 9.9882812,28.496094 9.578125,28.632812 9.3613281,28.849609 h 0.5253907 z m 1.3730468,-0.216797 -0.162109,0.570312 h 0.6875 l 0.103515,-0.361328 z M 11,28.158203 l -0.666016,0.222656 -0.134765,0.46875 h 0.6875 l 0.189453,-0.666015 z m 1.402344,-0.01758 -0.04492,0.154297 0.146484,0.04883 z m -2.304688,-0.02734 -0.04297,0.04297 0.0332,-0.0098 z M 5.9941406,9.8476562 a 0.15001501,0.15001501 0 0 1 0.140625,0.2187498 l -0.9960937,1.990235 -0.9882813,2.966797 v 2.941406 l 0.984375,1.96875 a 0.15023822,0.15023822 0 0 1 -0.2695312,0.132812 l -1,-2 A 0.15001501,0.15001501 0 0 1 3.8496094,18 v -3 a 0.15001501,0.15001501 0 0 1 0.00781,-0.04687 l 1,-3 a 0.15001501,0.15001501 0 0 1 0.00781,-0.01953 l 1,-2.0000002 A 0.15001501,0.15001501 0 0 1 5.9941406,9.8476562 Z M 8.4453125,8.34375 6.0957031,9.1269531 4.1367188,12.066406 3.1503906,15.023438 v 1.953124 l 0.9804688,2.94336 0.9570312,0.957031 1.1542969,0.576172 -0.3476563,-0.347656 a 0.15001501,0.15001501 0 0 1 -0.037109,-0.05859 l -1,-3 A 0.15001501,0.15001501 0 0 1 4.8496094,18 v -3 a 0.15001501,0.15001501 0 0 1 0.00781,-0.04687 l 1,-3 a 0.15001501,0.15001501 0 0 1 0.00781,-0.01953 l 1,-2.0000002 a 0.15001501,0.15001501 0 0 1 0.029297,-0.039063 z m 8.6679685,-0.1933594 -5.667969,19.8398434 0.626954,0.208985 0.130859,-0.457031 -0.337891,-0.675782 a 0.15023858,0.15023858 0 1 1 0.269532,-0.132812 l 0.191406,0.380859 5.474609,-19.1640624 z m -1,0 -1.964843,6.8750004 a 0.15001501,0.15001501 0 0 1 -0.002,0.0078 0.15001501,0.15001501 0 0 1 -0.002,0.0078 0.15001501,0.15001501 0 0 1 -0.002,0.0059 0.15001501,0.15001501 0 0 1 -0.002,0.0078 l -3.4375,12.03125 0.191406,-0.191407 a 0.15001501,0.15001501 0 1 1 0.210938,0.210938 l -0.570313,0.570312 -0.101562,0.355469 0.498047,-0.166016 a 0.15001501,0.15001501 0 0 1 0.02148,-0.0078 0.15001501,0.15001501 0 0 1 0.0059,-0.002 0.15001501,0.15001501 0 0 1 0.04492,-0.0059 0.15001501,0.15001501 0 0 1 0.0039,0 0.15001501,0.15001501 0 0 1 0.0098,0.002 0.15001501,0.15001501 0 0 1 0.0039,0 0.15001501,0.15001501 0 0 1 0.01172,0.002 0.15001501,0.15001501 0 0 1 0.0039,0 0.15001501,0.15001501 0 0 1 0.0098,0.0039 0.15001501,0.15001501 0 0 1 0.0039,0 l 0.01367,0.0059 0.0957,0.03125 5.640625,-19.7441404 z m -7.0527341,0 -1.9375,1.9375004 -0.984375,1.96875 -0.9882813,2.966797 v 2.953124 l 0.9804688,2.94336 0.9296875,0.929687 h 1.9042969 l 1.9472652,-0.972656 0.964844,-0.964844 0.984375,-1.96875 0.988281,-2.96289 v -0.0039 -2.953124 L 12.876953,9.1054688 10.964844,8.1503906 Z M 8.9960938,7.8476562 a 0.15001501,0.15001501 0 0 1 0.015625,0.00195 H 11 a 0.15001501,0.15001501 0 0 1 0.06641,0.015625 l 2,1 a 0.15001501,0.15001501 0 0 1 0.07617,0.087891 l 1,3 A 0.15001501,0.15001501 0 0 1 14.150391,12 v 1.925781 l 1.697265,-5.9394529 a 0.15001501,0.15001501 0 0 1 0.02344,-0.064453 0.15001501,0.15001501 0 0 1 0.002,-0.00391 0.15001501,0.15001501 0 0 1 0.0059,-0.00977 0.15001501,0.15001501 0 0 1 0.002,-0.00391 0.15001501,0.15001501 0 0 1 0.0078,-0.00586 0.15001501,0.15001501 0 0 1 0.0039,-0.00391 0.15001501,0.15001501 0 0 1 0.0078,-0.00781 0.15001501,0.15001501 0 0 1 0.002,-0.00195 0.15001501,0.15001501 0 0 1 0.0098,-0.00781 0.15001501,0.15001501 0 0 1 0.002,-0.00195 0.15001501,0.15001501 0 0 1 0.0078,-0.00391 0.15001501,0.15001501 0 0 1 0.0059,-0.00391 0.15001501,0.15001501 0 0 1 0.02734,-0.011719 0.15001501,0.15001501 0 0 1 0.02539,-0.00586 0.15001501,0.15001501 0 0 1 0.0039,0 0.15001501,0.15001501 0 0 1 0.04102,0 h 0.955078 a 0.15001501,0.15001501 0 0 1 0.04492,0 H 18 a 0.15001501,0.15001501 0 0 1 0.144531,0.1914062 l -5.621093,19.6718754 0.382812,0.763671 1.117188,0.373047 H 15 a 0.150391,0.150391 0 0 1 0,0.300782 h -0.988281 -0.01563 -0.96875 a 0.15001501,0.15001501 0 0 1 -0.04492,0 h -0.962891 a 0.15001501,0.15001501 0 0 1 -0.04492,0 h -0.955078 a 0.15001501,0.15001501 0 0 1 -0.04492,0 h -0.955078 a 0.15001501,0.15001501 0 0 1 -0.044922,0 H 9.0175781 a 0.15001501,0.15001501 0 0 1 -0.029297,0 H 8.0078125 7.9921875 7 a 0.150391,0.150391 0 1 1 0,-0.300782 h 0.9765625 l 1.4453125,-0.482421 0.84375,-0.84375 2.478516,-8.677735 -0.609375,1.220703 a 0.15001501,0.15001501 0 0 1 -0.0293,0.03906 l -1,1 a 0.15001501,0.15001501 0 0 1 -0.03906,0.0293 l -1.9999998,1 A 0.15001501,0.15001501 0 0 1 9,22.150391 H 7.015625 a 0.15001501,0.15001501 0 0 1 -0.025391,0 0.15001501,0.15001501 0 0 1 -0.00391,0 0.15001501,0.15001501 0 0 1 -0.011719,-0.002 0.15001501,0.15001501 0 0 1 -0.00195,0 0.15001501,0.15001501 0 0 1 -0.011719,-0.0039 0.15001501,0.15001501 0 0 1 -0.00391,0 0.15001501,0.15001501 0 0 1 -0.00977,-0.0039 0.15001501,0.15001501 0 0 1 -0.013672,-0.0059 l -0.00391,-0.002 A 0.15001501,0.15001501 0 0 1 6.9160156,22.125 L 4.9335938,21.134766 a 0.15001501,0.15001501 0 0 1 -0.039063,-0.0293 l -1,-1 a 0.15001501,0.15001501 0 0 1 -0.037109,-0.05859 l -1,-3 A 0.15001501,0.15001501 0 0 1 2.8496094,17 v -2 a 0.15001501,0.15001501 0 0 1 0.00781,-0.04687 l 1,-3 A 0.15001501,0.15001501 0 0 1 3.875,11.916016 l 2,-3.0000004 A 0.15001501,0.15001501 0 0 1 5.953125,8.8574219 L 8.9375,7.8632812 a 0.15001501,0.15001501 0 0 1 0.017578,-0.00586 0.15001501,0.15001501 0 0 1 0.041016,-0.00977 z"
     id="path2" />
</svg>
