<?xml version="1.0" encoding="UTF-8" standalone="no"?>
<svg
   xmlns:dc="http://purl.org/dc/elements/1.1/"
   xmlns:cc="http://creativecommons.org/ns#"
   xmlns:rdf="http://www.w3.org/1999/02/22-rdf-syntax-ns#"
   xmlns:svg="http://www.w3.org/2000/svg"
   xmlns="http://www.w3.org/2000/svg"
   xmlns:sodipodi="http://sodipodi.sourceforge.net/DTD/sodipodi-0.dtd"
   xmlns:inkscape="http://www.inkscape.org/namespaces/inkscape"
   data-dec="8220"
   width="14"
   height="40"
   version="1.1"
   id="svg4"
   sodipodi:docname="8220.svg"
   inkscape:version="0.92.4 (unknown)">
  <metadata
     id="metadata10">
    <rdf:RDF>
      <cc:Work
         rdf:about="">
        <dc:format>image/svg+xml</dc:format>
        <dc:type
           rdf:resource="http://purl.org/dc/dcmitype/StillImage" />
      </cc:Work>
    </rdf:RDF>
  </metadata>
  <defs
     id="defs8" />
  <sodipodi:namedview
     pagecolor="#ffffff"
     bordercolor="#666666"
     borderopacity="1"
     objecttolerance="10"
     gridtolerance="10"
     guidetolerance="10"
     inkscape:pageopacity="0"
     inkscape:pageshadow="2"
     inkscape:window-width="640"
     inkscape:window-height="480"
     id="namedview6"
     showgrid="false"
     inkscape:zoom="5.9"
     inkscape:cx="7"
     inkscape:cy="20"
     inkscape:window-x="0"
     inkscape:window-y="27"
     inkscape:window-maximized="0"
     inkscape:current-layer="svg4" />
  <path
     style="color:#000000;font-style:normal;font-variant:normal;font-weight:normal;font-stretch:normal;font-size:medium;line-height:normal;font-family:sans-serif;font-variant-ligatures:normal;font-variant-position:normal;font-variant-caps:normal;font-variant-numeric:normal;font-variant-alternates:normal;font-feature-settings:normal;text-indent:0;text-align:start;text-decoration:none;text-decoration-line:none;text-decoration-style:solid;text-decoration-color:#000000;letter-spacing:normal;word-spacing:normal;text-transform:none;writing-mode:lr-tb;direction:ltr;text-orientation:mixed;dominant-baseline:auto;baseline-shift:baseline;text-anchor:start;white-space:normal;shape-padding:0;clip-rule:nonzero;display:inline;overflow:visible;visibility:visible;opacity:1;isolation:auto;mix-blend-mode:normal;color-interpolation:sRGB;color-interpolation-filters:linearRGB;solid-color:#000000;solid-opacity:1;vector-effect:none;fill:#013272;fill-opacity:1;fill-rule:nonzero;stroke:none;stroke-width:1;stroke-linecap:round;stroke-linejoin:round;stroke-miterlimit:4;stroke-dasharray:none;stroke-dashoffset:0;stroke-opacity:1;color-rendering:auto;image-rendering:auto;shape-rendering:auto;text-rendering:auto;enable-background:accumulate"
     d="M 11.001953,0.49609375 A 0.50005,0.50005 0 0 1 11.222656,1.4472656 L 9.4277344,2.3457031 8.953125,4.2460938 9.2070312,4.5 H 10 a 0.50005,0.50005 0 0 1 0.353516,0.1464844 l 1,1 A 0.50005,0.50005 0 0 1 11.5,6 v 1 a 0.50005,0.50005 0 0 1 -0.146484,0.3535156 l -1,1 A 0.50005,0.50005 0 0 1 10,8.5 H 9 A 0.50005,0.50005 0 0 1 8.6464844,8.3535156 l -1,-1 A 0.50005,0.50005 0 0 1 7.5,7 V 6.0664062 a 0.50005,0.50005 0 0 1 0,-0.1269531 V 4.0605469 a 0.50005,0.50005 0 0 1 0.089844,-0.359375 L 8.5390625,1.8066406 A 0.50005,0.50005 0 0 1 8.5527344,1.7773438 0.50005,0.50005 0 0 1 8.8417969,1.5195312 L 10.777344,0.55273438 a 0.50005,0.50005 0 0 1 0.224609,-0.0566406 z m -4.9999999,0 A 0.50005,0.50005 0 0 1 6.2226562,1.4472656 L 4.4277344,2.3457031 3.953125,4.2460938 4.2070312,4.5 H 5 a 0.50005,0.50005 0 0 1 0.3535156,0.1464844 l 1,1 A 0.50005,0.50005 0 0 1 6.5,6 V 7 A 0.50005,0.50005 0 0 1 6.3535156,7.3535156 l -1,1 A 0.50005,0.50005 0 0 1 5,8.5 H 4 A 0.50005,0.50005 0 0 1 3.6464844,8.3535156 l -1,-1 A 0.50005,0.50005 0 0 1 2.5,7 V 6.0664062 a 0.50005,0.50005 0 0 1 0,-0.1269531 V 4.0605469 a 0.50005,0.50005 0 0 1 0.089844,-0.359375 L 3.5390625,1.8066406 A 0.50005,0.50005 0 0 1 3.5527344,1.7773438 0.50005,0.50005 0 0 1 3.8417969,1.5195312 L 5.7773438,0.55273438 a 0.50005,0.50005 0 0 1 0.2246093,-0.0566406 z"
     id="path2" />
</svg>
