<?xml version="1.0" encoding="UTF-8" standalone="no"?>
<svg
   xmlns:dc="http://purl.org/dc/elements/1.1/"
   xmlns:cc="http://creativecommons.org/ns#"
   xmlns:rdf="http://www.w3.org/1999/02/22-rdf-syntax-ns#"
   xmlns:svg="http://www.w3.org/2000/svg"
   xmlns="http://www.w3.org/2000/svg"
   xmlns:sodipodi="http://sodipodi.sourceforge.net/DTD/sodipodi-0.dtd"
   xmlns:inkscape="http://www.inkscape.org/namespaces/inkscape"
   data-dec="38"
   width="26"
   height="40"
   version="1.1"
   id="svg4"
   sodipodi:docname="38.svg"
   inkscape:version="0.92.4 (unknown)">
  <metadata
     id="metadata10">
    <rdf:RDF>
      <cc:Work
         rdf:about="">
        <dc:format>image/svg+xml</dc:format>
        <dc:type
           rdf:resource="http://purl.org/dc/dcmitype/StillImage" />
      </cc:Work>
    </rdf:RDF>
  </metadata>
  <defs
     id="defs8" />
  <sodipodi:namedview
     pagecolor="#ffffff"
     bordercolor="#666666"
     borderopacity="1"
     objecttolerance="10"
     gridtolerance="10"
     guidetolerance="10"
     inkscape:pageopacity="0"
     inkscape:pageshadow="2"
     inkscape:window-width="640"
     inkscape:window-height="480"
     id="namedview6"
     showgrid="false"
     inkscape:zoom="5.9"
     inkscape:cx="13"
     inkscape:cy="20"
     inkscape:window-x="0"
     inkscape:window-y="27"
     inkscape:window-maximized="0"
     inkscape:current-layer="svg4" />
  <path
     style="color:#000000;font-style:normal;font-variant:normal;font-weight:normal;font-stretch:normal;font-size:medium;line-height:normal;font-family:sans-serif;font-variant-ligatures:normal;font-variant-position:normal;font-variant-caps:normal;font-variant-numeric:normal;font-variant-alternates:normal;font-feature-settings:normal;text-indent:0;text-align:start;text-decoration:none;text-decoration-line:none;text-decoration-style:solid;text-decoration-color:#000000;letter-spacing:normal;word-spacing:normal;text-transform:none;writing-mode:lr-tb;direction:ltr;text-orientation:mixed;dominant-baseline:auto;baseline-shift:baseline;text-anchor:start;white-space:normal;shape-padding:0;clip-rule:nonzero;display:inline;overflow:visible;visibility:visible;opacity:1;isolation:auto;mix-blend-mode:normal;color-interpolation:sRGB;color-interpolation-filters:linearRGB;solid-color:#000000;solid-opacity:1;vector-effect:none;fill:#013272;fill-opacity:1;fill-rule:nonzero;stroke:none;stroke-width:1;stroke-linecap:round;stroke-linejoin:round;stroke-miterlimit:4;stroke-dasharray:none;stroke-dashoffset:0;stroke-opacity:1;color-rendering:auto;image-rendering:auto;shape-rendering:auto;text-rendering:auto;enable-background:accumulate"
     d="m 17.427734,21.271484 a 0.50005,0.50005 0 0 1 -0.324218,0.220704 L 17.117188,21.5 H 18 a 0.50005,0.50005 0 0 1 -0.222656,-0.05273 z m -7.074218,-9.099609 -2.0957035,1.257813 a 0.50005,0.50005 0 0 1 -0.035156,0.01758 L 6.296875,14.410156 5.4101562,15.296875 4.5,17.117188 v 1.765624 L 5.4101562,20.703125 5.9238281,21.216797 7.0585938,21.5 h 1.8242187 l 1.8203125,-0.910156 1.902344,-1.902344 0.121093,-0.195312 -0.142578,-0.214844 a 0.50005,0.50005 0 0 1 -0.03125,-0.05469 l -1,-2 a 0.50005,0.50005 0 0 1 -0.02734,-0.06445 l -1,-3 a 0.50005,0.50005 0 0 1 -0.01953,-0.07617 z M 23.5,10.035156 A 0.50005,0.50005 0 0 1 23.082031,10.5 H 23.5 Z M 22.5,10 v 0.5 h 0.419922 A 0.50005,0.50005 0 0 1 22.5,10 Z M 13,1.5585938 11.373047,2.3730469 10.5,4.1171875 v 2.8007813 l 0.974609,2.9238281 0.103516,0.3105471 1.125,-0.5625002 L 14.589844,7.703125 15.5,5.8828125 V 4.1171875 L 14.626953,2.3730469 Z M 12.982422,0.5 a 0.50005,0.50005 0 0 1 0.240234,0.0527344 l 2,1.00000002 a 0.50005,0.50005 0 0 1 0.22461,0.2246094 l 1,2 A 0.50005,0.50005 0 0 1 16.5,4 v 2 a 0.50005,0.50005 0 0 1 -0.05273,0.2226562 l -1,2 a 0.50005,0.50005 0 0 1 -0.09375,0.1308594 l -1.96875,1.9687504 a 0.50005,0.50005 0 0 1 -0.01172,0.01367 l -0.01953,0.01758 a 0.50005,0.50005 0 0 1 -0.0078,0.0078 0.50005,0.50005 0 0 1 -0.03711,0.0332 0.50005,0.50005 0 0 1 -0.0098,0.0078 0.50005,0.50005 0 0 1 -0.03125,0.01953 0.50005,0.50005 0 0 1 -0.0098,0.0078 l -1.322265,0.792968 0.527344,1.585938 1.697265,3.392578 3.416016,-5.466797 a 0.50005,0.50005 0 0 1 0.07031,-0.08789 l 2,-1.9999996 a 0.50005,0.50005 0 0 1 0.13086,-0.09375 l 2,-1 A 0.50005,0.50005 0 0 1 22,7.5 h 1 a 0.50005,0.50005 0 0 1 0.353516,0.1464844 l 1,1 A 0.50005,0.50005 0 0 1 24.5,9 v 2 A 0.50005,0.50005 0 0 1 24,11.5 H 22 A 0.50005,0.50005 0 0 1 21.5,11 V 9 a 0.50005,0.50005 0 0 1 0.04883,-0.2167969 L 20.296875,9.4101562 18.394531,11.3125 14.724609,17.183594 16.341797,19.611328 18.117188,20.5 h 0.675781 L 19.5,19.792969 V 19 a 0.50005,0.50005 0 1 1 1,0 v 0.933594 a 0.50005,0.50005 0 0 1 -0.07031,0.322265 l -0.982422,1.966797 A 0.50005,0.50005 0 0 1 19,22.5 h -2 a 0.50005,0.50005 0 0 1 -0.222656,-0.05273 l -2,-1 a 0.50005,0.50005 0 0 1 -0.19336,-0.169922 l -1.261718,-1.892578 -1.96875,1.96875 a 0.50005,0.50005 0 0 1 -0.13086,0.09375 l -1.9999998,1 A 0.50005,0.50005 0 0 1 9,22.5 H 7.0429688 a 0.50005,0.50005 0 0 1 -0.066406,0 H 6.0664062 a 0.50005,0.50005 0 0 1 -0.2558593,-0.03516 0.50005,0.50005 0 0 1 -0.00391,-0.002 L 2.8515625,21.478516 a 0.50005,0.50005 0 0 1 -0.00977,-0.0039 0.50005,0.50005 0 0 1 -0.3222657,-0.316406 L 1.5527344,19.222656 A 0.50005,0.50005 0 0 1 1.5,19 v -2 a 0.50005,0.50005 0 0 1 0.052734,-0.222656 l 1,-2 a 0.50005,0.50005 0 0 1 0.09375,-0.13086 l 1,-1 a 0.50005,0.50005 0 0 1 0.1308594,-0.09375 l 2,-1 a 0.50005,0.50005 0 0 1 0.037109,-0.01758 L 10.126953,10.810547 9.5078125,7.0898438 a 0.50005,0.50005 0 0 1 -0.00195,-0.00781 0.50005,0.50005 0 0 1 -0.00391,-0.03125 A 0.50005,0.50005 0 0 1 9.5,6.9511719 V 4 a 0.50005,0.50005 0 0 1 0.052734,-0.2226562 l 0.9999996,-2 a 0.50005,0.50005 0 0 1 0.22461,-0.2246094 l 2,-1.00000002 A 0.50005,0.50005 0 0 1 12.982422,0.5 Z"
     id="path2" />
</svg>
