<?xml version="1.0" encoding="UTF-8" standalone="no"?>
<svg
   xmlns:dc="http://purl.org/dc/elements/1.1/"
   xmlns:cc="http://creativecommons.org/ns#"
   xmlns:rdf="http://www.w3.org/1999/02/22-rdf-syntax-ns#"
   xmlns:svg="http://www.w3.org/2000/svg"
   xmlns="http://www.w3.org/2000/svg"
   xmlns:sodipodi="http://sodipodi.sourceforge.net/DTD/sodipodi-0.dtd"
   xmlns:inkscape="http://www.inkscape.org/namespaces/inkscape"
   data-dec="51"
   width="20"
   height="40"
   version="1.1"
   id="svg4"
   sodipodi:docname="51.svg"
   inkscape:version="0.92.4 5da689c313, 2019-01-14">
  <metadata
     id="metadata10">
    <rdf:RDF>
      <cc:Work
         rdf:about="">
        <dc:format>image/svg+xml</dc:format>
        <dc:type
           rdf:resource="http://purl.org/dc/dcmitype/StillImage" />
        <dc:title></dc:title>
      </cc:Work>
    </rdf:RDF>
  </metadata>
  <defs
     id="defs8" />
  <sodipodi:namedview
     pagecolor="#ffffff"
     bordercolor="#666666"
     borderopacity="1"
     objecttolerance="10"
     gridtolerance="10"
     guidetolerance="10"
     inkscape:pageopacity="0"
     inkscape:pageshadow="2"
     inkscape:window-width="1920"
     inkscape:window-height="1043"
     id="namedview6"
     showgrid="false"
     inkscape:zoom="5.9"
     inkscape:cx="10"
     inkscape:cy="20"
     inkscape:window-x="0"
     inkscape:window-y="37"
     inkscape:window-maximized="0"
     inkscape:current-layer="svg4" />
  <path
     style="color:#000000;font-style:normal;font-variant:normal;font-weight:normal;font-stretch:normal;font-size:medium;line-height:normal;font-family:sans-serif;font-variant-ligatures:normal;font-variant-position:normal;font-variant-caps:normal;font-variant-numeric:normal;font-variant-alternates:normal;font-feature-settings:normal;text-indent:0;text-align:start;text-decoration:none;text-decoration-line:none;text-decoration-style:solid;text-decoration-color:#000000;letter-spacing:normal;word-spacing:normal;text-transform:none;writing-mode:lr-tb;direction:ltr;text-orientation:mixed;dominant-baseline:auto;baseline-shift:baseline;text-anchor:start;white-space:normal;shape-padding:0;clip-rule:nonzero;display:inline;overflow:visible;visibility:visible;opacity:1;isolation:auto;mix-blend-mode:normal;color-interpolation:sRGB;color-interpolation-filters:linearRGB;solid-color:#000000;solid-opacity:1;vector-effect:none;fill:#000000;fill-opacity:1;fill-rule:nonzero;stroke:none;stroke-width:2.5;stroke-linecap:round;stroke-linejoin:round;stroke-miterlimit:4;stroke-dasharray:none;stroke-dashoffset:0;stroke-opacity:1;color-rendering:auto;image-rendering:auto;shape-rendering:auto;text-rendering:auto;enable-background:accumulate"
     d="M 4.9804688,-0.26757812 A 1.250125,1.250125 0 0 1 5.203125,-0.25 h 9.615234 a 1.250125,1.250125 0 0 1 0.375,0 H 16 a 1.250125,1.250125 0 0 1 0.986328,2.0175781 l -4.886719,6.28125 2.294922,0.765625 a 1.250125,1.250125 0 0 1 0.490235,0.3007813 l 2,1.9999996 a 1.250125,1.250125 0 0 1 0.300781,0.490235 l 1,3 A 1.250125,1.250125 0 0 1 18.25,15 v 1 a 1.250125,1.250125 0 0 1 -0.06445,0.394531 l -1,3 a 1.250125,1.250125 0 0 1 -0.300781,0.490235 l -2,2 a 1.250125,1.250125 0 0 1 -0.490235,0.300781 l -3,1 A 1.250125,1.250125 0 0 1 11,23.25 H 8 a 1.250125,1.250125 0 0 1 -0.3945312,-0.06445 l -3,-1 A 1.250125,1.250125 0 0 1 4.1152344,21.884766 l -1,-1 A 1.250125,1.250125 0 0 1 2.8828125,20.558594 l -1,-2 A 1.250125,1.250125 0 0 1 3,16.75 h 0.8007812 a 1.250125,1.250125 0 0 1 0.7675782,0.126953 1.250125,1.250125 0 0 1 0.080078,0.04492 1.250125,1.250125 0 0 1 0.056641,0.03516 1.250125,1.250125 0 0 1 0.015625,0.0098 1.250125,1.250125 0 0 1 0.013672,0.01172 1.250125,1.250125 0 0 1 0.4765625,0.65039 L 5.71875,18.642578 6.5585938,19.201172 8.203125,19.75 h 2.59375 l 1.648437,-0.548828 1.052735,-0.703125 0.703125,-1.052735 L 14.75,15.796875 v -0.59375 L 14.201172,13.554688 13.498047,12.501953 12.445312,11.798828 10.796875,11.25 H 9.1816406 a 1.250125,1.250125 0 0 1 -0.375,0 h -0.625 A 1.250125,1.250125 0 0 1 6.8964844,10.619141 1.250125,1.250125 0 0 1 6.8847656,10.597656 1.250125,1.250125 0 0 1 6.8457031,10.519531 1.250125,1.250125 0 0 1 6.7695312,10.292969 1.250125,1.250125 0 0 1 7.1171875,9.0996094 L 11.666016,3.25 H 5 A 1.250125,1.250125 0 0 1 3.75,2 V 1.1992188 a 1.250125,1.250125 0 0 1 0.3320312,-1.0664063 1.250125,1.250125 0 0 1 0.013672,-0.0136719 1.250125,1.250125 0 0 1 0.00781,-0.007813 1.250125,1.250125 0 0 1 0.8769532,-0.37890624 z"
     id="path2" />
</svg>
