<?xml version="1.0" encoding="UTF-8" standalone="no"?>
<svg
   xmlns:dc="http://purl.org/dc/elements/1.1/"
   xmlns:cc="http://creativecommons.org/ns#"
   xmlns:rdf="http://www.w3.org/1999/02/22-rdf-syntax-ns#"
   xmlns:svg="http://www.w3.org/2000/svg"
   xmlns="http://www.w3.org/2000/svg"
   xmlns:sodipodi="http://sodipodi.sourceforge.net/DTD/sodipodi-0.dtd"
   xmlns:inkscape="http://www.inkscape.org/namespaces/inkscape"
   data-dec="120"
   width="20"
   height="40"
   version="1.1"
   id="svg4"
   sodipodi:docname="120.svg"
   inkscape:version="0.92.4 (unknown)">
  <metadata
     id="metadata10">
    <rdf:RDF>
      <cc:Work
         rdf:about="">
        <dc:format>image/svg+xml</dc:format>
        <dc:type
           rdf:resource="http://purl.org/dc/dcmitype/StillImage" />
      </cc:Work>
    </rdf:RDF>
  </metadata>
  <defs
     id="defs8" />
  <sodipodi:namedview
     pagecolor="#ffffff"
     bordercolor="#666666"
     borderopacity="1"
     objecttolerance="10"
     gridtolerance="10"
     guidetolerance="10"
     inkscape:pageopacity="0"
     inkscape:pageshadow="2"
     inkscape:window-width="640"
     inkscape:window-height="480"
     id="namedview6"
     showgrid="false"
     inkscape:zoom="5.9"
     inkscape:cx="10"
     inkscape:cy="20"
     inkscape:window-x="0"
     inkscape:window-y="27"
     inkscape:window-maximized="0"
     inkscape:current-layer="svg4" />
  <path
     style="color:#000000;font-style:normal;font-variant:normal;font-weight:normal;font-stretch:normal;font-size:medium;line-height:normal;font-family:sans-serif;font-variant-ligatures:normal;font-variant-position:normal;font-variant-caps:normal;font-variant-numeric:normal;font-variant-alternates:normal;font-feature-settings:normal;text-indent:0;text-align:start;text-decoration:none;text-decoration-line:none;text-decoration-style:solid;text-decoration-color:#000000;letter-spacing:normal;word-spacing:normal;text-transform:none;writing-mode:lr-tb;direction:ltr;text-orientation:mixed;dominant-baseline:auto;baseline-shift:baseline;text-anchor:start;white-space:normal;shape-padding:0;clip-rule:nonzero;display:inline;overflow:visible;visibility:visible;opacity:1;isolation:auto;mix-blend-mode:normal;color-interpolation:sRGB;color-interpolation-filters:linearRGB;solid-color:#000000;solid-opacity:1;vector-effect:none;fill:#013272;fill-opacity:1;fill-rule:nonzero;stroke:none;stroke-width:2.5;stroke-linecap:round;stroke-linejoin:round;stroke-miterlimit:4;stroke-dasharray:none;stroke-dashoffset:0;stroke-opacity:1;color-rendering:auto;image-rendering:auto;shape-rendering:auto;text-rendering:auto;enable-background:accumulate"
     d="M 9.0195312,6.734375 A 1.250125,1.250125 0 0 1 9.1796875,6.75 H 10 a 1.250125,1.250125 0 0 1 1.117188,0.6914062 l 0.890624,1.78125 1.107422,-1.1074218 a 1.250125,1.250125 0 0 1 0.326172,-0.2324219 l 2,-1 A 1.250125,1.250125 0 0 1 16,6.75 h 1 a 1.250125,1.250125 0 0 1 0.884766,0.3652344 l 1,1 A 1.250125,1.250125 0 0 1 19.25,9 v 1 a 1.250125,1.250125 0 0 1 -0.365234,0.884766 l -1,1 a 1.250125,1.250125 0 0 1 -1.769532,0 l -1,-1 A 1.250125,1.250125 0 0 1 14.75,10.021484 l -0.0098,0.0059 -1.71289,1.71289 -0.847656,1.695313 -0.929688,3.71875 v 2.550781 L 11.771484,20.75 h 0.933594 l 1.439453,-0.71875 1.814453,-2.724609 a 1.2507842,1.2507842 0 1 1 2.082032,1.386718 l -2,3 a 1.250125,1.250125 0 0 1 -0.482422,0.423829 l -2,1 A 1.250125,1.250125 0 0 1 13,23.25 h -1.800781 a 1.250125,1.250125 0 0 1 -0.378907,0 H 10 A 1.250125,1.250125 0 0 1 8.8828125,22.558594 l -0.890625,-1.78125 -1.1074219,1.107422 a 1.250125,1.250125 0 0 1 -0.3261718,0.232422 l -2,1 A 1.250125,1.250125 0 0 1 4,23.25 H 3 A 1.250125,1.250125 0 0 1 2.1152344,22.884766 l -1,-1 A 1.250125,1.250125 0 0 1 0.75,21 v -1 a 1.250125,1.250125 0 0 1 0.3652344,-0.884766 l 1,-1 a 1.250125,1.250125 0 0 1 1.7695312,0 l 1,1 A 1.250125,1.250125 0 0 1 5.25,19.978516 l 0.00977,-0.0059 1.7128906,-1.71289 L 7.8203125,16.564453 8.75,12.845703 V 10.294922 L 8.2285156,9.25 H 7.2949219 L 5.8554688,9.96875 4.0410156,12.693359 A 1.2507838,1.2507838 0 1 1 1.9589844,11.306641 l 2,-3.0000004 A 1.250125,1.250125 0 0 1 4.4414062,7.8828125 l 2,-1 A 1.250125,1.250125 0 0 1 7,6.75 h 1.8007812 a 1.250125,1.250125 0 0 1 0.21875,-0.015625 z"
     id="path2" />
</svg>
