<?xml version="1.0" encoding="UTF-8" standalone="no"?>
<svg
   xmlns:dc="http://purl.org/dc/elements/1.1/"
   xmlns:cc="http://creativecommons.org/ns#"
   xmlns:rdf="http://www.w3.org/1999/02/22-rdf-syntax-ns#"
   xmlns:svg="http://www.w3.org/2000/svg"
   xmlns="http://www.w3.org/2000/svg"
   xmlns:sodipodi="http://sodipodi.sourceforge.net/DTD/sodipodi-0.dtd"
   xmlns:inkscape="http://www.inkscape.org/namespaces/inkscape"
   data-dec="81"
   width="22"
   height="40"
   version="1.1"
   id="svg4"
   sodipodi:docname="81.svg"
   inkscape:version="0.92.4 (unknown)">
  <metadata
     id="metadata10">
    <rdf:RDF>
      <cc:Work
         rdf:about="">
        <dc:format>image/svg+xml</dc:format>
        <dc:type
           rdf:resource="http://purl.org/dc/dcmitype/StillImage" />
      </cc:Work>
    </rdf:RDF>
  </metadata>
  <defs
     id="defs8" />
  <sodipodi:namedview
     pagecolor="#ffffff"
     bordercolor="#666666"
     borderopacity="1"
     objecttolerance="10"
     gridtolerance="10"
     guidetolerance="10"
     inkscape:pageopacity="0"
     inkscape:pageshadow="2"
     inkscape:window-width="640"
     inkscape:window-height="480"
     id="namedview6"
     showgrid="false"
     inkscape:zoom="5.9"
     inkscape:cx="11"
     inkscape:cy="20"
     inkscape:window-x="0"
     inkscape:window-y="27"
     inkscape:window-maximized="0"
     inkscape:current-layer="svg4" />
  <path
     style="color:#000000;font-style:normal;font-variant:normal;font-weight:normal;font-stretch:normal;font-size:medium;line-height:normal;font-family:sans-serif;font-variant-ligatures:normal;font-variant-position:normal;font-variant-caps:normal;font-variant-numeric:normal;font-variant-alternates:normal;font-feature-settings:normal;text-indent:0;text-align:start;text-decoration:none;text-decoration-line:none;text-decoration-style:solid;text-decoration-color:#000000;letter-spacing:normal;word-spacing:normal;text-transform:none;writing-mode:lr-tb;direction:ltr;text-orientation:mixed;dominant-baseline:auto;baseline-shift:baseline;text-anchor:start;white-space:normal;shape-padding:0;clip-rule:nonzero;display:inline;overflow:visible;visibility:visible;opacity:1;isolation:auto;mix-blend-mode:normal;color-interpolation:sRGB;color-interpolation-filters:linearRGB;solid-color:#000000;solid-opacity:1;vector-effect:none;fill:#013272;fill-opacity:1;fill-rule:nonzero;stroke:none;stroke-width:2.5;stroke-linecap:round;stroke-linejoin:round;stroke-miterlimit:4;stroke-dasharray:none;stroke-dashoffset:0;stroke-opacity:1;color-rendering:auto;image-rendering:auto;shape-rendering:auto;text-rendering:auto;enable-background:accumulate"
     d="M 8.2949219,17.25 6.9316406,17.931641 6.25,19.294922 v 0.1875 L 7.5195312,20.75 h 2.1875 L 10.75,20.228516 V 19.294922 L 10.068359,17.931641 8.7050781,17.25 Z M 12.292969,2.25 10.740234,3.0273438 8.9707031,4.796875 7.1328125,7.5546875 6.2011719,10.349609 5.25,14.154297 v 1.847656 a 1.250125,1.250125 0 0 1 0.1914062,-0.119141 l 2,-1 A 1.250125,1.250125 0 0 1 8,14.75 h 1 a 1.250125,1.250125 0 0 1 0.5585938,0.132812 l 2.0000002,1 a 1.250125,1.250125 0 0 1 0.558594,0.558594 l 0.890624,1.783203 0.02149,-0.02148 1.837891,-2.757813 0.93164,-2.794921 L 16.75,8.8457031 V 6.203125 L 15.908203,3.6757812 14.480469,2.25 Z m 2.693359,-2.51171875 a 1.250125,1.250125 0 0 1 0.658203,0.1875 l 1.914063,0.95703125 a 1.250125,1.250125 0 0 1 0.326172,0.2324219 l 1,1 a 1.250125,1.250125 0 0 1 0.300781,0.4902344 l 1,3 A 1.250125,1.250125 0 0 1 20.25,6 v 3 a 1.250125,1.250125 0 0 1 -0.03711,0.3027344 l -1,3.9999996 a 1.250125,1.250125 0 0 1 -0.02734,0.0918 l -1,3 a 1.250125,1.250125 0 0 1 -0.144531,0.298828 l -2,3 a 1.250125,1.250125 0 0 1 -0.15625,0.191407 l -2,2 a 1.250125,1.250125 0 0 1 -0.119141,0.101562 l 0.402344,2.41211 0.332031,0.333984 0.25,-0.25 V 24 a 1.250125,1.250125 0 1 1 2.5,0 v 0.820312 a 1.250125,1.250125 0 0 1 -0.175781,0.824219 l -0.957031,1.914063 A 1.250125,1.250125 0 0 1 15,28.25 h -2 a 1.250125,1.250125 0 0 1 -0.884766,-0.365234 l -1,-1 A 1.250125,1.250125 0 0 1 10.75,26 v -2.933594 l -0.269531,0.08984 a 1.250125,1.250125 0 0 1 -0.01953,0.0078 A 1.250125,1.250125 0 0 1 9.8554688,23.25 H 7.1796875 A 1.250125,1.250125 0 0 1 6.3554688,23.074219 L 4.4414062,22.117188 A 1.250125,1.250125 0 0 1 4.1152344,21.884766 l -1,-1 A 1.250125,1.250125 0 0 1 2.8144531,20.394531 l -1,-3 A 1.250125,1.250125 0 0 1 1.75,17 v -3 a 1.250125,1.250125 0 0 1 0.037109,-0.302734 l 1,-4.0000004 a 1.250125,1.250125 0 0 1 0.027344,-0.091797 l 1,-3 A 1.250125,1.250125 0 0 1 3.9589844,6.3066406 l 2,-3 a 1.250125,1.250125 0 0 1 0.15625,-0.1914062 l 2,-2 A 1.250125,1.250125 0 0 1 8.6054688,0.81445312 l 2.8769532,-0.95898437 a 1.250125,1.250125 0 0 1 0.248047,-0.078125 1.250125,1.250125 0 0 1 0.02148,-0.005859 1.250125,1.250125 0 0 1 0.0059,-0.001953 1.250125,1.250125 0 0 1 0.05274,-0.007813 1.250125,1.250125 0 0 1 0.113281,-0.0136719 1.250125,1.250125 0 0 1 0.02344,-0.001953 1.250125,1.250125 0 0 1 0.103515,-0.001953 1.250125,1.250125 0 0 1 0.0078,0 1.250125,1.250125 0 0 1 0.01172,0.001953 1.250125,1.250125 0 0 1 0.07422,0.003906 h 2.675781 a 1.250125,1.250125 0 0 1 0.166016,-0.0117188 z"
     id="path2" />
</svg>
