<?xml version="1.0" encoding="UTF-8" standalone="no"?>
<svg
   xmlns:dc="http://purl.org/dc/elements/1.1/"
   xmlns:cc="http://creativecommons.org/ns#"
   xmlns:rdf="http://www.w3.org/1999/02/22-rdf-syntax-ns#"
   xmlns:svg="http://www.w3.org/2000/svg"
   xmlns="http://www.w3.org/2000/svg"
   xmlns:sodipodi="http://sodipodi.sourceforge.net/DTD/sodipodi-0.dtd"
   xmlns:inkscape="http://www.inkscape.org/namespaces/inkscape"
   data-dec="66"
   width="22"
   height="40"
   version="1.1"
   id="svg4"
   sodipodi:docname="66.svg"
   inkscape:version="0.92.4 (unknown)">
  <metadata
     id="metadata10">
    <rdf:RDF>
      <cc:Work
         rdf:about="">
        <dc:format>image/svg+xml</dc:format>
        <dc:type
           rdf:resource="http://purl.org/dc/dcmitype/StillImage" />
      </cc:Work>
    </rdf:RDF>
  </metadata>
  <defs
     id="defs8" />
  <sodipodi:namedview
     pagecolor="#ffffff"
     bordercolor="#666666"
     borderopacity="1"
     objecttolerance="10"
     gridtolerance="10"
     guidetolerance="10"
     inkscape:pageopacity="0"
     inkscape:pageshadow="2"
     inkscape:window-width="640"
     inkscape:window-height="480"
     id="namedview6"
     showgrid="false"
     inkscape:zoom="5.9"
     inkscape:cx="11"
     inkscape:cy="20"
     inkscape:window-x="0"
     inkscape:window-y="27"
     inkscape:window-maximized="0"
     inkscape:current-layer="svg4" />
  <path
     style="color:#000000;font-style:normal;font-variant:normal;font-weight:normal;font-stretch:normal;font-size:medium;line-height:normal;font-family:sans-serif;font-variant-ligatures:normal;font-variant-position:normal;font-variant-caps:normal;font-variant-numeric:normal;font-variant-alternates:normal;font-feature-settings:normal;text-indent:0;text-align:start;text-decoration:none;text-decoration-line:none;text-decoration-style:solid;text-decoration-color:#000000;letter-spacing:normal;word-spacing:normal;text-transform:none;writing-mode:lr-tb;direction:ltr;text-orientation:mixed;dominant-baseline:auto;baseline-shift:baseline;text-anchor:start;white-space:normal;shape-padding:0;clip-rule:nonzero;display:inline;overflow:visible;visibility:visible;opacity:1;isolation:auto;mix-blend-mode:normal;color-interpolation:sRGB;color-interpolation-filters:linearRGB;solid-color:#000000;solid-opacity:1;vector-effect:none;fill:#013272;fill-opacity:1;fill-rule:nonzero;stroke:none;stroke-width:0.5;stroke-linecap:round;stroke-linejoin:round;stroke-miterlimit:4;stroke-dasharray:none;stroke-dashoffset:0;stroke-opacity:1;color-rendering:auto;image-rendering:auto;shape-rendering:auto;text-rendering:auto;enable-background:accumulate"
     d="m 16.429688,12.074219 0.748046,0.748047 a 0.250025,0.250025 0 0 1 0.04492,0.06641 l 1,2 A 0.250025,0.250025 0 0 1 18.25,15 v 3 a 0.250025,0.250025 0 0 1 -0.02734,0.111328 l -1,2 a 0.250025,0.250025 0 0 1 -0.04492,0.06641 L 16.429688,20.925781 16.865234,20.78125 17.794922,19.851562 18.75,17.941406 V 15.058594 L 17.794922,13.148438 16.865234,12.21875 Z M 6.25,11.25 v 10.5 h 7.693359 l 1.908203,-0.955078 0.94336,-0.94336 L 17.75,17.941406 V 15.058594 L 16.794922,13.148438 15.851562,12.205078 13.943359,11.25 Z m 10.179688,-9.1757812 0.748046,0.7480468 a 0.250025,0.250025 0 0 1 0.04492,0.066406 l 1,2 A 0.250025,0.250025 0 0 1 18.25,5 v 2 a 0.250025,0.250025 0 0 1 -0.02734,0.1113281 l -1,2 a 0.250025,0.250025 0 0 1 -0.04492,0.066406 l -0.75,0.75 L 16.865234,9.78125 17.794922,8.8515625 18.75,6.9414062 V 5.0585938 L 17.794922,3.1484375 16.865234,2.21875 Z M 6.25,1.25 v 9.5 h 7.693359 L 15.851562,9.7949219 16.794922,8.8515625 17.75,6.9414062 V 5.0585938 L 16.794922,3.1484375 15.851562,2.2050781 13.943359,1.25 Z m -1,0 v 20.5 h 0.5 V 11.041016 a 0.250025,0.250025 0 0 1 0,-0.08789 V 1.25 Z M 4.9960938,0.74609375 A 0.250025,0.250025 0 0 1 5.046875,0.75 h 0.9121094 a 0.250025,0.250025 0 0 1 0.087891,0 h 7.919922 a 0.250025,0.250025 0 0 1 0.03906,0 0.250025,0.250025 0 0 1 0.02539,0.001953 0.250025,0.250025 0 0 1 0.02344,0.003906 0.250025,0.250025 0 0 1 0.0098,0.001953 0.250025,0.250025 0 0 1 0.03516,0.0136719 l 2.978516,0.99218752 a 0.250025,0.250025 0 0 1 0.09961,0.058594 l 1,1 a 0.250025,0.250025 0 0 1 0.04492,0.066406 l 1,2 A 0.250025,0.250025 0 0 1 19.25,5 v 2 a 0.250025,0.250025 0 0 1 -0.02734,0.1113281 l -1,2 a 0.250025,0.250025 0 0 1 -0.04492,0.066406 l -1,0.9999996 a 0.250025,0.250025 0 0 1 -0.09961,0.05859 L 14.787109,11 l 2.291016,0.763672 a 0.250025,0.250025 0 0 1 0.09961,0.05859 l 1,1 a 0.250025,0.250025 0 0 1 0.04492,0.06641 l 1,2 A 0.250025,0.250025 0 0 1 19.25,15 v 3 a 0.250025,0.250025 0 0 1 -0.02734,0.111328 l -1,2 a 0.250025,0.250025 0 0 1 -0.04492,0.06641 l -1,1 a 0.250025,0.250025 0 0 1 -0.09961,0.05859 l -2.982422,0.994141 a 0.250025,0.250025 0 0 1 -0.02148,0.0078 0.250025,0.250025 0 0 1 -0.09961,0.01172 H 6.0410156 a 0.250025,0.250025 0 0 1 -0.087891,0 H 5.0410156 a 0.250025,0.250025 0 0 1 -0.087891,0 H 2 a 0.250025,0.250025 0 1 1 0,-0.5 H 4.75 V 1.25 H 2 a 0.250025,0.250025 0 1 1 0,-0.5 h 2.9589844 a 0.250025,0.250025 0 0 1 0.037109,-0.003906 z"
     id="path2" />
</svg>
