<?xml version="1.0" encoding="UTF-8" standalone="no"?>
<svg
   xmlns:dc="http://purl.org/dc/elements/1.1/"
   xmlns:cc="http://creativecommons.org/ns#"
   xmlns:rdf="http://www.w3.org/1999/02/22-rdf-syntax-ns#"
   xmlns:svg="http://www.w3.org/2000/svg"
   xmlns="http://www.w3.org/2000/svg"
   xmlns:sodipodi="http://sodipodi.sourceforge.net/DTD/sodipodi-0.dtd"
   xmlns:inkscape="http://www.inkscape.org/namespaces/inkscape"
   data-dec="106"
   width="12"
   height="40"
   version="1.1"
   id="svg4"
   sodipodi:docname="106.svg"
   inkscape:version="0.92.4 5da689c313, 2019-01-14">
  <metadata
     id="metadata10">
    <rdf:RDF>
      <cc:Work
         rdf:about="">
        <dc:format>image/svg+xml</dc:format>
        <dc:type
           rdf:resource="http://purl.org/dc/dcmitype/StillImage" />
        <dc:title></dc:title>
      </cc:Work>
    </rdf:RDF>
  </metadata>
  <defs
     id="defs8" />
  <sodipodi:namedview
     pagecolor="#ffffff"
     bordercolor="#666666"
     borderopacity="1"
     objecttolerance="10"
     gridtolerance="10"
     guidetolerance="10"
     inkscape:pageopacity="0"
     inkscape:pageshadow="2"
     inkscape:window-width="1920"
     inkscape:window-height="1043"
     id="namedview6"
     showgrid="false"
     inkscape:zoom="5.9"
     inkscape:cx="6"
     inkscape:cy="20"
     inkscape:window-x="0"
     inkscape:window-y="37"
     inkscape:window-maximized="0"
     inkscape:current-layer="svg4" />
  <path
     style="color:#000000;font-style:normal;font-variant:normal;font-weight:normal;font-stretch:normal;font-size:medium;line-height:normal;font-family:sans-serif;font-variant-ligatures:normal;font-variant-position:normal;font-variant-caps:normal;font-variant-numeric:normal;font-variant-alternates:normal;font-feature-settings:normal;text-indent:0;text-align:start;text-decoration:none;text-decoration-line:none;text-decoration-style:solid;text-decoration-color:#000000;letter-spacing:normal;word-spacing:normal;text-transform:none;writing-mode:lr-tb;direction:ltr;text-orientation:mixed;dominant-baseline:auto;baseline-shift:baseline;text-anchor:start;white-space:normal;shape-padding:0;clip-rule:nonzero;display:inline;overflow:visible;visibility:visible;opacity:1;isolation:auto;mix-blend-mode:normal;color-interpolation:sRGB;color-interpolation-filters:linearRGB;solid-color:#000000;solid-opacity:1;vector-effect:none;fill:#000000;fill-opacity:1;fill-rule:nonzero;stroke:none;stroke-width:1.5;stroke-linecap:round;stroke-linejoin:round;stroke-miterlimit:4;stroke-dasharray:none;stroke-dashoffset:0;stroke-opacity:1;color-rendering:auto;image-rendering:auto;shape-rendering:auto;text-rendering:auto;enable-background:accumulate"
     d="m 8.3886719,7.2402344 a 0.750075,0.750075 0 0 1 0.5332031,0.2128906 0.750075,0.750075 0 0 1 0.00391,0.00195 0.750075,0.750075 0 0 1 0.00391,0.00391 0.750075,0.750075 0 0 1 0.046875,0.048828 0.750075,0.750075 0 0 1 0.00391,0.00586 0.750075,0.750075 0 0 1 0.1699218,0.609375 V 26 a 0.750075,0.750075 0 0 1 -0.1074218,0.386719 l -1.1992188,2 a 0.750075,0.750075 0 0 1 -0.3554688,0.304687 l -2.4003906,1 A 0.750075,0.750075 0 0 1 4.8007812,29.75 H 2.4003906 A 0.750075,0.750075 0 0 1 1.9199219,29.576172 l -1.19921878,-1 A 0.750075,0.750075 0 0 1 0.44921875,28 v -0.882812 a 0.750075,0.750075 0 0 1 0.33984375,-0.75 l 1.1308594,-0.94336 A 0.750075,0.750075 0 0 1 3.1503906,26 v 1 a 0.750075,0.750075 0 0 1 -0.75,0.75 H 2.0703125 l 0.6015625,0.5 H 4.6503906 L 6.6835938,27.402344 7.6503906,25.792969 V 8.75 H 3.5996094 a 0.750075,0.750075 0 1 1 0,-1.5 h 4.6777344 a 0.750075,0.750075 0 0 1 0.1113281,-0.00977 z M 7.1992188,1.9765625 7.171875,2 7.1992188,2.0234375 7.2285156,2 Z M 7.1699219,0.24414062 a 0.750075,0.750075 0 0 1 0.029297,0 0.750075,0.750075 0 0 1 0.578125,0.25976563 l 0.00195,0.003906 1.1015625,0.9160156 a 0.750075,0.750075 0 0 1 0,1.1523438 l -1.2011719,1 a 0.750075,0.750075 0 0 1 -0.9589844,0 l -1.2011719,-1 a 0.750075,0.750075 0 0 1 0,-1.1523438 L 6.6269531,0.50195312 a 0.750075,0.750075 0 0 1 0.5429688,-0.2578125 z"
     id="path2" />
</svg>
