<?xml version="1.0" encoding="UTF-8"?>
<glyph name="guillemotleft" format="1">
  <advance width="404"/>
  <unicode hex="00AB"/>
  <outline>
    <contour>
      <point x="376" y="449" type="line"/>
      <point x="378" y="449" type="line"/>
      <point x="381" y="449" type="line"/>
      <point x="382" y="449" type="line"/>
      <point x="383" y="449" type="line"/>
      <point x="383" y="448" type="line"/>
      <point x="384" y="448" type="line"/>
      <point x="385" y="448" type="line"/>
      <point x="386" y="447" type="line"/>
      <point x="388" y="446" type="line"/>
      <point x="390" y="444" type="line"/>
      <point x="392" y="443" type="line"/>
      <point x="393" y="441" type="line"/>
      <point x="394" y="441" type="line" smooth="yes"/>
      <point x="395" y="440"/>
      <point x="396" y="439"/>
      <point x="396" y="438" type="curve" smooth="yes"/>
      <point x="396" y="437" type="line"/>
      <point x="396" y="436" type="line"/>
      <point x="397" y="434" type="line" smooth="yes"/>
      <point x="397" y="433"/>
      <point x="398" y="433"/>
      <point x="398" y="432" type="curve" smooth="yes"/>
      <point x="398" y="431" type="line"/>
      <point x="398" y="429" type="line"/>
      <point x="398" y="428" type="line"/>
      <point x="398" y="425" type="line"/>
      <point x="398" y="424" type="line"/>
      <point x="398" y="422" type="line" smooth="yes"/>
      <point x="398" y="421"/>
      <point x="397" y="422"/>
      <point x="397" y="421" type="curve" smooth="yes"/>
      <point x="397" y="420"/>
      <point x="396" y="420"/>
      <point x="396" y="419" type="curve" smooth="yes"/>
      <point x="396" y="417" type="line" smooth="yes"/>
      <point x="396" y="416"/>
      <point x="394" y="415"/>
      <point x="393" y="414" type="curve" smooth="yes"/>
      <point x="393" y="412" type="line"/>
      <point x="260" y="253" type="line"/>
      <point x="393" y="94" type="line"/>
      <point x="394" y="92" type="line"/>
      <point x="395" y="90" type="line"/>
      <point x="396" y="89" type="line"/>
      <point x="397" y="87" type="line"/>
      <point x="397" y="86" type="line"/>
      <point x="397" y="85" type="line"/>
      <point x="398" y="85" type="line"/>
      <point x="398" y="82" type="line"/>
      <point x="398" y="79" type="line"/>
      <point x="398" y="78" type="line"/>
      <point x="398" y="77" type="line"/>
      <point x="398" y="76" type="line"/>
      <point x="397" y="74" type="line"/>
      <point x="397" y="72" type="line"/>
      <point x="396" y="70" type="line"/>
      <point x="396" y="69" type="line"/>
      <point x="395" y="68" type="line"/>
      <point x="394" y="66" type="line"/>
      <point x="392" y="65" type="line"/>
      <point x="390" y="63" type="line"/>
      <point x="389" y="63" type="line" smooth="yes"/>
      <point x="388" y="62"/>
      <point x="386" y="60"/>
      <point x="385" y="59" type="curve" smooth="yes"/>
      <point x="383" y="59" type="line"/>
      <point x="383" y="58" type="line"/>
      <point x="381" y="58" type="line"/>
      <point x="378" y="58" type="line"/>
      <point x="376" y="58" type="line"/>
      <point x="374" y="58" type="line" smooth="yes"/>
      <point x="372" y="58"/>
      <point x="370" y="58"/>
      <point x="368" y="59" type="curve" smooth="yes"/>
      <point x="367" y="59" type="line" smooth="yes"/>
      <point x="366" y="59"/>
      <point x="365" y="62"/>
      <point x="364" y="62" type="curve" smooth="yes"/>
      <point x="363" y="63" type="line"/>
      <point x="361" y="64" type="line"/>
      <point x="361" y="65" type="line"/>
      <point x="187" y="238" type="line" smooth="yes"/>
      <point x="184" y="241"/>
      <point x="180" y="247"/>
      <point x="180" y="253" type="curve" smooth="yes"/>
      <point x="180" y="259"/>
      <point x="184" y="265"/>
      <point x="187" y="268" type="curve" smooth="yes"/>
      <point x="361" y="442" type="line"/>
      <point x="362" y="443" type="line"/>
      <point x="365" y="447" type="line"/>
      <point x="367" y="447" type="line" smooth="yes"/>
      <point x="368" y="447"/>
      <point x="371" y="449"/>
      <point x="372" y="449" type="curve" smooth="yes"/>
      <point x="373" y="449" type="line"/>
    </contour>
    <contour>
      <point x="202" y="449" type="line"/>
      <point x="205" y="449" type="line"/>
      <point x="207" y="449" type="line"/>
      <point x="208" y="449" type="line"/>
      <point x="209" y="449" type="line"/>
      <point x="209" y="448" type="line"/>
      <point x="211" y="448" type="line"/>
      <point x="212" y="447" type="line"/>
      <point x="213" y="447" type="line"/>
      <point x="214" y="446" type="line"/>
      <point x="217" y="444" type="line"/>
      <point x="218" y="443" type="line"/>
      <point x="219" y="441" type="line"/>
      <point x="220" y="441" type="line" smooth="yes"/>
      <point x="221" y="440"/>
      <point x="222" y="439"/>
      <point x="222" y="438" type="curve" smooth="yes"/>
      <point x="222" y="437" type="line"/>
      <point x="223" y="436" type="line"/>
      <point x="223" y="434" type="line" smooth="yes"/>
      <point x="223" y="433"/>
      <point x="224" y="433"/>
      <point x="224" y="432" type="curve" smooth="yes"/>
      <point x="224" y="431" type="line"/>
      <point x="224" y="429" type="line"/>
      <point x="224" y="428" type="line"/>
      <point x="224" y="425" type="line"/>
      <point x="224" y="424" type="line"/>
      <point x="224" y="422" type="line" smooth="yes"/>
      <point x="224" y="421"/>
      <point x="223" y="422"/>
      <point x="223" y="421" type="curve" smooth="yes"/>
      <point x="223" y="419" type="line"/>
      <point x="222" y="417" type="line" smooth="yes"/>
      <point x="222" y="416"/>
      <point x="221" y="415"/>
      <point x="220" y="414" type="curve" smooth="yes"/>
      <point x="219" y="414" type="line"/>
      <point x="219" y="412" type="line"/>
      <point x="86" y="253" type="line"/>
      <point x="219" y="94" type="line"/>
      <point x="220" y="92" type="line"/>
      <point x="221" y="90" type="line"/>
      <point x="222" y="89" type="line"/>
      <point x="223" y="87" type="line"/>
      <point x="223" y="86" type="line"/>
      <point x="224" y="85" type="line"/>
      <point x="224" y="82" type="line"/>
      <point x="224" y="79" type="line"/>
      <point x="224" y="78" type="line"/>
      <point x="224" y="77" type="line"/>
      <point x="224" y="76" type="line"/>
      <point x="223" y="74" type="line"/>
      <point x="223" y="72" type="line"/>
      <point x="222" y="70" type="line"/>
      <point x="222" y="69" type="line"/>
      <point x="221" y="68" type="line"/>
      <point x="220" y="66" type="line"/>
      <point x="219" y="65" type="line"/>
      <point x="217" y="63" type="line"/>
      <point x="216" y="63" type="line" smooth="yes"/>
      <point x="215" y="62"/>
      <point x="212" y="60"/>
      <point x="211" y="59" type="curve" smooth="yes"/>
      <point x="209" y="59" type="line"/>
      <point x="209" y="58" type="line"/>
      <point x="207" y="58" type="line"/>
      <point x="205" y="58" type="line"/>
      <point x="204" y="58" type="line"/>
      <point x="202" y="58" type="line"/>
      <point x="200" y="58" type="line"/>
      <point x="199" y="58" type="line"/>
      <point x="197" y="58" type="line"/>
      <point x="195" y="59" type="line"/>
      <point x="194" y="59" type="line"/>
      <point x="192" y="60" type="line"/>
      <point x="190" y="62" type="line"/>
      <point x="189" y="63" type="line"/>
      <point x="187" y="64" type="line"/>
      <point x="187" y="65" type="line"/>
      <point x="13" y="238" type="line" smooth="yes"/>
      <point x="10" y="241"/>
      <point x="8" y="247"/>
      <point x="8" y="253" type="curve" smooth="yes"/>
      <point x="8" y="259"/>
      <point x="10" y="265"/>
      <point x="13" y="268" type="curve" smooth="yes"/>
      <point x="187" y="442" type="line"/>
      <point x="188" y="443" type="line"/>
      <point x="191" y="447" type="line"/>
      <point x="192" y="447" type="line"/>
      <point x="194" y="447" type="line" smooth="yes"/>
      <point x="195" y="447"/>
      <point x="197" y="449"/>
      <point x="198" y="449" type="curve" smooth="yes"/>
      <point x="199" y="449" type="line"/>
    </contour>
  </outline>
  <lib>
    <dict>
      <key>com.fontlab.hintData</key>
      <dict>
        <key>hhints</key>
        <array>
          <dict>
            <key>position</key>
            <integer>427</integer>
            <key>width</key>
            <integer>22</integer>
          </dict>
        </array>
      </dict>
    </dict>
  </lib>
</glyph>
