<?xml version="1.0" encoding="UTF-8" standalone="no"?>
<svg
   xmlns:dc="http://purl.org/dc/elements/1.1/"
   xmlns:cc="http://creativecommons.org/ns#"
   xmlns:rdf="http://www.w3.org/1999/02/22-rdf-syntax-ns#"
   xmlns:svg="http://www.w3.org/2000/svg"
   xmlns="http://www.w3.org/2000/svg"
   xmlns:sodipodi="http://sodipodi.sourceforge.net/DTD/sodipodi-0.dtd"
   xmlns:inkscape="http://www.inkscape.org/namespaces/inkscape"
   data-dec="82"
   width="24"
   height="40"
   version="1.1"
   id="svg4"
   sodipodi:docname="82.svg"
   inkscape:version="0.92.4 (unknown)">
  <metadata
     id="metadata10">
    <rdf:RDF>
      <cc:Work
         rdf:about="">
        <dc:format>image/svg+xml</dc:format>
        <dc:type
           rdf:resource="http://purl.org/dc/dcmitype/StillImage" />
      </cc:Work>
    </rdf:RDF>
  </metadata>
  <defs
     id="defs8" />
  <sodipodi:namedview
     pagecolor="#ffffff"
     bordercolor="#666666"
     borderopacity="1"
     objecttolerance="10"
     gridtolerance="10"
     guidetolerance="10"
     inkscape:pageopacity="0"
     inkscape:pageshadow="2"
     inkscape:window-width="640"
     inkscape:window-height="480"
     id="namedview6"
     showgrid="false"
     inkscape:zoom="5.9"
     inkscape:cx="12"
     inkscape:cy="20"
     inkscape:window-x="0"
     inkscape:window-y="27"
     inkscape:window-maximized="0"
     inkscape:current-layer="svg4" />
  <path
     style="color:#000000;font-style:normal;font-variant:normal;font-weight:normal;font-stretch:normal;font-size:medium;line-height:normal;font-family:sans-serif;font-variant-ligatures:normal;font-variant-position:normal;font-variant-caps:normal;font-variant-numeric:normal;font-variant-alternates:normal;font-feature-settings:normal;text-indent:0;text-align:start;text-decoration:none;text-decoration-line:none;text-decoration-style:solid;text-decoration-color:#000000;letter-spacing:normal;word-spacing:normal;text-transform:none;writing-mode:lr-tb;direction:ltr;text-orientation:mixed;dominant-baseline:auto;baseline-shift:baseline;text-anchor:start;white-space:normal;shape-padding:0;clip-rule:nonzero;display:inline;overflow:visible;visibility:visible;opacity:1;isolation:auto;mix-blend-mode:normal;color-interpolation:sRGB;color-interpolation-filters:linearRGB;solid-color:#000000;solid-opacity:1;vector-effect:none;fill:#013272;fill-opacity:1;fill-rule:nonzero;stroke:none;stroke-width:2.5;stroke-linecap:round;stroke-linejoin:round;stroke-miterlimit:4;stroke-dasharray:none;stroke-dashoffset:0;stroke-opacity:1;color-rendering:auto;image-rendering:auto;shape-rendering:auto;text-rendering:auto;enable-background:accumulate"
     d="m 10.941406,2.25 -2.1425779,7.5 h 3.0585939 a 1.250125,1.250125 0 0 1 0.255859,0 h 3.59375 L 17.259766,8.9726562 17.908203,8.3242188 18.75,5.796875 V 4.2949219 L 18.068359,2.9316406 16.707031,2.25 Z M 8.9589844,-0.265625 a 1.250125,1.250125 0 0 1 0.25,0.015625 h 0.59375 a 1.250125,1.250125 0 0 1 0.4062496,0 h 6.648438 a 1.250125,1.250125 0 0 1 0.58789,0.0800781 l 0.0098,0.003906 2.939453,0.98046874 a 1.250125,1.250125 0 0 1 0.722657,0.62695308 l 1,2 A 1.250125,1.250125 0 0 1 22.25,4 v 2 a 1.250125,1.250125 0 0 1 -0.06445,0.3945312 l -1,3 a 1.250125,1.250125 0 0 1 -0.300781,0.4902344 l -1,1.0000004 a 1.250125,1.250125 0 0 1 -0.490235,0.300781 l -2.914062,0.970703 a 1.250125,1.250125 0 0 1 -0.01953,0.0078 1.250125,1.250125 0 0 1 -0.449219,0.0918 1.250125,1.250125 0 0 1 0.167969,0.330079 1.250125,1.250125 0 0 1 0.01562,0.05273 1.250125,1.250125 0 0 1 0.0059,0.01758 l 1.912109,6.689453 0.386719,0.386719 0.25,-0.25 V 19 a 1.250125,1.250125 0 1 1 2.5,0 v 0.820312 a 1.250125,1.250125 0 0 1 -0.175781,0.824219 l -0.957031,1.914063 A 1.250125,1.250125 0 0 1 19,23.25 h -2 a 1.250125,1.250125 0 0 1 -0.884766,-0.365234 l -1,-1 A 1.250125,1.250125 0 0 1 14.759766,21.154297 L 13.8125,13.580078 13.259766,13.027344 11.707031,12.25 H 8.0859375 L 5.65625,20.75 H 7 a 1.250125,1.250125 0 1 1 0,2.5 H 4.1972656 a 1.250125,1.250125 0 0 1 -0.40625,0 h -0.59375 a 1.250125,1.250125 0 0 1 -0.40625,0 H 0 a 1.250125,1.250125 0 1 1 0,-2.5 H 2.0585938 L 7.34375,2.25 H 6 a 1.250125,1.250125 0 1 1 0,-2.5 h 2.8027344 a 1.250125,1.250125 0 0 1 0.15625,-0.015625 z"
     id="path2" />
</svg>
