<?xml version="1.0" encoding="UTF-8" standalone="no"?>
<svg
   xmlns:dc="http://purl.org/dc/elements/1.1/"
   xmlns:cc="http://creativecommons.org/ns#"
   xmlns:rdf="http://www.w3.org/1999/02/22-rdf-syntax-ns#"
   xmlns:svg="http://www.w3.org/2000/svg"
   xmlns="http://www.w3.org/2000/svg"
   xmlns:sodipodi="http://sodipodi.sourceforge.net/DTD/sodipodi-0.dtd"
   xmlns:inkscape="http://www.inkscape.org/namespaces/inkscape"
   data-dec="63"
   width="18"
   height="40"
   version="1.1"
   id="svg4"
   sodipodi:docname="63.svg"
   inkscape:version="0.92.4 (unknown)">
  <metadata
     id="metadata10">
    <rdf:RDF>
      <cc:Work
         rdf:about="">
        <dc:format>image/svg+xml</dc:format>
        <dc:type
           rdf:resource="http://purl.org/dc/dcmitype/StillImage" />
      </cc:Work>
    </rdf:RDF>
  </metadata>
  <defs
     id="defs8" />
  <sodipodi:namedview
     pagecolor="#ffffff"
     bordercolor="#666666"
     borderopacity="1"
     objecttolerance="10"
     gridtolerance="10"
     guidetolerance="10"
     inkscape:pageopacity="0"
     inkscape:pageshadow="2"
     inkscape:window-width="640"
     inkscape:window-height="480"
     id="namedview6"
     showgrid="false"
     inkscape:zoom="5.9"
     inkscape:cx="9"
     inkscape:cy="20"
     inkscape:window-x="0"
     inkscape:window-y="27"
     inkscape:window-maximized="0"
     inkscape:current-layer="svg4" />
  <path
     style="color:#000000;font-style:normal;font-variant:normal;font-weight:normal;font-stretch:normal;font-size:medium;line-height:normal;font-family:sans-serif;font-variant-ligatures:normal;font-variant-position:normal;font-variant-caps:normal;font-variant-numeric:normal;font-variant-alternates:normal;font-feature-settings:normal;text-indent:0;text-align:start;text-decoration:none;text-decoration-line:none;text-decoration-style:solid;text-decoration-color:#000000;letter-spacing:normal;word-spacing:normal;text-transform:none;writing-mode:lr-tb;direction:ltr;text-orientation:mixed;dominant-baseline:auto;baseline-shift:baseline;text-anchor:start;white-space:normal;shape-padding:0;clip-rule:nonzero;display:inline;overflow:visible;visibility:visible;opacity:1;isolation:auto;mix-blend-mode:normal;color-interpolation:sRGB;color-interpolation-filters:linearRGB;solid-color:#000000;solid-opacity:1;vector-effect:none;fill:#013272;fill-opacity:1;fill-rule:nonzero;stroke:none;stroke-width:0.5;stroke-linecap:round;stroke-linejoin:round;stroke-miterlimit:4;stroke-dasharray:none;stroke-dashoffset:0;stroke-opacity:1;color-rendering:auto;image-rendering:auto;shape-rendering:auto;text-rendering:auto;enable-background:accumulate"
     d="M 9,20.355469 8.3554688,21 9,21.644531 9.6445312,21 Z m -0.027344,-0.607422 a 0.250025,0.250025 0 0 1 0.021484,0 0.250025,0.250025 0 0 1 0.00391,0 0.250025,0.250025 0 0 1 0.021484,0 0.250025,0.250025 0 0 1 0.00195,0 0.250025,0.250025 0 0 1 0.023437,0.0039 0.250025,0.250025 0 0 1 0.00195,0 0.250025,0.250025 0 0 1 0.00391,0.002 0.250025,0.250025 0 0 1 0.064453,0.02148 0.250025,0.250025 0 0 1 0.00195,0.002 0.250025,0.250025 0 0 1 0.060547,0.04492 0.250025,0.250025 0 0 1 0.015625,0.01367 l 0.00781,0.0098 a 0.250025,0.250025 0 0 1 0.00781,0.0098 l 0.9687496,0.966797 a 0.250025,0.250025 0 0 1 0,0.355468 l -0.9999996,1 a 0.250025,0.250025 0 0 1 -0.3554688,0 l -1,-1 a 0.250025,0.250025 0 0 1 0,-0.355468 l 0.9746094,-0.97461 a 0.250025,0.250025 0 0 1 0.025391,-0.02539 0.250025,0.250025 0 0 1 0.076172,-0.05273 0.250025,0.250025 0 0 1 0.00195,-0.002 0.250025,0.250025 0 0 1 0.072266,-0.01953 z M 12.429688,2.0742188 13.177734,2.8222656 a 0.250025,0.250025 0 0 1 0.04492,0.066406 l 1,2 A 0.250025,0.250025 0 0 1 14.25,5 v 2 a 0.250025,0.250025 0 0 1 -0.02734,0.1113281 l -1,2 a 0.250025,0.250025 0 0 1 -0.04492,0.066406 L 12.269531,10.085938 12.851562,9.7949219 13.794922,8.8515625 14.75,6.9414062 V 5.0585938 L 13.794922,3.1484375 12.865234,2.21875 Z M 9.9921875,0.74804688 A 0.250025,0.250025 0 0 1 10.005859,0.75 a 0.250025,0.250025 0 0 1 0.0098,0 0.250025,0.250025 0 0 1 0.01563,0.001953 0.250025,0.250025 0 0 1 0.02344,0.003906 0.250025,0.250025 0 0 1 0.0098,0.001953 0.250025,0.250025 0 0 1 0.03516,0.0136719 l 2.978516,0.99218752 a 0.250025,0.250025 0 0 1 0.09961,0.058594 l 1,1 a 0.250025,0.250025 0 0 1 0.04492,0.066406 l 1,2 A 0.250025,0.250025 0 0 1 15.25,5 v 2 a 0.250025,0.250025 0 0 1 -0.02734,0.1113281 l -1,2 a 0.250025,0.250025 0 0 1 -0.04492,0.066406 l -1,0.9999996 a 0.250025,0.250025 0 0 1 -0.06641,0.04492 l -1.978516,0.990235 a 0.250025,0.250025 0 0 1 -0.0098,0.0059 0.250025,0.250025 0 0 1 -0.03516,0.01563 L 9.25,12.154297 V 15 a 0.250025,0.250025 0 1 1 -0.5,0 V 12 A 0.250025,0.250025 0 0 1 8.8886719,11.777344 L 10.847656,10.796875 12.794922,8.8515625 13.75,6.9414062 V 5.0585938 L 12.794922,3.1484375 11.851562,2.2050781 9.9433594,1.25 H 7.0585938 L 5.1484375,2.2050781 4.2050781,3.1484375 3.25,5.0585938 V 5.8964844 L 4,6.6445312 4.6445312,6 3.8222656,5.1777344 A 0.25135454,0.25135454 0 0 1 4.1777344,4.8222656 l 1,1 a 0.250025,0.250025 0 0 1 0,0.3554688 l -1,1 a 0.250025,0.250025 0 0 1 -0.3554688,0 l -1,-1 A 0.250025,0.250025 0 0 1 2.75,6 V 5 a 0.250025,0.250025 0 0 1 0.027344,-0.1113281 l 1,-2 a 0.250025,0.250025 0 0 1 0.044922,-0.066406 l 1,-1 a 0.250025,0.250025 0 0 1 0.066406,-0.044922 l 2,-1.00000005 A 0.250025,0.250025 0 0 1 7,0.75 h 2.9667969 a 0.250025,0.250025 0 0 1 0.025391,-0.001953 z"
     id="path2" />
</svg>
