<?xml version="1.0" encoding="UTF-8" standalone="no"?>
<svg
   xmlns:dc="http://purl.org/dc/elements/1.1/"
   xmlns:cc="http://creativecommons.org/ns#"
   xmlns:rdf="http://www.w3.org/1999/02/22-rdf-syntax-ns#"
   xmlns:svg="http://www.w3.org/2000/svg"
   xmlns="http://www.w3.org/2000/svg"
   xmlns:sodipodi="http://sodipodi.sourceforge.net/DTD/sodipodi-0.dtd"
   xmlns:inkscape="http://www.inkscape.org/namespaces/inkscape"
   data-dec="49"
   width="20"
   height="40"
   version="1.1"
   id="svg4"
   sodipodi:docname="49.svg"
   inkscape:version="0.92.4 (unknown)">
  <metadata
     id="metadata10">
    <rdf:RDF>
      <cc:Work
         rdf:about="">
        <dc:format>image/svg+xml</dc:format>
        <dc:type
           rdf:resource="http://purl.org/dc/dcmitype/StillImage" />
      </cc:Work>
    </rdf:RDF>
  </metadata>
  <defs
     id="defs8" />
  <sodipodi:namedview
     pagecolor="#ffffff"
     bordercolor="#666666"
     borderopacity="1"
     objecttolerance="10"
     gridtolerance="10"
     guidetolerance="10"
     inkscape:pageopacity="0"
     inkscape:pageshadow="2"
     inkscape:window-width="640"
     inkscape:window-height="480"
     id="namedview6"
     showgrid="false"
     inkscape:zoom="5.9"
     inkscape:cx="10"
     inkscape:cy="20"
     inkscape:window-x="0"
     inkscape:window-y="27"
     inkscape:window-maximized="0"
     inkscape:current-layer="svg4" />
  <path
     style="color:#000000;font-style:normal;font-variant:normal;font-weight:normal;font-stretch:normal;font-size:medium;line-height:normal;font-family:sans-serif;font-variant-ligatures:normal;font-variant-position:normal;font-variant-caps:normal;font-variant-numeric:normal;font-variant-alternates:normal;font-feature-settings:normal;text-indent:0;text-align:start;text-decoration:none;text-decoration-line:none;text-decoration-style:solid;text-decoration-color:#000000;letter-spacing:normal;word-spacing:normal;text-transform:none;writing-mode:lr-tb;direction:ltr;text-orientation:mixed;dominant-baseline:auto;baseline-shift:baseline;text-anchor:start;white-space:normal;shape-padding:0;clip-rule:nonzero;display:inline;overflow:visible;visibility:visible;opacity:1;isolation:auto;mix-blend-mode:normal;color-interpolation:sRGB;color-interpolation-filters:linearRGB;solid-color:#000000;solid-opacity:1;vector-effect:none;fill:#013272;fill-opacity:1;fill-rule:nonzero;stroke:none;stroke-width:0.30000001;stroke-linecap:round;stroke-linejoin:round;stroke-miterlimit:4;stroke-dasharray:none;stroke-dashoffset:0;stroke-opacity:1;color-rendering:auto;image-rendering:auto;shape-rendering:auto;text-rendering:auto;enable-background:accumulate"
     d="m 12.001953,21.669922 0.0918,0.179687 h 0.269531 z m -4.0039061,0 -0.3613281,0.179687 H 7.90625 Z m 3.1523441,-0.427734 v 0.607421 h 0.607421 l -0.203124,-0.404297 z m -2.3007816,0 -0.4042969,0.203124 -0.203125,0.404297 h 0.6074219 z m 2.3007816,-0.605469 v 0.269531 l 0.179687,0.0918 z m -2.3007816,0 -0.1796875,0.361328 0.1796875,-0.0918 z M 9.9824219,2.8476562 a 0.15001501,0.15001501 0 0 1 0.015625,0 A 0.15001501,0.15001501 0 0 1 10.150391,3 V 21 A 0.1503908,0.1503908 0 0 1 9.8496094,21 V 3 A 0.15001501,0.15001501 0 0 1 9.9824219,2.8476562 Z M 10.849609,1.3613281 9.1503906,3.0605469 V 19.980469 a 0.15001501,0.15001501 0 0 1 0,0.0293 v 0.96289 a 0.15001501,0.15001501 0 0 1 0,0.04492 v 0.832031 h 1.6992184 v -0.828125 a 0.15001501,0.15001501 0 0 1 0,-0.04492 v -0.96289 a 0.15001501,0.15001501 0 0 1 0,-0.0293 z m 0.146485,-0.51367185 a 0.15001501,0.15001501 0 0 1 0.002,0 0.15001501,0.15001501 0 0 1 0.04297,0.005859 0.15001501,0.15001501 0 0 1 0.002,0 0.15001501,0.15001501 0 0 1 0.02734,0.0117188 0.15001501,0.15001501 0 0 1 0.01172,0.007813 0.15001501,0.15001501 0 0 1 0.01172,0.007813 0.15001501,0.15001501 0 0 1 0.002,0 0.15001501,0.15001501 0 0 1 0.0098,0.009766 0.15001501,0.15001501 0 0 1 0.0098,0.0117188 0.15001501,0.15001501 0 0 1 0.01758,0.0234375 0.15001501,0.15001501 0 0 1 0,0.001953 0.15001501,0.15001501 0 0 1 0.0059,0.0117187 0.15001501,0.15001501 0 0 1 0,0.001953 0.15001501,0.15001501 0 0 1 0.0059,0.0117188 0.15001501,0.15001501 0 0 1 0,0.001953 0.15001501,0.15001501 0 0 1 0.0059,0.0292969 0.15001501,0.15001501 0 0 1 0,0.0292969 V 19.964844 l 0.628906,1.255859 1.255859,0.628906 H 15 a 0.150391,0.150391 0 1 1 0,0.300782 h -1.980469 -0.0293 -0.96289 a 0.15001501,0.15001501 0 0 1 -0.04492,0 h -0.964844 a 0.15001501,0.15001501 0 0 1 -0.04492,0 H 9.0175781 a 0.15001501,0.15001501 0 0 1 -0.044922,0 H 8.0214844 a 0.15001501,0.15001501 0 0 1 -0.044922,0 H 7.0136719 6.984375 5 A 0.150391,0.150391 0 0 1 5,21.849609 H 6.9648438 L 8.2207031,21.220703 8.8496094,19.964844 V 3.3613281 L 8.1054688,4.1054688 a 0.15001501,0.15001501 0 0 1 -0.039063,0.029297 l -2,1 A 0.15023831,0.15023831 0 0 1 5.9335938,4.8652344 L 7.9121094,3.8769531 8.8730469,2.9179688 A 0.15001501,0.15001501 0 0 1 8.8808594,2.90625 0.15001501,0.15001501 0 0 1 8.9023438,2.8847656 0.15001501,0.15001501 0 0 1 8.9140625,2.875 L 10.873047,0.91796875 a 0.15001501,0.15001501 0 0 1 0.0078,-0.0117188 0.15001501,0.15001501 0 0 1 0.05859,-0.0449219 0.15001501,0.15001501 0 0 1 0.02539,-0.007813 0.15001501,0.15001501 0 0 1 0.01758,-0.003906 0.15001501,0.15001501 0 0 1 0.01367,-0.001953 z"
     id="path2" />
</svg>
