<?xml version="1.0" encoding="UTF-8" standalone="no"?>
<svg
   xmlns:dc="http://purl.org/dc/elements/1.1/"
   xmlns:cc="http://creativecommons.org/ns#"
   xmlns:rdf="http://www.w3.org/1999/02/22-rdf-syntax-ns#"
   xmlns:svg="http://www.w3.org/2000/svg"
   xmlns="http://www.w3.org/2000/svg"
   xmlns:sodipodi="http://sodipodi.sourceforge.net/DTD/sodipodi-0.dtd"
   xmlns:inkscape="http://www.inkscape.org/namespaces/inkscape"
   data-dec="69"
   width="20"
   height="40"
   version="1.1"
   id="svg4"
   sodipodi:docname="69.svg"
   inkscape:version="0.92.4 5da689c313, 2019-01-14">
  <metadata
     id="metadata10">
    <rdf:RDF>
      <cc:Work
         rdf:about="">
        <dc:format>image/svg+xml</dc:format>
        <dc:type
           rdf:resource="http://purl.org/dc/dcmitype/StillImage" />
        <dc:title></dc:title>
      </cc:Work>
    </rdf:RDF>
  </metadata>
  <defs
     id="defs8" />
  <sodipodi:namedview
     pagecolor="#ffffff"
     bordercolor="#666666"
     borderopacity="1"
     objecttolerance="10"
     gridtolerance="10"
     guidetolerance="10"
     inkscape:pageopacity="0"
     inkscape:pageshadow="2"
     inkscape:window-width="1920"
     inkscape:window-height="1043"
     id="namedview6"
     showgrid="false"
     inkscape:zoom="5.9"
     inkscape:cx="10"
     inkscape:cy="20"
     inkscape:window-x="0"
     inkscape:window-y="37"
     inkscape:window-maximized="0"
     inkscape:current-layer="svg4" />
  <path
     style="color:#000000;font-style:normal;font-variant:normal;font-weight:normal;font-stretch:normal;font-size:medium;line-height:normal;font-family:sans-serif;font-variant-ligatures:normal;font-variant-position:normal;font-variant-caps:normal;font-variant-numeric:normal;font-variant-alternates:normal;font-feature-settings:normal;text-indent:0;text-align:start;text-decoration:none;text-decoration-line:none;text-decoration-style:solid;text-decoration-color:#000000;letter-spacing:normal;word-spacing:normal;text-transform:none;writing-mode:lr-tb;direction:ltr;text-orientation:mixed;dominant-baseline:auto;baseline-shift:baseline;text-anchor:start;white-space:normal;shape-padding:0;clip-rule:nonzero;display:inline;overflow:visible;visibility:visible;opacity:1;isolation:auto;mix-blend-mode:normal;color-interpolation:sRGB;color-interpolation-filters:linearRGB;solid-color:#000000;solid-opacity:1;vector-effect:none;fill:#000000;fill-opacity:1;fill-rule:nonzero;stroke:none;stroke-width:0.5;stroke-linecap:round;stroke-linejoin:round;stroke-miterlimit:4;stroke-dasharray:none;stroke-dashoffset:0;stroke-opacity:1;color-rendering:auto;image-rendering:auto;shape-rendering:auto;text-rendering:auto;enable-background:accumulate"
     d="m 5.25,11.25 v 0.5 h 5.5 v -0.5 z m -1,-10 v 20.5 h 11.5 v -0.5 H 5.0410156 a 0.250025,0.250025 0 0 1 -0.1972656,-0.05273 0.250025,0.250025 0 0 1 -0.00195,0 0.250025,0.250025 0 0 1 -0.00781,-0.0078 0.250025,0.250025 0 0 1 -0.00977,-0.0098 0.250025,0.250025 0 0 1 -0.015625,-0.01563 0.250025,0.250025 0 0 1 -0.00195,-0.002 0.250025,0.250025 0 0 1 -0.013672,-0.01758 0.250025,0.250025 0 0 1 -0.00195,-0.002 0.250025,0.250025 0 0 1 -0.00391,-0.0078 0.250025,0.250025 0 0 1 -0.00781,-0.01367 A 0.250025,0.250025 0 0 1 4.75,20.953125 v -8.912109 a 0.250025,0.250025 0 0 1 0,-0.08789 v -0.912109 a 0.250025,0.250025 0 0 1 0,-0.08789 V 2.0410156 a 0.250025,0.250025 0 0 1 0.052734,-0.1972656 0.250025,0.250025 0 0 1 0,-0.00195 0.250025,0.250025 0 0 1 0.00781,-0.00781 0.250025,0.250025 0 0 1 0.027344,-0.027344 0.250025,0.250025 0 0 1 0.017578,-0.013672 0.250025,0.250025 0 0 1 0.00195,-0.00195 0.250025,0.250025 0 0 1 0.00781,-0.00391 0.250025,0.250025 0 0 1 0.013672,-0.00781 A 0.250025,0.250025 0 0 1 5.046875,1.75 H 15.75 V 1.25 Z M 3.9960938,0.74609375 A 0.250025,0.250025 0 0 1 4.046875,0.75 h 11.912109 a 0.250025,0.250025 0 0 1 0.197266,0.0527344 0.250025,0.250025 0 0 1 0.002,0 0.250025,0.250025 0 0 1 0.01758,0.015625 0.250025,0.250025 0 0 1 0,0.001953 0.250025,0.250025 0 0 1 0.01563,0.015625 0.250025,0.250025 0 0 1 0.002,0.001953 0.250025,0.250025 0 0 1 0.01367,0.0175781 0.250025,0.250025 0 0 1 0.002,0.001953 0.250025,0.250025 0 0 1 0.01172,0.0195312 0.250025,0.250025 0 0 1 0,0.001953 A 0.250025,0.250025 0 0 1 16.25,1.046875 V 2 A 0.250025,0.250025 0 0 1 16,2.25 H 5.25 v 8.5 H 11 A 0.250025,0.250025 0 0 1 11.25,11 v 0.958984 a 0.250025,0.250025 0 0 1 -0.05273,0.197266 0.250025,0.250025 0 0 1 0,0.002 0.250025,0.250025 0 0 1 -0.0078,0.0078 0.250025,0.250025 0 0 1 -0.0098,0.0098 0.250025,0.250025 0 0 1 -0.01563,0.01563 0.250025,0.250025 0 0 1 -0.002,0.002 0.250025,0.250025 0 0 1 -0.01758,0.01367 0.250025,0.250025 0 0 1 -0.002,0.002 0.250025,0.250025 0 0 1 -0.0078,0.0039 0.250025,0.250025 0 0 1 -0.01367,0.0078 0.250025,0.250025 0 0 1 -0.167969,0.0293 H 5.25 v 8.5 H 16 A 0.250025,0.250025 0 0 1 16.25,21 v 0.958984 a 0.250025,0.250025 0 0 1 -0.05273,0.197266 0.250025,0.250025 0 0 1 0,0.002 0.250025,0.250025 0 0 1 -0.0078,0.0078 0.250025,0.250025 0 0 1 -0.0098,0.0098 0.250025,0.250025 0 0 1 -0.01563,0.01563 0.250025,0.250025 0 0 1 -0.002,0.002 0.250025,0.250025 0 0 1 -0.01758,0.01367 0.250025,0.250025 0 0 1 -0.002,0.002 0.250025,0.250025 0 0 1 -0.0078,0.0039 0.250025,0.250025 0 0 1 -0.01367,0.0078 0.250025,0.250025 0 0 1 -0.167969,0.0293 H 4.0410156 a 0.250025,0.250025 0 0 1 -0.1972656,-0.05273 0.250025,0.250025 0 0 1 -0.00195,0 0.250025,0.250025 0 0 1 -0.00781,-0.0078 0.250025,0.250025 0 0 1 -0.00977,-0.0098 0.250025,0.250025 0 0 1 -0.015625,-0.01563 0.250025,0.250025 0 0 1 -0.00195,-0.002 0.250025,0.250025 0 0 1 -0.013672,-0.01758 0.250025,0.250025 0 0 1 -0.00195,-0.002 0.250025,0.250025 0 0 1 -0.00391,-0.0078 0.250025,0.250025 0 0 1 -0.00781,-0.01367 A 0.250025,0.250025 0 0 1 3.75,21.953125 V 1.0410156 a 0.250025,0.250025 0 0 1 0.052734,-0.1972656 0.250025,0.250025 0 0 1 0,-0.001953 0.250025,0.250025 0 0 1 0.00781,-0.007813 0.250025,0.250025 0 0 1 0.027344,-0.0273438 0.250025,0.250025 0 0 1 0.017578,-0.0136719 0.250025,0.250025 0 0 1 0.00195,-0.001953 0.250025,0.250025 0 0 1 0.00781,-0.003906 0.250025,0.250025 0 0 1 0.013672,-0.007813 0.250025,0.250025 0 0 1 0.1171876,-0.0332031 z"
     id="path2" />
</svg>
