<?xml version="1.0" encoding="UTF-8" standalone="no"?>
<svg
   xmlns:dc="http://purl.org/dc/elements/1.1/"
   xmlns:cc="http://creativecommons.org/ns#"
   xmlns:rdf="http://www.w3.org/1999/02/22-rdf-syntax-ns#"
   xmlns:svg="http://www.w3.org/2000/svg"
   xmlns="http://www.w3.org/2000/svg"
   xmlns:sodipodi="http://sodipodi.sourceforge.net/DTD/sodipodi-0.dtd"
   xmlns:inkscape="http://www.inkscape.org/namespaces/inkscape"
   data-dec="180"
   width="12"
   height="40"
   version="1.1"
   id="svg4"
   sodipodi:docname="180.svg"
   inkscape:version="0.92.4 (unknown)">
  <metadata
     id="metadata10">
    <rdf:RDF>
      <cc:Work
         rdf:about="">
        <dc:format>image/svg+xml</dc:format>
        <dc:type
           rdf:resource="http://purl.org/dc/dcmitype/StillImage" />
      </cc:Work>
    </rdf:RDF>
  </metadata>
  <defs
     id="defs8" />
  <sodipodi:namedview
     pagecolor="#ffffff"
     bordercolor="#666666"
     borderopacity="1"
     objecttolerance="10"
     gridtolerance="10"
     guidetolerance="10"
     inkscape:pageopacity="0"
     inkscape:pageshadow="2"
     inkscape:window-width="640"
     inkscape:window-height="480"
     id="namedview6"
     showgrid="false"
     inkscape:zoom="5.9"
     inkscape:cx="6"
     inkscape:cy="20"
     inkscape:window-x="0"
     inkscape:window-y="27"
     inkscape:window-maximized="0"
     inkscape:current-layer="svg4" />
  <path
     style="color:#000000;font-style:normal;font-variant:normal;font-weight:normal;font-stretch:normal;font-size:medium;line-height:normal;font-family:sans-serif;font-variant-ligatures:normal;font-variant-position:normal;font-variant-caps:normal;font-variant-numeric:normal;font-variant-alternates:normal;font-feature-settings:normal;text-indent:0;text-align:start;text-decoration:none;text-decoration-line:none;text-decoration-style:solid;text-decoration-color:#000000;letter-spacing:normal;word-spacing:normal;text-transform:none;writing-mode:lr-tb;direction:ltr;text-orientation:mixed;dominant-baseline:auto;baseline-shift:baseline;text-anchor:start;white-space:normal;shape-padding:0;clip-rule:nonzero;display:inline;overflow:visible;visibility:visible;opacity:1;isolation:auto;mix-blend-mode:normal;color-interpolation:sRGB;color-interpolation-filters:linearRGB;solid-color:#000000;solid-opacity:1;vector-effect:none;fill:#013272;fill-opacity:1;fill-rule:nonzero;stroke:none;stroke-width:1.5;stroke-linecap:round;stroke-linejoin:round;stroke-miterlimit:4;stroke-dasharray:none;stroke-dashoffset:0;stroke-opacity:1;color-rendering:auto;image-rendering:auto;shape-rendering:auto;text-rendering:auto;enable-background:accumulate"
     d="M 7.9921875,0.2421875 A 0.750075,0.750075 0 0 1 8.6054688,0.54296875 L 9.53125,1.46875 A 0.750075,0.750075 0 0 1 9.4804688,2.5761719 L 3.5039062,7.5566406 a 0.750075,0.750075 0 0 1 -0.1269531,0.09375 0.750075,0.750075 0 0 1 -0.1347656,0.064453 0.750075,0.750075 0 0 1 -0.072266,0.021484 0.750075,0.750075 0 0 1 -0.074219,0.013672 0.750075,0.750075 0 0 1 -0.011719,0.00195 0.750075,0.750075 0 0 1 -0.0625,0.00391 0.750075,0.750075 0 0 1 -0.076172,0 A 0.750075,0.750075 0 0 1 2.8867188,7.75 0.750075,0.750075 0 0 1 2.859375,7.7460938 0.750075,0.750075 0 0 1 2.8378906,7.7402344 0.750075,0.750075 0 0 1 2.7871094,7.7285156 0.750075,0.750075 0 0 1 2.7265625,7.7089844 0.750075,0.750075 0 0 1 2.6054688,7.6484375 0.750075,0.750075 0 0 1 2.5859375,7.6367188 0.750075,0.750075 0 0 1 2.5703125,7.6269531 0.750075,0.750075 0 0 1 2.5253906,7.59375 a 0.750075,0.750075 0 0 1 -0.013672,-0.00977 0.750075,0.750075 0 0 1 -0.044922,-0.042969 0.750075,0.750075 0 0 1 -0.042969,-0.044922 0.750075,0.750075 0 0 1 -0.00586,-0.00781 0.750075,0.750075 0 0 1 -0.00781,-0.00977 0.750075,0.750075 0 0 1 -0.039062,-0.052734 0.750075,0.750075 0 0 1 -0.033203,-0.052734 0.750075,0.750075 0 0 1 -0.00586,-0.00977 0.750075,0.750075 0 0 1 -0.027344,-0.058594 0.750075,0.750075 0 0 1 -0.013672,-0.035156 0.750075,0.750075 0 0 1 -0.033203,-0.1074218 0.750075,0.750075 0 0 1 -0.00195,-0.011719 0.750075,0.750075 0 0 1 0,-0.00195 0.750075,0.750075 0 0 1 -0.00977,-0.072266 0.750075,0.750075 0 0 1 0.013672,-0.2226563 0.750075,0.750075 0 0 1 0.019531,-0.074219 0.750075,0.750075 0 0 1 0.025391,-0.070312 0.750075,0.750075 0 0 1 0.033203,-0.066406 0.750075,0.750075 0 0 1 0.085937,-0.1230469 l 0.00586,-0.00781 L 7.3496094,0.609375 A 0.750075,0.750075 0 0 1 7.9921875,0.2421875 Z"
     id="path2" />
</svg>
