<?xml version="1.0" encoding="UTF-8" standalone="no"?>
<svg
   xmlns:dc="http://purl.org/dc/elements/1.1/"
   xmlns:cc="http://creativecommons.org/ns#"
   xmlns:rdf="http://www.w3.org/1999/02/22-rdf-syntax-ns#"
   xmlns:svg="http://www.w3.org/2000/svg"
   xmlns="http://www.w3.org/2000/svg"
   xmlns:sodipodi="http://sodipodi.sourceforge.net/DTD/sodipodi-0.dtd"
   xmlns:inkscape="http://www.inkscape.org/namespaces/inkscape"
   data-dec="36"
   width="20"
   height="40"
   version="1.1"
   id="svg4"
   sodipodi:docname="36.svg"
   inkscape:version="0.92.4 5da689c313, 2019-01-14">
  <metadata
     id="metadata10">
    <rdf:RDF>
      <cc:Work
         rdf:about="">
        <dc:format>image/svg+xml</dc:format>
        <dc:type
           rdf:resource="http://purl.org/dc/dcmitype/StillImage" />
        <dc:title></dc:title>
      </cc:Work>
    </rdf:RDF>
  </metadata>
  <defs
     id="defs8" />
  <sodipodi:namedview
     pagecolor="#ffffff"
     bordercolor="#666666"
     borderopacity="1"
     objecttolerance="10"
     gridtolerance="10"
     guidetolerance="10"
     inkscape:pageopacity="0"
     inkscape:pageshadow="2"
     inkscape:window-width="1920"
     inkscape:window-height="1043"
     id="namedview6"
     showgrid="false"
     inkscape:zoom="5.9"
     inkscape:cx="10"
     inkscape:cy="20"
     inkscape:window-x="0"
     inkscape:window-y="37"
     inkscape:window-maximized="0"
     inkscape:current-layer="svg4" />
  <path
     style="color:#000000;font-style:normal;font-variant:normal;font-weight:normal;font-stretch:normal;font-size:medium;line-height:normal;font-family:sans-serif;font-variant-ligatures:normal;font-variant-position:normal;font-variant-caps:normal;font-variant-numeric:normal;font-variant-alternates:normal;font-feature-settings:normal;text-indent:0;text-align:start;text-decoration:none;text-decoration-line:none;text-decoration-style:solid;text-decoration-color:#000000;letter-spacing:normal;word-spacing:normal;text-transform:none;writing-mode:lr-tb;direction:ltr;text-orientation:mixed;dominant-baseline:auto;baseline-shift:baseline;text-anchor:start;white-space:normal;shape-padding:0;clip-rule:nonzero;display:inline;overflow:visible;visibility:visible;opacity:1;isolation:auto;mix-blend-mode:normal;color-interpolation:sRGB;color-interpolation-filters:linearRGB;solid-color:#000000;solid-opacity:1;vector-effect:none;fill:#000000;fill-opacity:1;fill-rule:nonzero;stroke:none;stroke-width:1.5;stroke-linecap:round;stroke-linejoin:round;stroke-miterlimit:4;stroke-dasharray:none;stroke-dashoffset:0;stroke-opacity:1;color-rendering:auto;image-rendering:auto;shape-rendering:auto;text-rendering:auto;enable-background:accumulate"
     d="M 10.75,12.712891 V 20.25 h 0.128906 l 1.785156,-0.595703 1.00586,-0.669922 L 14.25,17.822266 V 16.177734 L 13.382812,14.443359 12.556641,13.617188 Z M 8.1210938,2.75 5.4042969,3.65625 4.75,4.3105469 V 5.8222656 L 5.5585938,7.4414062 8.25,8.7871094 V 2.75 Z M 8.9882812,-3.7597656 A 0.750075,0.750075 0 0 1 9.1230469,-3.75 H 10 A 0.750075,0.750075 0 0 1 10.75,-3 V 0.25 H 11 a 0.750075,0.750075 0 0 1 0.236328,0.0390625 l 3,1 A 0.750075,0.750075 0 0 1 14.53125,1.46875 l 2,2 A 0.750075,0.750075 0 0 1 16,4.75 H 14.107422 A 0.750075,0.750075 0 0 1 13.798828,4.7265625 0.750075,0.750075 0 0 1 13.728516,4.703125 0.750075,0.750075 0 0 1 13.6875,4.6855469 0.750075,0.750075 0 0 1 13.648438,4.6660156 0.750075,0.750075 0 0 1 13.400391,4.4628906 L 12.556641,3.6171875 10.822266,2.75 H 10.75 v 7.287109 l 2.585938,1.292969 a 0.750075,0.750075 0 0 1 0.195312,0.138672 l 2,2 a 0.750075,0.750075 0 0 1 0.138672,0.195312 l 1,2 A 0.750075,0.750075 0 0 1 16.75,16 v 2 a 0.750075,0.750075 0 0 1 -0.08008,0.335938 l -1,2 A 0.750075,0.750075 0 0 1 15.53125,20.53125 l -1,1 a 0.750075,0.750075 0 0 1 -0.294922,0.179688 l -3,1 A 0.750075,0.750075 0 0 1 11,22.75 h -0.25 v 3.126953 a 0.750075,0.750075 0 0 1 -0.201172,0.644531 0.750075,0.750075 0 0 1 -0.0039,0.0039 0.750075,0.750075 0 0 1 -0.0039,0.0039 0.750075,0.750075 0 0 1 -0.04883,0.04687 0.750075,0.750075 0 0 1 -0.0059,0.0039 A 0.750075,0.750075 0 0 1 9.8769531,26.75 H 9 A 0.750075,0.750075 0 0 1 8.25,26 V 22.75 H 8 a 0.750075,0.750075 0 0 1 -0.2363281,-0.03906 l -3,-1 A 0.750075,0.750075 0 0 1 4.46875,21.53125 l -2,-2 A 0.750075,0.750075 0 0 1 3,18.25 h 1.8925781 a 0.750075,0.750075 0 0 1 0.3085938,0.02344 0.750075,0.750075 0 0 1 0.070312,0.02344 0.750075,0.750075 0 0 1 0.041016,0.01758 0.750075,0.750075 0 0 1 0.039063,0.01953 0.750075,0.750075 0 0 1 0.2480469,0.203125 l 0.84375,0.845703 L 8.1777344,20.25 H 8.25 V 11.462891 L 4.6640625,9.6699219 A 0.750075,0.750075 0 0 1 4.46875,9.53125 l -1,-1 A 0.750075,0.750075 0 0 1 3.3300781,8.3359375 l -1,-2 A 0.750075,0.750075 0 0 1 2.25,6 V 4 A 0.750075,0.750075 0 0 1 2.46875,3.46875 l 2,-2 A 0.750075,0.750075 0 0 1 4.7636719,1.2890625 l 3,-1 A 0.750075,0.750075 0 0 1 8,0.25 h 0.25 v -3.1269531 a 0.750075,0.750075 0 0 1 0.2011719,-0.6445313 0.750075,0.750075 0 0 1 0.00586,-0.00586 0.750075,0.750075 0 0 1 0.00586,-0.00586 0.750075,0.750075 0 0 1 0.050781,-0.046875 0.750075,0.750075 0 0 1 0.4746093,-0.1796875 z"
     id="path2" />
</svg>
