<?xml version="1.0" encoding="UTF-8" standalone="no"?>
<svg
   xmlns:dc="http://purl.org/dc/elements/1.1/"
   xmlns:cc="http://creativecommons.org/ns#"
   xmlns:rdf="http://www.w3.org/1999/02/22-rdf-syntax-ns#"
   xmlns:svg="http://www.w3.org/2000/svg"
   xmlns="http://www.w3.org/2000/svg"
   xmlns:sodipodi="http://sodipodi.sourceforge.net/DTD/sodipodi-0.dtd"
   xmlns:inkscape="http://www.inkscape.org/namespaces/inkscape"
   data-dec="114"
   width="16"
   height="40"
   version="1.1"
   id="svg4"
   sodipodi:docname="114.svg"
   inkscape:version="0.92.4 (unknown)">
  <metadata
     id="metadata10">
    <rdf:RDF>
      <cc:Work
         rdf:about="">
        <dc:format>image/svg+xml</dc:format>
        <dc:type
           rdf:resource="http://purl.org/dc/dcmitype/StillImage" />
      </cc:Work>
    </rdf:RDF>
  </metadata>
  <defs
     id="defs8" />
  <sodipodi:namedview
     pagecolor="#ffffff"
     bordercolor="#666666"
     borderopacity="1"
     objecttolerance="10"
     gridtolerance="10"
     guidetolerance="10"
     inkscape:pageopacity="0"
     inkscape:pageshadow="2"
     inkscape:window-width="640"
     inkscape:window-height="480"
     id="namedview6"
     showgrid="false"
     inkscape:zoom="5.9"
     inkscape:cx="8"
     inkscape:cy="20"
     inkscape:window-x="0"
     inkscape:window-y="27"
     inkscape:window-maximized="0"
     inkscape:current-layer="svg4" />
  <path
     style="color:#000000;font-style:normal;font-variant:normal;font-weight:normal;font-stretch:normal;font-size:medium;line-height:normal;font-family:sans-serif;font-variant-ligatures:normal;font-variant-position:normal;font-variant-caps:normal;font-variant-numeric:normal;font-variant-alternates:normal;font-feature-settings:normal;text-indent:0;text-align:start;text-decoration:none;text-decoration-line:none;text-decoration-style:solid;text-decoration-color:#000000;letter-spacing:normal;word-spacing:normal;text-transform:none;writing-mode:lr-tb;direction:ltr;text-orientation:mixed;dominant-baseline:auto;baseline-shift:baseline;text-anchor:start;white-space:normal;shape-padding:0;clip-rule:nonzero;display:inline;overflow:visible;visibility:visible;opacity:1;isolation:auto;mix-blend-mode:normal;color-interpolation:sRGB;color-interpolation-filters:linearRGB;solid-color:#000000;solid-opacity:1;vector-effect:none;fill:#013272;fill-opacity:1;fill-rule:nonzero;stroke:none;stroke-width:2.5;stroke-linecap:round;stroke-linejoin:round;stroke-miterlimit:4;stroke-dasharray:none;stroke-dashoffset:0;stroke-opacity:1;color-rendering:auto;image-rendering:auto;shape-rendering:auto;text-rendering:auto;enable-background:accumulate"
     d="M 5.9863281,6.7382812 A 1.250125,1.250125 0 0 1 6.1523438,6.75 H 7 a 1.250125,1.250125 0 0 1 0.8847656,0.3652344 l 1,1 A 1.250125,1.250125 0 0 1 9.25,8.9804688 l 0.865234,-0.8652344 a 1.250125,1.250125 0 0 1 0.326172,-0.2324219 l 2,-1 A 1.250125,1.250125 0 0 1 13,6.75 h 2 a 1.250125,1.250125 0 0 1 0.884766,0.3652344 l 1,1 A 1.250125,1.250125 0 0 1 17.25,9 v 1 a 1.250125,1.250125 0 0 1 -0.365234,0.884766 l -1,1 a 1.250125,1.250125 0 0 1 -1.769532,0 l -1,-1 A 1.250125,1.250125 0 0 1 12.873047,9.4609375 l -1.132813,0.5664065 -1.71289,1.71289 -1.8574221,3.712891 -1.96875,6.890625 A 1.250125,1.250125 0 0 1 4.4960938,23.162109 1.250125,1.250125 0 0 1 2.7988281,21.65625 L 4.7929688,14.675781 5.75,10.845703 V 9.5175781 L 5.4824219,9.25 H 4.5175781 l -1.4902343,1.490234 -0.9101563,1.81836 a 1.250125,1.250125 0 1 1 -2.234375,-1.117188 l 1,-1.9999998 A 1.250125,1.250125 0 0 1 1.1152344,9.1152344 l 2,-2 A 1.250125,1.250125 0 0 1 4,6.75 h 1.8203125 a 1.250125,1.250125 0 0 1 0.1660156,-0.011719 z"
     id="path2" />
</svg>
