<?xml version="1.0" encoding="UTF-8" standalone="no"?>
<svg
   xmlns:dc="http://purl.org/dc/elements/1.1/"
   xmlns:cc="http://creativecommons.org/ns#"
   xmlns:rdf="http://www.w3.org/1999/02/22-rdf-syntax-ns#"
   xmlns:svg="http://www.w3.org/2000/svg"
   xmlns="http://www.w3.org/2000/svg"
   xmlns:sodipodi="http://sodipodi.sourceforge.net/DTD/sodipodi-0.dtd"
   xmlns:inkscape="http://www.inkscape.org/namespaces/inkscape"
   data-dec="83"
   id="dec_83"
   width="20"
   height="40"
   version="1.1"
   sodipodi:docname="83.svg"
   inkscape:version="0.91 r13725">
  <metadata
     id="metadata9">
    <rdf:RDF>
      <cc:Work
         rdf:about="">
        <dc:format>image/svg+xml</dc:format>
        <dc:type
           rdf:resource="http://purl.org/dc/dcmitype/StillImage" />
      </cc:Work>
    </rdf:RDF>
  </metadata>
  <defs
     id="defs7" />
  <sodipodi:namedview
     pagecolor="#ffffff"
     bordercolor="#666666"
     borderopacity="1"
     objecttolerance="10"
     gridtolerance="10"
     guidetolerance="10"
     inkscape:pageopacity="0"
     inkscape:pageshadow="2"
     inkscape:window-width="1333"
     inkscape:window-height="744"
     id="namedview5"
     showgrid="true"
     inkscape:zoom="16.68772"
     inkscape:cx="-9.1075539"
     inkscape:cy="24.56151"
     inkscape:window-x="33"
     inkscape:window-y="924"
     inkscape:window-maximized="1"
     inkscape:current-layer="dec_83">
    <inkscape:grid
       type="xygrid"
       id="grid11" />
  </sodipodi:namedview>
  <path
     style="color:#000000;font-style:normal;font-variant:normal;font-weight:normal;font-stretch:normal;font-size:medium;line-height:normal;font-family:sans-serif;text-indent:0;text-align:start;text-decoration:none;text-decoration-line:none;text-decoration-style:solid;text-decoration-color:#000000;letter-spacing:normal;word-spacing:normal;text-transform:none;direction:ltr;block-progression:tb;writing-mode:lr-tb;baseline-shift:baseline;text-anchor:start;white-space:normal;clip-rule:nonzero;display:inline;overflow:visible;visibility:visible;opacity:1;isolation:auto;mix-blend-mode:normal;color-interpolation:sRGB;color-interpolation-filters:linearRGB;solid-color:#000000;solid-opacity:1;fill:#000000;fill-opacity:1;fill-rule:nonzero;stroke:none;stroke-width:1px;stroke-linecap:round;stroke-linejoin:round;stroke-miterlimit:4;stroke-dasharray:none;stroke-dashoffset:0;stroke-opacity:1;color-rendering:auto;image-rendering:auto;shape-rendering:auto;text-rendering:auto;enable-background:accumulate"
     d="M 8 0.5 A 0.50005 0.50005 0 0 0 7.8417969 0.52539062 L 4.8417969 1.5253906 A 0.50005 0.50005 0 0 0 4.6464844 1.6464844 L 2.6464844 3.6464844 A 0.50005 0.50005 0 0 0 2.5 4 L 2.5 6 A 0.50005 0.50005 0 0 0 2.5527344 6.2226562 L 3.5527344 8.2226562 A 0.50005 0.50005 0 0 0 3.6464844 8.3535156 L 4.6464844 9.3535156 A 0.50005 0.50005 0 0 0 4.7773438 9.4472656 L 6.7773438 10.447266 A 0.50005 0.50005 0 0 0 6.8144531 10.464844 L 11.794922 12.457031 L 13.703125 13.410156 L 14.589844 14.296875 L 15.5 16.117188 L 15.5 17.792969 L 14.703125 18.589844 L 12.882812 19.5 L 9 19.5 L 7.2207031 19.5 L 6.3515625 18.644531 L 5.3535156 17.646484 A 0.50005 0.50005 0 0 0 5 17.5 L 4.0351562 17.5 L 4 17.5 L 3 17.5 A 0.50005 0.50005 0 0 0 2.5 18 L 2.5 19 A 0.50005 0.50005 0 0 0 2.6464844 19.353516 L 4.6464844 21.353516 A 0.50005 0.50005 0 0 0 4.8789062 21.484375 L 8.8964844 22.484375 A 0.50005 0.50005 0 0 0 9.0175781 22.5 L 13.017578 22.5 A 0.50005 0.50005 0 0 0 13.175781 22.474609 L 16.175781 21.474609 A 0.50005 0.50005 0 0 0 16.371094 21.353516 L 18.371094 19.353516 A 0.50005 0.50005 0 0 0 18.517578 19 L 18.517578 16 A 0.50005 0.50005 0 0 0 18.464844 15.777344 L 17.464844 13.777344 A 0.50005 0.50005 0 0 0 17.371094 13.646484 L 15.371094 11.646484 A 0.50005 0.50005 0 0 0 15.240234 11.552734 L 13.240234 10.552734 A 0.50005 0.50005 0 0 0 13.203125 10.535156 L 8.2226562 8.5429688 L 6.3886719 7.6269531 L 5.5 5.8476562 L 5.5 4.2070312 L 6.2070312 3.5 L 12.882812 3.5 L 14.703125 4.4101562 L 15.646484 5.3535156 A 0.50005 0.50005 0 0 0 16 5.5 L 16.929688 5.5 A 0.50005 0.50005 0 0 0 17.076172 5.5 L 17.925781 5.5 A 0.50005 0.50005 0 0 0 18.324219 5.3867188 A 0.50005 0.50005 0 0 0 18.34375 5.3710938 A 0.50005 0.50005 0 0 0 18.357422 5.3554688 A 0.50005 0.50005 0 0 0 18.501953 4.9277344 L 18.515625 4.0898438 A 0.50005 0.50005 0 0 0 18.515625 4.0839844 A 0.50005 0.50005 0 0 0 18.5 3.8632812 A 0.50005 0.50005 0 0 0 18.5 3.859375 A 0.50005 0.50005 0 0 0 18.494141 3.84375 A 0.50005 0.50005 0 0 0 18.476562 3.796875 A 0.50005 0.50005 0 0 0 18.453125 3.7519531 A 0.50005 0.50005 0 0 0 18.320312 3.5957031 L 16.371094 1.6464844 A 0.50005 0.50005 0 0 0 16.175781 1.5253906 L 13.175781 0.52539062 A 0.50005 0.50005 0 0 0 13.017578 0.5 L 12.035156 0.5 L 12 0.5 L 9.0175781 0.5 L 8 0.5 z M 13.515625 2.6992188 L 15.644531 3.4082031 L 16.175781 4.46875 L 15.353516 3.6464844 A 0.50005 0.50005 0 0 0 15.222656 3.5527344 L 13.515625 2.6992188 z M 16.806641 3.4980469 L 17.513672 4.203125 L 17.507812 4.5 L 17.308594 4.5 L 16.806641 3.4980469 z M 4.5 6 A 0.50005 0.50005 0 0 0 5 6.5 L 4.7070312 6.5 L 5.2089844 7.5019531 L 4.5 6.7929688 L 4.5 6 z M 16.185547 13.875 L 16.605469 14.296875 L 17.029297 15.142578 L 16.185547 13.875 z M 17.5 16.082031 L 17.517578 16.117188 L 17.517578 18.792969 L 16.806641 19.501953 L 17.447266 18.222656 A 0.50005 0.50005 0 0 0 17.5 18 L 17.5 16.082031 z M 4.5 18.5 L 4.7929688 18.5 L 5.6464844 19.353516 A 0.50005 0.50005 0 0 0 5.6503906 19.357422 L 6.1601562 19.859375 L 5.2695312 19.5625 L 4.5 18.792969 L 4.5 18.5 z M 16.175781 18.53125 L 15.644531 19.591797 L 13.515625 20.300781 L 15.222656 19.447266 A 0.50005 0.50005 0 0 0 15.353516 19.353516 L 16.175781 18.53125 z "
     id="path17" />
</svg>
