<?xml version="1.0" encoding="UTF-8"?>
<glyph name="parenleft" format="1">
  <advance width="404"/>
  <unicode hex="0028"/>
  <outline>
    <contour>
      <point x="318" y="768" type="curve" smooth="yes"/>
      <point x="319" y="768" type="line" smooth="yes"/>
      <point x="331" y="768"/>
      <point x="340" y="758"/>
      <point x="340" y="746" type="curve" smooth="yes"/>
      <point x="340" y="740"/>
      <point x="336" y="733"/>
      <point x="333" y="730" type="curve" smooth="yes"/>
      <point x="278" y="674" type="line"/>
      <point x="223" y="563" type="line"/>
      <point x="195" y="480" type="line"/>
      <point x="166" y="338" type="line"/>
      <point x="166" y="227" type="line"/>
      <point x="195" y="86" type="line"/>
      <point x="223" y="1" type="line"/>
      <point x="278" y="-110" type="line"/>
      <point x="333" y="-165" type="line" smooth="yes"/>
      <point x="336" y="-168"/>
      <point x="340" y="-174"/>
      <point x="340" y="-180" type="curve" smooth="yes"/>
      <point x="340" y="-192"/>
      <point x="330" y="-202"/>
      <point x="318" y="-202" type="curve" smooth="yes"/>
      <point x="312" y="-202"/>
      <point x="305" y="-199"/>
      <point x="302" y="-196" type="curve" smooth="yes"/>
      <point x="246" y="-140" type="line"/>
      <point x="245" y="-139" type="line"/>
      <point x="244" y="-136" type="line"/>
      <point x="243" y="-136" type="line"/>
      <point x="243" y="-135" type="line"/>
      <point x="242" y="-135" type="line"/>
      <point x="242" y="-134" type="line"/>
      <point x="185" y="-48" type="line" smooth="yes"/>
      <point x="185" y="-47"/>
      <point x="184" y="-47"/>
      <point x="184" y="-46" type="curve" smooth="yes"/>
      <point x="125" y="70" type="line" smooth="yes"/>
      <point x="124" y="71"/>
      <point x="123" y="75"/>
      <point x="123" y="76" type="curve" smooth="yes"/>
      <point x="95" y="220" type="line"/>
      <point x="95" y="224" type="line"/>
      <point x="95" y="340" type="line"/>
      <point x="95" y="344" type="line"/>
      <point x="123" y="490" type="line" smooth="yes"/>
      <point x="123" y="491"/>
      <point x="124" y="494"/>
      <point x="125" y="495" type="curve" smooth="yes"/>
      <point x="184" y="610" type="line" smooth="yes"/>
      <point x="184" y="611"/>
      <point x="185" y="612"/>
      <point x="185" y="613" type="curve" smooth="yes"/>
      <point x="242" y="700" type="line"/>
      <point x="243" y="700" type="line" smooth="yes"/>
      <point x="244" y="701"/>
      <point x="244" y="702"/>
      <point x="245" y="703" type="curve" smooth="yes"/>
      <point x="245" y="704" type="line"/>
      <point x="246" y="704" type="line"/>
      <point x="302" y="761" type="line" smooth="yes"/>
      <point x="305" y="764"/>
      <point x="314" y="768"/>
    </contour>
  </outline>
  <lib>
    <dict>
      <key>com.fontlab.hintData</key>
      <dict>
        <key>hhints</key>
        <array>
          <dict>
            <key>position</key>
            <integer>-202</integer>
            <key>width</key>
            <integer>23</integer>
          </dict>
        </array>
        <key>vhints</key>
        <array>
          <dict>
            <key>position</key>
            <integer>95</integer>
            <key>width</key>
            <integer>72</integer>
          </dict>
        </array>
      </dict>
    </dict>
  </lib>
</glyph>
