<?xml version="1.0" encoding="UTF-8"?>
<glyph name="eight" format="2">
  <advance width="491"/>
  <unicode hex="0038"/>
  <outline>
    <contour>
      <point x="210" y="290" type="line"/>
      <point x="140" y="266" type="line"/>
      <point x="122" y="250" type="line"/>
      <point x="101" y="207" type="line"/>
      <point x="101" y="169" type="line"/>
      <point x="122" y="128" type="line"/>
      <point x="140" y="111" type="line"/>
      <point x="210" y="87" type="line"/>
      <point x="283" y="87" type="line"/>
      <point x="353" y="111" type="line"/>
      <point x="370" y="128" type="line"/>
      <point x="390" y="169" type="line"/>
      <point x="390" y="207" type="line"/>
      <point x="370" y="250" type="line"/>
      <point x="353" y="266" type="line"/>
      <point x="283" y="290" type="line"/>
    </contour>
    <contour>
      <point x="213" y="550" type="line"/>
      <point x="170" y="529" type="line"/>
      <point x="152" y="510" type="line"/>
      <point x="130" y="468" type="line"/>
      <point x="130" y="460" type="line"/>
      <point x="152" y="417" type="line"/>
      <point x="170" y="398" type="line"/>
      <point x="213" y="377" type="line"/>
      <point x="279" y="377" type="line"/>
      <point x="321" y="398" type="line"/>
      <point x="341" y="417" type="line"/>
      <point x="362" y="460" type="line"/>
      <point x="362" y="468" type="line"/>
      <point x="341" y="510" type="line"/>
      <point x="321" y="529" type="line"/>
      <point x="279" y="550" type="line"/>
    </contour>
    <contour>
      <point x="202" y="637" type="curve" smooth="yes"/>
      <point x="289" y="637" type="line" smooth="yes"/>
      <point x="295" y="637"/>
      <point x="303" y="634"/>
      <point x="309" y="632" type="curve" smooth="yes"/>
      <point x="366" y="604" type="line" smooth="yes"/>
      <point x="369" y="602"/>
      <point x="376" y="597"/>
      <point x="378" y="595" type="curve" smooth="yes"/>
      <point x="407" y="566" type="line" smooth="yes"/>
      <point x="409" y="564"/>
      <point x="413" y="559"/>
      <point x="415" y="556" type="curve" smooth="yes"/>
      <point x="444" y="497" type="line" smooth="yes"/>
      <point x="446" y="491"/>
      <point x="449" y="484"/>
      <point x="449" y="478" type="curve" smooth="yes"/>
      <point x="449" y="449" type="line" smooth="yes"/>
      <point x="449" y="443"/>
      <point x="446" y="436"/>
      <point x="444" y="430" type="curve" smooth="yes"/>
      <point x="415" y="372" type="line" smooth="yes"/>
      <point x="413" y="369"/>
      <point x="409" y="363"/>
      <point x="407" y="361" type="curve" smooth="yes"/>
      <point x="392" y="345" type="line"/>
      <point x="396" y="343"/>
      <point x="404" y="339"/>
      <point x="407" y="336" type="curve" smooth="yes"/>
      <point x="436" y="306" type="line" smooth="yes"/>
      <point x="438" y="304"/>
      <point x="442" y="298"/>
      <point x="444" y="295" type="curve" smooth="yes"/>
      <point x="473" y="236" type="line" smooth="yes"/>
      <point x="475" y="230"/>
      <point x="477" y="224"/>
      <point x="477" y="218" type="curve" smooth="yes"/>
      <point x="477" y="160" type="line" smooth="yes"/>
      <point x="477" y="154"/>
      <point x="475" y="147"/>
      <point x="473" y="141" type="curve" smooth="yes"/>
      <point x="444" y="82" type="line" smooth="yes"/>
      <point x="442" y="79"/>
      <point x="438" y="74"/>
      <point x="436" y="72" type="curve" smooth="yes"/>
      <point x="407" y="42" type="line" smooth="yes"/>
      <point x="403" y="38"/>
      <point x="396" y="34"/>
      <point x="390" y="32" type="curve" smooth="yes"/>
      <point x="304" y="2" type="line" smooth="yes"/>
      <point x="301" y="1"/>
      <point x="293" y="0"/>
      <point x="289" y="0" type="curve" smooth="yes"/>
      <point x="202" y="0" type="line" smooth="yes"/>
      <point x="198" y="0"/>
      <point x="192" y="1"/>
      <point x="189" y="2" type="curve" smooth="yes"/>
      <point x="102" y="32" type="line" smooth="yes"/>
      <point x="96" y="34"/>
      <point x="89" y="38"/>
      <point x="85" y="42" type="curve" smooth="yes"/>
      <point x="56" y="72" type="line" smooth="yes"/>
      <point x="54" y="74"/>
      <point x="50" y="79"/>
      <point x="48" y="82" type="curve" smooth="yes"/>
      <point x="19" y="141" type="line" smooth="yes"/>
      <point x="17" y="147"/>
      <point x="14" y="154"/>
      <point x="14" y="160" type="curve" smooth="yes"/>
      <point x="14" y="218" type="line" smooth="yes"/>
      <point x="14" y="224"/>
      <point x="17" y="230"/>
      <point x="19" y="236" type="curve" smooth="yes"/>
      <point x="48" y="295" type="line" smooth="yes"/>
      <point x="50" y="298"/>
      <point x="54" y="304"/>
      <point x="56" y="306" type="curve" smooth="yes"/>
      <point x="85" y="336" type="line" smooth="yes"/>
      <point x="88" y="339"/>
      <point x="96" y="343"/>
      <point x="100" y="345" type="curve"/>
      <point x="85" y="361" type="line" smooth="yes"/>
      <point x="83" y="363"/>
      <point x="79" y="369"/>
      <point x="77" y="372" type="curve" smooth="yes"/>
      <point x="48" y="430" type="line" smooth="yes"/>
      <point x="46" y="436"/>
      <point x="43" y="443"/>
      <point x="43" y="449" type="curve" smooth="yes"/>
      <point x="43" y="478" type="line" smooth="yes"/>
      <point x="43" y="484"/>
      <point x="46" y="491"/>
      <point x="48" y="497" type="curve" smooth="yes"/>
      <point x="77" y="556" type="line" smooth="yes"/>
      <point x="79" y="559"/>
      <point x="83" y="564"/>
      <point x="85" y="566" type="curve" smooth="yes"/>
      <point x="114" y="595" type="line" smooth="yes"/>
      <point x="116" y="597"/>
      <point x="122" y="602"/>
      <point x="125" y="604" type="curve" smooth="yes"/>
      <point x="184" y="632" type="line" smooth="yes"/>
      <point x="190" y="634"/>
      <point x="196" y="637"/>
    </contour>
  </outline>
  <lib>
    <dict>
      <key>com.fontlab.hintData</key>
      <dict>
        <key>hhints</key>
        <array>
          <dict>
            <key>position</key>
            <integer>0</integer>
            <key>width</key>
            <integer>87</integer>
          </dict>
          <dict>
            <key>position</key>
            <integer>290</integer>
            <key>width</key>
            <integer>87</integer>
          </dict>
          <dict>
            <key>position</key>
            <integer>550</integer>
            <key>width</key>
            <integer>87</integer>
          </dict>
        </array>
        <key>vhints</key>
        <array>
          <dict>
            <key>position</key>
            <integer>14</integer>
            <key>width</key>
            <integer>87</integer>
          </dict>
          <dict>
            <key>position</key>
            <integer>391</integer>
            <key>width</key>
            <integer>87</integer>
          </dict>
        </array>
      </dict>
    </dict>
  </lib>
</glyph>
