<?xml version="1.0" encoding="UTF-8" standalone="no"?>
<svg
   xmlns:dc="http://purl.org/dc/elements/1.1/"
   xmlns:cc="http://creativecommons.org/ns#"
   xmlns:rdf="http://www.w3.org/1999/02/22-rdf-syntax-ns#"
   xmlns:svg="http://www.w3.org/2000/svg"
   xmlns="http://www.w3.org/2000/svg"
   xmlns:sodipodi="http://sodipodi.sourceforge.net/DTD/sodipodi-0.dtd"
   xmlns:inkscape="http://www.inkscape.org/namespaces/inkscape"
   data-dec="64"
   id="dec_64"
   width="28"
   height="40"
   version="1.1"
   sodipodi:docname="64.svg"
   inkscape:version="0.91 r13725">
  <metadata
     id="metadata9">
    <rdf:RDF>
      <cc:Work
         rdf:about="">
        <dc:format>image/svg+xml</dc:format>
        <dc:type
           rdf:resource="http://purl.org/dc/dcmitype/StillImage" />
      </cc:Work>
    </rdf:RDF>
  </metadata>
  <defs
     id="defs7" />
  <sodipodi:namedview
     pagecolor="#ffffff"
     bordercolor="#666666"
     borderopacity="1"
     objecttolerance="10"
     gridtolerance="10"
     guidetolerance="10"
     inkscape:pageopacity="0"
     inkscape:pageshadow="2"
     inkscape:window-width="1333"
     inkscape:window-height="744"
     id="namedview5"
     showgrid="true"
     inkscape:zoom="23.6"
     inkscape:cx="2.7711861"
     inkscape:cy="26.573634"
     inkscape:window-x="33"
     inkscape:window-y="924"
     inkscape:window-maximized="1"
     inkscape:current-layer="dec_64">
    <inkscape:grid
       type="xygrid"
       id="grid11" />
  </sodipodi:namedview>
  <path
     style="color:#000000;font-style:normal;font-variant:normal;font-weight:normal;font-stretch:normal;font-size:medium;line-height:normal;font-family:sans-serif;text-indent:0;text-align:start;text-decoration:none;text-decoration-line:none;text-decoration-style:solid;text-decoration-color:#000000;letter-spacing:normal;word-spacing:normal;text-transform:none;direction:ltr;block-progression:tb;writing-mode:lr-tb;baseline-shift:baseline;text-anchor:start;white-space:normal;clip-rule:nonzero;display:inline;overflow:visible;visibility:visible;opacity:1;isolation:auto;mix-blend-mode:normal;color-interpolation:sRGB;color-interpolation-filters:linearRGB;solid-color:#000000;solid-opacity:1;fill:#000000;fill-opacity:1;fill-rule:nonzero;stroke:none;stroke-width:1px;stroke-linecap:round;stroke-linejoin:round;stroke-miterlimit:4;stroke-dasharray:none;stroke-dashoffset:0;stroke-opacity:1;color-rendering:auto;image-rendering:auto;shape-rendering:auto;text-rendering:auto;enable-background:accumulate"
     d="M 12 0.5 A 0.50005 0.50005 0 0 0 11.841797 0.52539062 L 8.8417969 1.5253906 A 0.50005 0.50005 0 0 0 8.7773438 1.5527344 L 6.7773438 2.5527344 A 0.50005 0.50005 0 0 0 6.6464844 2.6464844 L 4.6464844 4.6464844 A 0.50005 0.50005 0 0 0 4.5527344 4.7773438 L 3.5527344 6.7773438 A 0.50005 0.50005 0 0 0 3.5253906 6.8417969 L 2.5253906 9.8417969 A 0.50005 0.50005 0 0 0 2.5 10 L 2.5 13 A 0.50005 0.50005 0 0 0 2.5253906 13.158203 L 3.5253906 16.158203 A 0.50005 0.50005 0 0 0 3.5527344 16.222656 L 4.5527344 18.222656 A 0.50005 0.50005 0 0 0 4.6464844 18.353516 L 6.6464844 20.353516 A 0.50005 0.50005 0 0 0 6.7773438 20.447266 L 8.7773438 21.447266 A 0.50005 0.50005 0 0 0 8.8417969 21.474609 L 11.841797 22.474609 A 0.50005 0.50005 0 0 0 12 22.5 L 15 22.5 A 0.50005 0.50005 0 0 0 15.158203 22.474609 L 18.158203 21.474609 A 0.50005 0.50005 0 0 0 18.353516 21.353516 L 19.353516 20.353516 L 20.310547 19.396484 A 0.50005 0.50005 0 0 0 20.482422 18.847656 A 0.50005 0.50005 0 0 0 20.482422 18.845703 A 0.50005 0.50005 0 0 0 20.464844 18.800781 A 0.50005 0.50005 0 0 0 20.464844 18.798828 A 0.50005 0.50005 0 0 0 20.443359 18.755859 A 0.50005 0.50005 0 0 0 20.441406 18.753906 A 0.50005 0.50005 0 0 0 20.417969 18.712891 A 0.50005 0.50005 0 0 0 20.416016 18.710938 A 0.50005 0.50005 0 0 0 19.939453 18.5 L 19.074219 18.5 A 0.50005 0.50005 0 0 0 18.851562 18.519531 A 0.50005 0.50005 0 0 0 18.820312 18.53125 A 0.50005 0.50005 0 0 0 18.804688 18.537109 A 0.50005 0.50005 0 0 0 18.796875 18.541016 A 0.50005 0.50005 0 0 0 18.759766 18.558594 A 0.50005 0.50005 0 0 0 18.746094 18.566406 A 0.50005 0.50005 0 0 0 18.595703 18.697266 L 17.730469 19.5625 L 14.917969 20.5 L 12.082031 20.5 L 9.1914062 19.537109 L 7.3417969 18.611328 L 5.453125 15.779297 L 4.5 12.917969 L 4.5 10.082031 L 5.4628906 7.1914062 L 6.4101562 5.296875 L 8.2558594 3.4511719 L 12.0625 2.5 L 13 2.5 L 14.980469 2.5 C 15.042989 2.512703 15.146044 2.5356353 15.283203 2.5664062 C 15.566334 2.6299273 15.979108 2.7258886 16.427734 2.8339844 C 17.297417 3.043533 18.293137 3.3017331 18.767578 3.4550781 L 21.025391 5.2851562 L 21.517578 7.1289062 A 0.50005 0.50005 0 0 0 21.525391 7.1582031 L 22.5 10.082031 L 22.5 11.917969 L 21.5625 14.730469 L 20.792969 15.5 L 20 15.5 L 19.5 15.5 L 19.5 14.03125 L 20.496094 6.0625 A 0.50005 0.50005 0 0 0 20 5.5 L 19.080078 5.5 A 0.50005 0.50005 0 0 0 18.955078 5.4941406 A 0.50005 0.50005 0 0 0 18.917969 5.5 L 18.080078 5.5 A 0.50005 0.50005 0 0 0 17.716797 5.5839844 A 0.50005 0.50005 0 0 0 17.681641 5.6074219 A 0.50005 0.50005 0 0 0 17.675781 5.6132812 A 0.50005 0.50005 0 0 0 17.642578 5.6445312 A 0.50005 0.50005 0 0 0 17.638672 5.6464844 A 0.50005 0.50005 0 0 0 17.611328 5.6777344 A 0.50005 0.50005 0 0 0 17.605469 5.6835938 A 0.50005 0.50005 0 0 0 17.582031 5.71875 A 0.50005 0.50005 0 0 0 17.494141 6.0214844 L 17.474609 6.1777344 L 16.222656 5.5527344 A 0.50005 0.50005 0 0 0 16 5.5 L 13.056641 5.5 A 0.50005 0.50005 0 0 0 12.939453 5.5 L 12.056641 5.5 A 0.50005 0.50005 0 0 0 11.851562 5.5214844 A 0.50005 0.50005 0 0 0 11.8125 5.5351562 A 0.50005 0.50005 0 0 0 11.804688 5.5390625 A 0.50005 0.50005 0 0 0 11.796875 5.5429688 A 0.50005 0.50005 0 0 0 11.761719 5.5605469 A 0.50005 0.50005 0 0 0 11.759766 5.5605469 A 0.50005 0.50005 0 0 0 11.751953 5.5644531 A 0.50005 0.50005 0 0 0 11.726562 5.5820312 A 0.50005 0.50005 0 0 0 11.722656 5.5839844 A 0.50005 0.50005 0 0 0 11.716797 5.5878906 L 8.7226562 7.5839844 A 0.50005 0.50005 0 0 0 8.6113281 7.6835938 A 0.50005 0.50005 0 0 0 8.5820312 7.7246094 A 0.50005 0.50005 0 0 0 8.5253906 7.8417969 A 0.50005 0.50005 0 0 0 8.5195312 7.8613281 L 7.5253906 10.841797 A 0.50005 0.50005 0 0 0 7.5 11 L 7.5 14 A 0.50005 0.50005 0 0 0 7.5527344 14.222656 L 8.5527344 16.222656 A 0.50005 0.50005 0 0 0 8.7773438 16.447266 L 10.777344 17.447266 A 0.50005 0.50005 0 0 0 11 17.5 L 13.976562 17.5 L 13.988281 17.5 L 14 17.5 A 0.50005 0.50005 0 0 0 14.050781 17.498047 A 0.50005 0.50005 0 0 0 14.212891 17.457031 A 0.50005 0.50005 0 0 0 14.220703 17.453125 L 16.962891 16.539062 L 18.744141 17.429688 A 0.50005 0.50005 0 0 0 19.066406 17.5 L 21 17.5 A 0.50005 0.50005 0 0 0 21.353516 17.353516 L 23.353516 15.353516 A 0.50005 0.50005 0 0 0 23.474609 15.158203 L 24.474609 12.158203 A 0.50005 0.50005 0 0 0 24.5 12 L 24.5 10 A 0.50005 0.50005 0 0 0 24.474609 9.8417969 L 23.474609 6.8417969 A 0.50005 0.50005 0 0 0 23.447266 6.7773438 L 22.447266 4.7773438 A 0.50005 0.50005 0 0 0 22.353516 4.6464844 L 20.353516 2.6464844 A 0.50005 0.50005 0 0 0 20.222656 2.5527344 L 18.222656 1.5527344 A 0.50005 0.50005 0 0 0 18.158203 1.5253906 L 15.158203 0.52539062 A 0.50005 0.50005 0 0 0 15 0.5 L 12 0.5 z M 12.990234 6.6074219 L 15.804688 6.90625 L 17.242188 8.0371094 L 16.513672 13.853516 L 15.626953 15.626953 L 15.033203 15.923828 L 11.228516 15.521484 L 9.5 13.792969 L 9.5 11.082031 L 10.419922 8.3203125 L 12.990234 6.6074219 z M 5.0371094 16.957031 L 5.7832031 18.076172 L 5.4101562 17.703125 L 5.0371094 16.957031 z "
     id="path15" />
</svg>
