<?xml version="1.0" encoding="UTF-8" standalone="no"?>
<svg
   xmlns:dc="http://purl.org/dc/elements/1.1/"
   xmlns:cc="http://creativecommons.org/ns#"
   xmlns:rdf="http://www.w3.org/1999/02/22-rdf-syntax-ns#"
   xmlns:svg="http://www.w3.org/2000/svg"
   xmlns="http://www.w3.org/2000/svg"
   xmlns:sodipodi="http://sodipodi.sourceforge.net/DTD/sodipodi-0.dtd"
   xmlns:inkscape="http://www.inkscape.org/namespaces/inkscape"
   data-dec="53"
   width="20"
   height="40"
   version="1.1"
   id="svg4"
   sodipodi:docname="53.svg"
   inkscape:version="0.92.4 (unknown)">
  <metadata
     id="metadata10">
    <rdf:RDF>
      <cc:Work
         rdf:about="">
        <dc:format>image/svg+xml</dc:format>
        <dc:type
           rdf:resource="http://purl.org/dc/dcmitype/StillImage" />
      </cc:Work>
    </rdf:RDF>
  </metadata>
  <defs
     id="defs8" />
  <sodipodi:namedview
     pagecolor="#ffffff"
     bordercolor="#666666"
     borderopacity="1"
     objecttolerance="10"
     gridtolerance="10"
     guidetolerance="10"
     inkscape:pageopacity="0"
     inkscape:pageshadow="2"
     inkscape:window-width="640"
     inkscape:window-height="480"
     id="namedview6"
     showgrid="false"
     inkscape:zoom="5.9"
     inkscape:cx="10"
     inkscape:cy="20"
     inkscape:window-x="0"
     inkscape:window-y="27"
     inkscape:window-maximized="0"
     inkscape:current-layer="svg4" />
  <path
     style="color:#000000;font-style:normal;font-variant:normal;font-weight:normal;font-stretch:normal;font-size:medium;line-height:normal;font-family:sans-serif;font-variant-ligatures:normal;font-variant-position:normal;font-variant-caps:normal;font-variant-numeric:normal;font-variant-alternates:normal;font-feature-settings:normal;text-indent:0;text-align:start;text-decoration:none;text-decoration-line:none;text-decoration-style:solid;text-decoration-color:#000000;letter-spacing:normal;word-spacing:normal;text-transform:none;writing-mode:lr-tb;direction:ltr;text-orientation:mixed;dominant-baseline:auto;baseline-shift:baseline;text-anchor:start;white-space:normal;shape-padding:0;clip-rule:nonzero;display:inline;overflow:visible;visibility:visible;opacity:1;isolation:auto;mix-blend-mode:normal;color-interpolation:sRGB;color-interpolation-filters:linearRGB;solid-color:#000000;solid-opacity:1;vector-effect:none;fill:#013272;fill-opacity:1;fill-rule:nonzero;stroke:none;stroke-width:2.5;stroke-linecap:round;stroke-linejoin:round;stroke-miterlimit:4;stroke-dasharray:none;stroke-dashoffset:0;stroke-opacity:1;color-rendering:auto;image-rendering:auto;shape-rendering:auto;text-rendering:auto;enable-background:accumulate"
     d="M 4.9804688,-0.26757812 A 1.250125,1.250125 0 0 1 5.203125,-0.25 h 9.742187 a 1.250125,1.250125 0 0 1 0.929688,0.33984375 1.250125,1.250125 0 0 1 0.287109,0.40625 1.250125,1.250125 0 0 1 0.04492,0.11523437 1.250125,1.250125 0 0 1 0,0.001953 1.250125,1.250125 0 0 1 0.05273,0.2421875 1.250125,1.250125 0 0 1 0.0078,0.125 1.250125,1.250125 0 0 1 -0.02148,0.25000005 1.250125,1.250125 0 0 1 -0.0293,0.1210937 1.250125,1.250125 0 0 1 -0.408203,0.6152344 1.250125,1.250125 0 0 1 -0.002,0 1.250125,1.250125 0 0 1 -0.59961,0.2675781 L 10.246094,3.2265625 A 1.250125,1.250125 0 0 1 10,3.25 H 5.8261719 L 4.9355469,7.7050781 7.6054688,6.8144531 A 1.250125,1.250125 0 0 1 8,6.75 h 2.857422 a 1.250125,1.250125 0 0 1 0.58789,0.080078 l 0.0098,0.00391 2.939453,0.9804687 a 1.250125,1.250125 0 0 1 0.490235,0.3007813 l 2,1.9999996 a 1.250125,1.250125 0 0 1 0.300781,0.490235 l 1,3 A 1.250125,1.250125 0 0 1 18.25,14 v 2 a 1.250125,1.250125 0 0 1 -0.06445,0.394531 l -1,3 a 1.250125,1.250125 0 0 1 -0.300781,0.490235 l -2,2 a 1.250125,1.250125 0 0 1 -0.490235,0.300781 l -2.914062,0.970703 a 1.250125,1.250125 0 0 1 -0.01953,0.0078 A 1.250125,1.250125 0 0 1 10.855469,23.25 H 8 a 1.250125,1.250125 0 0 1 -0.3945312,-0.06445 l -3,-1 A 1.250125,1.250125 0 0 1 4.1152344,21.884766 l -1,-1 A 1.250125,1.250125 0 0 1 2.8828125,20.558594 l -1,-2 A 1.250125,1.250125 0 0 1 1.75,18 v -1 a 1.250125,1.250125 0 0 1 0.3652344,-0.884766 l 1,-1 a 1.250125,1.250125 0 0 1 1.7695312,0 l 1,1 a 1.250125,1.250125 0 0 1 0,1.769532 l -1,1 a 1.250125,1.250125 0 0 1 -0.03125,0.0293 L 5.0273438,19.259766 5.6757812,19.908203 8.203125,20.75 h 2.503906 L 12.259766,19.972656 13.908203,18.324219 14.75,15.796875 v -1.59375 L 13.908203,11.675781 12.259766,10.027344 10.707031,9.25 H 8.203125 l -2.5273438,0.841797 -1.6855468,1.685547 a 1.250125,1.250125 0 0 1 -0.011719,0.01367 1.250125,1.250125 0 0 1 -1.5566406,0.335937 1.250125,1.250125 0 0 1 -0.00586,-0.002 1.250125,1.250125 0 0 1 -0.048828,-0.0293 1.250125,1.250125 0 0 1 -0.058594,-0.03516 1.250125,1.250125 0 0 1 -0.5097657,-1.429688 L 3.734375,0.94726562 a 1.250125,1.250125 0 0 1 0.4316406,-0.890625 1.250125,1.250125 0 0 1 0.025391,-0.0234375 1.250125,1.250125 0 0 1 0.7890626,-0.30078124 z"
     id="path2" />
</svg>
