<?xml version="1.0" encoding="UTF-8" standalone="no"?>
<svg
   xmlns:dc="http://purl.org/dc/elements/1.1/"
   xmlns:cc="http://creativecommons.org/ns#"
   xmlns:rdf="http://www.w3.org/1999/02/22-rdf-syntax-ns#"
   xmlns:svg="http://www.w3.org/2000/svg"
   xmlns="http://www.w3.org/2000/svg"
   xmlns:sodipodi="http://sodipodi.sourceforge.net/DTD/sodipodi-0.dtd"
   xmlns:inkscape="http://www.inkscape.org/namespaces/inkscape"
   data-dec="67"
   width="20"
   height="40"
   version="1.1"
   id="svg4"
   sodipodi:docname="67.svg"
   inkscape:version="0.92.4 (unknown)">
  <metadata
     id="metadata10">
    <rdf:RDF>
      <cc:Work
         rdf:about="">
        <dc:format>image/svg+xml</dc:format>
        <dc:type
           rdf:resource="http://purl.org/dc/dcmitype/StillImage" />
      </cc:Work>
    </rdf:RDF>
  </metadata>
  <defs
     id="defs8" />
  <sodipodi:namedview
     pagecolor="#ffffff"
     bordercolor="#666666"
     borderopacity="1"
     objecttolerance="10"
     gridtolerance="10"
     guidetolerance="10"
     inkscape:pageopacity="0"
     inkscape:pageshadow="2"
     inkscape:window-width="640"
     inkscape:window-height="480"
     id="namedview6"
     showgrid="false"
     inkscape:zoom="5.9"
     inkscape:cx="10"
     inkscape:cy="20"
     inkscape:window-x="0"
     inkscape:window-y="27"
     inkscape:window-maximized="0"
     inkscape:current-layer="svg4" />
  <path
     style="color:#000000;font-style:normal;font-variant:normal;font-weight:normal;font-stretch:normal;font-size:medium;line-height:normal;font-family:sans-serif;font-variant-ligatures:normal;font-variant-position:normal;font-variant-caps:normal;font-variant-numeric:normal;font-variant-alternates:normal;font-feature-settings:normal;text-indent:0;text-align:start;text-decoration:none;text-decoration-line:none;text-decoration-style:solid;text-decoration-color:#000000;letter-spacing:normal;word-spacing:normal;text-transform:none;writing-mode:lr-tb;direction:ltr;text-orientation:mixed;dominant-baseline:auto;baseline-shift:baseline;text-anchor:start;white-space:normal;shape-padding:0;clip-rule:nonzero;display:inline;overflow:visible;visibility:visible;opacity:1;isolation:auto;mix-blend-mode:normal;color-interpolation:sRGB;color-interpolation-filters:linearRGB;solid-color:#000000;solid-opacity:1;vector-effect:none;fill:#013272;fill-opacity:1;fill-rule:nonzero;stroke:none;stroke-width:0.5;stroke-linecap:round;stroke-linejoin:round;stroke-miterlimit:4;stroke-dasharray:none;stroke-dashoffset:0;stroke-opacity:1;color-rendering:auto;image-rendering:auto;shape-rendering:auto;text-rendering:auto;enable-background:accumulate"
     d="M 17.75,2.5371094 17.261719,4 17.75,5.4628906 Z M 7.5703125,2.0742188 7.1347656,2.21875 5.2050781,4.1484375 4.2324219,6.0957031 3.25,9.0410156 v 4.9179684 l 0.9824219,2.945313 0.9726562,1.947265 1.9296875,1.929688 0.4355469,0.144531 -1.7480469,-1.748047 a 0.250025,0.250025 0 0 1 -0.044922,-0.06641 l -1,-2 a 0.250025,0.250025 0 0 1 -0.013672,-0.0332 l -1,-3 A 0.250025,0.250025 0 0 1 3.75,14 V 9 a 0.250025,0.250025 0 0 1 0.013672,-0.078125 l 1,-3 a 0.250025,0.250025 0 0 1 0.013672,-0.033203 l 1,-2 a 0.250025,0.250025 0 0 1 0.044922,-0.066406 z M 10.001953,0.74804688 A 0.250025,0.250025 0 0 1 10.025391,0.75 H 12 a 0.250025,0.250025 0 0 1 0.07813,0.0136719 l 3,1.00000002 a 0.250025,0.250025 0 0 1 0.09961,0.058594 L 16.892578,3.5371094 17.763672,0.921875 A 0.250025,0.250025 0 0 1 18.25,1 V 7 A 0.250025,0.250025 0 0 1 17.763672,7.078125 L 16.783203,4.1386719 14.865234,2.21875 11.958984,1.25 H 10.056641 L 8.1484375,2.2050781 6.2050781,4.1484375 5.2324219,6.0957031 4.25,9.0410156 v 4.9179684 l 0.9824219,2.945313 0.9726562,1.947265 1.9433594,1.94336 L 10.056641,21.75 h 1.902343 l 2.90625,-0.96875 1.929688,-1.929688 0.982422,-1.96289 a 0.250025,0.250025 0 1 1 0.445312,0.222656 l -1,2 a 0.250025,0.250025 0 0 1 -0.04492,0.06641 l -2,2 a 0.250025,0.250025 0 0 1 -0.09961,0.05859 l -3,1 A 0.250025,0.250025 0 0 1 12,22.25 h -1.966797 a 0.250025,0.250025 0 0 1 -0.039062,0 0.250025,0.250025 0 0 1 -0.00977,0 0.250025,0.250025 0 0 1 -0.015625,-0.002 0.250025,0.250025 0 0 1 -0.023437,-0.0039 0.250025,0.250025 0 0 1 -0.00977,-0.002 0.250025,0.250025 0 0 1 -0.035156,-0.01367 L 6.921875,21.236328 a 0.250025,0.250025 0 0 1 -0.099609,-0.05859 l -2,-2 a 0.250025,0.250025 0 0 1 -0.044922,-0.06641 l -1,-2 a 0.250025,0.250025 0 0 1 -0.013672,-0.0332 l -1,-3 A 0.250025,0.250025 0 0 1 2.75,14 V 9 a 0.250025,0.250025 0 0 1 0.013672,-0.078125 l 1,-3 a 0.250025,0.250025 0 0 1 0.013672,-0.033203 l 1,-2 a 0.250025,0.250025 0 0 1 0.044922,-0.066406 l 2,-2 A 0.250025,0.250025 0 0 1 6.921875,1.7636719 L 9.9042969,0.76953125 a 0.250025,0.250025 0 0 1 0.021484,-0.007813 0.250025,0.250025 0 0 1 0.076172,-0.0136719 z"
     id="path2" />
</svg>
