<?xml version="1.0" encoding="UTF-8" standalone="no"?>
<svg
   xmlns:dc="http://purl.org/dc/elements/1.1/"
   xmlns:cc="http://creativecommons.org/ns#"
   xmlns:rdf="http://www.w3.org/1999/02/22-rdf-syntax-ns#"
   xmlns:svg="http://www.w3.org/2000/svg"
   xmlns="http://www.w3.org/2000/svg"
   xmlns:sodipodi="http://sodipodi.sourceforge.net/DTD/sodipodi-0.dtd"
   xmlns:inkscape="http://www.inkscape.org/namespaces/inkscape"
   data-dec="83"
   width="17"
   height="40"
   version="1.1"
   id="svg4"
   sodipodi:docname="83.svg"
   inkscape:version="0.92.4 (unknown)">
  <metadata
     id="metadata10">
    <rdf:RDF>
      <cc:Work
         rdf:about="">
        <dc:format>image/svg+xml</dc:format>
        <dc:type
           rdf:resource="http://purl.org/dc/dcmitype/StillImage" />
      </cc:Work>
    </rdf:RDF>
  </metadata>
  <defs
     id="defs8" />
  <sodipodi:namedview
     pagecolor="#ffffff"
     bordercolor="#666666"
     borderopacity="1"
     objecttolerance="10"
     gridtolerance="10"
     guidetolerance="10"
     inkscape:pageopacity="0"
     inkscape:pageshadow="2"
     inkscape:window-width="640"
     inkscape:window-height="480"
     id="namedview6"
     showgrid="false"
     inkscape:zoom="5.9"
     inkscape:cx="8.5"
     inkscape:cy="20"
     inkscape:window-x="0"
     inkscape:window-y="27"
     inkscape:window-maximized="0"
     inkscape:current-layer="svg4" />
  <path
     style="color:#000000;font-style:normal;font-variant:normal;font-weight:normal;font-stretch:normal;font-size:medium;line-height:normal;font-family:sans-serif;font-variant-ligatures:normal;font-variant-position:normal;font-variant-caps:normal;font-variant-numeric:normal;font-variant-alternates:normal;font-feature-settings:normal;text-indent:0;text-align:start;text-decoration:none;text-decoration-line:none;text-decoration-style:solid;text-decoration-color:#000000;letter-spacing:normal;word-spacing:normal;text-transform:none;writing-mode:lr-tb;direction:ltr;text-orientation:mixed;dominant-baseline:auto;baseline-shift:baseline;text-anchor:start;white-space:normal;shape-padding:0;clip-rule:nonzero;display:inline;overflow:visible;visibility:visible;opacity:1;isolation:auto;mix-blend-mode:normal;color-interpolation:sRGB;color-interpolation-filters:linearRGB;solid-color:#000000;solid-opacity:1;vector-effect:none;fill:#000000;fill-opacity:1;fill-rule:nonzero;stroke:none;stroke-width:1.5;stroke-linecap:round;stroke-linejoin:round;stroke-miterlimit:4;stroke-dasharray:none;stroke-dashoffset:0;stroke-opacity:1;color-rendering:auto;image-rendering:auto;shape-rendering:auto;text-rendering:auto;enable-background:accumulate"
     d="m 9.9746094,0.24609375 a 0.750075,0.750075 0 0 1 0.1894526,0.0214844 0.750075,0.750075 0 0 1 0.07227,0.0214844 0.750075,0.750075 0 0 1 0.03125,0.009766 l 0.0059,0.001953 2.96289,0.98828125 A 0.750075,0.750075 0 0 1 13.53125,1.46875 l 1,1 A 0.750075,0.750075 0 0 1 14.75,3 V 6 A 0.750075,0.750075 0 0 1 13.289062,6.2363281 L 12.34375,3.4042969 11.556641,2.6171875 9.8242188,1.75 H 6.1777344 L 4.4433594,2.6171875 3.6171875,3.4433594 2.75,5.1777344 V 5.8242188 L 3.5820312,7.4863281 6.2929688,9.2929688 11.146484,10.263672 A 0.750075,0.750075 0 0 1 11.416016,10.375 l 3,2 a 0.750075,0.750075 0 0 1 0.253906,0.289062 l 1,2 A 0.750075,0.750075 0 0 1 15.75,15 v 0.927734 a 0.750075,0.750075 0 0 1 0,0.16211 V 18 a 0.750075,0.750075 0 0 1 -0.08008,0.335938 l -1,2 A 0.750075,0.750075 0 0 1 14.53125,20.53125 l -1,1 a 0.750075,0.750075 0 0 1 -0.294922,0.179688 l -3,1 A 0.750075,0.750075 0 0 1 10,22.75 H 8 A 0.750075,0.750075 0 0 1 7.7636719,22.710938 L 4.859375,21.742188 a 0.750075,0.750075 0 0 1 -0.00781,-0.002 0.750075,0.750075 0 0 1 -0.2402344,-0.0957 L 2.6640625,20.669922 A 0.750075,0.750075 0 0 1 2.46875,20.53125 l -1,-1 A 0.750075,0.750075 0 0 1 1.25,19 V 16 A 0.750075,0.750075 0 0 1 2.7109375,15.763672 L 3.65625,18.595703 5.40625,20.34375 8.1210938,21.25 H 9.8789062 L 12.595703,20.34375 13.382812,19.556641 14.25,17.822266 V 16.175781 L 13.417969,14.513672 10.707031,12.707031 5.8535156,11.736328 A 0.750075,0.750075 0 0 1 5.5839844,11.625 l -3,-2 A 0.750075,0.750075 0 0 1 2.3300781,9.3359375 l -1,-2 A 0.750075,0.750075 0 0 1 1.25,7 V 6.0722656 a 0.750075,0.750075 0 0 1 0,-0.1621094 V 5 a 0.750075,0.750075 0 0 1 0.080078,-0.3359375 l 1,-2 A 0.750075,0.750075 0 0 1 2.46875,2.46875 l 1,-1 A 0.750075,0.750075 0 0 1 3.6640625,1.3300781 l 2,-0.99999998 A 0.750075,0.750075 0 0 1 6,0.25 h 3.8984375 a 0.750075,0.750075 0 0 1 0.076172,-0.003906 z"
     id="path2" />
</svg>
