<?xml version="1.0" encoding="UTF-8" standalone="no"?>
<svg
   xmlns:dc="http://purl.org/dc/elements/1.1/"
   xmlns:cc="http://creativecommons.org/ns#"
   xmlns:rdf="http://www.w3.org/1999/02/22-rdf-syntax-ns#"
   xmlns:svg="http://www.w3.org/2000/svg"
   xmlns="http://www.w3.org/2000/svg"
   xmlns:sodipodi="http://sodipodi.sourceforge.net/DTD/sodipodi-0.dtd"
   xmlns:inkscape="http://www.inkscape.org/namespaces/inkscape"
   data-dec="112"
   width="20"
   height="40"
   version="1.1"
   id="svg4"
   sodipodi:docname="112.svg"
   inkscape:version="0.92.4 (unknown)">
  <metadata
     id="metadata10">
    <rdf:RDF>
      <cc:Work
         rdf:about="">
        <dc:format>image/svg+xml</dc:format>
        <dc:type
           rdf:resource="http://purl.org/dc/dcmitype/StillImage" />
      </cc:Work>
    </rdf:RDF>
  </metadata>
  <defs
     id="defs8" />
  <sodipodi:namedview
     pagecolor="#ffffff"
     bordercolor="#666666"
     borderopacity="1"
     objecttolerance="10"
     gridtolerance="10"
     guidetolerance="10"
     inkscape:pageopacity="0"
     inkscape:pageshadow="2"
     inkscape:window-width="640"
     inkscape:window-height="480"
     id="namedview6"
     showgrid="false"
     inkscape:zoom="5.9"
     inkscape:cx="10"
     inkscape:cy="20"
     inkscape:window-x="0"
     inkscape:window-y="27"
     inkscape:window-maximized="0"
     inkscape:current-layer="svg4" />
  <path
     style="color:#000000;font-style:normal;font-variant:normal;font-weight:normal;font-stretch:normal;font-size:medium;line-height:normal;font-family:sans-serif;font-variant-ligatures:normal;font-variant-position:normal;font-variant-caps:normal;font-variant-numeric:normal;font-variant-alternates:normal;font-feature-settings:normal;text-indent:0;text-align:start;text-decoration:none;text-decoration-line:none;text-decoration-style:solid;text-decoration-color:#000000;letter-spacing:normal;word-spacing:normal;text-transform:none;writing-mode:lr-tb;direction:ltr;text-orientation:mixed;dominant-baseline:auto;baseline-shift:baseline;text-anchor:start;white-space:normal;shape-padding:0;clip-rule:nonzero;display:inline;overflow:visible;visibility:visible;opacity:1;isolation:auto;mix-blend-mode:normal;color-interpolation:sRGB;color-interpolation-filters:linearRGB;solid-color:#000000;solid-opacity:1;vector-effect:none;fill:#000000;fill-opacity:1;fill-rule:nonzero;stroke:none;stroke-width:1;stroke-linecap:round;stroke-linejoin:round;stroke-miterlimit:4;stroke-dasharray:none;stroke-dashoffset:0;stroke-opacity:1;color-rendering:auto;image-rendering:auto;shape-rendering:auto;text-rendering:auto;enable-background:accumulate"
     d="M 10.980469,9.5195312 7.4121094,10.412109 6.5,14.058594 v 2.859375 l 0.8867188,2.664062 3.5937502,0.898438 2.748047,-0.916016 0.833984,-0.833984 0.9375,-2.8125 v -1.835938 l -0.9375,-2.8125 -0.833984,-0.833984 z M 3.9921875,7.4921875 A 0.50005,0.50005 0 0 1 4.0800781,7.5 h 0.8378907 a 0.50005,0.50005 0 0 1 0.1621093,0 H 6 A 0.50005,0.50005 0 0 1 6.5,8 V 8.7929688 L 6.6464844,8.6464844 a 0.50005,0.50005 0 0 1 0.1308594,-0.09375 l 2,-1 A 0.50005,0.50005 0 0 1 9,7.5 h 1 2 1 a 0.50005,0.50005 0 0 1 0.222656,0.052734 l 2,1 a 0.50005,0.50005 0 0 1 0.13086,0.09375 l 2,1.9999996 a 0.50005,0.50005 0 0 1 0.121093,0.195313 l 1,3 A 0.50005,0.50005 0 0 1 18.5,14 v 2 a 0.50005,0.50005 0 0 1 -0.02539,0.158203 l -1,3 a 0.50005,0.50005 0 0 1 -0.121093,0.195313 l -2,2 a 0.50005,0.50005 0 0 1 -0.13086,0.09375 l -2,1 A 0.50005,0.50005 0 0 1 13,22.5 H 12 10 9 a 0.50005,0.50005 0 0 1 -0.2226562,-0.05273 l -2,-1 A 0.50005,0.50005 0 0 1 6.6464844,21.353516 L 6.5,21.207031 v 7.710938 a 0.50005,0.50005 0 0 1 -0.1035156,0.394531 0.50005,0.50005 0 0 1 -0.00195,0.0039 0.50005,0.50005 0 0 1 -0.03125,0.0332 0.50005,0.50005 0 0 1 -0.00195,0.0039 0.50005,0.50005 0 0 1 -0.033203,0.03125 0.50005,0.50005 0 0 1 -0.00391,0.002 A 0.50005,0.50005 0 0 1 5.9199219,29.5 H 5.0820312 a 0.50005,0.50005 0 0 1 -0.1621093,0 H 4 A 0.50005,0.50005 0 0 1 3.5,29 V 8.0820312 A 0.50005,0.50005 0 0 1 3.6035156,7.6875 a 0.50005,0.50005 0 0 1 0.00195,-0.00391 0.50005,0.50005 0 0 1 0.03125,-0.033203 0.50005,0.50005 0 0 1 0.00195,-0.00391 0.50005,0.50005 0 0 1 0.017578,-0.017578 0.50005,0.50005 0 0 1 0.019531,-0.015625 0.50005,0.50005 0 0 1 0.3164063,-0.1210937 z"
     id="path2" />
</svg>
