<?xml version="1.0" encoding="UTF-8" standalone="no"?>
<svg
   xmlns:dc="http://purl.org/dc/elements/1.1/"
   xmlns:cc="http://creativecommons.org/ns#"
   xmlns:rdf="http://www.w3.org/1999/02/22-rdf-syntax-ns#"
   xmlns:svg="http://www.w3.org/2000/svg"
   xmlns="http://www.w3.org/2000/svg"
   xmlns:sodipodi="http://sodipodi.sourceforge.net/DTD/sodipodi-0.dtd"
   xmlns:inkscape="http://www.inkscape.org/namespaces/inkscape"
   data-dec="75"
   width="20"
   height="40"
   version="1.1"
   id="svg4"
   sodipodi:docname="75.svg"
   inkscape:version="0.92.4 (unknown)">
  <metadata
     id="metadata10">
    <rdf:RDF>
      <cc:Work
         rdf:about="">
        <dc:format>image/svg+xml</dc:format>
        <dc:type
           rdf:resource="http://purl.org/dc/dcmitype/StillImage" />
      </cc:Work>
    </rdf:RDF>
  </metadata>
  <defs
     id="defs8" />
  <sodipodi:namedview
     pagecolor="#ffffff"
     bordercolor="#666666"
     borderopacity="1"
     objecttolerance="10"
     gridtolerance="10"
     guidetolerance="10"
     inkscape:pageopacity="0"
     inkscape:pageshadow="2"
     inkscape:window-width="640"
     inkscape:window-height="480"
     id="namedview6"
     showgrid="false"
     inkscape:zoom="5.9"
     inkscape:cx="10"
     inkscape:cy="20"
     inkscape:window-x="0"
     inkscape:window-y="27"
     inkscape:window-maximized="0"
     inkscape:current-layer="svg4" />
  <path
     style="color:#000000;font-style:normal;font-variant:normal;font-weight:normal;font-stretch:normal;font-size:medium;line-height:normal;font-family:sans-serif;font-variant-ligatures:normal;font-variant-position:normal;font-variant-caps:normal;font-variant-numeric:normal;font-variant-alternates:normal;font-feature-settings:normal;text-indent:0;text-align:start;text-decoration:none;text-decoration-line:none;text-decoration-style:solid;text-decoration-color:#000000;letter-spacing:normal;word-spacing:normal;text-transform:none;writing-mode:lr-tb;direction:ltr;text-orientation:mixed;dominant-baseline:auto;baseline-shift:baseline;text-anchor:start;white-space:normal;shape-padding:0;clip-rule:nonzero;display:inline;overflow:visible;visibility:visible;opacity:1;isolation:auto;mix-blend-mode:normal;color-interpolation:sRGB;color-interpolation-filters:linearRGB;solid-color:#000000;solid-opacity:1;vector-effect:none;fill:#013272;fill-opacity:1;fill-rule:nonzero;stroke:none;stroke-width:1;stroke-linecap:round;stroke-linejoin:round;stroke-miterlimit:4;stroke-dasharray:none;stroke-dashoffset:0;stroke-opacity:1;color-rendering:auto;image-rendering:auto;shape-rendering:auto;text-rendering:auto;enable-background:accumulate"
     d="M 6.4980469,21.060547 A 0.50005,0.50005 0 0 1 6.0820312,21.5 H 6.5 v -0.427734 a 0.50005,0.50005 0 0 1 -0.00195,-0.01172 z m -0.9960938,-0.0039 A 0.50005,0.50005 0 0 1 5.5,21.070312 V 21.5 H 5.9140625 A 0.50005,0.50005 0 0 1 5.5019531,21.056641 Z M 10.90625,9.8007812 10.177734,10.529297 a 0.50005,0.50005 0 0 1 0.244141,0.203125 l 0.08984,0.142578 a 0.50005,0.50005 0 0 1 0.910156,-0.142578 l 1.740234,2.736328 z M 6.0859375,1.5 A 0.50005,0.50005 0 0 1 6.4980469,1.9433594 0.50005,0.50005 0 0 1 6.5,1.9296875 V 1.5 Z M 5.5,1.5 v 0.4277344 a 0.50005,0.50005 0 0 1 0.00195,0.011719 A 0.50005,0.50005 0 0 1 5.9179688,1.5 Z M 4.9921875,0.4921875 A 0.50005,0.50005 0 0 1 5.0800781,0.5 h 1.8378907 a 0.50005,0.50005 0 0 1 0.1621093,0 h 0.8476563 a 0.50005,0.50005 0 0 1 0.1503906,0 h 0.875 a 0.50005,0.50005 0 0 1 0.1113281,0 H 10 a 0.50005,0.50005 0 1 1 0,1 H 9.1171875 L 8.0390625,2.0390625 7.5,3.1171875 V 11.792969 L 10.583984,8.7089844 A 0.50005,0.50005 0 0 1 10.701172,8.5917969 L 17.292969,2 l -0.5,-0.5 H 15 a 0.50005,0.50005 0 1 1 0,-1 h 1.933594 a 0.50005,0.50005 0 0 1 0.126953,0 h 2.892578 a 0.50005,0.50005 0 0 1 0.111328,0 H 21 a 0.50005,0.50005 0 1 1 0,1 h -0.882812 l -1.81836,0.9101562 a 0.50005,0.50005 0 0 1 -0.002,0 l -0.002,0.00195 a 0.50005,0.50005 0 0 1 -0.0078,0.00586 L 11.632812,9.0742188 18.671875,20.513672 20.152344,21.5 H 21 a 0.50005,0.50005 0 1 1 0,1 h -0.933594 a 0.50005,0.50005 0 0 1 -0.123047,0 h -0.857421 a 0.50005,0.50005 0 0 1 -0.158204,0 h -0.849609 a 0.50005,0.50005 0 0 1 -0.144531,0 h -0.855469 a 0.50005,0.50005 0 0 1 -0.144531,0 h -1.873047 a 0.50005,0.50005 0 0 1 -0.134766,0 H 14 a 0.50005,0.50005 0 1 1 0,-1 h 0.792969 L 15.585938,20.707031 9.578125,11.267578 A 0.50005,0.50005 0 0 1 9.53125,11.175781 L 7.5,13.207031 v 6.675781 L 8.0390625,20.960938 9.1171875,21.5 H 10 a 0.50005,0.50005 0 1 1 0,1 H 9.0664062 a 0.50005,0.50005 0 0 1 -0.1152343,0 h -0.875 a 0.50005,0.50005 0 0 1 -0.1464844,0 H 7.0820312 a 0.50005,0.50005 0 0 1 -0.1621093,0 H 5.0820312 a 0.50005,0.50005 0 0 1 -0.1621093,0 H 4.0722656 a 0.50005,0.50005 0 0 1 -0.1503906,0 h -0.875 a 0.50005,0.50005 0 0 1 -0.1113281,0 H 2 a 0.50005,0.50005 0 1 1 0,-1 H 2.8828125 L 3.9609375,20.960938 4.5,19.882812 V 3.1171875 L 3.9609375,2.0390625 2.8828125,1.5 H 2 a 0.50005,0.50005 0 1 1 0,-1 h 0.9335938 a 0.50005,0.50005 0 0 1 0.1152343,0 h 0.875 a 0.50005,0.50005 0 0 1 0.1464844,0 h 0.8476563 a 0.50005,0.50005 0 0 1 0.074219,-0.007813 z"
     id="path2" />
</svg>
