<?xml version="1.0" encoding="UTF-8" standalone="no"?>
<svg
   xmlns:dc="http://purl.org/dc/elements/1.1/"
   xmlns:cc="http://creativecommons.org/ns#"
   xmlns:rdf="http://www.w3.org/1999/02/22-rdf-syntax-ns#"
   xmlns:svg="http://www.w3.org/2000/svg"
   xmlns="http://www.w3.org/2000/svg"
   xmlns:sodipodi="http://sodipodi.sourceforge.net/DTD/sodipodi-0.dtd"
   xmlns:inkscape="http://www.inkscape.org/namespaces/inkscape"
   data-dec="76"
   width="19"
   height="40"
   version="1.1"
   id="svg4"
   sodipodi:docname="76.svg"
   inkscape:version="0.92.4 5da689c313, 2019-01-14">
  <metadata
     id="metadata10">
    <rdf:RDF>
      <cc:Work
         rdf:about="">
        <dc:format>image/svg+xml</dc:format>
        <dc:type
           rdf:resource="http://purl.org/dc/dcmitype/StillImage" />
        <dc:title></dc:title>
      </cc:Work>
    </rdf:RDF>
  </metadata>
  <defs
     id="defs8" />
  <sodipodi:namedview
     pagecolor="#ffffff"
     bordercolor="#666666"
     borderopacity="1"
     objecttolerance="10"
     gridtolerance="10"
     guidetolerance="10"
     inkscape:pageopacity="0"
     inkscape:pageshadow="2"
     inkscape:window-width="1920"
     inkscape:window-height="1043"
     id="namedview6"
     showgrid="false"
     inkscape:zoom="5.9"
     inkscape:cx="9.5"
     inkscape:cy="20"
     inkscape:window-x="0"
     inkscape:window-y="37"
     inkscape:window-maximized="0"
     inkscape:current-layer="svg4" />
  <path
     style="color:#000000;font-style:normal;font-variant:normal;font-weight:normal;font-stretch:normal;font-size:medium;line-height:normal;font-family:sans-serif;font-variant-ligatures:normal;font-variant-position:normal;font-variant-caps:normal;font-variant-numeric:normal;font-variant-alternates:normal;font-feature-settings:normal;text-indent:0;text-align:start;text-decoration:none;text-decoration-line:none;text-decoration-style:solid;text-decoration-color:#000000;letter-spacing:normal;word-spacing:normal;text-transform:none;writing-mode:lr-tb;direction:ltr;text-orientation:mixed;dominant-baseline:auto;baseline-shift:baseline;text-anchor:start;white-space:normal;shape-padding:0;clip-rule:nonzero;display:inline;overflow:visible;visibility:visible;opacity:1;isolation:auto;mix-blend-mode:normal;color-interpolation:sRGB;color-interpolation-filters:linearRGB;solid-color:#000000;solid-opacity:1;vector-effect:none;fill:#000000;fill-opacity:1;fill-rule:nonzero;stroke:none;stroke-width:0.5;stroke-linecap:round;stroke-linejoin:round;stroke-miterlimit:4;stroke-dasharray:none;stroke-dashoffset:0;stroke-opacity:1;color-rendering:auto;image-rendering:auto;shape-rendering:auto;text-rendering:auto;enable-background:accumulate"
     d="M 5.25,21.605469 V 21.75 h 0.1445312 z m -1.5,0 L 3.6054688,21.75 H 3.75 Z m 13.693359,-1.048828 -1.332031,0.666015 a 0.250025,0.250025 0 0 1 -0.0332,0.01367 L 14.537109,21.75 h 2.308594 z M 5.25,1.25 V 1.3945312 L 5.3945312,1.25 Z m -1,0 v 0.7207031 a 0.250025,0.250025 0 0 1 0,0.060547 v 18.929688 a 0.250025,0.250025 0 0 1 0,0.07422 V 21.75 h 0.5 v -0.720703 a 0.250025,0.250025 0 0 1 0,-0.06055 V 2.0390625 a 0.250025,0.250025 0 0 1 0,-0.074219 V 1.25 Z M 3.6054688,1.25 3.75,1.3945312 V 1.25 Z M 3.9960938,0.74609375 A 0.250025,0.250025 0 0 1 4.046875,0.75 h 0.9121094 a 0.250025,0.250025 0 0 1 0.087891,0 H 6 7 a 0.250025,0.250025 0 0 1 0,0.5 H 6.1035156 L 5.25,2.1054688 V 20.894531 L 6.1054688,21.75 h 6.8574222 l 2.941406,-0.982422 1.984375,-0.990234 a 0.250025,0.250025 0 0 1 0.333984,0.333984 l -1,2 A 0.250025,0.250025 0 0 1 17,22.25 h -3.986328 a 0.250025,0.250025 0 0 1 -0.03711,0 H 6.0390625 a 0.250025,0.250025 0 0 1 -0.074219,0 H 5.0410156 a 0.250025,0.250025 0 0 1 -0.087891,0 H 4.0410156 a 0.250025,0.250025 0 0 1 -0.087891,0 H 3 2 a 0.250025,0.250025 0 0 1 0,-0.5 H 2.8964844 L 3.75,20.894531 V 2.1054688 L 2.8964844,1.25 H 2 a 0.250025,0.250025 0 0 1 0,-0.5 h 1 0.021484 0.9375 a 0.250025,0.250025 0 0 1 0.037109,-0.003906 z"
     id="path2" />
</svg>
