<?xml version="1.0" encoding="UTF-8"?>
<glyph name="A" format="1">
  <advance width="578"/>
  <unicode hex="0041"/>
  <outline>
    <contour>
      <point x="405" y="14" type="line"/>
      <point x="395" y="9" type="line"/>
      <point x="403" y="9" type="line"/>
    </contour>
    <contour>
      <point x="424" y="23" type="line"/>
      <point x="418" y="20" type="line"/>
      <point x="412" y="9" type="line"/>
      <point x="428" y="9" type="line"/>
    </contour>
    <contour>
      <point x="88" y="28" type="line"/>
      <point x="68" y="9" type="line"/>
      <point x="126" y="9" type="line"/>
    </contour>
    <contour>
      <point x="487" y="32" type="line"/>
      <point x="495" y="9" type="line"/>
      <point x="510" y="9" type="line"/>
    </contour>
    <contour>
      <point x="383" y="174" type="line"/>
      <point x="424" y="51" type="line"/>
      <point x="430" y="64" type="line" smooth="yes"/>
      <point x="431" y="65"/>
      <point x="433" y="66"/>
      <point x="434" y="66" type="curve" smooth="yes"/>
      <point x="436" y="66"/>
      <point x="439" y="65"/>
      <point x="439" y="63" type="curve" smooth="yes"/>
      <point x="439" y="62"/>
      <point x="438" y="60" type="line"/>
      <point x="427" y="38" type="line"/>
      <point x="429" y="35" type="line"/>
      <point x="432" y="37" type="line"/>
      <point x="434" y="37" type="line" smooth="yes"/>
      <point x="436" y="37"/>
      <point x="439" y="35"/>
      <point x="439" y="33" type="curve" smooth="yes"/>
      <point x="439" y="32"/>
      <point x="437" y="31"/>
      <point x="436" y="30" type="curve" smooth="yes"/>
      <point x="431" y="26" type="line"/>
      <point x="438" y="9" type="line"/>
      <point x="458" y="9" type="line"/>
      <point x="403" y="174" type="line"/>
    </contour>
    <contour>
      <point x="260" y="514" type="line"/>
      <point x="143" y="183" type="line"/>
      <point x="145" y="183" type="line"/>
      <point x="371" y="183" type="line"/>
    </contour>
    <contour>
      <point x="289" y="598" type="line"/>
      <point x="264" y="527" type="line"/>
      <point x="265" y="527" type="line"/>
      <point x="380" y="183" type="line"/>
      <point x="399" y="183" type="line"/>
      <point x="285" y="524" type="line"/>
      <point x="285" y="526" type="line" smooth="yes"/>
      <point x="285" y="528"/>
      <point x="287" y="530"/>
      <point x="289" y="530" type="curve" smooth="yes"/>
      <point x="291" y="530"/>
      <point x="294" y="528"/>
      <point x="294" y="527" type="curve" smooth="yes"/>
      <point x="409" y="180" type="line"/>
      <point x="409" y="179" type="line"/>
      <point x="466" y="9" type="line"/>
      <point x="486" y="9" type="line"/>
      <point x="474" y="45" type="line"/>
      <point x="460" y="59" type="line" smooth="yes"/>
      <point x="459" y="60"/>
      <point x="459" y="62"/>
      <point x="459" y="63" type="curve" smooth="yes"/>
      <point x="459" y="65"/>
      <point x="461" y="67"/>
      <point x="463" y="67" type="curve" smooth="yes"/>
      <point x="464" y="67"/>
      <point x="465" y="66"/>
      <point x="466" y="65" type="curve" smooth="yes"/>
      <point x="468" y="64" type="line"/>
    </contour>
    <contour>
      <point x="289" y="617" type="line"/>
      <point x="290" y="616" type="line"/>
      <point x="292" y="616" type="line"/>
      <point x="293" y="616" type="line"/>
      <point x="293" y="615" type="line"/>
      <point x="294" y="615" type="line"/>
      <point x="294" y="614" type="line"/>
      <point x="294" y="613" type="line"/>
      <point x="482" y="50" type="line"/>
      <point x="522" y="9" type="line"/>
      <point x="550" y="9" type="line" smooth="yes"/>
      <point x="552" y="9"/>
      <point x="554" y="6"/>
      <point x="554" y="4" type="curve" smooth="yes"/>
      <point x="554" y="2"/>
      <point x="552" y="0"/>
      <point x="550" y="0" type="curve" smooth="yes"/>
      <point x="521" y="0" type="line"/>
      <point x="520" y="0" type="line"/>
      <point x="493" y="0" type="line"/>
      <point x="492" y="0" type="line"/>
      <point x="464" y="0" type="line"/>
      <point x="463" y="0" type="line"/>
      <point x="462" y="0" type="line"/>
      <point x="434" y="0" type="line"/>
      <point x="433" y="0" type="line"/>
      <point x="406" y="0" type="line"/>
      <point x="405" y="0" type="line"/>
      <point x="376" y="0" type="line"/>
      <point x="348" y="0" type="line" smooth="yes"/>
      <point x="346" y="0"/>
      <point x="343" y="2"/>
      <point x="343" y="4" type="curve" smooth="yes"/>
      <point x="343" y="6"/>
      <point x="346" y="9"/>
      <point x="348" y="9" type="curve" smooth="yes"/>
      <point x="375" y="9" type="line"/>
      <point x="411" y="26" type="line"/>
      <point x="418" y="40" type="line"/>
      <point x="373" y="174" type="line"/>
      <point x="145" y="174" type="line" smooth="yes"/>
      <point x="144" y="174"/>
      <point x="142" y="174"/>
      <point x="141" y="175" type="curve" smooth="yes"/>
      <point x="92" y="35" type="line"/>
      <point x="146" y="9" type="line"/>
      <point x="202" y="9" type="line" smooth="yes"/>
      <point x="204" y="9"/>
      <point x="207" y="6"/>
      <point x="207" y="4" type="curve" smooth="yes"/>
      <point x="207" y="2"/>
      <point x="204" y="0"/>
      <point x="202" y="0" type="curve" smooth="yes"/>
      <point x="145" y="0" type="line"/>
      <point x="144" y="0" type="line"/>
      <point x="58" y="0" type="line"/>
      <point x="57" y="0" type="line"/>
      <point x="29" y="0" type="line" smooth="yes"/>
      <point x="27" y="0"/>
      <point x="24" y="2"/>
      <point x="24" y="4" type="curve" smooth="yes"/>
      <point x="24" y="6"/>
      <point x="27" y="9"/>
      <point x="29" y="9" type="curve" smooth="yes"/>
      <point x="56" y="9" type="line"/>
      <point x="84" y="35" type="line"/>
      <point x="285" y="613" type="line"/>
      <point x="286" y="614" type="line"/>
      <point x="286" y="615" type="line"/>
      <point x="286" y="616" type="line"/>
      <point x="287" y="616" type="line"/>
      <point x="288" y="616" type="line"/>
    </contour>
  </outline>
  <lib>
    <dict>
      <key>com.fontlab.hintData</key>
      <dict>
        <key>hhints</key>
        <array>
          <dict>
            <key>position</key>
            <integer>0</integer>
            <key>width</key>
            <integer>9</integer>
          </dict>
          <dict>
            <key>position</key>
            <integer>174</integer>
            <key>width</key>
            <integer>9</integer>
          </dict>
          <dict>
            <key>position</key>
            <integer>595</integer>
            <key>width</key>
            <integer>22</integer>
          </dict>
        </array>
        <key>vhints</key>
        <array>
          <dict>
            <key>position</key>
            <integer>286</integer>
            <key>width</key>
            <integer>8</integer>
          </dict>
          <dict>
            <key>position</key>
            <integer>430</integer>
            <key>width</key>
            <integer>9</integer>
          </dict>
        </array>
      </dict>
    </dict>
  </lib>
</glyph>
