<?xml version="1.0" encoding="UTF-8" standalone="no"?>
<svg
   xmlns:dc="http://purl.org/dc/elements/1.1/"
   xmlns:cc="http://creativecommons.org/ns#"
   xmlns:rdf="http://www.w3.org/1999/02/22-rdf-syntax-ns#"
   xmlns:svg="http://www.w3.org/2000/svg"
   xmlns="http://www.w3.org/2000/svg"
   xmlns:sodipodi="http://sodipodi.sourceforge.net/DTD/sodipodi-0.dtd"
   xmlns:inkscape="http://www.inkscape.org/namespaces/inkscape"
   data-dec="94"
   width="22"
   height="40"
   version="1.1"
   id="svg4"
   sodipodi:docname="94.svg"
   inkscape:version="0.92.4 (unknown)">
  <metadata
     id="metadata10">
    <rdf:RDF>
      <cc:Work
         rdf:about="">
        <dc:format>image/svg+xml</dc:format>
        <dc:type
           rdf:resource="http://purl.org/dc/dcmitype/StillImage" />
      </cc:Work>
    </rdf:RDF>
  </metadata>
  <defs
     id="defs8" />
  <sodipodi:namedview
     pagecolor="#ffffff"
     bordercolor="#666666"
     borderopacity="1"
     objecttolerance="10"
     gridtolerance="10"
     guidetolerance="10"
     inkscape:pageopacity="0"
     inkscape:pageshadow="2"
     inkscape:window-width="640"
     inkscape:window-height="480"
     id="namedview6"
     showgrid="false"
     inkscape:zoom="5.9"
     inkscape:cx="11"
     inkscape:cy="20"
     inkscape:window-x="0"
     inkscape:window-y="27"
     inkscape:window-maximized="0"
     inkscape:current-layer="svg4" />
  <path
     style="color:#000000;font-style:normal;font-variant:normal;font-weight:normal;font-stretch:normal;font-size:medium;line-height:normal;font-family:sans-serif;font-variant-ligatures:normal;font-variant-position:normal;font-variant-caps:normal;font-variant-numeric:normal;font-variant-alternates:normal;font-feature-settings:normal;text-indent:0;text-align:start;text-decoration:none;text-decoration-line:none;text-decoration-style:solid;text-decoration-color:#000000;letter-spacing:normal;word-spacing:normal;text-transform:none;writing-mode:lr-tb;direction:ltr;text-orientation:mixed;dominant-baseline:auto;baseline-shift:baseline;text-anchor:start;white-space:normal;shape-padding:0;clip-rule:nonzero;display:inline;overflow:visible;visibility:visible;opacity:1;isolation:auto;mix-blend-mode:normal;color-interpolation:sRGB;color-interpolation-filters:linearRGB;solid-color:#000000;solid-opacity:1;vector-effect:none;fill:#000000;fill-opacity:1;fill-rule:nonzero;stroke:none;stroke-width:1;stroke-linecap:round;stroke-linejoin:round;stroke-miterlimit:4;stroke-dasharray:none;stroke-dashoffset:0;stroke-opacity:1;color-rendering:auto;image-rendering:auto;shape-rendering:auto;text-rendering:auto;enable-background:accumulate"
     d="m 11,1.5 h 0.0098 0.988281 H 12 a 0.50005,0.50005 0 0 1 0.04687,0.00195 0.50005,0.50005 0 0 1 0.05078,0.00781 0.50005,0.50005 0 0 1 0.269532,0.1445313 l 4.207031,3.5058593 0.683593,0.4101563 a 0.50005,0.50005 0 0 1 0.236329,0.3574219 l 0.777343,0.6484375 a 0.50005,0.50005 0 0 1 0.0098,0.00586 0.50005,0.50005 0 0 1 0.222656,0.3730469 0.50005,0.50005 0 0 1 0,0.099609 0.50005,0.50005 0 0 1 0,0.00195 0.50005,0.50005 0 0 1 -0.002,0.00977 0.50005,0.50005 0 0 1 -0.0039,0.023438 0.50005,0.50005 0 0 1 0,0.00195 0.50005,0.50005 0 0 1 0,0.00195 0.50005,0.50005 0 0 1 0,0.00195 0.50005,0.50005 0 0 1 -0.002,0.00977 0.50005,0.50005 0 0 1 -0.0059,0.021484 0.50005,0.50005 0 0 1 -0.0039,0.013672 0.50005,0.50005 0 0 1 0,0.00195 0.50005,0.50005 0 0 1 -0.0039,0.00977 0.50005,0.50005 0 0 1 0,0.00195 0.50005,0.50005 0 0 1 -0.01172,0.033203 0.50005,0.50005 0 0 1 0,0.00195 0.50005,0.50005 0 0 1 -0.002,0.00391 0.50005,0.50005 0 0 1 -0.002,0.00195 0.50005,0.50005 0 0 1 0,0.00391 0.50005,0.50005 0 0 1 -0.002,0.00195 0.50005,0.50005 0 0 1 -0.0078,0.015625 0.50005,0.50005 0 0 1 -0.002,0.00586 0.50005,0.50005 0 0 1 -0.0059,0.00977 0.50005,0.50005 0 0 1 0,0.00195 0.50005,0.50005 0 0 1 -0.002,0.00391 0.50005,0.50005 0 0 1 -0.0039,0.00586 0.50005,0.50005 0 0 1 0,0.00195 0.50005,0.50005 0 0 1 -0.01758,0.029297 0.50005,0.50005 0 0 1 -0.002,0.00391 0.50005,0.50005 0 0 1 -0.0059,0.00781 0.50005,0.50005 0 0 1 0,0.00195 0.50005,0.50005 0 0 1 -0.02344,0.027344 0.50005,0.50005 0 0 1 0,0.00195 0.50005,0.50005 0 0 1 -0.002,0.00195 0.50005,0.50005 0 0 1 -0.0059,0.00781 0.50005,0.50005 0 0 1 -0.01758,0.017578 0.50005,0.50005 0 0 1 0,0.00195 0.50005,0.50005 0 0 1 -0.0078,0.00586 0.50005,0.50005 0 0 1 0,0.00195 0.50005,0.50005 0 0 1 -0.0059,0.00391 0.50005,0.50005 0 0 1 -0.002,0.00391 0.50005,0.50005 0 0 1 -0.002,0.00195 0.50005,0.50005 0 0 1 -0.0039,0.00391 0.50005,0.50005 0 0 1 -0.0332,0.027344 0.50005,0.50005 0 0 1 -0.03125,0.023437 0.50005,0.50005 0 0 1 -0.0098,0.00586 0.50005,0.50005 0 0 1 -0.0078,0.00586 0.50005,0.50005 0 0 1 -0.02344,0.013672 0.50005,0.50005 0 0 1 -0.01172,0.00586 0.50005,0.50005 0 0 1 -0.01172,0.00586 0.50005,0.50005 0 0 1 -0.01953,0.00781 0.50005,0.50005 0 0 1 -0.0039,0.00195 0.50005,0.50005 0 0 1 -0.0078,0.00195 0.50005,0.50005 0 0 1 -0.0039,0.00195 0.50005,0.50005 0 0 1 -0.0039,0.00195 0.50005,0.50005 0 0 1 -0.03125,0.011719 0.50005,0.50005 0 0 1 -0.0098,0.00195 0.50005,0.50005 0 0 1 -0.03906,0.00977 0.50005,0.50005 0 0 1 -0.0078,0 0.50005,0.50005 0 0 1 -0.04102,0.00586 0.50005,0.50005 0 0 1 -0.04883,0.00195 0.50005,0.50005 0 0 1 -0.02539,-0.00195 0.50005,0.50005 0 0 1 -0.02539,0 A 0.50005,0.50005 0 0 1 17.939453,7.5 H 17 A 0.50005,0.50005 0 0 1 16.5,7 V 6.71875 l -5,-2.8554688 -6.2226562,3.5527344 a 0.50005,0.50005 0 0 1 -0.00195,0.00195 0.50005,0.50005 0 0 1 -0.00781,0.00391 l -0.00586,0.00391 a 0.50005,0.50005 0 0 1 -0.029297,0.017578 0.50005,0.50005 0 0 1 -0.00781,0.00391 0.50005,0.50005 0 0 1 -0.00195,0.00195 0.50005,0.50005 0 0 1 -0.00586,0.00195 0.50005,0.50005 0 0 1 0,0.00195 0.50005,0.50005 0 0 1 -0.00977,0.00391 0.50005,0.50005 0 0 1 -0.035156,0.013672 0.50005,0.50005 0 0 1 -0.013672,0.00586 0.50005,0.50005 0 0 1 -0.025391,0.00781 0.50005,0.50005 0 0 1 -0.013672,0.00391 0.50005,0.50005 0 0 1 -0.00586,0.00195 0.50005,0.50005 0 0 1 -0.00391,0 0.50005,0.50005 0 0 1 -0.023437,0.00586 0.50005,0.50005 0 0 1 -0.00977,0.00195 0.50005,0.50005 0 0 1 -0.00586,0 0.50005,0.50005 0 0 1 -0.00977,0.00195 0.50005,0.50005 0 0 1 -0.00977,0 0.50005,0.50005 0 0 1 -0.023437,0.00391 0.50005,0.50005 0 0 1 -0.013672,0 0.50005,0.50005 0 0 1 -0.021484,0 0.50005,0.50005 0 0 1 -0.021484,0 0.50005,0.50005 0 0 1 -0.00586,0 0.50005,0.50005 0 0 1 -0.023438,-0.00195 0.50005,0.50005 0 0 1 -0.019531,-0.00391 0.50005,0.50005 0 0 1 -0.00391,0 0.50005,0.50005 0 0 1 -0.00781,-0.00195 0.50005,0.50005 0 0 1 -0.041016,-0.00781 0.50005,0.50005 0 0 1 -0.00391,0 0.50005,0.50005 0 0 1 -0.00391,-0.00195 0.50005,0.50005 0 0 1 -0.015625,-0.00586 0.50005,0.50005 0 0 1 -0.017578,-0.00586 0.50005,0.50005 0 0 1 -0.00586,-0.00195 0.50005,0.50005 0 0 1 -0.00391,0 0.50005,0.50005 0 0 1 -0.00391,-0.00195 0.50005,0.50005 0 0 1 -0.03125,-0.013672 0.50005,0.50005 0 0 1 -0.011719,-0.00391 0.50005,0.50005 0 0 1 -0.00195,-0.00195 0.50005,0.50005 0 0 1 -0.029297,-0.015625 0.50005,0.50005 0 0 1 0,-0.00195 0.50005,0.50005 0 0 1 -0.015625,-0.00781 0.50005,0.50005 0 0 1 -0.00977,-0.00781 0.50005,0.50005 0 0 1 -0.023438,-0.017578 0.50005,0.50005 0 0 1 -0.00391,-0.00195 0.50005,0.50005 0 0 1 -0.00391,-0.00195 0.50005,0.50005 0 0 1 -0.011719,-0.011719 0.50005,0.50005 0 0 1 -0.013672,-0.00977 0.50005,0.50005 0 0 1 0,-0.00195 0.50005,0.50005 0 0 1 -0.00781,-0.00586 0.50005,0.50005 0 0 1 -0.00195,-0.00195 0.50005,0.50005 0 0 1 -0.025391,-0.025391 0.50005,0.50005 0 0 1 0,-0.00195 0.50005,0.50005 0 0 1 -0.00781,-0.00781 0.50005,0.50005 0 0 1 -0.00195,-0.00195 0.50005,0.50005 0 0 1 -0.00781,-0.00977 0.50005,0.50005 0 0 1 -0.00781,-0.00977 0.50005,0.50005 0 0 1 -0.00586,-0.00781 0.50005,0.50005 0 0 1 -0.00391,-0.00586 0.50005,0.50005 0 0 1 -0.00391,-0.00391 0.50005,0.50005 0 0 1 -0.00195,-0.00391 0.50005,0.50005 0 0 1 -0.00586,-0.00781 0.50005,0.50005 0 0 1 -0.00195,-0.00586 0.50005,0.50005 0 0 1 -0.00586,-0.00977 0.50005,0.50005 0 0 1 -0.00391,-0.00391 0.50005,0.50005 0 0 1 0,-0.00195 0.50005,0.50005 0 0 1 -0.00391,-0.00586 0.50005,0.50005 0 0 1 -0.00195,-0.00391 0.50005,0.50005 0 0 1 -0.00195,-0.00391 0.50005,0.50005 0 0 1 -0.00781,-0.015625 0.50005,0.50005 0 0 1 -0.00781,-0.013672 0.50005,0.50005 0 0 1 -0.00195,-0.00195 0.50005,0.50005 0 0 1 0,-0.00195 0.50005,0.50005 0 0 1 -0.00977,-0.023437 0.50005,0.50005 0 0 1 -0.00195,-0.00391 0.50005,0.50005 0 0 1 -0.00781,-0.021484 0.50005,0.50005 0 0 1 -0.00195,-0.00977 0.50005,0.50005 0 0 1 -0.00195,-0.00781 0.50005,0.50005 0 0 1 -0.00391,-0.00977 0.50005,0.50005 0 0 1 -0.00391,-0.013672 0.50005,0.50005 0 0 1 0,-0.00195 0.50005,0.50005 0 0 1 -0.00195,-0.00977 0.50005,0.50005 0 0 1 -0.00195,-0.00391 0.50005,0.50005 0 0 1 -0.00195,-0.017578 0.50005,0.50005 0 0 1 -0.00195,-0.00781 0.50005,0.50005 0 0 1 -0.00195,-0.00781 0.50005,0.50005 0 0 1 0,-0.00195 0.50005,0.50005 0 0 1 0,-0.00586 0.50005,0.50005 0 0 1 0,-0.00195 0.50005,0.50005 0 0 1 -0.00195,-0.00781 0.50005,0.50005 0 0 1 0,-0.015625 0.50005,0.50005 0 0 1 0,-0.00195 0.50005,0.50005 0 0 1 -0.00195,-0.015625 0.50005,0.50005 0 0 1 0,-0.00781 0.50005,0.50005 0 0 1 0,-0.00391 0.50005,0.50005 0 0 1 0,-0.00195 0.50005,0.50005 0 0 1 0,-0.00195 0.50005,0.50005 0 0 1 0.00195,-0.046875 0.50005,0.50005 0 0 1 0,-0.00391 0.50005,0.50005 0 0 1 0.00195,-0.00781 0.50005,0.50005 0 0 1 0,-0.00781 0.50005,0.50005 0 0 1 0.00586,-0.029297 0.50005,0.50005 0 0 1 0,-0.00391 0.50005,0.50005 0 0 1 0.00781,-0.033203 0.50005,0.50005 0 0 1 0,-0.00195 0.50005,0.50005 0 0 1 0.00391,-0.00977 0.50005,0.50005 0 0 1 0,-0.00391 0.50005,0.50005 0 0 1 0.00781,-0.019531 0.50005,0.50005 0 0 1 0.00391,-0.011719 0.50005,0.50005 0 0 1 0,-0.00195 0.50005,0.50005 0 0 1 0.00195,-0.00586 0.50005,0.50005 0 0 1 0.00391,-0.00586 0.50005,0.50005 0 0 1 0,-0.00195 0.50005,0.50005 0 0 1 0,-0.00195 0.50005,0.50005 0 0 1 0.00195,-0.00195 0.50005,0.50005 0 0 1 0.00391,-0.00781 0.50005,0.50005 0 0 1 0.013672,-0.029297 0.50005,0.50005 0 0 1 0.019531,-0.033203 0.50005,0.50005 0 0 1 0.025391,-0.037109 0.50005,0.50005 0 0 1 0.00391,-0.00391 0.50005,0.50005 0 0 1 0.00391,-0.00586 0.50005,0.50005 0 0 1 0.00586,-0.00586 0.50005,0.50005 0 0 1 0.00195,-0.00195 0.50005,0.50005 0 0 1 0.019531,-0.023437 0.50005,0.50005 0 0 1 0.00586,-0.00586 0.50005,0.50005 0 0 1 0.00195,-0.00195 0.50005,0.50005 0 0 1 0.011719,-0.00977 0.50005,0.50005 0 0 1 0.017578,-0.017578 0.50005,0.50005 0 0 1 0.00586,-0.00391 0.50005,0.50005 0 0 1 0.00195,-0.00195 0.50005,0.50005 0 0 1 0.00195,-0.00195 l 0.00195,-0.00195 a 0.50005,0.50005 0 0 1 0.00195,-0.00195 l 0.00195,-0.00195 a 0.50005,0.50005 0 0 1 0.023437,-0.017578 L 10.628906,1.6582031 A 0.50005,0.50005 0 0 1 10.960938,1.5019531 0.50005,0.50005 0 0 1 11,1.5 Z"
     id="path2" />
</svg>
