<?xml version="1.0" encoding="UTF-8" standalone="no"?>
<svg
   xmlns:dc="http://purl.org/dc/elements/1.1/"
   xmlns:cc="http://creativecommons.org/ns#"
   xmlns:rdf="http://www.w3.org/1999/02/22-rdf-syntax-ns#"
   xmlns:svg="http://www.w3.org/2000/svg"
   xmlns="http://www.w3.org/2000/svg"
   xmlns:sodipodi="http://sodipodi.sourceforge.net/DTD/sodipodi-0.dtd"
   xmlns:inkscape="http://www.inkscape.org/namespaces/inkscape"
   data-dec="125"
   width="14"
   height="40"
   version="1.1"
   id="svg4"
   sodipodi:docname="125.svg"
   inkscape:version="0.92.4 (unknown)">
  <metadata
     id="metadata10">
    <rdf:RDF>
      <cc:Work
         rdf:about="">
        <dc:format>image/svg+xml</dc:format>
        <dc:type
           rdf:resource="http://purl.org/dc/dcmitype/StillImage" />
      </cc:Work>
    </rdf:RDF>
  </metadata>
  <defs
     id="defs8" />
  <sodipodi:namedview
     pagecolor="#ffffff"
     bordercolor="#666666"
     borderopacity="1"
     objecttolerance="10"
     gridtolerance="10"
     guidetolerance="10"
     inkscape:pageopacity="0"
     inkscape:pageshadow="2"
     inkscape:window-width="640"
     inkscape:window-height="480"
     id="namedview6"
     showgrid="false"
     inkscape:zoom="5.9"
     inkscape:cx="7"
     inkscape:cy="20"
     inkscape:window-x="0"
     inkscape:window-y="27"
     inkscape:window-maximized="0"
     inkscape:current-layer="svg4" />
  <path
     style="color:#000000;font-style:normal;font-variant:normal;font-weight:normal;font-stretch:normal;font-size:medium;line-height:normal;font-family:sans-serif;font-variant-ligatures:normal;font-variant-position:normal;font-variant-caps:normal;font-variant-numeric:normal;font-variant-alternates:normal;font-feature-settings:normal;text-indent:0;text-align:start;text-decoration:none;text-decoration-line:none;text-decoration-style:solid;text-decoration-color:#000000;letter-spacing:normal;word-spacing:normal;text-transform:none;writing-mode:lr-tb;direction:ltr;text-orientation:mixed;dominant-baseline:auto;baseline-shift:baseline;text-anchor:start;white-space:normal;shape-padding:0;clip-rule:nonzero;display:inline;overflow:visible;visibility:visible;opacity:1;isolation:auto;mix-blend-mode:normal;color-interpolation:sRGB;color-interpolation-filters:linearRGB;solid-color:#000000;solid-opacity:1;vector-effect:none;fill:#013272;fill-opacity:1;fill-rule:nonzero;stroke:none;stroke-width:1;stroke-linecap:round;stroke-linejoin:round;stroke-miterlimit:4;stroke-dasharray:none;stroke-dashoffset:0;stroke-opacity:1;color-rendering:auto;image-rendering:auto;shape-rendering:auto;text-rendering:auto;enable-background:accumulate"
     d="m 5.5,18 v 0.882812 l 0.9101562,1.820313 0.9433594,0.943359 a 0.50005,0.50005 0 0 1 0.09375,0.13086 l 1,2 A 0.50005,0.50005 0 0 1 8.5,24 V 23.117188 L 7.5898438,21.296875 6.6464844,20.353516 a 0.50005,0.50005 0 0 1 -0.09375,-0.13086 l -1,-2 A 0.50005,0.50005 0 0 1 5.5,18 Z m 3,-16 a 0.50005,0.50005 0 0 1 -0.052734,0.2226562 l -1,2 a 0.50005,0.50005 0 0 1 -0.09375,0.1308594 L 6.4101562,5.296875 5.5,7.1171875 V 8 a 0.50005,0.50005 0 0 1 0.052734,-0.2226562 l 1,-2 a 0.50005,0.50005 0 0 1 0.09375,-0.1308594 L 7.5898438,4.703125 8.5,2.8828125 Z M 4.9824219,-3.5039062 a 0.50005,0.50005 0 0 1 0.2402343,0.056641 l 1.9316407,0.9667968 a 0.50005,0.50005 0 0 1 0.00781,0.00391 0.50005,0.50005 0 0 1 0.2167968,0.1484375 l 0.9746094,0.9746094 a 0.50005,0.50005 0 0 1 0.09375,0.1308594 l 1,1.99999995 A 0.50005,0.50005 0 0 1 9.5,1 v 2 a 0.50005,0.50005 0 0 1 -0.052734,0.2226562 l -1,2 a 0.50005,0.50005 0 0 1 -0.09375,0.1308594 L 7.4101562,6.296875 6.5,8.1171875 v 1.6757813 l 1.7949219,1.7949222 1.9277341,0.964843 a 0.50005,0.50005 0 0 1 0,0.894532 L 8.2949219,14.412109 6.5,16.207031 v 1.675781 l 0.9101562,1.820313 0.9433594,0.943359 a 0.50005,0.50005 0 0 1 0.09375,0.13086 l 1,2 A 0.50005,0.50005 0 0 1 9.5,23 v 2 a 0.50005,0.50005 0 0 1 -0.052734,0.222656 l -1,2 a 0.50005,0.50005 0 0 1 -0.09375,0.13086 l -0.9726562,0.972656 -0.027344,0.02734 a 0.50005,0.50005 0 0 1 -0.00781,0.0078 A 0.50005,0.50005 0 0 1 7.15625,28.480469 L 5.2226562,29.447266 A 0.50005,0.50005 0 1 1 4.7773438,28.552734 L 6.6269531,27.626953 7.5,25.882812 V 24.117188 L 6.5898438,22.296875 5.6464844,21.353516 a 0.50005,0.50005 0 0 1 -0.09375,-0.13086 l -1,-2 A 0.50005,0.50005 0 0 1 4.5,19 v -2 a 0.50005,0.50005 0 0 1 0.052734,-0.222656 l 1,-2 a 0.50005,0.50005 0 0 1 0.2246094,-0.22461 l 1.9609374,-0.980468 a 0.50005,0.50005 0 0 1 0.082031,-0.04102 L 8.8828125,13 7.8183594,12.46875 a 0.50005,0.50005 0 0 1 -0.00781,-0.0039 0.50005,0.50005 0 0 1 -0.066406,-0.03516 L 5.7773438,11.447266 a 0.50005,0.50005 0 0 1 -0.2246094,-0.22461 l -1,-1.9999998 A 0.50005,0.50005 0 0 1 4.5,9 V 7 a 0.50005,0.50005 0 0 1 0.052734,-0.2226562 l 1,-2 a 0.50005,0.50005 0 0 1 0.09375,-0.1308594 L 6.5898438,3.703125 7.5,1.8828125 V 0.1171875 L 6.6269531,-1.6269531 4.7773438,-2.5527344 a 0.50005,0.50005 0 0 1 0.2050781,-0.9511718 z"
     id="path2" />
</svg>
