<?xml version="1.0" encoding="UTF-8" standalone="no"?>
<svg
   xmlns:dc="http://purl.org/dc/elements/1.1/"
   xmlns:cc="http://creativecommons.org/ns#"
   xmlns:rdf="http://www.w3.org/1999/02/22-rdf-syntax-ns#"
   xmlns:svg="http://www.w3.org/2000/svg"
   xmlns="http://www.w3.org/2000/svg"
   xmlns:sodipodi="http://sodipodi.sourceforge.net/DTD/sodipodi-0.dtd"
   xmlns:inkscape="http://www.inkscape.org/namespaces/inkscape"
   data-dec="109"
   width="12"
   height="40"
   version="1.1"
   id="svg4"
   sodipodi:docname="109.svg"
   inkscape:version="0.92.4 5da689c313, 2019-01-14">
  <metadata
     id="metadata10">
    <rdf:RDF>
      <cc:Work
         rdf:about="">
        <dc:format>image/svg+xml</dc:format>
        <dc:type
           rdf:resource="http://purl.org/dc/dcmitype/StillImage" />
        <dc:title></dc:title>
      </cc:Work>
    </rdf:RDF>
  </metadata>
  <defs
     id="defs8" />
  <sodipodi:namedview
     pagecolor="#ffffff"
     bordercolor="#666666"
     borderopacity="1"
     objecttolerance="10"
     gridtolerance="10"
     guidetolerance="10"
     inkscape:pageopacity="0"
     inkscape:pageshadow="2"
     inkscape:window-width="1920"
     inkscape:window-height="1043"
     id="namedview6"
     showgrid="false"
     inkscape:zoom="5.9"
     inkscape:cx="6"
     inkscape:cy="20"
     inkscape:window-x="0"
     inkscape:window-y="37"
     inkscape:window-maximized="0"
     inkscape:current-layer="svg4" />
  <path
     style="color:#000000;font-style:normal;font-variant:normal;font-weight:normal;font-stretch:normal;font-size:medium;line-height:normal;font-family:sans-serif;font-variant-ligatures:normal;font-variant-position:normal;font-variant-caps:normal;font-variant-numeric:normal;font-variant-alternates:normal;font-feature-settings:normal;text-indent:0;text-align:start;text-decoration:none;text-decoration-line:none;text-decoration-style:solid;text-decoration-color:#000000;letter-spacing:normal;word-spacing:normal;text-transform:none;writing-mode:lr-tb;direction:ltr;text-orientation:mixed;dominant-baseline:auto;baseline-shift:baseline;text-anchor:start;white-space:normal;shape-padding:0;clip-rule:nonzero;display:inline;overflow:visible;visibility:visible;opacity:1;isolation:auto;mix-blend-mode:normal;color-interpolation:sRGB;color-interpolation-filters:linearRGB;solid-color:#000000;solid-opacity:1;vector-effect:none;fill:#000000;fill-opacity:1;fill-rule:nonzero;stroke:none;stroke-width:1.5;stroke-linecap:round;stroke-linejoin:round;stroke-miterlimit:4;stroke-dasharray:none;stroke-dashoffset:0;stroke-opacity:1;color-rendering:auto;image-rendering:auto;shape-rendering:auto;text-rendering:auto;enable-background:accumulate"
     d="M 7.9609375,8.75 7.4550781,9.3808594 6.75,11.146484 V 21.25 H 7.1992188 A 0.750075,0.750075 0 0 1 7.8007812,21.537109 0.750075,0.750075 0 0 1 8.4003906,21.25 H 9.25 V 11.074219 L 8.9003906,9.3261719 8.4394531,8.75 Z M 1.9882812,7.2402344 a 0.750075,0.750075 0 0 1 0.5332032,0.2109375 0.750075,0.750075 0 0 1 0.00391,0.00391 0.750075,0.750075 0 0 1 0.00391,0.00391 0.750075,0.750075 0 0 1 0.046875,0.048828 0.750075,0.750075 0 0 1 0.00391,0.00586 0.750075,0.750075 0 0 1 0.1679688,0.3496093 L 3.0136719,7.53125 A 0.750075,0.750075 0 0 1 3.5996094,7.25 h 1.2011718 a 0.750075,0.750075 0 0 1 0.5839844,0.28125 l 0.8007813,1 a 0.750075,0.750075 0 0 1 0.015625,0.019531 0.750075,0.750075 0 0 1 0.013672,-0.019531 l 0.7988281,-1 A 0.750075,0.750075 0 0 1 7.5996094,7.25 h 1.2011718 a 0.750075,0.750075 0 0 1 0.5839844,0.28125 l 0.8007814,1 a 0.750075,0.750075 0 0 1 0.150391,0.3222656 l 0.40039,2.0000004 A 0.750075,0.750075 0 0 1 10.75,11 v 10.25 h 0.449219 a 0.750075,0.750075 0 1 1 0,1.5 h -1.076172 a 0.750075,0.750075 0 0 1 -0.2460939,0 H 8.4003906 A 0.750075,0.750075 0 0 1 7.7988281,22.462891 0.750075,0.750075 0 0 1 7.1992188,22.75 H 6.1230469 a 0.750075,0.750075 0 0 1 -0.2460938,0 H 4.8007812 a 0.750075,0.750075 0 1 1 0,-1.5 H 5.25 V 11.087891 a 0.750075,0.750075 0 0 1 0,-0.01367 v -0.0039 L 4.9003906,9.3261719 4.4394531,8.75 H 3.9609375 L 3.4550781,9.3808594 2.75,11.146484 V 21.25 h 0.4492188 a 0.750075,0.750075 0 1 1 0,1.5 H 2.1230469 a 0.750075,0.750075 0 0 1 -0.2460938,0 H 0.80078125 a 0.750075,0.750075 0 1 1 0,-1.5 H 1.25 V 11.087891 a 0.750075,0.750075 0 0 1 0,-0.148438 V 8.75 H 0.80078125 a 0.750075,0.750075 0 1 1 0,-1.5 H 1.8769531 a 0.750075,0.750075 0 0 1 0.1113281,-0.00977 z"
     id="path2" />
</svg>
