<?xml version="1.0" encoding="UTF-8" standalone="no"?>
<svg
   xmlns:dc="http://purl.org/dc/elements/1.1/"
   xmlns:cc="http://creativecommons.org/ns#"
   xmlns:rdf="http://www.w3.org/1999/02/22-rdf-syntax-ns#"
   xmlns:svg="http://www.w3.org/2000/svg"
   xmlns="http://www.w3.org/2000/svg"
   xmlns:sodipodi="http://sodipodi.sourceforge.net/DTD/sodipodi-0.dtd"
   xmlns:inkscape="http://www.inkscape.org/namespaces/inkscape"
   data-dec="38"
   width="23"
   height="40"
   version="1.1"
   id="svg4"
   sodipodi:docname="38.svg"
   inkscape:version="0.92.4 (unknown)">
  <metadata
     id="metadata10">
    <rdf:RDF>
      <cc:Work
         rdf:about="">
        <dc:format>image/svg+xml</dc:format>
        <dc:type
           rdf:resource="http://purl.org/dc/dcmitype/StillImage" />
      </cc:Work>
    </rdf:RDF>
  </metadata>
  <defs
     id="defs8" />
  <sodipodi:namedview
     pagecolor="#ffffff"
     bordercolor="#666666"
     borderopacity="1"
     objecttolerance="10"
     gridtolerance="10"
     guidetolerance="10"
     inkscape:pageopacity="0"
     inkscape:pageshadow="2"
     inkscape:window-width="640"
     inkscape:window-height="480"
     id="namedview6"
     showgrid="false"
     inkscape:zoom="5.9"
     inkscape:cx="11.5"
     inkscape:cy="20"
     inkscape:window-x="0"
     inkscape:window-y="27"
     inkscape:window-maximized="0"
     inkscape:current-layer="svg4" />
  <path
     style="color:#000000;font-style:normal;font-variant:normal;font-weight:normal;font-stretch:normal;font-size:medium;line-height:normal;font-family:sans-serif;font-variant-ligatures:normal;font-variant-position:normal;font-variant-caps:normal;font-variant-numeric:normal;font-variant-alternates:normal;font-feature-settings:normal;text-indent:0;text-align:start;text-decoration:none;text-decoration-line:none;text-decoration-style:solid;text-decoration-color:#000000;letter-spacing:normal;word-spacing:normal;text-transform:none;writing-mode:lr-tb;direction:ltr;text-orientation:mixed;dominant-baseline:auto;baseline-shift:baseline;text-anchor:start;white-space:normal;shape-padding:0;clip-rule:nonzero;display:inline;overflow:visible;visibility:visible;opacity:1;isolation:auto;mix-blend-mode:normal;color-interpolation:sRGB;color-interpolation-filters:linearRGB;solid-color:#000000;solid-opacity:1;vector-effect:none;fill:#000000;fill-opacity:1;fill-rule:nonzero;stroke:none;stroke-width:2;stroke-linecap:round;stroke-linejoin:round;stroke-miterlimit:4;stroke-dasharray:none;stroke-dashoffset:0;stroke-opacity:1;color-rendering:auto;image-rendering:auto;shape-rendering:auto;text-rendering:auto;enable-background:accumulate"
     d="M 7.953125,12.792969 7.3496094,12.943359 5.5917969,13.822266 4.8222656,14.591797 4,16.236328 v 1.527344 L 4.8222656,19.408203 5.5917969,20.177734 7.2363281,21 H 9.7636719 L 11.408203,20.177734 13.085938,18.5 10.292969,15.707031 A 1.0001,1.0001 0 0 1 10.21875,15.625 Z M 9.2363281,4 7.7460938,4.7460938 7,6.2363281 V 7.7636719 L 7.8476562,9.4589844 8.7128906,10.541016 10.650391,10.056641 12.253906,9.2539062 13,7.7636719 V 6.2363281 L 12.253906,4.7460938 10.763672,4 Z M 9,2 h 2 a 1.0001,1.0001 0 0 1 0.447266,0.1054688 l 2,1 a 1.0001,1.0001 0 0 1 0.447265,0.4472656 l 1,2 A 1.0001,1.0001 0 0 1 15,6 v 2 a 1.0001,1.0001 0 0 1 -0.105469,0.4472656 l -1,2.0000004 a 1.0001,1.0001 0 0 1 -0.447265,0.447265 l -2,1 a 1.0001,1.0001 0 0 1 -0.205078,0.07617 l -1.154297,0.289063 1.658203,2.072265 2.498047,2.498047 0.923828,-1.384766 1.964843,-2.947265 0.972657,-1.945313 a 1.0001,1.0001 0 0 1 0.1875,-0.259765 l 1,-1.0000002 a 1.0001,1.0001 0 1 1 1.414062,1.4140622 l -0.884765,0.884766 -0.927735,1.855469 a 1.0001,1.0001 0 0 1 -0.0625,0.107422 l -2,3 -1.144531,1.71875 0.01953,0.01953 1.884766,1.884765 1.855469,0.927735 a 1.0001163,1.0001163 0 1 1 -0.894532,1.789062 l -2,-1 a 1.0001,1.0001 0 0 1 -0.259765,-0.1875 L 14.5,19.914062 12.707031,21.707031 a 1.0001,1.0001 0 0 1 -0.259765,0.1875 l -2,1 A 1.0001,1.0001 0 0 1 10,23 H 7 A 1.0001,1.0001 0 0 1 6.5527344,22.894531 l -2,-1 a 1.0001,1.0001 0 0 1 -0.2597656,-0.1875 l -1,-1 a 1.0001,1.0001 0 0 1 -0.1875,-0.259765 l -1,-2 A 1.0001,1.0001 0 0 1 2,18 v -2 a 1.0001,1.0001 0 0 1 0.1054688,-0.447266 l 1,-2 a 1.0001,1.0001 0 0 1 0.1875,-0.259765 l 1,-1 a 1.0001,1.0001 0 0 1 0.2597656,-0.1875 l 2,-1 a 1.0001,1.0001 0 0 1 0.037109,-0.01563 L 6.21875,10.625 A 1.0001,1.0001 0 0 1 6.1054688,10.447266 l -1,-2.0000004 A 1.0001,1.0001 0 0 1 5,8 V 6 A 1.0001,1.0001 0 0 1 5.1054688,5.5527344 l 1,-2 A 1.0001,1.0001 0 0 1 6.5527344,3.1054688 l 2,-1 A 1.0001,1.0001 0 0 1 9,2 Z"
     id="path2" />
</svg>
