<?xml version="1.0" encoding="UTF-8" standalone="no"?>
<svg
   xmlns:dc="http://purl.org/dc/elements/1.1/"
   xmlns:cc="http://creativecommons.org/ns#"
   xmlns:rdf="http://www.w3.org/1999/02/22-rdf-syntax-ns#"
   xmlns:svg="http://www.w3.org/2000/svg"
   xmlns="http://www.w3.org/2000/svg"
   xmlns:sodipodi="http://sodipodi.sourceforge.net/DTD/sodipodi-0.dtd"
   xmlns:inkscape="http://www.inkscape.org/namespaces/inkscape"
   data-dec="121"
   width="18"
   height="40"
   version="1.1"
   id="svg4"
   sodipodi:docname="121.svg"
   inkscape:version="0.92.4 (unknown)">
  <metadata
     id="metadata10">
    <rdf:RDF>
      <cc:Work
         rdf:about="">
        <dc:format>image/svg+xml</dc:format>
        <dc:type
           rdf:resource="http://purl.org/dc/dcmitype/StillImage" />
      </cc:Work>
    </rdf:RDF>
  </metadata>
  <defs
     id="defs8" />
  <sodipodi:namedview
     pagecolor="#ffffff"
     bordercolor="#666666"
     borderopacity="1"
     objecttolerance="10"
     gridtolerance="10"
     guidetolerance="10"
     inkscape:pageopacity="0"
     inkscape:pageshadow="2"
     inkscape:window-width="615"
     inkscape:window-height="417"
     id="namedview6"
     showgrid="false"
     inkscape:zoom="5.9"
     inkscape:cx="9"
     inkscape:cy="20"
     inkscape:window-x="0"
     inkscape:window-y="27"
     inkscape:window-maximized="0"
     inkscape:current-layer="svg4" />
  <path
     style="color:#000000;font-style:normal;font-variant:normal;font-weight:normal;font-stretch:normal;font-size:medium;line-height:normal;font-family:sans-serif;font-variant-ligatures:normal;font-variant-position:normal;font-variant-caps:normal;font-variant-numeric:normal;font-variant-alternates:normal;font-feature-settings:normal;text-indent:0;text-align:start;text-decoration:none;text-decoration-line:none;text-decoration-style:solid;text-decoration-color:#000000;letter-spacing:normal;word-spacing:normal;text-transform:none;writing-mode:lr-tb;direction:ltr;text-orientation:mixed;dominant-baseline:auto;baseline-shift:baseline;text-anchor:start;white-space:normal;shape-padding:0;clip-rule:nonzero;display:inline;overflow:visible;visibility:visible;opacity:1;isolation:auto;mix-blend-mode:normal;color-interpolation:sRGB;color-interpolation-filters:linearRGB;solid-color:#000000;solid-opacity:1;vector-effect:none;fill:#013272;fill-opacity:1;fill-rule:nonzero;stroke:none;stroke-width:2;stroke-linecap:round;stroke-linejoin:round;stroke-miterlimit:4;stroke-dasharray:none;stroke-dashoffset:0;stroke-opacity:1;color-rendering:auto;image-rendering:auto;shape-rendering:auto;text-rendering:auto;enable-background:accumulate"
     d="M 3.9746094,6.9863281 A 1.0001,1.0001 0 0 1 4.1445312,7 H 7 A 1.0001,1.0001 0 1 1 7,9 H 5.5175781 L 10,19.458984 14.482422,9 H 13 a 1.0001,1.0001 0 1 1 0,-2 h 2.851562 a 1.0001,1.0001 0 0 1 0.314454,0 H 18 a 1.0001,1.0001 0 1 1 0,2 H 16.660156 L 10.96875,22.279297 a 1.0001,1.0001 0 0 1 -0.140625,0.298828 l -1.9335938,3.869141 a 1.0001,1.0001 0 0 1 -0.1875,0.259765 l -2,2 a 1.0001,1.0001 0 0 1 -0.2597656,0.1875 l -2,1 A 1.0001,1.0001 0 0 1 4,30 H 3 A 1.0001,1.0001 0 0 1 2.2929688,29.707031 l -1,-1 a 1.0001,1.0001 0 0 1 0,-1.414062 l 1,-1 A 1.0001,1.0001 0 0 1 4,27 v 0.882812 L 5.4082031,27.177734 7.1777344,25.408203 8.8964844,21.966797 3.3398438,9 H 2 A 1.0001,1.0001 0 1 1 2,7 h 1.8417969 a 1.0001,1.0001 0 0 1 0.1328125,-0.013672 z"
     id="path2" />
</svg>
