<?xml version="1.0" encoding="UTF-8" standalone="no"?>
<svg
   xmlns:dc="http://purl.org/dc/elements/1.1/"
   xmlns:cc="http://creativecommons.org/ns#"
   xmlns:rdf="http://www.w3.org/1999/02/22-rdf-syntax-ns#"
   xmlns:svg="http://www.w3.org/2000/svg"
   xmlns="http://www.w3.org/2000/svg"
   xmlns:sodipodi="http://sodipodi.sourceforge.net/DTD/sodipodi-0.dtd"
   xmlns:inkscape="http://www.inkscape.org/namespaces/inkscape"
   data-dec="35"
   width="22"
   height="40"
   version="1.1"
   id="svg4"
   sodipodi:docname="35.svg"
   inkscape:version="0.92.4 (unknown)">
  <metadata
     id="metadata10">
    <rdf:RDF>
      <cc:Work
         rdf:about="">
        <dc:format>image/svg+xml</dc:format>
        <dc:type
           rdf:resource="http://purl.org/dc/dcmitype/StillImage" />
      </cc:Work>
    </rdf:RDF>
  </metadata>
  <defs
     id="defs8" />
  <sodipodi:namedview
     pagecolor="#ffffff"
     bordercolor="#666666"
     borderopacity="1"
     objecttolerance="10"
     gridtolerance="10"
     guidetolerance="10"
     inkscape:pageopacity="0"
     inkscape:pageshadow="2"
     inkscape:window-width="640"
     inkscape:window-height="480"
     id="namedview6"
     showgrid="false"
     inkscape:zoom="5.9"
     inkscape:cx="11"
     inkscape:cy="20"
     inkscape:window-x="0"
     inkscape:window-y="27"
     inkscape:window-maximized="0"
     inkscape:current-layer="svg4" />
  <path
     style="color:#000000;font-style:normal;font-variant:normal;font-weight:normal;font-stretch:normal;font-size:medium;line-height:normal;font-family:sans-serif;font-variant-ligatures:normal;font-variant-position:normal;font-variant-caps:normal;font-variant-numeric:normal;font-variant-alternates:normal;font-feature-settings:normal;text-indent:0;text-align:start;text-decoration:none;text-decoration-line:none;text-decoration-style:solid;text-decoration-color:#000000;letter-spacing:normal;word-spacing:normal;text-transform:none;writing-mode:lr-tb;direction:ltr;text-orientation:mixed;dominant-baseline:auto;baseline-shift:baseline;text-anchor:start;white-space:normal;shape-padding:0;clip-rule:nonzero;display:inline;overflow:visible;visibility:visible;opacity:1;isolation:auto;mix-blend-mode:normal;color-interpolation:sRGB;color-interpolation-filters:linearRGB;solid-color:#000000;solid-opacity:1;vector-effect:none;fill:#000000;fill-opacity:1;fill-rule:nonzero;stroke:none;stroke-width:1;stroke-linecap:round;stroke-linejoin:round;stroke-miterlimit:4;stroke-dasharray:none;stroke-dashoffset:0;stroke-opacity:1;color-rendering:auto;image-rendering:auto;shape-rendering:auto;text-rendering:auto;enable-background:accumulate"
     d="m 8.5585938,10.5 -1.09375,5 h 4.9765622 l 1.09375,-5 z M 17.005859,-3.5097656 a 0.50005,0.50005 0 0 1 0.482422,0.6171875 L 14.777344,9.5 H 18 a 0.50005,0.50005 0 1 1 0,1 h -3.441406 l -1.09375,5 H 17 a 0.50005,0.50005 0 1 1 0,1 H 13.246094 L 10.488281,29.107422 A 0.50005,0.50005 0 1 1 9.5117188,28.892578 L 12.222656,16.5 H 7.2460938 L 4.4882812,29.107422 A 0.50005,0.50005 0 1 1 3.5117188,28.892578 L 6.2226562,16.5 H 3 a 0.50005,0.50005 0 1 1 0,-1 h 3.4414062 l 1.09375,-5 H 4 a 0.50005,0.50005 0 1 1 0,-1 H 7.7539062 L 10.511719,-3.1074219 a 0.50005,0.50005 0 0 1 0.490234,-0.4003906 0.50005,0.50005 0 0 1 0.486328,0.6152344 L 8.7773438,9.5 h 4.9765622 l 2.757813,-12.6074219 a 0.50005,0.50005 0 0 1 0.49414,-0.4023437 z"
     id="path2" />
</svg>
