<?xml version="1.0" encoding="UTF-8" standalone="no"?>
<svg
   xmlns:dc="http://purl.org/dc/elements/1.1/"
   xmlns:cc="http://creativecommons.org/ns#"
   xmlns:rdf="http://www.w3.org/1999/02/22-rdf-syntax-ns#"
   xmlns:svg="http://www.w3.org/2000/svg"
   xmlns="http://www.w3.org/2000/svg"
   xmlns:sodipodi="http://sodipodi.sourceforge.net/DTD/sodipodi-0.dtd"
   xmlns:inkscape="http://www.inkscape.org/namespaces/inkscape"
   data-dec="63"
   width="15"
   height="40"
   version="1.1"
   id="svg4"
   sodipodi:docname="63.svg"
   inkscape:version="0.92.4 5da689c313, 2019-01-14">
  <metadata
     id="metadata10">
    <rdf:RDF>
      <cc:Work
         rdf:about="">
        <dc:format>image/svg+xml</dc:format>
        <dc:type
           rdf:resource="http://purl.org/dc/dcmitype/StillImage" />
        <dc:title></dc:title>
      </cc:Work>
    </rdf:RDF>
  </metadata>
  <defs
     id="defs8" />
  <sodipodi:namedview
     pagecolor="#ffffff"
     bordercolor="#666666"
     borderopacity="1"
     objecttolerance="10"
     gridtolerance="10"
     guidetolerance="10"
     inkscape:pageopacity="0"
     inkscape:pageshadow="2"
     inkscape:window-width="1920"
     inkscape:window-height="1043"
     id="namedview6"
     showgrid="false"
     inkscape:zoom="5.9"
     inkscape:cx="7.5"
     inkscape:cy="20"
     inkscape:window-x="0"
     inkscape:window-y="37"
     inkscape:window-maximized="0"
     inkscape:current-layer="svg4" />
  <path
     style="color:#000000;font-style:normal;font-variant:normal;font-weight:normal;font-stretch:normal;font-size:medium;line-height:normal;font-family:sans-serif;font-variant-ligatures:normal;font-variant-position:normal;font-variant-caps:normal;font-variant-numeric:normal;font-variant-alternates:normal;font-feature-settings:normal;text-indent:0;text-align:start;text-decoration:none;text-decoration-line:none;text-decoration-style:solid;text-decoration-color:#000000;letter-spacing:normal;word-spacing:normal;text-transform:none;writing-mode:lr-tb;direction:ltr;text-orientation:mixed;dominant-baseline:auto;baseline-shift:baseline;text-anchor:start;white-space:normal;shape-padding:0;clip-rule:nonzero;display:inline;overflow:visible;visibility:visible;opacity:1;isolation:auto;mix-blend-mode:normal;color-interpolation:sRGB;color-interpolation-filters:linearRGB;solid-color:#000000;solid-opacity:1;vector-effect:none;fill:#000000;fill-opacity:1;fill-rule:nonzero;stroke:none;stroke-width:0.5;stroke-linecap:round;stroke-linejoin:round;stroke-miterlimit:4;stroke-dasharray:none;stroke-dashoffset:0;stroke-opacity:1;color-rendering:auto;image-rendering:auto;shape-rendering:auto;text-rendering:auto;enable-background:accumulate"
     d="m 7.25,21.25 v 0.144531 L 7.3945312,21.25 Z m -0.6445312,0 L 6.75,21.394531 V 21.25 Z M 7.25,20.605469 V 20.75 h 0.1445312 z m -0.5,0 L 6.6054688,20.75 H 6.75 Z m 0.2460938,-0.859375 a 0.250025,0.250025 0 0 1 0.023437,0.002 0.250025,0.250025 0 0 1 0.00195,0 0.250025,0.250025 0 0 1 0.046875,0.0078 0.250025,0.250025 0 0 1 0.00195,0 0.250025,0.250025 0 0 1 0.00586,0.002 0.250025,0.250025 0 0 1 0.033203,0.01367 0.250025,0.250025 0 0 1 0.00586,0.0039 0.250025,0.250025 0 0 1 0.00195,0 0.250025,0.250025 0 0 1 0.019531,0.01172 0.250025,0.250025 0 0 1 0.00195,0 0.250025,0.250025 0 0 1 0.00781,0.0059 0.250025,0.250025 0 0 1 0.011719,0.0098 0.250025,0.250025 0 0 1 0.017578,0.01563 0.250025,0.250025 0 0 1 0,0.002 0.250025,0.250025 0 0 1 0.00195,0.002 0.250025,0.250025 0 0 1 0.015625,0.01367 0.250025,0.250025 0 0 1 0,0.002 l 0.00781,0.0078 a 0.250025,0.250025 0 0 1 0.00781,0.0098 l 0.9433594,0.941406 a 0.250025,0.250025 0 0 1 0.00586,0.0039 0.250025,0.250025 0 0 1 0.00781,0.0098 0.250025,0.250025 0 0 1 0.00977,0.0078 l 0.00195,0.0039 a 0.250025,0.250025 0 0 1 0.013672,0.01367 0.250025,0.250025 0 0 1 0.037109,0.05664 0.250025,0.250025 0 0 1 0.00391,0.0059 0.250025,0.250025 0 0 1 0,0.002 0.250025,0.250025 0 0 1 0.00977,0.02344 0.250025,0.250025 0 0 1 0.00586,0.02344 0.250025,0.250025 0 0 1 0.00391,0.02539 0.250025,0.250025 0 0 1 0,0.04687 0.250025,0.250025 0 0 1 0,0.002 0.250025,0.250025 0 0 1 -0.00781,0.04687 0.250025,0.250025 0 0 1 -0.00195,0.0078 0.250025,0.250025 0 0 1 -0.013672,0.0332 0.250025,0.250025 0 0 1 -0.00391,0.0059 0.250025,0.250025 0 0 1 0,0.002 0.250025,0.250025 0 0 1 -0.011719,0.01953 0.250025,0.250025 0 0 1 -0.00586,0.0098 0.250025,0.250025 0 0 1 -0.00977,0.01172 0.250025,0.250025 0 0 1 -0.017578,0.01758 0.250025,0.250025 0 0 1 -0.00195,0.002 l -0.023437,0.02344 a 0.250025,0.250025 0 0 1 -0.00977,0.0078 l -0.9414062,0.94336 a 0.250025,0.250025 0 0 1 -0.00391,0.0059 l -0.00977,0.0078 a 0.250025,0.250025 0 0 1 -0.00781,0.0098 0.250025,0.250025 0 0 1 -0.00391,0.002 0.250025,0.250025 0 0 1 -0.013672,0.01367 0.250025,0.250025 0 0 1 -0.056641,0.03711 0.250025,0.250025 0 0 1 -0.00586,0.0039 0.250025,0.250025 0 0 1 -0.00195,0 0.250025,0.250025 0 0 1 -0.070312,0.01953 0.250025,0.250025 0 0 1 -0.00195,0 0.250025,0.250025 0 0 1 -0.046875,0 0.250025,0.250025 0 0 1 -0.00195,0 0.250025,0.250025 0 0 1 -0.046875,-0.0078 0.250025,0.250025 0 0 1 -0.00195,0 0.250025,0.250025 0 0 1 -0.00586,-0.002 0.250025,0.250025 0 0 1 -0.033203,-0.01367 0.250025,0.250025 0 0 1 -0.00586,-0.0039 0.250025,0.250025 0 0 1 -0.00195,0 0.250025,0.250025 0 0 1 -0.019531,-0.01172 0.250025,0.250025 0 0 1 -0.00195,0 0.250025,0.250025 0 0 1 -0.00781,-0.0059 0.250025,0.250025 0 0 1 -0.011719,-0.0098 0.250025,0.250025 0 0 1 -0.017578,-0.01563 0.250025,0.250025 0 0 1 0,-0.002 0.250025,0.250025 0 0 1 -0.00195,-0.002 l -0.015625,-0.01367 a 0.250025,0.250025 0 0 1 0,-0.002 0.250025,0.250025 0 0 1 -0.00781,-0.0078 l -0.00781,-0.0098 -0.9433594,-0.941406 a 0.250025,0.250025 0 0 1 -0.00586,-0.0039 0.250025,0.250025 0 0 1 -0.00781,-0.0098 0.250025,0.250025 0 0 1 -0.011719,-0.01172 0.250025,0.250025 0 0 1 -0.013672,-0.01367 0.250025,0.250025 0 0 1 -0.037109,-0.05664 0.250025,0.250025 0 0 1 -0.00391,-0.0059 0.250025,0.250025 0 0 1 0,-0.002 0.250025,0.250025 0 0 1 -0.00977,-0.02148 0.250025,0.250025 0 0 1 0,-0.002 0.250025,0.250025 0 0 1 -0.00586,-0.02344 0.250025,0.250025 0 0 1 -0.00391,-0.02539 0.250025,0.250025 0 0 1 0,-0.04687 0.250025,0.250025 0 0 1 0,-0.002 0.250025,0.250025 0 0 1 0.00781,-0.04687 0.250025,0.250025 0 0 1 0,-0.002 0.250025,0.250025 0 0 1 0.00195,-0.0059 0.250025,0.250025 0 0 1 0.013672,-0.0332 0.250025,0.250025 0 0 1 0.00391,-0.0059 0.250025,0.250025 0 0 1 0,-0.002 0.250025,0.250025 0 0 1 0.011719,-0.01953 0.250025,0.250025 0 0 1 0,-0.002 0.250025,0.250025 0 0 1 0.00586,-0.0078 0.250025,0.250025 0 0 1 0.00977,-0.01172 0.250025,0.250025 0 0 1 0.017578,-0.01758 0.250025,0.250025 0 0 1 0.00195,-0.002 l 0.013672,-0.01563 a 0.250025,0.250025 0 0 1 0.00977,-0.0078 l 0.00977,-0.0078 0.9414062,-0.94336 a 0.250025,0.250025 0 0 1 0.00391,-0.0059 0.250025,0.250025 0 0 1 0.00977,-0.0078 0.250025,0.250025 0 0 1 0.00781,-0.0098 0.250025,0.250025 0 0 1 0.00391,-0.002 0.250025,0.250025 0 0 1 0.013672,-0.01367 0.250025,0.250025 0 0 1 0.056641,-0.03711 0.250025,0.250025 0 0 1 0.00586,-0.0039 0.250025,0.250025 0 0 1 0.00195,0 0.250025,0.250025 0 0 1 0.046875,-0.01563 0.250025,0.250025 0 0 1 0.023437,-0.0039 0.250025,0.250025 0 0 1 0.00195,0 0.250025,0.250025 0 0 1 0.023438,-0.002 z M 6.75,14.058594 l -0.5,1 v 0.83789 L 7,16.644531 7.6445312,16 6.8222656,15.177734 A 0.250025,0.250025 0 0 1 6.75,15 Z m -4,-10.0000002 -0.5,1 V 5.8964844 L 3,6.6445312 3.6445312,6 2.8222656,5.1777344 A 0.250025,0.250025 0 0 1 2.75,5 Z m 7.679688,-1.984375 0.748046,0.7480468 a 0.250025,0.250025 0 0 1 0.04492,0.066406 l 1,2 A 0.250025,0.250025 0 0 1 12.25,5 v 2 a 0.250025,0.250025 0 0 1 -0.02734,0.1113281 l -1,2 a 0.250025,0.250025 0 0 1 -0.04492,0.066406 l -1,0.9999996 L 9.96875,10.386719 10.839844,9.8066406 11.794922,8.8515625 12.75,6.9414062 V 5.0585938 L 11.794922,3.1484375 10.865234,2.21875 Z M 7.9921875,0.74804688 A 0.250025,0.250025 0 0 1 8.0058594,0.75 a 0.250025,0.250025 0 0 1 0.00977,0 0.250025,0.250025 0 0 1 0.015625,0.001953 0.250025,0.250025 0 0 1 0.023437,0.003906 0.250025,0.250025 0 0 1 0.00977,0.001953 0.250025,0.250025 0 0 1 0.035156,0.0136719 L 11.078125,1.7636719 a 0.250025,0.250025 0 0 1 0.09961,0.058594 l 1,1 a 0.250025,0.250025 0 0 1 0.04492,0.066406 l 1,2 A 0.250025,0.250025 0 0 1 13.25,5 v 2 a 0.250025,0.250025 0 0 1 -0.02734,0.1113281 l -1,2 a 0.250025,0.250025 0 0 1 -0.04492,0.066406 l -1,0.9999996 a 0.250025,0.250025 0 0 1 -0.03906,0.03125 L 8.1914062,12.173828 7.25,14.058594 v 0.83789 l 0.9023438,0.900391 a 0.250025,0.250025 0 0 1 0.025391,0.02539 0.250025,0.250025 0 0 1 0.052734,0.07617 0.250025,0.250025 0 0 1 0.00195,0.002 0.250025,0.250025 0 0 1 0.019531,0.09375 0.250025,0.250025 0 0 1 0,0.0039 0.250025,0.250025 0 0 1 0,0.02148 0.250025,0.250025 0 0 1 0,0.002 0.250025,0.250025 0 0 1 -0.00391,0.02344 0.250025,0.250025 0 0 1 0,0.002 0.250025,0.250025 0 0 1 -0.00195,0.0039 0.250025,0.250025 0 0 1 -0.021484,0.06445 0.250025,0.250025 0 0 1 -0.00195,0.002 0.250025,0.250025 0 0 1 -0.044922,0.06055 l -0.023437,0.02344 a 0.250025,0.250025 0 0 1 -0.00977,0.0078 l -0.9667968,0.96875 a 0.250025,0.250025 0 0 1 -0.3554688,0 l -1,-1 A 0.250025,0.250025 0 0 1 5.75,16 v -1 a 0.250025,0.250025 0 0 1 0.027344,-0.111328 l 1,-2 a 0.250025,0.250025 0 0 1 0.044922,-0.06641 l 0.9824219,-0.980469 a 0.250025,0.250025 0 0 1 0.00977,-0.0098 0.250025,0.250025 0 0 1 0.00781,-0.0098 l 0.00391,-0.002 a 0.250025,0.250025 0 0 1 0,-0.002 0.250025,0.250025 0 0 1 0.00391,-0.0039 0.250025,0.250025 0 0 1 0.00586,-0.0039 L 9.8222656,9.8222656 10.794922,8.8515625 11.75,6.9414062 V 5.0585938 L 10.794922,3.1484375 9.8515625,2.2050781 7.9433594,1.25 H 6.0585938 L 4.1855469,2.1875 3.25,4.0585938 v 0.8378906 l 0.9277344,0.9257812 a 0.250025,0.250025 0 0 1 0,0.3554688 l -1,1 a 0.250025,0.250025 0 0 1 -0.3554688,0 l -1,-1 A 0.250025,0.250025 0 0 1 1.75,6 V 5 a 0.250025,0.250025 0 0 1 0.027344,-0.1113281 l 1,-2 a 0.250025,0.250025 0 0 1 0.044922,-0.066406 L 3.8144531,1.8320312 a 0.250025,0.250025 0 0 1 0.011719,-0.011719 0.250025,0.250025 0 0 1 0.019531,-0.017578 0.250025,0.250025 0 0 1 0.00391,-0.00391 0.250025,0.250025 0 0 1 0.078125,-0.041016 L 5.8886719,0.77734375 A 0.250025,0.250025 0 0 1 6,0.75 h 1.9667969 a 0.250025,0.250025 0 0 1 0.025391,-0.001953 z"
     id="path2" />
</svg>
