<?xml version="1.0" encoding="UTF-8" standalone="no"?>
<svg
   xmlns:dc="http://purl.org/dc/elements/1.1/"
   xmlns:cc="http://creativecommons.org/ns#"
   xmlns:rdf="http://www.w3.org/1999/02/22-rdf-syntax-ns#"
   xmlns:svg="http://www.w3.org/2000/svg"
   xmlns="http://www.w3.org/2000/svg"
   xmlns:sodipodi="http://sodipodi.sourceforge.net/DTD/sodipodi-0.dtd"
   xmlns:inkscape="http://www.inkscape.org/namespaces/inkscape"
   data-dec="112"
   width="22"
   height="40"
   version="1.1"
   id="svg4"
   sodipodi:docname="112.svg"
   inkscape:version="0.92.4 (unknown)">
  <metadata
     id="metadata10">
    <rdf:RDF>
      <cc:Work
         rdf:about="">
        <dc:format>image/svg+xml</dc:format>
        <dc:type
           rdf:resource="http://purl.org/dc/dcmitype/StillImage" />
      </cc:Work>
    </rdf:RDF>
  </metadata>
  <defs
     id="defs8" />
  <sodipodi:namedview
     pagecolor="#ffffff"
     bordercolor="#666666"
     borderopacity="1"
     objecttolerance="10"
     gridtolerance="10"
     guidetolerance="10"
     inkscape:pageopacity="0"
     inkscape:pageshadow="2"
     inkscape:window-width="615"
     inkscape:window-height="417"
     id="namedview6"
     showgrid="false"
     inkscape:zoom="5.9"
     inkscape:cx="11"
     inkscape:cy="20"
     inkscape:window-x="0"
     inkscape:window-y="27"
     inkscape:window-maximized="0"
     inkscape:current-layer="svg4" />
  <path
     style="color:#000000;font-style:normal;font-variant:normal;font-weight:normal;font-stretch:normal;font-size:medium;line-height:normal;font-family:sans-serif;font-variant-ligatures:normal;font-variant-position:normal;font-variant-caps:normal;font-variant-numeric:normal;font-variant-alternates:normal;font-feature-settings:normal;text-indent:0;text-align:start;text-decoration:none;text-decoration-line:none;text-decoration-style:solid;text-decoration-color:#000000;letter-spacing:normal;word-spacing:normal;text-transform:none;writing-mode:lr-tb;direction:ltr;text-orientation:mixed;dominant-baseline:auto;baseline-shift:baseline;text-anchor:start;white-space:normal;shape-padding:0;clip-rule:nonzero;display:inline;overflow:visible;visibility:visible;opacity:1;isolation:auto;mix-blend-mode:normal;color-interpolation:sRGB;color-interpolation-filters:linearRGB;solid-color:#000000;solid-opacity:1;vector-effect:none;fill:#013272;fill-opacity:1;fill-rule:nonzero;stroke:none;stroke-width:1;stroke-linecap:round;stroke-linejoin:round;stroke-miterlimit:4;stroke-dasharray:none;stroke-dashoffset:0;stroke-opacity:1;color-rendering:auto;image-rendering:auto;shape-rendering:auto;text-rendering:auto;enable-background:accumulate"
     d="m 15.507812,20.103516 -0.06055,0.11914 a 0.50005,0.50005 0 0 1 -0.09375,0.13086 l -0.501954,0.501953 0.828126,-0.275391 0.08594,-0.130859 a 0.50005,0.50005 0 0 1 -0.257813,-0.345703 z m 1.148438,-10.7167972 0.0625,0.1894531 a 0.50005,0.50005 0 0 1 0.101562,-0.048828 L 16.703125,9.4101562 Z M 13.117188,8.5 11.296875,9.4101562 10.410156,10.296875 9.4628906,12.191406 8.5,15.082031 v 2.835938 L 9.4082031,20.644531 11.117188,21.5 h 1.675781 L 14.589844,19.703125 15.537109,17.808594 16.5,14.917969 V 12.082031 L 15.5625,9.2695312 14.792969,8.5 Z m 1.876953,-1.0058594 a 0.50005,0.50005 0 0 1 0.261718,0.076172 l 1.966797,0.9824219 a 0.50005,0.50005 0 0 1 0.13086,0.09375 l 1,1 a 0.50005,0.50005 0 0 1 0.121093,0.1953125 l 1,3.0000001 A 0.50005,0.50005 0 0 1 19.5,13 v 2 a 0.50005,0.50005 0 0 1 -0.02539,0.158203 l -1,3 a 0.50005,0.50005 0 0 1 -0.05859,0.119141 l -2,3 a 0.50005,0.50005 0 0 1 -0.257813,0.197265 l -2.955078,0.984375 a 0.50005,0.50005 0 0 1 -0.0078,0.0039 A 0.50005,0.50005 0 0 1 12.925781,22.5 H 11 a 0.50005,0.50005 0 0 1 -0.222656,-0.05273 l -2.0000002,-1 A 0.50005,0.50005 0 0 1 8.5253906,21.158203 l -1,-3 a 0.50005,0.50005 0 0 1 -0.023437,-0.107422 l -0.017578,0.07031 a 0.50005,0.50005 0 0 1 -0.00195,0.0098 L 4.8847656,27.654297 5.1542969,28.191406 6.0820312,28.5 H 7 a 0.50005,0.50005 0 1 1 0,1 H 6.0546875 a 0.50005,0.50005 0 0 1 -0.089844,0 H 5.0761719 a 0.50005,0.50005 0 0 1 -0.1464844,0 H 4.0820312 a 0.50005,0.50005 0 0 1 -0.1679687,0 H 3.0820312 a 0.50005,0.50005 0 0 1 -0.1679687,0 H 2.0761719 a 0.50005,0.50005 0 0 1 -0.1601563,0 H 1.0605469 a 0.50005,0.50005 0 0 1 -0.13476565,0 h -0.8828125 a 0.50005,0.50005 0 0 1 -0.09179687,0 H -1 a 0.50005,0.50005 0 1 1 0,-1 h 0.91796875 L 1.2304688,28.0625 1.9550781,27.337891 5.5175781,14.871094 6.5,10.941406 V 9.2070312 L 5.7929688,8.5 H 4.2070312 l -1.796875,1.796875 -0.9628906,1.925781 A 0.50005,0.50005 0 1 1 0.55273438,11.777344 L 1.5527344,9.7773438 a 0.50005,0.50005 0 0 1 0.09375,-0.1308594 l 2,-2 A 0.50005,0.50005 0 0 1 4,7.5 H 6 A 0.50005,0.50005 0 0 1 6.3535156,7.6464844 L 7.3027344,8.5957031 A 0.50005,0.50005 0 0 1 7.46875,8.8203125 L 8.4472656,10.777344 A 0.50005,0.50005 0 0 1 8.5,11 v 0.917969 l 0.025391,-0.07617 a 0.50005,0.50005 0 0 1 0.027344,-0.06445 l 1,-2.0000002 a 0.50005,0.50005 0 0 1 0.09375,-0.1308594 l 0.9999996,-1 a 0.50005,0.50005 0 0 1 0.13086,-0.09375 l 2,-1 A 0.50005,0.50005 0 0 1 13,7.5 h 1.933594 a 0.50005,0.50005 0 0 1 0.06055,-0.00586 z"
     id="path2" />
</svg>
