<?xml version="1.0" encoding="UTF-8" standalone="no"?>
<svg
   xmlns:dc="http://purl.org/dc/elements/1.1/"
   xmlns:cc="http://creativecommons.org/ns#"
   xmlns:rdf="http://www.w3.org/1999/02/22-rdf-syntax-ns#"
   xmlns:svg="http://www.w3.org/2000/svg"
   xmlns="http://www.w3.org/2000/svg"
   xmlns:sodipodi="http://sodipodi.sourceforge.net/DTD/sodipodi-0.dtd"
   xmlns:inkscape="http://www.inkscape.org/namespaces/inkscape"
   data-dec="105"
   width="14"
   height="40"
   version="1.1"
   id="svg4"
   sodipodi:docname="105.svg"
   inkscape:version="0.92.4 (unknown)">
  <metadata
     id="metadata10">
    <rdf:RDF>
      <cc:Work
         rdf:about="">
        <dc:format>image/svg+xml</dc:format>
        <dc:type
           rdf:resource="http://purl.org/dc/dcmitype/StillImage" />
      </cc:Work>
    </rdf:RDF>
  </metadata>
  <defs
     id="defs8" />
  <sodipodi:namedview
     pagecolor="#ffffff"
     bordercolor="#666666"
     borderopacity="1"
     objecttolerance="10"
     gridtolerance="10"
     guidetolerance="10"
     inkscape:pageopacity="0"
     inkscape:pageshadow="2"
     inkscape:window-width="640"
     inkscape:window-height="480"
     id="namedview6"
     showgrid="false"
     inkscape:zoom="5.9"
     inkscape:cx="7"
     inkscape:cy="20"
     inkscape:window-x="0"
     inkscape:window-y="27"
     inkscape:window-maximized="0"
     inkscape:current-layer="svg4" />
  <path
     style="color:#000000;font-style:normal;font-variant:normal;font-weight:normal;font-stretch:normal;font-size:medium;line-height:normal;font-family:sans-serif;font-variant-ligatures:normal;font-variant-position:normal;font-variant-caps:normal;font-variant-numeric:normal;font-variant-alternates:normal;font-feature-settings:normal;text-indent:0;text-align:start;text-decoration:none;text-decoration-line:none;text-decoration-style:solid;text-decoration-color:#000000;letter-spacing:normal;word-spacing:normal;text-transform:none;writing-mode:lr-tb;direction:ltr;text-orientation:mixed;dominant-baseline:auto;baseline-shift:baseline;text-anchor:start;white-space:normal;shape-padding:0;clip-rule:nonzero;display:inline;overflow:visible;visibility:visible;opacity:1;isolation:auto;mix-blend-mode:normal;color-interpolation:sRGB;color-interpolation-filters:linearRGB;solid-color:#000000;solid-opacity:1;vector-effect:none;fill:#013272;fill-opacity:1;fill-rule:nonzero;stroke:none;stroke-width:0.5;stroke-linecap:round;stroke-linejoin:round;stroke-miterlimit:4;stroke-dasharray:none;stroke-dashoffset:0;stroke-opacity:1;color-rendering:auto;image-rendering:auto;shape-rendering:auto;text-rendering:auto;enable-background:accumulate"
     d="M 6.6054688,8.25 7.1777344,8.8222656 A 0.250025,0.250025 0 0 1 7.25,9 v 3 a 0.250025,0.250025 0 0 1 -0.013672,0.07813 L 5.25,18.041016 v 2.855468 L 6.1035156,21.75 H 6.3945312 L 5.8222656,21.177734 A 0.250025,0.250025 0 0 1 5.75,21 v -3 a 0.250025,0.250025 0 0 1 0.013672,-0.07813 L 7.75,11.958984 V 9.1035156 L 6.8964844,8.25 Z M 5.9726562,7.7480469 A 0.250025,0.250025 0 0 1 6.0351562,7.75 H 7 a 0.250025,0.250025 0 0 1 0.1777344,0.072266 l 1,1 A 0.250025,0.250025 0 0 1 8.25,9 v 3 a 0.250025,0.250025 0 0 1 -0.013672,0.07813 L 6.25,18.041016 v 2.855468 L 7.1054688,21.75 h 1.7910156 l 1.8984376,-1.898438 0.982422,-1.96289 a 0.250025,0.250025 0 1 1 0.445312,0.222656 l -1,2 a 0.250025,0.250025 0 0 1 -0.04492,0.06641 l -1.9999996,2 A 0.250025,0.250025 0 0 1 9,22.25 H 7.0390625 a 0.250025,0.250025 0 0 1 -0.074219,0 H 6 a 0.250025,0.250025 0 0 1 -0.1777344,-0.07227 l -1,-1 A 0.250025,0.250025 0 0 1 4.75,21 v -3 a 0.250025,0.250025 0 0 1 0.013672,-0.07813 L 6.75,11.958984 V 9.1035156 L 5.8945312,8.25 H 4.1035156 l -1.8984375,1.898438 -0.9824219,1.96289 A 0.250025,0.250025 0 1 1 0.77734375,11.888672 L 1.7773438,9.8886719 a 0.250025,0.250025 0 0 1 0.044922,-0.066406 l 2,-2 A 0.250025,0.250025 0 0 1 4,7.75 h 1.9609375 a 0.250025,0.250025 0 0 1 0.011719,-0.00195 z M 9,1.3554688 8.3554688,2 9,2.6445312 9.6445312,2 Z M 8.9726562,0.74804688 a 0.250025,0.250025 0 0 1 0.021484,0 0.250025,0.250025 0 0 1 0.00391,0 0.250025,0.250025 0 0 1 0.021484,0 0.250025,0.250025 0 0 1 0.00195,0 0.250025,0.250025 0 0 1 0.023437,0.003906 0.250025,0.250025 0 0 1 0.00195,0 0.250025,0.250025 0 0 1 0.00391,0.001953 0.250025,0.250025 0 0 1 0.064453,0.0214844 0.250025,0.250025 0 0 1 0.00195,0.001953 0.250025,0.250025 0 0 1 0.060547,0.0449219 0.250025,0.250025 0 0 1 0.015625,0.0136719 l 0.00781,0.009766 a 0.250025,0.250025 0 0 1 0.00781,0.009766 L 10.177734,1.8222656 a 0.250025,0.250025 0 0 1 0,0.3554688 l -0.9999996,1 a 0.250025,0.250025 0 0 1 -0.3554688,0 l -1,-1 a 0.250025,0.250025 0 0 1 0,-0.3554688 L 8.796875,0.84765625 a 0.250025,0.250025 0 0 1 0.025391,-0.0253906 0.250025,0.250025 0 0 1 0.076172,-0.0527344 0.250025,0.250025 0 0 1 0.00195,-0.001953 0.250025,0.250025 0 0 1 0.072266,-0.0195312 z"
     id="path2" />
</svg>
