<?xml version="1.0" encoding="UTF-8" standalone="no"?>
<svg
   xmlns:dc="http://purl.org/dc/elements/1.1/"
   xmlns:cc="http://creativecommons.org/ns#"
   xmlns:rdf="http://www.w3.org/1999/02/22-rdf-syntax-ns#"
   xmlns:svg="http://www.w3.org/2000/svg"
   xmlns="http://www.w3.org/2000/svg"
   xmlns:sodipodi="http://sodipodi.sourceforge.net/DTD/sodipodi-0.dtd"
   xmlns:inkscape="http://www.inkscape.org/namespaces/inkscape"
   data-dec="54"
   width="20"
   height="40"
   version="1.1"
   id="svg4"
   sodipodi:docname="54.svg"
   inkscape:version="0.92.4 5da689c313, 2019-01-14">
  <metadata
     id="metadata10">
    <rdf:RDF>
      <cc:Work
         rdf:about="">
        <dc:format>image/svg+xml</dc:format>
        <dc:type
           rdf:resource="http://purl.org/dc/dcmitype/StillImage" />
        <dc:title></dc:title>
      </cc:Work>
    </rdf:RDF>
  </metadata>
  <defs
     id="defs8" />
  <sodipodi:namedview
     pagecolor="#ffffff"
     bordercolor="#666666"
     borderopacity="1"
     objecttolerance="10"
     gridtolerance="10"
     guidetolerance="10"
     inkscape:pageopacity="0"
     inkscape:pageshadow="2"
     inkscape:window-width="1920"
     inkscape:window-height="1043"
     id="namedview6"
     showgrid="false"
     inkscape:zoom="5.9"
     inkscape:cx="10"
     inkscape:cy="20"
     inkscape:window-x="0"
     inkscape:window-y="37"
     inkscape:window-maximized="0"
     inkscape:current-layer="svg4" />
  <path
     style="color:#000000;font-style:normal;font-variant:normal;font-weight:normal;font-stretch:normal;font-size:medium;line-height:normal;font-family:sans-serif;font-variant-ligatures:normal;font-variant-position:normal;font-variant-caps:normal;font-variant-numeric:normal;font-variant-alternates:normal;font-feature-settings:normal;text-indent:0;text-align:start;text-decoration:none;text-decoration-line:none;text-decoration-style:solid;text-decoration-color:#000000;letter-spacing:normal;word-spacing:normal;text-transform:none;writing-mode:lr-tb;direction:ltr;text-orientation:mixed;dominant-baseline:auto;baseline-shift:baseline;text-anchor:start;white-space:normal;shape-padding:0;clip-rule:nonzero;display:inline;overflow:visible;visibility:visible;opacity:1;isolation:auto;mix-blend-mode:normal;color-interpolation:sRGB;color-interpolation-filters:linearRGB;solid-color:#000000;solid-opacity:1;vector-effect:none;fill:#000000;fill-opacity:1;fill-rule:nonzero;stroke:none;stroke-width:2.5;stroke-linecap:round;stroke-linejoin:round;stroke-miterlimit:4;stroke-dasharray:none;stroke-dashoffset:0;stroke-opacity:1;color-rendering:auto;image-rendering:auto;shape-rendering:auto;text-rendering:auto;enable-background:accumulate"
     d="M 10.203125,11.25 8.5546875,11.798828 7.5019531,12.501953 6.7988281,13.556641 6.3007812,15.048828 6.9589844,17.685547 7.5039062,18.5 8.5527344,19.199219 10.203125,19.75 h 0.59375 l 1.648437,-0.548828 1.052735,-0.703125 0.703125,-1.052735 L 14.75,15.796875 v -0.59375 L 14.201172,13.554688 13.498047,12.501953 12.445312,11.798828 10.796875,11.25 Z M 10,-0.25 h 2 a 1.250125,1.250125 0 0 1 0.394531,0.0644531 l 3,1 a 1.250125,1.250125 0 0 1 0.722657,0.62695308 l 1,2 A 1.250125,1.250125 0 0 1 16,5.25 H 15 A 1.250125,1.250125 0 0 1 13.882812,4.5585938 L 13.513672,3.8222656 11.796875,3.25 h -1.59375 L 8.2324219,3.90625 7.1777344,5.4882812 6.5039062,8.8535156 a 1.250125,1.250125 0 0 1 0.1015626,-0.039063 l 3,-1 A 1.250125,1.250125 0 0 1 10,7.75 h 1 a 1.250125,1.250125 0 0 1 0.394531,0.064453 l 3,1 a 1.250125,1.250125 0 0 1 0.490235,0.3007813 l 2,1.9999996 a 1.250125,1.250125 0 0 1 0.300781,0.490235 l 1,3 A 1.250125,1.250125 0 0 1 18.25,15 v 1 a 1.250125,1.250125 0 0 1 -0.06445,0.394531 l -1,3 a 1.250125,1.250125 0 0 1 -0.300781,0.490235 l -2,2 a 1.250125,1.250125 0 0 1 -0.490235,0.300781 l -3,1 A 1.250125,1.250125 0 0 1 11,23.25 h -1 a 1.250125,1.250125 0 0 1 -0.3945312,-0.06445 l -3,-1 A 1.250125,1.250125 0 0 1 6.1152344,21.884766 l -2,-2 a 1.250125,1.250125 0 0 1 -0.328125,-0.582032 l -1,-4 A 1.250125,1.250125 0 0 1 2.75,15 v -5 a 1.250125,1.250125 0 0 1 0.023437,-0.2460938 l 1,-5 A 1.250125,1.250125 0 0 1 3.9589844,4.3066406 l 2,-3 A 1.250125,1.250125 0 0 1 6.6054688,0.81445312 l 3,-1 A 1.250125,1.250125 0 0 1 10,-0.25 Z"
     id="path2" />
</svg>
