<?xml version="1.0" encoding="UTF-8" standalone="no"?>
<svg
   xmlns:dc="http://purl.org/dc/elements/1.1/"
   xmlns:cc="http://creativecommons.org/ns#"
   xmlns:rdf="http://www.w3.org/1999/02/22-rdf-syntax-ns#"
   xmlns:svg="http://www.w3.org/2000/svg"
   xmlns="http://www.w3.org/2000/svg"
   xmlns:sodipodi="http://sodipodi.sourceforge.net/DTD/sodipodi-0.dtd"
   xmlns:inkscape="http://www.inkscape.org/namespaces/inkscape"
   data-dec="36"
   width="20"
   height="40"
   version="1.1"
   id="svg4"
   sodipodi:docname="36.svg"
   inkscape:version="0.92.4 (unknown)">
  <metadata
     id="metadata10">
    <rdf:RDF>
      <cc:Work
         rdf:about="">
        <dc:format>image/svg+xml</dc:format>
        <dc:type
           rdf:resource="http://purl.org/dc/dcmitype/StillImage" />
      </cc:Work>
    </rdf:RDF>
  </metadata>
  <defs
     id="defs8" />
  <sodipodi:namedview
     pagecolor="#ffffff"
     bordercolor="#666666"
     borderopacity="1"
     objecttolerance="10"
     gridtolerance="10"
     guidetolerance="10"
     inkscape:pageopacity="0"
     inkscape:pageshadow="2"
     inkscape:window-width="640"
     inkscape:window-height="480"
     id="namedview6"
     showgrid="false"
     inkscape:zoom="5.9"
     inkscape:cx="10"
     inkscape:cy="20"
     inkscape:window-x="0"
     inkscape:window-y="27"
     inkscape:window-maximized="0"
     inkscape:current-layer="svg4" />
  <path
     style="color:#000000;font-style:normal;font-variant:normal;font-weight:normal;font-stretch:normal;font-size:medium;line-height:normal;font-family:sans-serif;font-variant-ligatures:normal;font-variant-position:normal;font-variant-caps:normal;font-variant-numeric:normal;font-variant-alternates:normal;font-feature-settings:normal;text-indent:0;text-align:start;text-decoration:none;text-decoration-line:none;text-decoration-style:solid;text-decoration-color:#000000;letter-spacing:normal;word-spacing:normal;text-transform:none;writing-mode:lr-tb;direction:ltr;text-orientation:mixed;dominant-baseline:auto;baseline-shift:baseline;text-anchor:start;white-space:normal;shape-padding:0;clip-rule:nonzero;display:inline;overflow:visible;visibility:visible;opacity:1;isolation:auto;mix-blend-mode:normal;color-interpolation:sRGB;color-interpolation-filters:linearRGB;solid-color:#000000;solid-opacity:1;vector-effect:none;fill:#013272;fill-opacity:1;fill-rule:nonzero;stroke:none;stroke-width:2;stroke-linecap:round;stroke-linejoin:round;stroke-miterlimit:4;stroke-dasharray:none;stroke-dashoffset:0;stroke-opacity:1;color-rendering:auto;image-rendering:auto;shape-rendering:auto;text-rendering:auto;enable-background:accumulate"
     d="m 13,14.117188 v 6.49414 L 14.291016,20.181641 15,18.763672 V 16.236328 L 14.253906,14.746094 Z M 9,12.720703 V 21 h 2 V 13.386719 Z M 7,2.3886719 5.7089844,2.8183594 5,4.2363281 V 5.7636719 L 5.7460938,7.2539062 7,7.8828125 Z M 9,2 v 6.6132812 l 2,0.6660157 V 2 Z M 7.984375,-4.0136719 A 1.0001,1.0001 0 0 1 9,-3 v 3 h 2 v -3 a 1.0001,1.0001 0 1 1 2,0 v 3.27929688 l 2.316406,0.77148432 a 1.0001,1.0001 0 0 1 0.390625,0.2421876 l 1,1 a 1.0001,1.0001 0 0 1 0.1875,0.2597656 l 1,2 A 1.0001,1.0001 0 0 1 18,5 V 7 A 1.0001,1.0001 0 0 1 17,8 H 15 A 1.0001,1.0001 0 0 1 14,7 V 5 a 1.0001,1.0001 0 0 1 1,-1 h 0.382812 L 15.177734,3.5917969 14.458984,2.875 13,2.3886719 v 7.5566406 l 0.316406,0.1054685 a 1.0001,1.0001 0 0 1 0.238282,0.117188 l 3,2 a 1.0001,1.0001 0 0 1 0.339843,0.384765 l 1,2 A 1.0001,1.0001 0 0 1 18,15 v 3 a 1.0001,1.0001 0 0 1 -0.105469,0.447266 l -1,2 a 1.0001,1.0001 0 0 1 -0.1875,0.259765 l -0.945312,0.945313 a 1.0001,1.0001 0 0 1 -0.576172,0.339844 L 13,22.720703 V 26 a 1.0001,1.0001 0 1 1 -2,0 V 23 H 9 v 3 A 1.0001,1.0001 0 1 1 7,26 V 22.720703 L 4.6835938,21.949219 a 1.0001,1.0001 0 0 1 -0.390625,-0.242188 l -1,-1 a 1.0001,1.0001 0 0 1 -0.1875,-0.259765 l -1,-2 A 1.0001,1.0001 0 0 1 2,18 v -2 a 1.0001,1.0001 0 0 1 1,-1 h 2 a 1.0001,1.0001 0 0 1 1,1 v 2 A 1.0001,1.0001 0 0 1 5,19 H 4.6171875 L 4.8222656,19.408203 5.5410156,20.125 7,20.611328 v -8.55664 L 6.6835938,11.949219 A 1.0001,1.0001 0 0 1 6.4453125,11.832031 l -3,-1.9999998 A 1.0001,1.0001 0 0 1 3.1054688,9.4472656 l -1,-2 A 1.0001,1.0001 0 0 1 2,7 V 4 A 1.0001,1.0001 0 0 1 2.2929688,3.2929688 L 4.2382812,1.3476562 A 1.0001,1.0001 0 0 1 4.8144531,1.0078125 L 7,0.27929688 V -3 a 1.0001,1.0001 0 0 1 0.984375,-1.0136719 z"
     id="path2" />
</svg>
