<?xml version="1.0" encoding="UTF-8" standalone="no"?>
<svg
   xmlns:dc="http://purl.org/dc/elements/1.1/"
   xmlns:cc="http://creativecommons.org/ns#"
   xmlns:rdf="http://www.w3.org/1999/02/22-rdf-syntax-ns#"
   xmlns:svg="http://www.w3.org/2000/svg"
   xmlns="http://www.w3.org/2000/svg"
   xmlns:sodipodi="http://sodipodi.sourceforge.net/DTD/sodipodi-0.dtd"
   xmlns:inkscape="http://www.inkscape.org/namespaces/inkscape"
   data-dec="59"
   width="8"
   height="40"
   version="1.1"
   id="svg4"
   sodipodi:docname="59.svg"
   inkscape:version="0.92.4 (unknown)">
  <metadata
     id="metadata10">
    <rdf:RDF>
      <cc:Work
         rdf:about="">
        <dc:format>image/svg+xml</dc:format>
        <dc:type
           rdf:resource="http://purl.org/dc/dcmitype/StillImage" />
      </cc:Work>
    </rdf:RDF>
  </metadata>
  <defs
     id="defs8" />
  <sodipodi:namedview
     pagecolor="#ffffff"
     bordercolor="#666666"
     borderopacity="1"
     objecttolerance="10"
     gridtolerance="10"
     guidetolerance="10"
     inkscape:pageopacity="0"
     inkscape:pageshadow="2"
     inkscape:window-width="640"
     inkscape:window-height="480"
     id="namedview6"
     showgrid="false"
     inkscape:zoom="5.9"
     inkscape:cx="4"
     inkscape:cy="20"
     inkscape:window-x="0"
     inkscape:window-y="27"
     inkscape:window-maximized="0"
     inkscape:current-layer="svg4" />
  <path
     style="color:#000000;font-style:normal;font-variant:normal;font-weight:normal;font-stretch:normal;font-size:medium;line-height:normal;font-family:sans-serif;font-variant-ligatures:normal;font-variant-position:normal;font-variant-caps:normal;font-variant-numeric:normal;font-variant-alternates:normal;font-feature-settings:normal;text-indent:0;text-align:start;text-decoration:none;text-decoration-line:none;text-decoration-style:solid;text-decoration-color:#000000;letter-spacing:normal;word-spacing:normal;text-transform:none;writing-mode:lr-tb;direction:ltr;text-orientation:mixed;dominant-baseline:auto;baseline-shift:baseline;text-anchor:start;white-space:normal;shape-padding:0;clip-rule:nonzero;display:inline;overflow:visible;visibility:visible;opacity:1;isolation:auto;mix-blend-mode:normal;color-interpolation:sRGB;color-interpolation-filters:linearRGB;solid-color:#000000;solid-opacity:1;vector-effect:none;fill:#000000;fill-opacity:1;fill-rule:nonzero;stroke:none;stroke-width:2;stroke-linecap:round;stroke-linejoin:round;stroke-miterlimit:4;stroke-dasharray:none;stroke-dashoffset:0;stroke-opacity:1;color-rendering:auto;image-rendering:auto;shape-rendering:auto;text-rendering:auto;enable-background:accumulate"
     d="m 3.984375,16 a 1.0001,1.0001 0 0 1 0.7226562,0.292969 L 5.59375,17.179688 A 1.0001,1.0001 0 0 1 6,18.126953 V 20 a 1.0001,1.0001 0 0 1 -0.2929688,0.707031 l -2,2 A 1.0001,1.0001 0 1 1 2.2929688,21.292969 L 3.6503906,19.935547 A 1.0001,1.0001 0 0 1 3.2929688,19.707031 l -1,-1 a 1.0001,1.0001 0 0 1 0,-1.414062 l 1,-1 A 1.0001,1.0001 0 0 1 3.984375,16 Z M 3.9707031,8.9902344 a 1.0001,1.0001 0 0 1 0.029297,0 1.0001,1.0001 0 0 1 0.089844,0.00391 1.0001,1.0001 0 0 1 0.734375,0.4160156 l 0.8828124,0.8828128 a 1.0001,1.0001 0 0 1 0,1.414062 l -1,1 a 1.0001,1.0001 0 0 1 -1.4140624,0 l -1,-1 a 1.0001,1.0001 0 0 1 0,-1.414062 L 3.1796875,9.40625 A 1.0001,1.0001 0 0 1 3.9707031,8.9902344 Z"
     id="path2" />
</svg>
