<?xml version="1.0" encoding="UTF-8" standalone="no"?>
<svg
   xmlns:dc="http://purl.org/dc/elements/1.1/"
   xmlns:cc="http://creativecommons.org/ns#"
   xmlns:rdf="http://www.w3.org/1999/02/22-rdf-syntax-ns#"
   xmlns:svg="http://www.w3.org/2000/svg"
   xmlns="http://www.w3.org/2000/svg"
   xmlns:sodipodi="http://sodipodi.sourceforge.net/DTD/sodipodi-0.dtd"
   xmlns:inkscape="http://www.inkscape.org/namespaces/inkscape"
   data-dec="89"
   width="22"
   height="40"
   version="1.1"
   id="svg4"
   sodipodi:docname="89.svg"
   inkscape:version="0.92.4 (unknown)">
  <metadata
     id="metadata10">
    <rdf:RDF>
      <cc:Work
         rdf:about="">
        <dc:format>image/svg+xml</dc:format>
        <dc:type
           rdf:resource="http://purl.org/dc/dcmitype/StillImage" />
      </cc:Work>
    </rdf:RDF>
  </metadata>
  <defs
     id="defs8" />
  <sodipodi:namedview
     pagecolor="#ffffff"
     bordercolor="#666666"
     borderopacity="1"
     objecttolerance="10"
     gridtolerance="10"
     guidetolerance="10"
     inkscape:pageopacity="0"
     inkscape:pageshadow="2"
     inkscape:window-width="615"
     inkscape:window-height="417"
     id="namedview6"
     showgrid="false"
     inkscape:zoom="5.9"
     inkscape:cx="11"
     inkscape:cy="20"
     inkscape:window-x="0"
     inkscape:window-y="27"
     inkscape:window-maximized="0"
     inkscape:current-layer="svg4" />
  <path
     style="color:#000000;font-style:normal;font-variant:normal;font-weight:normal;font-stretch:normal;font-size:medium;line-height:normal;font-family:sans-serif;font-variant-ligatures:normal;font-variant-position:normal;font-variant-caps:normal;font-variant-numeric:normal;font-variant-alternates:normal;font-feature-settings:normal;text-indent:0;text-align:start;text-decoration:none;text-decoration-line:none;text-decoration-style:solid;text-decoration-color:#000000;letter-spacing:normal;word-spacing:normal;text-transform:none;writing-mode:lr-tb;direction:ltr;text-orientation:mixed;dominant-baseline:auto;baseline-shift:baseline;text-anchor:start;white-space:normal;shape-padding:0;clip-rule:nonzero;display:inline;overflow:visible;visibility:visible;opacity:1;isolation:auto;mix-blend-mode:normal;color-interpolation:sRGB;color-interpolation-filters:linearRGB;solid-color:#000000;solid-opacity:1;vector-effect:none;fill:#013272;fill-opacity:1;fill-rule:nonzero;stroke:none;stroke-width:0.30000001;stroke-linecap:round;stroke-linejoin:round;stroke-miterlimit:4;stroke-dasharray:none;stroke-dashoffset:0;stroke-opacity:1;color-rendering:auto;image-rendering:auto;shape-rendering:auto;text-rendering:auto;enable-background:accumulate"
     d="m 5.9453125,21.84375 -0.019531,0.0059 h 0.013672 z m 3.3242187,-0.261719 -0.074219,0.267578 h 0.5625 L 9.6933594,21.722656 Z M 6.9824219,21.498047 6.578125,21.632812 6.3613281,21.849609 H 6.8867188 Z M 8.3535156,21.275391 8.1953125,21.849609 H 8.8867188 L 8.984375,21.486328 Z M 8,21.158203 7.3242188,21.382812 7.1953125,21.849609 h 0.6914063 l 0.1816406,-0.667968 z m -0.9179688,-0.0293 -0.027344,0.02734 0.021484,-0.0059 z m 2.3125,-0.0039 -0.046875,0.166016 0.15625,0.05273 z M 8.4296875,2.4765625 8.1347656,3.0664062 a 0.15001501,0.15001501 0 0 1 -0.1132812,0.083984 l 3.1171876,7.7929684 a 0.15001501,0.15001501 0 0 1 0.0059,0.0957 l -2.7128904,9.947266 0.6328125,0.210938 0.1289063,-0.47461 -0.328125,-0.65625 A 0.15023822,0.15023822 0 1 1 9.1347656,19.933594 L 9.3125,20.287109 11.841797,11.009766 Z M 6.5351562,1.9355469 10.138672,10.943359 a 0.15001501,0.15001501 0 0 1 0.0059,0.0957 l -2.4765622,9.082032 0.2265624,-0.226563 a 0.15001501,0.15001501 0 1 1 0.2109376,0.210938 l -0.5957032,0.595703 -0.091797,0.333984 0.5136718,-0.169922 a 0.15001501,0.15001501 0 0 1 0.021484,-0.0078 0.15001501,0.15001501 0 0 1 0.00586,-0.002 0.15001501,0.15001501 0 0 1 0.044922,-0.0059 0.15001501,0.15001501 0 0 1 0.00391,0 0.15001501,0.15001501 0 0 1 0.00977,0.002 0.15001501,0.15001501 0 0 1 0.00391,0 0.15001501,0.15001501 0 0 1 0.011719,0.002 0.15001501,0.15001501 0 0 1 0.00391,0 0.15001501,0.15001501 0 0 1 0.00977,0.0039 0.15001501,0.15001501 0 0 1 0.00391,0 l 0.013672,0.0059 0.082031,0.02734 2.6953126,-9.880859 -3.576172,-8.9394535 -0.1972656,0.064453 a 0.15001501,0.15001501 0 0 1 -0.00586,0.00391 l -0.015625,0.00391 a 0.15001501,0.15001501 0 0 1 -0.023437,0.00586 0.15001501,0.15001501 0 0 1 -0.015625,0.00195 0.15001501,0.15001501 0 0 1 -0.00195,0 0.15001501,0.15001501 0 0 1 -0.013672,0 0.15001501,0.15001501 0 0 1 -0.00195,0 0.15001501,0.15001501 0 0 1 -0.011719,-0.00195 0.15001501,0.15001501 0 0 1 -0.00781,0 0.15001501,0.15001501 0 0 1 -0.023437,-0.00781 0.15001501,0.15001501 0 0 1 -0.011719,-0.00391 0.15001501,0.15001501 0 0 1 -0.00195,-0.00195 l -0.011719,-0.00586 a 0.15001501,0.15001501 0 0 1 -0.013672,-0.00781 z m 1.6132813,-0.1601563 -0.5976563,0.1992188 0.3535157,0.8808594 0.375,-0.7519532 z M 8.5039062,1.65625 l -0.070312,0.023437 0.025391,0.066406 z M 19.636719,1.1503906 21,1.8320312 22.363281,1.1503906 Z m -11.4160159,0 0.1015625,0.25 0.3710938,-0.1230468 0.064453,-0.1269532 z m -1,0 0.21875,0.5449219 L 8.0371094,1.4960938 7.8984375,1.1503906 Z m -1,0 0.1464844,0.3652344 0.6445313,0.3222656 0.1425781,-0.046875 -0.2558594,-0.640625 z m -0.5839843,0 0.328125,0.1640625 -0.066406,-0.1640625 z M 6,0.84765625 a 0.15001501,0.15001501 0 0 1 0.015625,0.001953 h 0.96875 a 0.15001501,0.15001501 0 0 1 0.03125,0 h 0.96875 a 0.15001501,0.15001501 0 0 1 0.03125,0 h 0.9628906 a 0.15001501,0.15001501 0 0 1 0.044922,0 h 0.96875 0.015624 H 11 A 0.15039061,0.15039061 0 1 1 11,1.1503906 H 10.023438 L 8.90625,1.5234375 8.609375,2.1191406 12.054688,10.734375 20.748047,2.0410156 18.964844,1.1503906 H 18 a 0.15039061,0.15039061 0 1 1 0,-0.30078122 h 0.980469 0.0293 3.976562 0.0293 H 24 a 0.15039061,0.15039061 0 1 1 0,0.30078122 h -0.964844 l -1.945312,0.9726563 -0.0039,0.00195 -8.951172,8.951172 -2.6230472,9.613281 0.3945312,0.787109 1.117188,0.373047 H 12 a 0.150391,0.150391 0 1 1 0,0.300782 h -0.988281 -0.01563 -0.96875 a 0.15001501,0.15001501 0 0 1 -0.044922,0 H 9.0214844 a 0.15001501,0.15001501 0 0 1 -0.044922,0 H 8.0214844 a 0.15001501,0.15001501 0 0 1 -0.044922,0 H 7.0214844 a 0.15001501,0.15001501 0 0 1 -0.044922,0 H 6.0175781 a 0.15001501,0.15001501 0 0 1 -0.029297,0 H 5.0078125 4.9921875 4 A 0.150391,0.150391 0 0 1 4,21.849609 H 4.9765625 L 6.421875,21.367188 7.2402344,20.548828 9.8417969,11.009766 6.1328125,1.734375 4.9648438,1.1503906 H 4 A 0.15039068,0.15039068 0 1 1 4,0.84960938 H 4.9804688 5.0097656 5.984375 A 0.15001501,0.15001501 0 0 1 6,0.84765625 Z"
     id="path2" />
</svg>
