<?xml version="1.0" encoding="UTF-8" standalone="no"?>
<svg
   xmlns:dc="http://purl.org/dc/elements/1.1/"
   xmlns:cc="http://creativecommons.org/ns#"
   xmlns:rdf="http://www.w3.org/1999/02/22-rdf-syntax-ns#"
   xmlns:svg="http://www.w3.org/2000/svg"
   xmlns="http://www.w3.org/2000/svg"
   xmlns:sodipodi="http://sodipodi.sourceforge.net/DTD/sodipodi-0.dtd"
   xmlns:inkscape="http://www.inkscape.org/namespaces/inkscape"
   data-dec="99"
   width="18"
   height="40"
   version="1.1"
   id="svg4"
   sodipodi:docname="99.svg"
   inkscape:version="0.92.4 (unknown)">
  <metadata
     id="metadata10">
    <rdf:RDF>
      <cc:Work
         rdf:about="">
        <dc:format>image/svg+xml</dc:format>
        <dc:type
           rdf:resource="http://purl.org/dc/dcmitype/StillImage" />
      </cc:Work>
    </rdf:RDF>
  </metadata>
  <defs
     id="defs8" />
  <sodipodi:namedview
     pagecolor="#ffffff"
     bordercolor="#666666"
     borderopacity="1"
     objecttolerance="10"
     gridtolerance="10"
     guidetolerance="10"
     inkscape:pageopacity="0"
     inkscape:pageshadow="2"
     inkscape:window-width="640"
     inkscape:window-height="480"
     id="namedview6"
     showgrid="false"
     inkscape:zoom="5.9"
     inkscape:cx="9"
     inkscape:cy="20"
     inkscape:window-x="0"
     inkscape:window-y="27"
     inkscape:window-maximized="0"
     inkscape:current-layer="svg4" />
  <path
     style="color:#000000;font-style:normal;font-variant:normal;font-weight:normal;font-stretch:normal;font-size:medium;line-height:normal;font-family:sans-serif;font-variant-ligatures:normal;font-variant-position:normal;font-variant-caps:normal;font-variant-numeric:normal;font-variant-alternates:normal;font-feature-settings:normal;text-indent:0;text-align:start;text-decoration:none;text-decoration-line:none;text-decoration-style:solid;text-decoration-color:#000000;letter-spacing:normal;word-spacing:normal;text-transform:none;writing-mode:lr-tb;direction:ltr;text-orientation:mixed;dominant-baseline:auto;baseline-shift:baseline;text-anchor:start;white-space:normal;shape-padding:0;clip-rule:nonzero;display:inline;overflow:visible;visibility:visible;opacity:1;isolation:auto;mix-blend-mode:normal;color-interpolation:sRGB;color-interpolation-filters:linearRGB;solid-color:#000000;solid-opacity:1;vector-effect:none;fill:#013272;fill-opacity:1;fill-rule:nonzero;stroke:none;stroke-width:2;stroke-linecap:round;stroke-linejoin:round;stroke-miterlimit:4;stroke-dasharray:none;stroke-dashoffset:0;stroke-opacity:1;color-rendering:auto;image-rendering:auto;shape-rendering:auto;text-rendering:auto;enable-background:accumulate"
     d="M 9.0039062,6.9941406 A 1.0001,1.0001 0 0 1 9.1191406,7 H 12 a 1.0001,1.0001 0 0 1 0.447266,0.1054688 l 2,1 a 1.0001,1.0001 0 0 1 0.259765,0.1875 l 2,2.0000002 A 1.0001,1.0001 0 0 1 17,11 v 2 a 1.0001,1.0001 0 0 1 -1,1 h -2 a 1.0001,1.0001 0 0 1 -1,-1 v -2 a 1.0001,1.0001 0 0 1 0.650391,-0.935547 L 13.408203,9.8222656 11.763672,9 H 9.2363281 L 7.5917969,9.8222656 6.875,10.541016 6,13.162109 v 3.675782 l 0.875,2.621093 0.7167969,0.71875 L 9.2363281,21 h 1.6015629 l 2.621093,-0.875 1.833985,-1.832031 a 1.0001,1.0001 0 1 1 1.414062,1.414062 l -2,2 a 1.0001,1.0001 0 0 1 -0.390625,0.242188 l -3,1 A 1.0001,1.0001 0 0 1 11,23 H 9.109375 a 1.0001,1.0001 0 0 1 -0.4257812,-0.05078 l -0.039063,-0.01367 -2.9609374,-0.986328 a 1.0001,1.0001 0 0 1 -0.390625,-0.242188 l -2,-2 A 1.0001,1.0001 0 0 1 3.0507812,19.316406 l -1,-3 A 1.0001,1.0001 0 0 1 2,16 v -2 a 1.0001,1.0001 0 0 1 0.050781,-0.316406 l 1,-3 a 1.0001,1.0001 0 0 1 0.2421876,-0.390625 l 2,-2.0000002 A 1.0001,1.0001 0 0 1 5.6835938,8.0507812 L 8.6777344,7.0527344 a 1.0001,1.0001 0 0 1 0.00586,-0.00195 1.0001,1.0001 0 0 1 0.3203124,-0.056641 z"
     id="path2" />
</svg>
