<?xml version="1.0" encoding="UTF-8" standalone="no"?>
<svg
   xmlns:dc="http://purl.org/dc/elements/1.1/"
   xmlns:cc="http://creativecommons.org/ns#"
   xmlns:rdf="http://www.w3.org/1999/02/22-rdf-syntax-ns#"
   xmlns:svg="http://www.w3.org/2000/svg"
   xmlns="http://www.w3.org/2000/svg"
   xmlns:sodipodi="http://sodipodi.sourceforge.net/DTD/sodipodi-0.dtd"
   xmlns:inkscape="http://www.inkscape.org/namespaces/inkscape"
   data-dec="102"
   width="16"
   height="40"
   version="1.1"
   id="svg4"
   sodipodi:docname="102.svg"
   inkscape:version="0.92.4 (unknown)">
  <metadata
     id="metadata10">
    <rdf:RDF>
      <cc:Work
         rdf:about="">
        <dc:format>image/svg+xml</dc:format>
        <dc:type
           rdf:resource="http://purl.org/dc/dcmitype/StillImage" />
      </cc:Work>
    </rdf:RDF>
  </metadata>
  <defs
     id="defs8" />
  <sodipodi:namedview
     pagecolor="#ffffff"
     bordercolor="#666666"
     borderopacity="1"
     objecttolerance="10"
     gridtolerance="10"
     guidetolerance="10"
     inkscape:pageopacity="0"
     inkscape:pageshadow="2"
     inkscape:window-width="615"
     inkscape:window-height="417"
     id="namedview6"
     showgrid="false"
     inkscape:zoom="5.9"
     inkscape:cx="8"
     inkscape:cy="20"
     inkscape:window-x="0"
     inkscape:window-y="27"
     inkscape:window-maximized="0"
     inkscape:current-layer="svg4" />
  <path
     style="color:#000000;font-style:normal;font-variant:normal;font-weight:normal;font-stretch:normal;font-size:medium;line-height:normal;font-family:sans-serif;font-variant-ligatures:normal;font-variant-position:normal;font-variant-caps:normal;font-variant-numeric:normal;font-variant-alternates:normal;font-feature-settings:normal;text-indent:0;text-align:start;text-decoration:none;text-decoration-line:none;text-decoration-style:solid;text-decoration-color:#000000;letter-spacing:normal;word-spacing:normal;text-transform:none;writing-mode:lr-tb;direction:ltr;text-orientation:mixed;dominant-baseline:auto;baseline-shift:baseline;text-anchor:start;white-space:normal;shape-padding:0;clip-rule:nonzero;display:inline;overflow:visible;visibility:visible;opacity:1;isolation:auto;mix-blend-mode:normal;color-interpolation:sRGB;color-interpolation-filters:linearRGB;solid-color:#000000;solid-opacity:1;vector-effect:none;fill:#013272;fill-opacity:1;fill-rule:nonzero;stroke:none;stroke-width:1.5;stroke-linecap:round;stroke-linejoin:round;stroke-miterlimit:4;stroke-dasharray:none;stroke-dashoffset:0;stroke-opacity:1;color-rendering:auto;image-rendering:auto;shape-rendering:auto;text-rendering:auto;enable-background:accumulate"
     d="M 12.984375,0.2421875 A 0.750075,0.750075 0 0 1 13.105469,0.25 H 15 a 0.750075,0.750075 0 0 1 0.53125,0.21875 l 1,1 A 0.750075,0.750075 0 0 1 16.75,2 v 1 a 0.750075,0.750075 0 0 1 -0.21875,0.53125 l -1,1 a 0.750075,0.750075 0 0 1 -1.0625,0 l -1,-1 a 0.750075,0.750075 0 0 1 0,-1.0625 L 14.1875,1.75 h -0.875 L 11.617188,3.4433594 10.707031,5.2617188 10.210938,7.25 H 14 a 0.750075,0.750075 0 1 1 0,1.5 H 9.8359375 L 9.7304688,9.171875 7.7324219,18.162109 a 0.750075,0.750075 0 0 1 -0.00391,0.01953 l -1,4 a 0.750075,0.750075 0 0 1 -0.017578,0.05469 l -1,3 a 0.750075,0.750075 0 0 1 -0.041016,0.09961 l -1,2 A 0.750075,0.750075 0 0 1 4.53125,27.53125 L 3.5585938,28.503906 3.53125,28.53125 a 0.750075,0.750075 0 0 1 -0.2890625,0.185547 l -1.90625,0.953125 A 0.750075,0.750075 0 0 1 1,29.75 h -2 a 0.750075,0.750075 0 0 1 -0.53125,-0.21875 l -1,-1 A 0.750075,0.750075 0 0 1 -2.75,28 v -1 a 0.750075,0.750075 0 0 1 0.21875,-0.53125 l 1,-1 a 0.750075,0.750075 0 0 1 1.0625,0 l 1,1 a 0.750075,0.750075 0 0 1 0,1.0625 L -0.1875,28.25 H 0.82226562 L 2.4414062,27.439453 3.2929688,25.738281 4.2695312,21.830078 7.0742188,8.75 H 4 a 0.750075,0.750075 0 1 1 0,-1.5 h 3.4609375 l 0.828125,-2.4863281 a 0.750075,0.750075 0 0 1 0.041016,-0.099609 l 1,-2 A 0.750075,0.750075 0 0 1 9.46875,2.46875 l 1,-1 A 0.750075,0.750075 0 0 1 10.664062,1.3300781 L 12.617188,0.35351562 A 0.750075,0.750075 0 0 1 12.984375,0.2421875 Z"
     id="path2" />
</svg>
