<svg xmlns:dc="http://purl.org/dc/elements/1.1/" xmlns:cc="http://creativecommons.org/ns#" xmlns:rdf="http://www.w3.org/1999/02/22-rdf-syntax-ns#" xmlns:svg="http://www.w3.org/2000/svg" xmlns="http://www.w3.org/2000/svg" xmlns:sodipodi="http://sodipodi.sourceforge.net/DTD/sodipodi-0.dtd" xmlns:inkscape="http://www.inkscape.org/namespaces/inkscape" data-dec="339" id="dec_101" width="27" height="40" version="1.1" sodipodi:docname="339.svg" inkscape:version="0.92.3 (2405546, 2018-03-11)">
  <metadata id="metadata9">
    <rdf:RDF>
      <cc:Work rdf:about="">
        <dc:format>image/svg+xml</dc:format>
        <dc:type rdf:resource="http://purl.org/dc/dcmitype/StillImage"/>
        <dc:title/>
      </cc:Work>
    </rdf:RDF>
  </metadata>
  <defs id="defs7"/>
  <sodipodi:namedview pagecolor="#ffffff" bordercolor="#666666" borderopacity="1" objecttolerance="10" gridtolerance="10" guidetolerance="10" inkscape:pageopacity="0" inkscape:pageshadow="2" inkscape:window-width="1403" inkscape:window-height="872" id="namedview5" showgrid="true" showguides="true" inkscape:zoom="11.938687" inkscape:cx="2.4262357" inkscape:cy="26.69053" inkscape:window-x="37" inkscape:window-y="0" inkscape:window-maximized="1" inkscape:current-layer="dec_101">
    <inkscape:grid type="xygrid" id="grid819"/>
  </sodipodi:namedview>
  <path id="path2-6" style="fill:none;stroke:#000000;stroke-width:1;stroke-linecap:round;stroke-linejoin:round" d="m 7,8 -2,1 L 3,11 2,13 v 4 l 1,2 2,2 2,1 h 2 l 2,-1 2,-2 1,-2 v -4 l -1,-2 -2,-2 -2,-1 H 7 m 0,0 -2,1 v 0 L 3,13 v 4 l 2,4 v 0 l 2,1 m 2,0 2,-1 v 0 l 2,-4 V 13 L 11,9 v 4e-7 l -2,-1 M 18,8 l -2,1 -2,2 -1,2 v 4 l 1,2 2,2 2,1 h 3 l 2,-1 m -5,1 h 1 l -2,-1 -2,-2 -1,-2 v -4 l 1,-3 1,-1 2,-1 h 2 l 2,1 2,2 1,3 H 14 m 9,7 1,-1 m 0,-6 -1,-3 -1,-2              " inkscape:connector-curvature="0"/>
</svg>