<?xml version="1.0" encoding="UTF-8" standalone="no"?>
<svg
   xmlns:dc="http://purl.org/dc/elements/1.1/"
   xmlns:cc="http://creativecommons.org/ns#"
   xmlns:rdf="http://www.w3.org/1999/02/22-rdf-syntax-ns#"
   xmlns:svg="http://www.w3.org/2000/svg"
   xmlns="http://www.w3.org/2000/svg"
   xmlns:sodipodi="http://sodipodi.sourceforge.net/DTD/sodipodi-0.dtd"
   xmlns:inkscape="http://www.inkscape.org/namespaces/inkscape"
   data-dec="99"
   width="18"
   height="40"
   version="1.1"
   id="svg4"
   sodipodi:docname="99.svg"
   inkscape:version="0.92.4 (unknown)">
  <metadata
     id="metadata10">
    <rdf:RDF>
      <cc:Work
         rdf:about="">
        <dc:format>image/svg+xml</dc:format>
        <dc:type
           rdf:resource="http://purl.org/dc/dcmitype/StillImage" />
      </cc:Work>
    </rdf:RDF>
  </metadata>
  <defs
     id="defs8" />
  <sodipodi:namedview
     pagecolor="#ffffff"
     bordercolor="#666666"
     borderopacity="1"
     objecttolerance="10"
     gridtolerance="10"
     guidetolerance="10"
     inkscape:pageopacity="0"
     inkscape:pageshadow="2"
     inkscape:window-width="640"
     inkscape:window-height="480"
     id="namedview6"
     showgrid="false"
     inkscape:zoom="5.9"
     inkscape:cx="9"
     inkscape:cy="20"
     inkscape:window-x="0"
     inkscape:window-y="27"
     inkscape:window-maximized="0"
     inkscape:current-layer="svg4" />
  <path
     style="color:#000000;font-style:normal;font-variant:normal;font-weight:normal;font-stretch:normal;font-size:medium;line-height:normal;font-family:sans-serif;font-variant-ligatures:normal;font-variant-position:normal;font-variant-caps:normal;font-variant-numeric:normal;font-variant-alternates:normal;font-feature-settings:normal;text-indent:0;text-align:start;text-decoration:none;text-decoration-line:none;text-decoration-style:solid;text-decoration-color:#000000;letter-spacing:normal;word-spacing:normal;text-transform:none;writing-mode:lr-tb;direction:ltr;text-orientation:mixed;dominant-baseline:auto;baseline-shift:baseline;text-anchor:start;white-space:normal;shape-padding:0;clip-rule:nonzero;display:inline;overflow:visible;visibility:visible;opacity:1;isolation:auto;mix-blend-mode:normal;color-interpolation:sRGB;color-interpolation-filters:linearRGB;solid-color:#000000;solid-opacity:1;vector-effect:none;fill:#000000;fill-opacity:1;fill-rule:nonzero;stroke:none;stroke-width:0.30000001;stroke-linecap:round;stroke-linejoin:round;stroke-miterlimit:4;stroke-dasharray:none;stroke-dashoffset:0;stroke-opacity:1;color-rendering:auto;image-rendering:auto;shape-rendering:auto;text-rendering:auto;enable-background:accumulate"
     d="M 6.7578125,19.546875 7.1054688,19.894531 8.0625,20.849609 H 9.3632812 L 7.9335938,20.134766 Z m -1.3964844,-0.396484 1.7265625,1.726562 1.9472656,0.972656 h 1.9296878 l 1.947265,-0.972656 0.330079,-0.330078 -1.175782,0.587891 A 0.15001501,0.15001501 0 0 1 12,21.150391 H 10.005859 9.9902344 8 a 0.15001501,0.15001501 0 0 1 -0.1054688,-0.04492 l -1,-1 -0.9550781,-0.955078 z m 8.4882809,-0.513672 -0.714843,1.429687 a 0.15001501,0.15001501 0 0 1 -0.08789,0.07617 l -2.121094,0.707031 h 1.039063 l 1.884765,-0.941406 z m 0.300782,-0.394531 v 1.396484 l 0.74414,-0.744141 a 0.15001501,0.15001501 0 1 1 0.210938,0.210938 l -0.982422,0.980469 a 0.15001501,0.15001501 0 0 1 -0.03125,0.03125 l -0.986328,0.988281 a 0.15001501,0.15001501 0 0 1 -0.03906,0.0293 l -1.429687,0.714843 h 0.328125 l 1.947265,-0.972656 1.835938,-1.835937 z M 5.1074219,11.150391 4.1503906,14.023438 v 1.953124 l 0.9570313,2.873047 H 5.7910156 L 4.8574219,16.046875 A 0.15001501,0.15001501 0 0 1 4.8496094,16 v -2 a 0.15001501,0.15001501 0 0 1 0.00781,-0.04687 l 0.9335937,-2.802734 z m 5.8183591,-2.0000004 2.121094,0.7070313 a 0.15001501,0.15001501 0 0 1 0.08789,0.076172 l 0.714843,1.4296872 V 10.091797 L 11.964844,9.1503906 Z m -1.8906248,0 L 7.0878906,10.123047 6.7578125,10.453125 7.9335938,9.8652344 9.3632812,9.1503906 Z m 2.6015628,-1 1.429687,0.7148438 a 0.15001501,0.15001501 0 0 1 0.03906,0.029297 l 0.988281,0.9882813 a 0.15001501,0.15001501 0 0 1 0.02148,0.021484 l 0.990235,0.9902341 a 0.15001501,0.15001501 0 1 1 -0.210938,0.210938 l -0.74414,-0.744141 v 1.396484 L 15.748047,10.958984 13.912109,9.1230469 11.964844,8.1503906 Z m -2.6015628,0 -1.9472656,0.9726563 -1.7265625,1.7265621 h 0.578125 L 6.8945312,9.8945312 a 0.15001501,0.15001501 0 0 1 0.039063,-0.029297 l 2,-1 A 0.15001501,0.15001501 0 0 1 9,8.8496094 H 9.9882812 10.003906 12 a 0.15001501,0.15001501 0 0 1 0.06641,0.015625 L 13.242188,9.453125 12.912109,9.1230469 10.964844,8.1503906 Z m -1,0 -1.9472656,0.9726563 -1.9570312,1.9570311 -0.9804688,2.94336 v 1.953124 l 0.9804688,2.94336 1.9570312,1.957031 1.9472656,0.972656 h 0.328125 L 6.9335938,21.134766 a 0.15001501,0.15001501 0 0 1 -0.039063,-0.0293 l -1.984375,-1.986328 a 0.15001501,0.15001501 0 0 1 -0.015625,-0.01367 0.15001501,0.15001501 0 0 1 -0.00781,-0.0059 0.15001501,0.15001501 0 0 1 -0.023438,-0.03906 0.15001501,0.15001501 0 0 1 -0.00586,-0.01367 l -1,-3 a 0.15001501,0.15001501 0 0 1 0,-0.002 0.15001501,0.15001501 0 0 1 -0.00391,-0.01563 A 0.15001501,0.15001501 0 0 1 3.8496094,16 v -2 a 0.15001501,0.15001501 0 0 1 0.00781,-0.04687 l 1,-3 a 0.15001501,0.15001501 0 0 1 0.00391,-0.0098 0.15001501,0.15001501 0 0 1 0.00586,-0.01172 0.15001501,0.15001501 0 0 1 0,-0.002 0.15001501,0.15001501 0 0 1 0.00391,-0.0059 0.15001501,0.15001501 0 0 1 0.00391,-0.0059 0.15001501,0.15001501 0 0 1 0.00781,-0.01172 0.15001501,0.15001501 0 0 1 0.00195,-0.002 0.15001501,0.15001501 0 0 1 0.00781,-0.0098 0.15001501,0.15001501 0 0 1 0.011719,-0.0098 L 6.8945312,8.8945312 a 0.15001501,0.15001501 0 0 1 0.039063,-0.029297 L 8.3632812,8.1503906 Z M 7.984375,7.8496094 a 0.15001501,0.15001501 0 0 1 0.015625,0 h 1 2 0.0098 H 12 a 0.15001501,0.15001501 0 0 1 0.06641,0.015625 l 2,1 a 0.15001501,0.15001501 0 0 1 0.03906,0.029297 L 16.085938,10.875 a 0.15001501,0.15001501 0 0 1 0.02344,0.01953 0.15001501,0.15001501 0 0 1 0.01758,0.02344 0.15001501,0.15001501 0 0 1 0.0039,0.0078 0.15001501,0.15001501 0 0 1 0.0078,0.01367 0.15001501,0.15001501 0 0 1 0.002,0.0039 0.15001501,0.15001501 0 0 1 0.0059,0.01367 0.15001501,0.15001501 0 0 1 0.002,0.0098 0.15001501,0.15001501 0 0 1 0.0039,0.0293 0.15001501,0.15001501 0 0 1 0,0.0059 0.15001501,0.15001501 0 0 1 -0.002,0.0098 0.15001501,0.15001501 0 0 1 0,0.0059 0.15001501,0.15001501 0 0 1 -0.002,0.0098 0.15001501,0.15001501 0 0 1 0,0.0039 0.15001501,0.15001501 0 0 1 -0.002,0.0098 0.15001501,0.15001501 0 0 1 -0.002,0.0039 0.15001501,0.15001501 0 0 1 0,0.002 0.15001501,0.15001501 0 0 1 -0.0039,0.0098 0.15001501,0.15001501 0 0 1 -0.002,0.0039 0.15001501,0.15001501 0 0 1 -0.0039,0.0098 0.15001501,0.15001501 0 0 1 0,0.002 0.15001501,0.15001501 0 0 1 -0.002,0.002 0.15001501,0.15001501 0 0 1 -0.0059,0.0078 0.15001501,0.15001501 0 0 1 -0.0039,0.0039 0.15001501,0.15001501 0 0 1 -0.0039,0.0078 0.15001501,0.15001501 0 0 1 -0.0039,0.0039 0.15001501,0.15001501 0 0 1 -0.01172,0.01172 0.15001501,0.15001501 0 0 1 -0.0059,0.0059 0.15001501,0.15001501 0 0 1 -0.0059,0.0039 0.15001501,0.15001501 0 0 1 -0.02539,0.01563 0.15001501,0.15001501 0 0 1 -0.0059,0.0039 l -0.01367,0.0059 -1.980469,0.990235 a 0.15001501,0.15001501 0 0 1 -0.0098,0.0039 0.15001501,0.15001501 0 0 1 -0.01172,0.0039 0.15001501,0.15001501 0 0 1 -0.002,0.002 0.15001501,0.15001501 0 0 1 -0.03906,0.0059 0.15001501,0.15001501 0 0 1 -0.0059,0 0.15001501,0.15001501 0 0 1 -0.0078,0 0.15001501,0.15001501 0 0 1 -0.02148,-0.0039 0.15001501,0.15001501 0 0 1 -0.0098,-0.002 0.15001501,0.15001501 0 0 1 -0.0039,-0.002 0.15001501,0.15001501 0 0 1 -0.0098,-0.002 0.15001501,0.15001501 0 0 1 -0.0039,-0.002 0.15001501,0.15001501 0 0 1 -0.0098,-0.0059 0.15001501,0.15001501 0 0 1 -0.0039,-0.002 0.15001501,0.15001501 0 0 1 -0.0078,-0.0039 0.15001501,0.15001501 0 0 1 -0.0039,-0.002 0.15001501,0.15001501 0 0 1 -0.0039,-0.0039 0.15001501,0.15001501 0 0 1 -0.0098,-0.0078 0.15001501,0.15001501 0 0 1 -0.0059,-0.0059 0.15001501,0.15001501 0 0 1 -0.0039,-0.0039 0.15001501,0.15001501 0 0 1 -0.0078,-0.0078 0.15001501,0.15001501 0 0 1 -0.002,-0.0039 0.15001501,0.15001501 0 0 1 -0.0059,-0.0078 0.15001501,0.15001501 0 0 1 -0.0039,-0.0039 0.15001501,0.15001501 0 0 1 -0.0039,-0.0078 0.15001501,0.15001501 0 0 1 -0.0039,-0.0059 l -0.0039,-0.0078 -0.966797,-1.935547 -2.882812,-0.9609376 -1.9453128,0.9726566 -1.9453124,0.972656 -0.9707032,2.916016 v 1.953124 l 0.9707032,2.916016 1.9453124,0.972656 1.9453128,0.972657 2.882812,-0.960938 0.962891,-1.925781 a 0.15001501,0.15001501 0 0 1 0.0059,-0.01367 l 0.002,-0.0039 a 0.15001501,0.15001501 0 0 1 0.0059,-0.0098 0.15001501,0.15001501 0 0 1 0.0078,-0.01367 0.15001501,0.15001501 0 0 1 0.0098,-0.0098 0.15001501,0.15001501 0 0 1 0.0098,-0.01172 0.15001501,0.15001501 0 0 1 0.06641,-0.03516 0.15001501,0.15001501 0 0 1 0.0293,-0.0039 0.15001501,0.15001501 0 0 1 0.03125,0.002 0.15001501,0.15001501 0 0 1 0.01367,0.0039 0.15001501,0.15001501 0 0 1 0.02734,0.0098 l 1.97461,0.988282 a 0.15001501,0.15001501 0 0 1 0.01563,0.0059 0.15001501,0.15001501 0 0 1 0.02539,0.01367 0.15001501,0.15001501 0 0 1 0.0078,0.0059 0.15001501,0.15001501 0 0 1 0.0039,0.002 0.15001501,0.15001501 0 0 1 0.0078,0.0078 0.15001501,0.15001501 0 0 1 0.0039,0.002 0.15001501,0.15001501 0 0 1 0.0059,0.0078 0.15001501,0.15001501 0 0 1 0.0039,0.0039 0.15001501,0.15001501 0 0 1 0.0059,0.0078 0.15001501,0.15001501 0 0 1 0.0039,0.0039 0.15001501,0.15001501 0 0 1 0.0039,0.0078 0.15001501,0.15001501 0 0 1 0.0078,0.01367 0.15001501,0.15001501 0 0 1 0.002,0.0039 0.15001501,0.15001501 0 0 1 0.0039,0.0098 0.15001501,0.15001501 0 0 1 0.002,0.0039 0.15001501,0.15001501 0 0 1 0.002,0.0098 0.15001501,0.15001501 0 0 1 0.002,0.0059 0.15001501,0.15001501 0 0 1 0.002,0.0098 0.15001501,0.15001501 0 0 1 0,0.0059 0.15001501,0.15001501 0 0 1 0.002,0.0098 0.15001501,0.15001501 0 0 1 0,0.0039 0.15001501,0.15001501 0 0 1 0,0.0098 0.15001501,0.15001501 0 0 1 -0.0039,0.01953 0.15001501,0.15001501 0 0 1 -0.002,0.0098 0.15001501,0.15001501 0 0 1 -0.002,0.0059 0.15001501,0.15001501 0 0 1 -0.002,0.0098 0.15001501,0.15001501 0 0 1 -0.002,0.0039 0.15001501,0.15001501 0 0 1 -0.0039,0.0098 0.15001501,0.15001501 0 0 1 -0.01563,0.02539 0.15001501,0.15001501 0 0 1 -0.0039,0.0039 0.15001501,0.15001501 0 0 1 -0.01563,0.01758 0.15001501,0.15001501 0 0 1 -0.01172,0.0098 l -0.0039,0.002 -1.980469,1.980469 a 0.15001501,0.15001501 0 0 1 -0.03906,0.0293 l -2,1 A 0.15001501,0.15001501 0 0 1 12,22.150391 H 11 8.9902344 8 a 0.15001501,0.15001501 0 0 1 -0.066406,-0.01563 l -2,-1 a 0.15001501,0.15001501 0 0 1 -0.039063,-0.0293 l -2,-2 a 0.15001501,0.15001501 0 0 1 -0.037109,-0.05859 l -1,-3 A 0.15001501,0.15001501 0 0 1 2.8496094,16 v -2 a 0.15001501,0.15001501 0 0 1 0.00781,-0.04687 l 1,-3 a 0.15001501,0.15001501 0 0 1 0.037109,-0.05859 l 2,-1.9999998 a 0.15001501,0.15001501 0 0 1 0.039063,-0.029297 l 2,-1 a 0.15001501,0.15001501 0 0 1 0.050781,-0.015625 z"
     id="path2" />
</svg>
