<?xml version="1.0" encoding="UTF-8" standalone="no"?>
<svg
   xmlns:dc="http://purl.org/dc/elements/1.1/"
   xmlns:cc="http://creativecommons.org/ns#"
   xmlns:rdf="http://www.w3.org/1999/02/22-rdf-syntax-ns#"
   xmlns:svg="http://www.w3.org/2000/svg"
   xmlns="http://www.w3.org/2000/svg"
   xmlns:sodipodi="http://sodipodi.sourceforge.net/DTD/sodipodi-0.dtd"
   xmlns:inkscape="http://www.inkscape.org/namespaces/inkscape"
   data-dec="120"
   id="dec_120"
   width="18"
   height="40"
   version="1.1"
   sodipodi:docname="120.svg"
   inkscape:version="0.91 r13725">
  <metadata
     id="metadata9">
    <rdf:RDF>
      <cc:Work
         rdf:about="">
        <dc:format>image/svg+xml</dc:format>
        <dc:type
           rdf:resource="http://purl.org/dc/dcmitype/StillImage" />
      </cc:Work>
    </rdf:RDF>
  </metadata>
  <defs
     id="defs7" />
  <sodipodi:namedview
     pagecolor="#ffffff"
     bordercolor="#666666"
     borderopacity="1"
     objecttolerance="10"
     gridtolerance="10"
     guidetolerance="10"
     inkscape:pageopacity="0"
     inkscape:pageshadow="2"
     inkscape:window-width="1407"
     inkscape:window-height="876"
     id="namedview5"
     showgrid="true"
     inkscape:zoom="23.6"
     inkscape:cx="-2.2288136"
     inkscape:cy="19.682204"
     inkscape:window-x="33"
     inkscape:window-y="24"
     inkscape:window-maximized="1"
     inkscape:current-layer="dec_120">
    <inkscape:grid
       type="xygrid"
       id="grid11" />
  </sodipodi:namedview>
  <path
     style="color:#000000;font-style:normal;font-variant:normal;font-weight:normal;font-stretch:normal;font-size:medium;line-height:normal;font-family:sans-serif;text-indent:0;text-align:start;text-decoration:none;text-decoration-line:none;text-decoration-style:solid;text-decoration-color:#000000;letter-spacing:normal;word-spacing:normal;text-transform:none;direction:ltr;block-progression:tb;writing-mode:lr-tb;baseline-shift:baseline;text-anchor:start;white-space:normal;clip-rule:nonzero;display:inline;overflow:visible;visibility:visible;opacity:1;isolation:auto;mix-blend-mode:normal;color-interpolation:sRGB;color-interpolation-filters:linearRGB;solid-color:#000000;solid-opacity:1;fill:#000000;fill-opacity:1;fill-rule:nonzero;stroke:none;stroke-width:1;stroke-linecap:round;stroke-linejoin:round;stroke-miterlimit:4;stroke-dasharray:none;stroke-dashoffset:0;stroke-opacity:1;color-rendering:auto;image-rendering:auto;shape-rendering:auto;text-rendering:auto;enable-background:accumulate"
     d="M 3.0058594 7.4941406 A 0.50005 0.50005 0 0 0 2.6386719 7.6464844 A 0.50005 0.50005 0 0 0 2.6054688 7.6835938 A 0.50005 0.50005 0 0 0 2.5800781 7.7167969 A 0.50005 0.50005 0 0 0 2.5761719 7.7246094 A 0.50005 0.50005 0 0 0 2.5507812 7.765625 A 0.50005 0.50005 0 0 0 2.5507812 7.7675781 A 0.50005 0.50005 0 0 0 2.5332031 7.8046875 A 0.50005 0.50005 0 0 0 2.5214844 7.8359375 A 0.50005 0.50005 0 0 0 2.5039062 7.9003906 A 0.50005 0.50005 0 0 0 2.5019531 7.9082031 A 0.50005 0.50005 0 0 0 2.6503906 8.3632812 L 7.8652344 15 L 2.6523438 21.634766 A 0.50005 0.50005 0 0 0 2.5214844 22.162109 A 0.50005 0.50005 0 0 0 2.5390625 22.207031 A 0.50005 0.50005 0 0 0 2.5390625 22.208984 A 0.50005 0.50005 0 0 0 2.5585938 22.246094 A 0.50005 0.50005 0 0 0 2.5625 22.253906 A 0.50005 0.50005 0 0 0 2.5839844 22.289062 A 0.50005 0.50005 0 0 0 3.0703125 22.5 L 3.9199219 22.5 A 0.50005 0.50005 0 0 0 4.0703125 22.5 L 5 22.5 A 0.50005 0.50005 0 0 0 5.3925781 22.308594 L 9.5 17.080078 L 13.607422 22.308594 A 0.50005 0.50005 0 0 0 14 22.5 L 14.933594 22.5 A 0.50005 0.50005 0 0 0 15.078125 22.5 L 15.933594 22.5 A 0.50005 0.50005 0 0 0 16.361328 22.353516 A 0.50005 0.50005 0 0 0 16.394531 22.316406 A 0.50005 0.50005 0 0 0 16.419922 22.283203 A 0.50005 0.50005 0 0 0 16.423828 22.275391 A 0.50005 0.50005 0 0 0 16.445312 22.240234 A 0.50005 0.50005 0 0 0 16.449219 22.232422 A 0.50005 0.50005 0 0 0 16.466797 22.195312 A 0.50005 0.50005 0 0 0 16.470703 22.1875 A 0.50005 0.50005 0 0 0 16.486328 22.140625 A 0.50005 0.50005 0 0 0 16.496094 22.099609 A 0.50005 0.50005 0 0 0 16.498047 22.091797 A 0.50005 0.50005 0 0 0 16.349609 21.636719 L 11.134766 15 L 16.347656 8.3652344 A 0.50005 0.50005 0 0 0 16.478516 7.8378906 A 0.50005 0.50005 0 0 0 16.464844 7.7988281 A 0.50005 0.50005 0 0 0 16.460938 7.7910156 A 0.50005 0.50005 0 0 0 16.441406 7.7539062 A 0.50005 0.50005 0 0 0 16.4375 7.7460938 A 0.50005 0.50005 0 0 0 16.416016 7.7109375 A 0.50005 0.50005 0 0 0 15.929688 7.5 L 15.080078 7.5 A 0.50005 0.50005 0 0 0 14.929688 7.5 L 14 7.5 A 0.50005 0.50005 0 0 0 13.607422 7.6914062 L 9.5 12.919922 L 5.3925781 7.6914062 A 0.50005 0.50005 0 0 0 5 7.5 L 4.0664062 7.5 A 0.50005 0.50005 0 0 0 3.921875 7.5 L 3.0664062 7.5 A 0.50005 0.50005 0 0 0 3.0058594 7.4941406 z "
     id="path13" />
</svg>
