<?xml version="1.0" encoding="UTF-8" standalone="no"?>
<svg
   xmlns:dc="http://purl.org/dc/elements/1.1/"
   xmlns:cc="http://creativecommons.org/ns#"
   xmlns:rdf="http://www.w3.org/1999/02/22-rdf-syntax-ns#"
   xmlns:svg="http://www.w3.org/2000/svg"
   xmlns="http://www.w3.org/2000/svg"
   xmlns:sodipodi="http://sodipodi.sourceforge.net/DTD/sodipodi-0.dtd"
   xmlns:inkscape="http://www.inkscape.org/namespaces/inkscape"
   data-dec="64"
   width="28"
   height="40"
   version="1.1"
   id="svg4"
   sodipodi:docname="64.svg"
   inkscape:version="0.92.4 (unknown)">
  <metadata
     id="metadata10">
    <rdf:RDF>
      <cc:Work
         rdf:about="">
        <dc:format>image/svg+xml</dc:format>
        <dc:type
           rdf:resource="http://purl.org/dc/dcmitype/StillImage" />
      </cc:Work>
    </rdf:RDF>
  </metadata>
  <defs
     id="defs8" />
  <sodipodi:namedview
     pagecolor="#ffffff"
     bordercolor="#666666"
     borderopacity="1"
     objecttolerance="10"
     gridtolerance="10"
     guidetolerance="10"
     inkscape:pageopacity="0"
     inkscape:pageshadow="2"
     inkscape:window-width="640"
     inkscape:window-height="480"
     id="namedview6"
     showgrid="false"
     inkscape:zoom="5.9"
     inkscape:cx="14"
     inkscape:cy="20"
     inkscape:window-x="0"
     inkscape:window-y="27"
     inkscape:window-maximized="0"
     inkscape:current-layer="svg4" />
  <path
     style="color:#000000;font-style:normal;font-variant:normal;font-weight:normal;font-stretch:normal;font-size:medium;line-height:normal;font-family:sans-serif;font-variant-ligatures:normal;font-variant-position:normal;font-variant-caps:normal;font-variant-numeric:normal;font-variant-alternates:normal;font-feature-settings:normal;text-indent:0;text-align:start;text-decoration:none;text-decoration-line:none;text-decoration-style:solid;text-decoration-color:#000000;letter-spacing:normal;word-spacing:normal;text-transform:none;writing-mode:lr-tb;direction:ltr;text-orientation:mixed;dominant-baseline:auto;baseline-shift:baseline;text-anchor:start;white-space:normal;shape-padding:0;clip-rule:nonzero;display:inline;overflow:visible;visibility:visible;opacity:1;isolation:auto;mix-blend-mode:normal;color-interpolation:sRGB;color-interpolation-filters:linearRGB;solid-color:#000000;solid-opacity:1;vector-effect:none;fill:#013272;fill-opacity:1;fill-rule:nonzero;stroke:none;stroke-width:2;stroke-linecap:round;stroke-linejoin:round;stroke-miterlimit:4;stroke-dasharray:none;stroke-dashoffset:0;stroke-opacity:1;color-rendering:auto;image-rendering:auto;shape-rendering:auto;text-rendering:auto;enable-background:accumulate"
     d="M 12.414062,7 10.875,8.5410156 10,11.162109 v 2.601563 L 10.822266,15.408203 11.414062,16 h 2.34961 L 15.253906,15.253906 16.029297,13.705078 16.669922,8.578125 16.253906,7.7460938 14.763672,7 Z M 12.162109,2 9.3828125,2.9257812 7.5917969,3.8222656 5.8222656,5.5917969 4.9257812,7.3828125 4,10.162109 v 2.675782 l 0.9257812,2.779297 0.8964844,1.791015 1.7695313,1.769531 1.7910156,0.896485 L 12.162109,21 h 2.675782 l 2.779297,-0.925781 1.791015,-0.896485 0.884766,-0.884765 A 1.0001,1.0001 0 0 1 20.869141,18 h -1.722657 a 1.0001,1.0001 0 0 1 -0.658203,-0.136719 l -1.935547,-0.96875 a 1.0001,1.0001 0 0 1 -0.05273,-0.0293 1.0001,1.0001 0 0 1 -0.05273,0.0293 l -2,1 A 1.0001,1.0001 0 0 1 14,18 H 11.146484 A 1.0001,1.0001 0 0 1 10.488281,17.863281 L 8.5527344,16.894531 A 1.0001,1.0001 0 0 1 8.1054688,16.447266 l -1,-2 A 1.0001,1.0001 0 0 1 7,14 v -3 a 1.0001,1.0001 0 0 1 0.050781,-0.316406 l 1,-3.0000002 a 1.0001,1.0001 0 0 1 0.2421876,-0.390625 l 1,-1 a 1.0001,1.0001 0 0 1 0.2597656,-0.1875 L 11.486328,5.1386719 A 1.0001,1.0001 0 0 1 12.146484,5 H 15 a 1.0001,1.0001 0 0 1 0.447266,0.1054688 l 1.558593,0.7792968 0.002,-0.00977 A 1.0001,1.0001 0 0 1 18.501953,5.1210938 1.0001,1.0001 0 0 1 19.992188,6.125 L 19,14.0625 v 1.523438 L 19.414062,16 h 1.171876 L 22.125,14.458984 23,11.837891 V 10.162109 L 22.074219,7.3828125 21.177734,5.5917969 19.408203,3.8222656 17.617188,2.9257812 14.837891,2 Z M 12,0 h 3 a 1.0001,1.0001 0 0 1 0.316406,0.05078125 l 3,0.99999995 a 1.0001,1.0001 0 0 1 0.13086,0.054688 l 2,1 a 1.0001,1.0001 0 0 1 0.259765,0.1875 l 2,2 a 1.0001,1.0001 0 0 1 0.1875,0.2597656 l 1,2 a 1.0001,1.0001 0 0 1 0.05469,0.1308594 l 1,3 A 1.0001,1.0001 0 0 1 25,10 v 2 a 1.0001,1.0001 0 0 1 -0.05078,0.316406 l -1,3 a 1.0001,1.0001 0 0 1 -0.242188,0.390625 l -2,2 a 1.0001,1.0001 0 0 1 -0.607422,0.28711 1.0001,1.0001 0 0 1 0.607422,1.71289 l -1,1 a 1.0001,1.0001 0 0 1 -0.259765,0.1875 l -2,1 a 1.0001,1.0001 0 0 1 -0.13086,0.05469 l -3,1 A 1.0001,1.0001 0 0 1 15,23 h -3 a 1.0001,1.0001 0 0 1 -0.316406,-0.05078 l -3.0000002,-1 a 1.0001,1.0001 0 0 1 -0.1308594,-0.05469 l -2,-1 a 1.0001,1.0001 0 0 1 -0.2597656,-0.1875 l -2,-2 a 1.0001,1.0001 0 0 1 -0.1875,-0.259765 l -1,-2 a 1.0001,1.0001 0 0 1 -0.054688,-0.13086 l -1,-3 A 1.0001,1.0001 0 0 1 2,13 v -3 a 1.0001,1.0001 0 0 1 0.050781,-0.3164062 l 1,-3 a 1.0001,1.0001 0 0 1 0.054688,-0.1308594 l 1,-2 a 1.0001,1.0001 0 0 1 0.1875,-0.2597656 l 2,-2 a 1.0001,1.0001 0 0 1 0.2597656,-0.1875 l 2,-1 A 1.0001,1.0001 0 0 1 8.6835938,1.0507812 L 11.683594,0.05078125 A 1.0001,1.0001 0 0 1 12,0 Z"
     id="path2" />
</svg>
