<?xml version="1.0" encoding="UTF-8" standalone="no"?>
<svg
   xmlns:dc="http://purl.org/dc/elements/1.1/"
   xmlns:cc="http://creativecommons.org/ns#"
   xmlns:rdf="http://www.w3.org/1999/02/22-rdf-syntax-ns#"
   xmlns:svg="http://www.w3.org/2000/svg"
   xmlns="http://www.w3.org/2000/svg"
   xmlns:sodipodi="http://sodipodi.sourceforge.net/DTD/sodipodi-0.dtd"
   xmlns:inkscape="http://www.inkscape.org/namespaces/inkscape"
   data-dec="65"
   width="20"
   height="40"
   version="1.1"
   id="svg4"
   sodipodi:docname="65.svg"
   inkscape:version="0.92.4 5da689c313, 2019-01-14">
  <metadata
     id="metadata10">
    <rdf:RDF>
      <cc:Work
         rdf:about="">
        <dc:format>image/svg+xml</dc:format>
        <dc:type
           rdf:resource="http://purl.org/dc/dcmitype/StillImage" />
        <dc:title></dc:title>
      </cc:Work>
    </rdf:RDF>
  </metadata>
  <defs
     id="defs8" />
  <sodipodi:namedview
     pagecolor="#ffffff"
     bordercolor="#666666"
     borderopacity="1"
     objecttolerance="10"
     gridtolerance="10"
     guidetolerance="10"
     inkscape:pageopacity="0"
     inkscape:pageshadow="2"
     inkscape:window-width="1920"
     inkscape:window-height="1043"
     id="namedview6"
     showgrid="false"
     inkscape:zoom="5.9"
     inkscape:cx="10"
     inkscape:cy="20"
     inkscape:window-x="0"
     inkscape:window-y="37"
     inkscape:window-maximized="0"
     inkscape:current-layer="svg4" />
  <path
     style="color:#000000;font-style:normal;font-variant:normal;font-weight:normal;font-stretch:normal;font-size:medium;line-height:normal;font-family:sans-serif;font-variant-ligatures:normal;font-variant-position:normal;font-variant-caps:normal;font-variant-numeric:normal;font-variant-alternates:normal;font-feature-settings:normal;text-indent:0;text-align:start;text-decoration:none;text-decoration-line:none;text-decoration-style:solid;text-decoration-color:#000000;letter-spacing:normal;word-spacing:normal;text-transform:none;writing-mode:lr-tb;direction:ltr;text-orientation:mixed;dominant-baseline:auto;baseline-shift:baseline;text-anchor:start;white-space:normal;shape-padding:0;clip-rule:nonzero;display:inline;overflow:visible;visibility:visible;opacity:1;isolation:auto;mix-blend-mode:normal;color-interpolation:sRGB;color-interpolation-filters:linearRGB;solid-color:#000000;solid-opacity:1;vector-effect:none;fill:#000000;fill-opacity:1;fill-rule:nonzero;stroke:none;stroke-width:0.5;stroke-linecap:round;stroke-linejoin:round;stroke-miterlimit:4;stroke-dasharray:none;stroke-dashoffset:0;stroke-opacity:1;color-rendering:auto;image-rendering:auto;shape-rendering:auto;text-rendering:auto;enable-background:accumulate"
     d="M 3.3574219,21.712891 3.3457031,21.75 h 0.048828 z m 12.2890621,-0.0039 -0.04101,0.04102 h 0.05273 z M 17.070312,21.425781 17.179688,21.75 h 0.214843 z m -14.1406245,0 L 2.6054688,21.75 H 2.8203125 Z M 10,1.7871094 5.3457031,15.75 H 13.763672 L 9.7617188,3.0761719 A 0.25016003,0.25016003 0 1 1 10.238281,2.9238281 L 15.876953,20.78125 a 0.250025,0.250025 0 0 1 0.300781,0.396484 L 16.044922,21.310547 16.183594,21.75 h 0.470703 l -0.884766,-2.654297 a 0.250025,0.250025 0 0 1 -0.01563,-0.04687 z m -0.00977,-1.04101565 a 0.250025,0.250025 0 0 1 0.025391,0.001953 0.250025,0.250025 0 0 1 0.01172,0 0.250025,0.250025 0 0 1 0.03711,0.007813 0.250025,0.250025 0 0 1 0.02344,0.007813 0.250025,0.250025 0 0 1 0.01172,0.003906 0.250025,0.250025 0 0 1 0.01172,0.005859 0.250025,0.250025 0 0 1 0.02148,0.0117188 0.250025,0.250025 0 0 1 0.01953,0.0136719 0.250025,0.250025 0 0 1 0.01953,0.0175781 0.250025,0.250025 0 0 1 0.0098,0.007813 0.250025,0.250025 0 0 1 0.0078,0.009766 0.250025,0.250025 0 0 1 0.0078,0.007813 0.250025,0.250025 0 0 1 0.0078,0.0117187 0.250025,0.250025 0 0 1 0.04297,0.1015625 v 0.001953 L 16.230469,18.904297 17.205078,20.851562 18.103516,21.75 H 19 a 0.250025,0.250025 0 0 1 0,0.5 h -1.021484 -0.935547 a 0.250025,0.250025 0 0 1 -0.08203,0 h -0.917969 a 0.250025,0.250025 0 0 1 -0.08594,0 H 15 14 a 0.250025,0.250025 0 0 1 0,-0.5 h 0.896484 L 15.474609,21.169922 13.921875,16.25 H 5.1796875 l -0.9316406,2.791016 a 0.250025,0.250025 0 0 1 -0.00586,0.02344 0.250025,0.250025 0 0 1 -0.013672,0.03516 L 3.5351562,21.181641 4.1035156,21.75 H 5 a 0.250025,0.250025 0 0 1 0,0.5 H 3.9785156 3.0351562 a 0.250025,0.250025 0 0 1 -0.074219,0 H 2 1 a 0.250025,0.250025 0 0 1 0,-0.5 H 1.8964844 L 2.7988281,20.845703 3.7695312,18.904297 4.75,15.964844 a 0.250025,0.250025 0 0 1 0.025391,-0.08203 0.250025,0.250025 0 0 1 0.00391,-0.0059 L 9.7539062,0.95117188 a 0.250025,0.250025 0 0 1 0.037109,-0.0917969 0.250025,0.250025 0 0 1 0.03125,-0.0390625 0.250025,0.250025 0 0 1 0.039063,-0.03125 0.250025,0.250025 0 0 1 0.091797,-0.0371094 0.250025,0.250025 0 0 1 0.025391,-0.003906 0.250025,0.250025 0 0 1 0.011719,-0.001953 z"
     id="path2" />
</svg>
