<?xml version="1.0" encoding="UTF-8" standalone="no"?>
<svg
   xmlns:dc="http://purl.org/dc/elements/1.1/"
   xmlns:cc="http://creativecommons.org/ns#"
   xmlns:rdf="http://www.w3.org/1999/02/22-rdf-syntax-ns#"
   xmlns:svg="http://www.w3.org/2000/svg"
   xmlns="http://www.w3.org/2000/svg"
   xmlns:sodipodi="http://sodipodi.sourceforge.net/DTD/sodipodi-0.dtd"
   xmlns:inkscape="http://www.inkscape.org/namespaces/inkscape"
   data-dec="36"
   width="12"
   height="40"
   version="1.1"
   id="svg4"
   sodipodi:docname="36.svg"
   inkscape:version="0.92.4 5da689c313, 2019-01-14">
  <metadata
     id="metadata10">
    <rdf:RDF>
      <cc:Work
         rdf:about="">
        <dc:format>image/svg+xml</dc:format>
        <dc:type
           rdf:resource="http://purl.org/dc/dcmitype/StillImage" />
        <dc:title></dc:title>
      </cc:Work>
    </rdf:RDF>
  </metadata>
  <defs
     id="defs8" />
  <sodipodi:namedview
     pagecolor="#ffffff"
     bordercolor="#666666"
     borderopacity="1"
     objecttolerance="10"
     gridtolerance="10"
     guidetolerance="10"
     inkscape:pageopacity="0"
     inkscape:pageshadow="2"
     inkscape:window-width="1920"
     inkscape:window-height="1043"
     id="namedview6"
     showgrid="false"
     inkscape:zoom="5.9"
     inkscape:cx="6"
     inkscape:cy="20"
     inkscape:window-x="0"
     inkscape:window-y="37"
     inkscape:window-maximized="0"
     inkscape:current-layer="svg4" />
  <path
     style="color:#000000;font-style:normal;font-variant:normal;font-weight:normal;font-stretch:normal;font-size:medium;line-height:normal;font-family:sans-serif;font-variant-ligatures:normal;font-variant-position:normal;font-variant-caps:normal;font-variant-numeric:normal;font-variant-alternates:normal;font-feature-settings:normal;text-indent:0;text-align:start;text-decoration:none;text-decoration-line:none;text-decoration-style:solid;text-decoration-color:#000000;letter-spacing:normal;word-spacing:normal;text-transform:none;writing-mode:lr-tb;direction:ltr;text-orientation:mixed;dominant-baseline:auto;baseline-shift:baseline;text-anchor:start;white-space:normal;shape-padding:0;clip-rule:nonzero;display:inline;overflow:visible;visibility:visible;opacity:1;isolation:auto;mix-blend-mode:normal;color-interpolation:sRGB;color-interpolation-filters:linearRGB;solid-color:#000000;solid-opacity:1;vector-effect:none;fill:#000000;fill-opacity:1;fill-rule:nonzero;stroke:none;stroke-width:1.5;stroke-linecap:round;stroke-linejoin:round;stroke-miterlimit:4;stroke-dasharray:none;stroke-dashoffset:0;stroke-opacity:1;color-rendering:auto;image-rendering:auto;shape-rendering:auto;text-rendering:auto;enable-background:accumulate"
     d="m 7.9492188,12.099609 v 8.626953 l 0.453125,-0.251953 1.046875,-2.61914 V 15.109375 L 8.9082031,13.304688 8.421875,12.494141 Z M 5.5507812,10.607422 V 21.25 H 6.4492188 V 11.107422 Z m -1.5,-8.3339845 L 3.5390625,2.5585938 2.5507812,4.2070312 V 5.7929688 L 3.578125,7.5058594 4.0507812,7.9003906 Z m 1.5,-0.5234375 v 7.1425781 l 0.8984376,0.5 V 1.75 Z M 4.7890625,-3.7597656 A 0.750075,0.750075 0 0 1 5.5507812,-3 V 0.25 H 6.4492188 V -3 a 0.750075,0.750075 0 1 1 1.5,0 V 0.55859375 L 9.3632812,1.34375 a 0.750075,0.750075 0 0 1 0.2792969,0.2695312 l 1.2011719,2 A 0.750075,0.750075 0 0 1 10.949219,4 V 4.8769531 A 0.750075,0.750075 0 0 1 10.791016,5.4746094 L 10.242188,6.3867188 A 0.750075,0.750075 0 0 1 8.8496094,6 V 5 A 0.750075,0.750075 0 0 1 9.4492188,4.265625 V 4.2070312 L 8.4609375,2.5585938 7.9492188,2.2734375 v 7.9511715 l 0.2148437,0.119141 a 0.750075,0.750075 0 0 1 0.1152344,0.08008 l 1.2011719,1 a 0.750075,0.750075 0 0 1 0.1621093,0.189453 l 0.5996099,1 a 0.750075,0.750075 0 0 1 0.07617,0.171875 l 0.59961,2 A 0.750075,0.750075 0 0 1 10.949219,15 v 3 a 0.750075,0.750075 0 0 1 -0.05274,0.279297 l -1.1992184,3 A 0.750075,0.750075 0 0 1 9.3632812,21.65625 L 7.9492188,22.441406 V 26 a 0.750075,0.750075 0 1 1 -1.5,0 V 22.75 H 5.5507812 V 26 a 0.750075,0.750075 0 1 1 -1.5,0 V 22.441406 L 2.6367188,21.65625 A 0.750075,0.750075 0 0 1 2.3574219,21.386719 l -1.2011719,-2 A 0.750075,0.750075 0 0 1 1.0507812,19 v -0.876953 a 0.750075,0.750075 0 0 1 0.1582032,-0.597656 l 0.5488281,-0.91211 A 0.750075,0.750075 0 0 1 3.1503906,17 v 1 a 0.750075,0.750075 0 0 1 -0.5996094,0.734375 v 0.05859 l 0.9882813,1.648437 0.5117187,0.285156 V 9.7753906 L 3.8359375,9.65625 A 0.750075,0.750075 0 0 1 3.7207031,9.5761719 l -1.2011719,-1 A 0.750075,0.750075 0 0 1 2.3574219,8.3867188 L 1.2011719,6.4609375 A 0.750075,0.750075 0 0 1 1.0761719,6.2070312 0.750075,0.750075 0 0 1 1.0625,6.1484375 0.750075,0.750075 0 0 1 1.0507812,5.8945312 V 4 A 0.750075,0.750075 0 0 1 1.15625,3.6132812 l 1.2011719,-2 A 0.750075,0.750075 0 0 1 2.6367188,1.34375 L 4.0507812,0.55859375 V -3 a 0.750075,0.750075 0 0 1 0.7382813,-0.7597656 z"
     id="path2" />
</svg>
