<?xml version="1.0" encoding="UTF-8" standalone="no"?>
<svg
   xmlns:dc="http://purl.org/dc/elements/1.1/"
   xmlns:cc="http://creativecommons.org/ns#"
   xmlns:rdf="http://www.w3.org/1999/02/22-rdf-syntax-ns#"
   xmlns:svg="http://www.w3.org/2000/svg"
   xmlns="http://www.w3.org/2000/svg"
   xmlns:sodipodi="http://sodipodi.sourceforge.net/DTD/sodipodi-0.dtd"
   xmlns:inkscape="http://www.inkscape.org/namespaces/inkscape"
   data-dec="125"
   width="14"
   height="40"
   version="1.1"
   id="svg4"
   sodipodi:docname="125.svg"
   inkscape:version="0.92.4 (unknown)">
  <metadata
     id="metadata10">
    <rdf:RDF>
      <cc:Work
         rdf:about="">
        <dc:format>image/svg+xml</dc:format>
        <dc:type
           rdf:resource="http://purl.org/dc/dcmitype/StillImage" />
      </cc:Work>
    </rdf:RDF>
  </metadata>
  <defs
     id="defs8" />
  <sodipodi:namedview
     pagecolor="#ffffff"
     bordercolor="#666666"
     borderopacity="1"
     objecttolerance="10"
     gridtolerance="10"
     guidetolerance="10"
     inkscape:pageopacity="0"
     inkscape:pageshadow="2"
     inkscape:window-width="615"
     inkscape:window-height="417"
     id="namedview6"
     showgrid="false"
     inkscape:zoom="5.9"
     inkscape:cx="7"
     inkscape:cy="20"
     inkscape:window-x="0"
     inkscape:window-y="27"
     inkscape:window-maximized="0"
     inkscape:current-layer="svg4" />
  <path
     style="color:#000000;font-style:normal;font-variant:normal;font-weight:normal;font-stretch:normal;font-size:medium;line-height:normal;font-family:sans-serif;font-variant-ligatures:normal;font-variant-position:normal;font-variant-caps:normal;font-variant-numeric:normal;font-variant-alternates:normal;font-feature-settings:normal;text-indent:0;text-align:start;text-decoration:none;text-decoration-line:none;text-decoration-style:solid;text-decoration-color:#000000;letter-spacing:normal;word-spacing:normal;text-transform:none;writing-mode:lr-tb;direction:ltr;text-orientation:mixed;dominant-baseline:auto;baseline-shift:baseline;text-anchor:start;white-space:normal;shape-padding:0;clip-rule:nonzero;display:inline;overflow:visible;visibility:visible;opacity:1;isolation:auto;mix-blend-mode:normal;color-interpolation:sRGB;color-interpolation-filters:linearRGB;solid-color:#000000;solid-opacity:1;vector-effect:none;fill:#000000;fill-opacity:1;fill-rule:nonzero;stroke:none;stroke-width:3;stroke-linecap:round;stroke-linejoin:round;stroke-miterlimit:4;stroke-dasharray:none;stroke-dashoffset:0;stroke-opacity:1;color-rendering:auto;image-rendering:auto;shape-rendering:auto;text-rendering:auto;enable-background:accumulate"
     d="m 4.9472656,-4.5097656 a 1.50015,1.50015 0 0 1 0.7226563,0.1679687 l 2,1 a 1.50015,1.50015 0 0 1 0.390625,0.28125 l 1,1 a 1.50015,1.50015 0 0 1 0.28125,0.390625 L 10.341797,0.33007812 A 1.50015,1.50015 0 0 1 10.5,1 v 2 a 1.50015,1.50015 0 0 1 -0.158203,0.6699219 l -1.0000001,2 a 1.50015,1.50015 0 0 1 -0.28125,0.390625 L 8.2324219,6.8886719 7.5,8.3535156 v 1.0253906 l 1.3886719,1.3886718 1.7812501,0.890625 a 1.50015,1.50015 0 0 1 0,2.683594 L 8.8886719,15.232422 7.5,16.621094 v 1.02539 l 0.7324219,1.464844 0.828125,0.828125 a 1.50015,1.50015 0 0 1 0.28125,0.390625 l 1.0000001,2 A 1.50015,1.50015 0 0 1 10.5,23 v 2 a 1.50015,1.50015 0 0 1 -0.158203,0.669922 l -1.0000001,2 a 1.50015,1.50015 0 0 1 -0.28125,0.390625 l -1,1 a 1.50015,1.50015 0 0 1 -0.390625,0.28125 l -2,1 A 1.50015,1.50015 0 1 1 4.3300781,27.658203 l 1.78125,-0.890625 0.65625,-0.65625 L 7.5,24.646484 V 23.353516 L 6.7675781,21.888672 5.9394531,21.060547 a 1.50015,1.50015 0 0 1 -0.28125,-0.390625 l -1,-2 A 1.50015,1.50015 0 0 1 4.5,18 V 16 A 1.50015,1.50015 0 0 1 4.9394531,14.939453 L 6.8320312,13.046875 A 1.50015,1.50015 0 0 1 6.8730469,13 1.50015,1.50015 0 0 1 6.8359375,12.957031 L 4.9394531,11.060547 A 1.50015,1.50015 0 0 1 4.5,10 V 8 A 1.50015,1.50015 0 0 1 4.6582031,7.3300781 l 1,-2 a 1.50015,1.50015 0 0 1 0.28125,-0.390625 L 6.7675781,4.1113281 7.5,2.6464844 V 1.3535156 l -0.7324219,-1.46484372 -0.65625,-0.65625 -1.78125,-0.89062498 a 1.50015,1.50015 0 0 1 0.6171875,-2.8515625 z"
     id="path2" />
</svg>
