<?xml version="1.0" encoding="UTF-8" standalone="no"?>
<svg
   xmlns:dc="http://purl.org/dc/elements/1.1/"
   xmlns:cc="http://creativecommons.org/ns#"
   xmlns:rdf="http://www.w3.org/1999/02/22-rdf-syntax-ns#"
   xmlns:svg="http://www.w3.org/2000/svg"
   xmlns="http://www.w3.org/2000/svg"
   xmlns:sodipodi="http://sodipodi.sourceforge.net/DTD/sodipodi-0.dtd"
   xmlns:inkscape="http://www.inkscape.org/namespaces/inkscape"
   data-dec="187"
   width="14"
   height="40"
   version="1.1"
   id="svg4"
   sodipodi:docname="187.svg"
   inkscape:version="0.92.4 5da689c313, 2019-01-14">
  <metadata
     id="metadata10">
    <rdf:RDF>
      <cc:Work
         rdf:about="">
        <dc:format>image/svg+xml</dc:format>
        <dc:type
           rdf:resource="http://purl.org/dc/dcmitype/StillImage" />
        <dc:title></dc:title>
      </cc:Work>
    </rdf:RDF>
  </metadata>
  <defs
     id="defs8" />
  <sodipodi:namedview
     pagecolor="#ffffff"
     bordercolor="#666666"
     borderopacity="1"
     objecttolerance="10"
     gridtolerance="10"
     guidetolerance="10"
     inkscape:pageopacity="0"
     inkscape:pageshadow="2"
     inkscape:window-width="1920"
     inkscape:window-height="1043"
     id="namedview6"
     showgrid="false"
     inkscape:zoom="5.9"
     inkscape:cx="7"
     inkscape:cy="20"
     inkscape:window-x="0"
     inkscape:window-y="37"
     inkscape:window-maximized="0"
     inkscape:current-layer="svg4" />
  <path
     style="color:#000000;font-style:normal;font-variant:normal;font-weight:normal;font-stretch:normal;font-size:medium;line-height:normal;font-family:sans-serif;font-variant-ligatures:normal;font-variant-position:normal;font-variant-caps:normal;font-variant-numeric:normal;font-variant-alternates:normal;font-feature-settings:normal;text-indent:0;text-align:start;text-decoration:none;text-decoration-line:none;text-decoration-style:solid;text-decoration-color:#000000;letter-spacing:normal;word-spacing:normal;text-transform:none;writing-mode:lr-tb;direction:ltr;text-orientation:mixed;dominant-baseline:auto;baseline-shift:baseline;text-anchor:start;white-space:normal;shape-padding:0;clip-rule:nonzero;display:inline;overflow:visible;visibility:visible;opacity:1;isolation:auto;mix-blend-mode:normal;color-interpolation:sRGB;color-interpolation-filters:linearRGB;solid-color:#000000;solid-opacity:1;vector-effect:none;fill:#000000;fill-opacity:1;fill-rule:nonzero;stroke:none;stroke-width:1.5;stroke-linecap:round;stroke-linejoin:round;stroke-miterlimit:4;stroke-dasharray:none;stroke-dashoffset:0;stroke-opacity:1;color-rendering:auto;image-rendering:auto;shape-rendering:auto;text-rendering:auto;enable-background:accumulate"
     d="m 0.98632812,7.2421875 a 0.750075,0.750075 0 0 1 0.0117188,0 0.750075,0.750075 0 0 1 0.0683593,0.00391 0.750075,0.750075 0 0 1 0.068359,0.00977 0.750075,0.750075 0 0 1 0.00586,0.00195 0.750075,0.750075 0 0 1 0.066406,0.015625 0.750075,0.750075 0 0 1 0.00586,0.00195 0.750075,0.750075 0 0 1 0.066406,0.023437 0.750075,0.750075 0 0 1 0.00586,0.00195 0.750075,0.750075 0 0 1 0.125,0.068359 0.750075,0.750075 0 0 1 0.00195,0.00195 0.750075,0.750075 0 0 1 0.058594,0.042969 0.750075,0.750075 0 0 1 0.011719,0.011719 0.750075,0.750075 0 0 1 0.042969,0.039063 0.750075,0.750075 0 0 1 0.00586,0.00391 l 6,6 a 0.750075,0.750075 0 0 1 0,1.0625 l -5.9902344,5.988281 -0.00977,0.01172 a 0.750075,0.750075 0 0 1 -0.019531,0.01758 0.750075,0.750075 0 0 1 -0.019531,0.01758 0.750075,0.750075 0 0 1 -0.1210937,0.08789 0.750075,0.750075 0 0 1 -0.00586,0.0039 0.750075,0.750075 0 0 1 -0.060547,0.03125 0.750075,0.750075 0 0 1 -0.1367187,0.04687 0.750075,0.750075 0 0 1 -0.00391,0.002 0.750075,0.750075 0 0 1 -0.00781,0.002 0.750075,0.750075 0 0 1 -0.023437,0.0039 0.750075,0.750075 0 0 1 -0.1171875,0.01367 0.750075,0.750075 0 0 1 -0.0820313,-0.002 0.750075,0.750075 0 0 1 -0.0683594,-0.0098 0.750075,0.750075 0 0 1 -0.0527344,-0.01172 0.750075,0.750075 0 0 1 -0.0253906,-0.0059 0.750075,0.750075 0 0 1 -0.13476563,-0.05273 0.750075,0.750075 0 0 1 -0.005859,-0.002 0.750075,0.750075 0 0 1 -0.046875,-0.0293 0.750075,0.750075 0 0 1 -0.015625,-0.0078 0.750075,0.750075 0 0 1 -0.0566406,-0.04102 0.750075,0.750075 0 0 1 -0.005859,-0.0039 0.750075,0.750075 0 0 1 -0.0429688,-0.03906 0.750075,0.750075 0 0 1 -0.009766,-0.0098 0.750075,0.750075 0 0 1 -0.0488281,-0.05273 0.750075,0.750075 0 0 1 -0.003906,-0.0039 0.750075,0.750075 0 0 1 -0.009766,-0.01367 0.750075,0.750075 0 0 1 -0.0742188,-0.111328 0.750075,0.750075 0 0 1 -0.0292969,-0.06055 0.750075,0.750075 0 0 1 -0.0117188,-0.03125 0.750075,0.750075 0 0 1 -0.03125,-0.101562 0.750075,0.750075 0 0 1 -0.001953,-0.01172 0.750075,0.750075 0 0 1 -0.001953,-0.0059 0.750075,0.750075 0 0 1 -0.005859,-0.03906 0.750075,0.750075 0 0 1 -0.003906,-0.03516 0.750075,0.750075 0 0 1 0.001953,-0.150391 0.750075,0.750075 0 0 1 0.009766,-0.06641 0.750075,0.750075 0 0 1 0.001953,-0.0059 0.750075,0.750075 0 0 1 0.0195313,-0.07422 0.750075,0.750075 0 0 1 0.0253906,-0.07031 0.750075,0.750075 0 0 1 0.0292969,-0.06055 0.750075,0.750075 0 0 1 0.003906,-0.0059 0.750075,0.750075 0 0 1 0.0800781,-0.117187 0.750075,0.750075 0 0 1 0.005859,-0.0059 l 0.007813,-0.0098 L 5.0234375,14 0.43359375,8.4921875 a 0.750075,0.750075 0 0 1 -0.009766,-0.011719 0.750075,0.750075 0 0 1 -0.0371094,-0.046875 0.750075,0.750075 0 0 1 -0.0371094,-0.056641 0.750075,0.750075 0 0 1 -0.003906,-0.00586 0.750075,0.750075 0 0 1 -0.03125,-0.060547 0.750075,0.750075 0 0 1 -0.003906,-0.00586 A 0.750075,0.750075 0 0 1 0.296875,8.2695312 0.750075,0.750075 0 0 1 0.28320312,8.234375 0.750075,0.750075 0 0 1 0.26367188,8.1699219 0.750075,0.750075 0 0 1 0.26171875,8.1640625 0.750075,0.750075 0 0 1 0.25,8.0957031 a 0.750075,0.750075 0 0 1 -0.005859,-0.1503906 0.750075,0.750075 0 0 1 0,-0.00586 0.750075,0.750075 0 0 1 0.003906,-0.023437 0.750075,0.750075 0 0 1 0.005859,-0.050781 0.750075,0.750075 0 0 1 0.0136719,-0.066406 0.750075,0.750075 0 0 1 0.001953,-0.00586 0.750075,0.750075 0 0 1 0.0527344,-0.1347657 0.750075,0.750075 0 0 1 0.001953,-0.00586 0.750075,0.750075 0 0 1 0.0234375,-0.041016 0.750075,0.750075 0 0 1 0.0136719,-0.021484 0.750075,0.750075 0 0 1 0.003906,-0.00781 0.750075,0.750075 0 0 1 0.0390625,-0.054687 0.750075,0.750075 0 0 1 0.0507812,-0.056641 0.750075,0.750075 0 0 1 0.0488281,-0.046875 0.750075,0.750075 0 0 1 0.005859,-0.00391 0.750075,0.750075 0 0 1 0.0546875,-0.042969 0.750075,0.750075 0 0 1 0.003906,-0.00391 0.750075,0.750075 0 0 1 0.0585937,-0.035156 0.750075,0.750075 0 0 1 0.005859,-0.00391 0.750075,0.750075 0 0 1 0.0625,-0.029297 0.750075,0.750075 0 0 1 0.003906,-0.00195 0.750075,0.750075 0 0 1 0.0351563,-0.013672 0.750075,0.750075 0 0 1 0.0292969,-0.011719 0.750075,0.750075 0 0 1 0.005859,-0.00195 0.750075,0.750075 0 0 1 0.015625,-0.00391 0.750075,0.750075 0 0 1 0.0585938,-0.013672 0.750075,0.750075 0 0 1 0.0742188,-0.011719 0.750075,0.750075 0 0 1 0.0683594,-0.00391 z"
     id="path2" />
</svg>
