<?xml version="1.0" encoding="UTF-8" standalone="no"?>
<svg
   xmlns:dc="http://purl.org/dc/elements/1.1/"
   xmlns:cc="http://creativecommons.org/ns#"
   xmlns:rdf="http://www.w3.org/1999/02/22-rdf-syntax-ns#"
   xmlns:svg="http://www.w3.org/2000/svg"
   xmlns="http://www.w3.org/2000/svg"
   xmlns:sodipodi="http://sodipodi.sourceforge.net/DTD/sodipodi-0.dtd"
   xmlns:inkscape="http://www.inkscape.org/namespaces/inkscape"
   data-dec="117"
   width="19"
   height="40"
   version="1.1"
   id="svg4"
   sodipodi:docname="117.svg"
   inkscape:version="0.92.4 (unknown)">
  <metadata
     id="metadata10">
    <rdf:RDF>
      <cc:Work
         rdf:about="">
        <dc:format>image/svg+xml</dc:format>
        <dc:type
           rdf:resource="http://purl.org/dc/dcmitype/StillImage" />
      </cc:Work>
    </rdf:RDF>
  </metadata>
  <defs
     id="defs8" />
  <sodipodi:namedview
     pagecolor="#ffffff"
     bordercolor="#666666"
     borderopacity="1"
     objecttolerance="10"
     gridtolerance="10"
     guidetolerance="10"
     inkscape:pageopacity="0"
     inkscape:pageshadow="2"
     inkscape:window-width="640"
     inkscape:window-height="480"
     id="namedview6"
     showgrid="false"
     inkscape:zoom="5.9"
     inkscape:cx="9.5"
     inkscape:cy="20"
     inkscape:window-x="0"
     inkscape:window-y="27"
     inkscape:window-maximized="0"
     inkscape:current-layer="svg4" />
  <path
     style="color:#000000;font-style:normal;font-variant:normal;font-weight:normal;font-stretch:normal;font-size:medium;line-height:normal;font-family:sans-serif;font-variant-ligatures:normal;font-variant-position:normal;font-variant-caps:normal;font-variant-numeric:normal;font-variant-alternates:normal;font-feature-settings:normal;text-indent:0;text-align:start;text-decoration:none;text-decoration-line:none;text-decoration-style:solid;text-decoration-color:#000000;letter-spacing:normal;word-spacing:normal;text-transform:none;writing-mode:lr-tb;direction:ltr;text-orientation:mixed;dominant-baseline:auto;baseline-shift:baseline;text-anchor:start;white-space:normal;shape-padding:0;clip-rule:nonzero;display:inline;overflow:visible;visibility:visible;opacity:1;isolation:auto;mix-blend-mode:normal;color-interpolation:sRGB;color-interpolation-filters:linearRGB;solid-color:#000000;solid-opacity:1;vector-effect:none;fill:#000000;fill-opacity:1;fill-rule:nonzero;stroke:none;stroke-width:1.5;stroke-linecap:round;stroke-linejoin:round;stroke-miterlimit:4;stroke-dasharray:none;stroke-dashoffset:0;stroke-opacity:1;color-rendering:auto;image-rendering:auto;shape-rendering:auto;text-rendering:auto;enable-background:accumulate"
     d="M 3.9882812,7.2402344 A 0.750075,0.750075 0 0 1 4.1230469,7.25 h 0.7539062 a 0.750075,0.750075 0 0 1 0.2460938,0 H 6 7 a 0.750075,0.750075 0 0 1 0,1.5 H 6.3105469 L 5.75,9.3125 v 9.509766 L 6.5585938,20.441406 8.1757812,21.25 H 9.8222656 L 11.486328,20.417969 13.25,17.771484 V 9.3125 L 12.689453,8.75 H 12 a 0.750075,0.750075 0 0 1 0,-1.5 h 1 0.876953 a 0.750075,0.750075 0 0 1 0.246094,0 h 0.753906 a 0.750075,0.750075 0 0 1 0.246094,0 H 16 17 a 0.750075,0.750075 0 0 1 0,1.5 H 16.310547 L 15.75,9.3125 v 10.375 L 16.310547,20.25 H 17 a 0.750075,0.750075 0 0 1 0.236328,1.460938 l -2.882812,0.960937 a 0.750075,0.750075 0 0 1 -0.679688,0.01172 0.750075,0.750075 0 0 1 -0.06641,-0.03516 0.750075,0.750075 0 0 1 -0.04883,-0.0332 0.750075,0.750075 0 0 1 -0.02734,-0.01953 0.750075,0.750075 0 0 1 -0.01172,-0.0098 A 0.750075,0.750075 0 0 1 13.25,21.880859 v -1.402343 l -0.625,0.9375 a 0.750075,0.750075 0 0 1 -0.289062,0.253906 l -2,1 A 0.750075,0.750075 0 0 1 10,22.75 H 8.1015625 a 0.750075,0.750075 0 0 1 -0.265625,-0.01758 0.750075,0.750075 0 0 1 -0.072266,-0.02148 l -0.03125,-0.0098 a 0.750075,0.750075 0 0 1 -0.00586,-0.002 L 4.7636719,21.710938 a 0.750075,0.750075 0 0 1 -0.4335938,-0.375 l -1,-2 A 0.750075,0.750075 0 0 1 3.25,19 V 9.3125 L 2.6894531,8.75 H 2 a 0.750075,0.750075 0 0 1 0,-1.5 h 1 0.8769531 a 0.750075,0.750075 0 0 1 0.1113281,-0.00977 z"
     id="path2" />
</svg>
