<?xml version="1.0" encoding="UTF-8" standalone="no"?>
<svg
   xmlns:dc="http://purl.org/dc/elements/1.1/"
   xmlns:cc="http://creativecommons.org/ns#"
   xmlns:rdf="http://www.w3.org/1999/02/22-rdf-syntax-ns#"
   xmlns:svg="http://www.w3.org/2000/svg"
   xmlns="http://www.w3.org/2000/svg"
   xmlns:sodipodi="http://sodipodi.sourceforge.net/DTD/sodipodi-0.dtd"
   xmlns:inkscape="http://www.inkscape.org/namespaces/inkscape"
   data-dec="49"
   width="15"
   height="40"
   version="1.1"
   id="svg4"
   sodipodi:docname="49.svg"
   inkscape:version="0.92.4 5da689c313, 2019-01-14">
  <metadata
     id="metadata10">
    <rdf:RDF>
      <cc:Work
         rdf:about="">
        <dc:format>image/svg+xml</dc:format>
        <dc:type
           rdf:resource="http://purl.org/dc/dcmitype/StillImage" />
        <dc:title></dc:title>
      </cc:Work>
    </rdf:RDF>
  </metadata>
  <defs
     id="defs8" />
  <sodipodi:namedview
     pagecolor="#ffffff"
     bordercolor="#666666"
     borderopacity="1"
     objecttolerance="10"
     gridtolerance="10"
     guidetolerance="10"
     inkscape:pageopacity="0"
     inkscape:pageshadow="2"
     inkscape:window-width="1920"
     inkscape:window-height="1043"
     id="namedview6"
     showgrid="false"
     inkscape:zoom="5.9"
     inkscape:cx="7.5"
     inkscape:cy="20"
     inkscape:window-x="0"
     inkscape:window-y="37"
     inkscape:window-maximized="0"
     inkscape:current-layer="svg4" />
  <path
     style="color:#000000;font-style:normal;font-variant:normal;font-weight:normal;font-stretch:normal;font-size:medium;line-height:normal;font-family:sans-serif;font-variant-ligatures:normal;font-variant-position:normal;font-variant-caps:normal;font-variant-numeric:normal;font-variant-alternates:normal;font-feature-settings:normal;text-indent:0;text-align:start;text-decoration:none;text-decoration-line:none;text-decoration-style:solid;text-decoration-color:#000000;letter-spacing:normal;word-spacing:normal;text-transform:none;writing-mode:lr-tb;direction:ltr;text-orientation:mixed;dominant-baseline:auto;baseline-shift:baseline;text-anchor:start;white-space:normal;shape-padding:0;clip-rule:nonzero;display:inline;overflow:visible;visibility:visible;opacity:1;isolation:auto;mix-blend-mode:normal;color-interpolation:sRGB;color-interpolation-filters:linearRGB;solid-color:#000000;solid-opacity:1;vector-effect:none;fill:#000000;fill-opacity:1;fill-rule:nonzero;stroke:none;stroke-width:1.5;stroke-linecap:round;stroke-linejoin:round;stroke-miterlimit:4;stroke-dasharray:none;stroke-dashoffset:0;stroke-opacity:1;color-rendering:auto;image-rendering:auto;shape-rendering:auto;text-rendering:auto;enable-background:accumulate"
     d="m 7.9882812,0.24023438 a 0.750075,0.750075 0 0 1 0.2910157,0.0546875 0.750075,0.750075 0 0 1 0.00195,0 0.750075,0.750075 0 0 1 0.066406,0.0292969 0.750075,0.750075 0 0 1 0.00195,0.001953 0.750075,0.750075 0 0 1 0.0625,0.0351562 0.750075,0.750075 0 0 1 0.00195,0.001953 A 0.750075,0.750075 0 0 1 8.75,1.1035156 v 1.7734375 a 0.750075,0.750075 0 0 1 0,0.2460938 V 19.6875 L 9.9101562,20.847656 11.119141,21.25 H 13 a 0.750075,0.750075 0 1 1 0,1.5 h -1.921875 a 0.750075,0.750075 0 0 1 -0.132813,0 h -0.83789 a 0.750075,0.750075 0 0 1 -0.1992189,0 H 8.1230469 a 0.750075,0.750075 0 0 1 -0.2460938,0 H 7.1230469 a 0.750075,0.750075 0 0 1 -0.2460938,0 H 5.0996094 a 0.750075,0.750075 0 0 1 -0.2050782,0 H 4.0546875 a 0.750075,0.750075 0 0 1 -0.1269531,0 H 2 a 0.750075,0.750075 0 1 1 0,-1.5 H 3.8808594 L 5.0898438,20.847656 6.25,19.6875 V 4.3125 L 5.6875,3.75 H 5.0898438 a 0.750075,0.750075 0 0 1 -0.1875,0 H 3 A 0.750075,0.750075 0 0 1 2.8183594,2.2714844 L 5.8925781,1.5039062 7.5019531,0.4296875 A 0.750075,0.750075 0 0 1 7.9882812,0.24023438 Z"
     id="path2" />
</svg>
