{
  "fontname": "Times-Duplex",
  "height": 40,
  "data-date": "la date",
  "chars": [
    {
      "dec": "111",
      "width": "20",
      "d": "M9,8 L6,9 4,11 3,14 3,16 4,19 6,21 9,22 11,22 14,21 16,19 17,16 17,14 16,11 14,9 11,8 9,8 M9,8 L7,9 5,11 4,14 4,16 5,19 7,21 9,22 M11,22 L13,21 15,19 16,16 16,14 15,11 13,9 11,8 "
    },
    {
      "dec": "83",
      "width": "20",
      "d": "M16,4 L17,1 17,7 16,4 14,2 11,1 8,1 5,2 3,4 3,6 4,8 5,9 7,10 13,12 15,13 17,15 M3,6 L5,8 7,9 13,11 15,12 16,13 17,15 17,19 15,21 12,22 9,22 6,21 4,19 3,16 3,22 4,19 "
    },
    {
      "dec": "43",
      "width": "26",
      "d": "M13,4 L13,22 M4,13 L22,13 "
    },
    {
      "dec": "81",
      "width": "22",
      "d": "M10,1 L7,2 5,4 4,6 3,10 3,13 4,17 5,19 7,21 10,22 12,22 15,21 17,19 18,17 19,13 19,10 18,6 17,4 15,2 12,1 10,1 M10,1 L8,2 6,4 5,6 4,10 4,13 5,17 6,19 8,21 10,22 M12,22 L14,21 16,19 17,17 18,13 18,10 17,6 16,4 14,2 12,1 M7,20 L7,19 8,17 10,16 11,16 13,17 14,19 15,26 16,27 18,27 19,25 19,24 M14,19 L15,23 16,25 17,26 18,26 19,25 "
    },
    {
      "dec": "86",
      "width": "20",
      "d": "M3,1 L10,22 M4,1 L10,19 M17,1 L10,22 M1,1 L7,1 M13,1 L19,1 "
    },
    {
      "dec": "70",
      "width": "18",
      "d": "M5,1 L5,22 M6,1 L6,22 M12,7 L12,15 M2,1 L18,1 18,7 17,1 M6,11 L12,11 M2,22 L9,22 "
    },
    {
      "dec": "50",
      "width": "20",
      "d": "M4,5 L5,6 4,7 3,6 3,5 4,3 5,2 8,1 12,1 15,2 16,3 17,5 17,7 16,9 13,11 8,13 6,14 4,16 3,19 3,22 M12,1 L14,2 15,3 16,5 16,7 15,9 12,11 8,13 M3,20 L4,19 6,19 11,21 14,21 16,20 17,19 M6,19 L11,22 15,22 16,21 17,19 17,17 "
    },
    {
      "dec": "180",
      "width": "12",
      "d": "M 8,1 3,7 M 8,1 9,2 3,7 "
    },
    {
      "dec": "100",
      "width": "22",
      "d": "M15,1 L15,22 M16,1 L16,22 M15,11 L13,9 11,8 9,8 6,9 4,11 3,14 3,16 4,19 6,21 9,22 11,22 13,21 15,19 M9,8 L7,9 5,11 4,14 4,16 5,19 7,21 9,22 M12,1 L16,1 M15,22 L19,22 "
    },
    {
      "dec": "102",
      "width": "12",
      "d": "M10,2 L9,3 10,4 11,3 11,2 10,1 8,1 6,2 5,4 5,22 M8,1 L7,2 6,4 6,22 M2,8 L10,8 M2,22 L9,22 "
    },
    {
      "dec": "121",
      "width": "18",
      "d": "M4,8 L10,22 M5,8 L10,20 M16,8 L10,22 8,26 6,28 4,29 3,29 2,28 3,27 4,28 M2,8 L8,8 M12,8 L18,8 "
    },
    {
      "dec": "93",
      "width": "14",
      "d": "M9,-3 L9,29 M10,-3 L10,29 M3,-3 L10,-3 M3,29 L10,29 "
    },
    {
      "dec": "109",
      "width": "34",
      "d": "M5,8 L5,22 M6,8 L6,22 M6,11 L8,9 11,8 13,8 16,9 17,11 17,22 M13,8 L15,9 16,11 16,22 M17,11 L19,9 22,8 24,8 27,9 28,11 28,22 M24,8 L26,9 27,11 27,22 M2,8 L6,8 M2,22 L9,22 M13,22 L20,22 M24,22 L31,22 "
    },
    {
      "dec": "45",
      "width": "9",
      "d": "M 1,14 H 8 "
    },
    {
      "dec": "184",
      "width": "5",
      "d": "M 2,26 H 3 L 4,25 3,24 H 2 l 2,-2 "
    },
    {
      "dec": "120",
      "width": "20",
      "d": "M4,8 L15,22 M5,8 L16,22 M16,8 L4,22 M2,8 L8,8 M12,8 L18,8 M2,22 L8,22 M12,22 L18,22 "
    },
    {
      "dec": "71",
      "width": "24",
      "d": "M17,4 L18,7 18,1 17,4 15,2 12,1 10,1 7,2 5,4 4,6 3,9 3,14 4,17 5,19 7,21 10,22 12,22 15,21 17,19 M10,1 L8,2 6,4 5,6 4,9 4,14 5,17 6,19 8,21 10,22 M17,14 L17,22 M18,14 L18,22 M14,14 L21,14 "
    },
    {
      "dec": "65",
      "width": "20",
      "d": "M10,1 L3,22 M10,1 L17,22 M10,4 L16,22 M5,16 L14,16 M1,22 L7,22 M13,22 L19,22 "
    },
    {
      "dec": "104",
      "width": "22",
      "d": "M5,1 L5,22 M6,1 L6,22 M6,11 L8,9 11,8 13,8 16,9 17,11 17,22 M13,8 L15,9 16,11 16,22 M2,1 L6,1 M2,22 L9,22 M13,22 L20,22 "
    },
    {
      "dec": "60",
      "width": "24",
      "d": "M20,4 L4,13 20,22 "
    },
    {
      "dec": "49",
      "width": "20",
      "d": "M6,5 L8,4 11,1 11,22 M10,2 L10,22 M6,22 L15,22 "
    },
    {
      "dec": "97",
      "width": "21",
      "d": "m 5,10 v 1 H 4 V 10 L 5,9 7,8 h 4 l 2,1 1,1 1,2 v 7 l 1,2 1,1 M 14,10 v 9 l 1,2 2,1 h 1 m -4,-10 -1,1 -6,1 -3,1 -1,2 v 2 l 1,2 3,1 h 3 l 2,-1 2,-2 M 7,14 5,15 4,17 v 2 l 1,2 2,1 "
    },
    {
      "dec": "187",
      "width": "14",
      "d": "M 7,20 13,14 7,8 M 7,20 12,14 7,8 M 1,20 7,14 1,8 M 1,20 6,14 1,8 "
    },
    {
      "dec": "171",
      "width": "14",
      "d": "M 7,20 1,14 7,8 M 7,20 2,14 7,8 m 6,12 -6,-6 6,-6 m 0,12 -5,-6 5,-6 "
    },
    {
      "dec": "79",
      "width": "22",
      "d": "M10,1 L7,2 5,4 4,6 3,10 3,13 4,17 5,19 7,21 10,22 12,22 15,21 17,19 18,17 19,13 19,10 18,6 17,4 15,2 12,1 10,1 M10,1 L8,2 6,4 5,6 4,10 4,13 5,17 6,19 8,21 10,22 M12,22 L14,21 16,19 17,17 18,13 18,10 17,6 16,4 14,2 12,1 "
    },
    {
      "dec": "44",
      "width": "8",
      "d": "M5,18 L4,19 3,18 4,17 5,18 5,20 3,22 "
    },
    {
      "dec": "66",
      "width": "22",
      "d": "M5,1 L5,22 M6,1 L6,22 M2,1 L14,1 17,2 18,3 19,5 19,7 18,9 17,10 14,11 M14,1 L16,2 17,3 18,5 18,7 17,9 16,10 14,11 M6,11 L14,11 17,12 18,13 19,15 19,18 18,20 17,21 14,22 2,22 M14,11 L16,12 17,13 18,15 18,18 17,20 16,21 14,22 "
    },
    {
      "dec": "101",
      "width": "17",
      "d": "M 3,14 H 15 V 12 L 14,10 13,9 11,8 H 8 L 5,9 3,11 2,14 v 2 l 1,3 2,2 3,1 h 2 l 3,-1 2,-2 M 14,14 V 11 L 13,9 M 8,8 6,9 4,11 3,14 v 2 l 1,3 2,2 2,1 "
    },
    {
      "dec": "87",
      "width": "24",
      "d": "M4,1 L8,22 M5,1 L8,17 M12,1 L8,22 M12,1 L16,22 M13,1 L16,17 M20,1 L16,22 M1,1 L8,1 M17,1 L23,1 "
    },
    {
      "dec": "85",
      "width": "24",
      "d": "M5,1 L5,16 6,19 8,21 11,22 13,22 16,21 18,19 19,16 19,1 M6,1 L6,16 7,19 9,21 11,22 M2,1 L9,1 M16,1 L22,1 "
    },
    {
      "dec": "110",
      "width": "22",
      "d": "M5,8 L5,22 M6,8 L6,22 M6,11 L8,9 11,8 13,8 16,9 17,11 17,22 M13,8 L15,9 16,11 16,22 M2,8 L6,8 M2,22 L9,22 M13,22 L20,22 "
    },
    {
      "dec": "119",
      "width": "24",
      "d": "M4,8 L8,22 M5,8 L8,19 M12,8 L8,22 M12,8 L16,22 M13,8 L16,19 M20,8 L16,22 M1,8 L8,8 M17,8 L23,8 "
    },
    {
      "dec": "47",
      "width": "22",
      "d": "M20,-3 L2,29 "
    },
    {
      "dec": "125",
      "width": "14",
      "d": "M5,-3 L7,-2 8,-1 9,1 9,3 8,5 7,6 6,8 6,10 8,12 M7,-2 L8,0 8,2 7,4 6,5 5,7 5,9 6,11 10,13 6,15 5,17 5,19 6,21 7,22 8,24 8,26 7,28 M8,14 L6,16 6,18 7,20 8,21 9,23 9,25 8,27 7,28 5,29 "
    },
    {
      "dec": "55",
      "width": "20",
      "d": "M3,1 L3,7 M3,5 L4,3 6,1 8,1 13,4 15,4 16,3 17,1 M4,3 L6,2 8,2 13,4 M17,1 L17,4 16,7 12,12 11,14 10,17 10,22 M16,7 L11,12 10,14 9,17 9,22 "
    },
    {
      "dec": "339",
      "width": "30",
      "d": "M 8,8 5,9 3,11 2,14 v 2 l 1,3 2,2 3,1 h 2 l 3,-1 2,-2 1,-3 V 14 L 15,11 13,9 10,8 H 8 M 8,8 6,9 4,11 3,14 v 2 l 1,3 2,2 2,1 m 2,0 2,-1 2,-2 1,-3 V 14 L 14,11 12,9 10,8 m 6,6 H 28 V 12 L 27,10 26,9 24,8 h -3 l -3,1 -2,2 -1,3 v 2 l 1,3 2,2 3,1 h 2 l 3,-1 2,-2 M 27,14 V 11 L 26,9 m -5,-1 -2,1 -2,2 -1,3 v 2 l 1,3 2,2 2,1 "
    },
    {
      "dec": "62",
      "width": "24",
      "d": "M4,4 L20,13 4,22 "
    },
    {
      "dec": "95",
      "width": "20",
      "d": "M 0,28 H 20 "
    },
    {
      "dec": "69",
      "width": "20",
      "d": "M5,1 L5,22 M6,1 L6,22 M12,7 L12,15 M2,1 L18,1 18,7 17,1 M6,11 L12,11 M2,22 L18,22 18,16 17,22 "
    },
    {
      "dec": "8212",
      "width": "20",
      "d": "M 0,14 H 20 "
    },
    {
      "dec": "103",
      "width": "20",
      "d": "M8,8 L6,9 5,10 4,12 4,14 5,16 6,17 8,18 10,18 12,17 13,16 14,14 14,12 13,10 12,9 10,8 8,8 M6,9 L5,11 5,15 6,17 M12,17 L13,15 13,11 12,9 M13,10 L14,9 16,8 16,9 14,9 M5,16 L4,17 3,19 3,20 4,22 7,23 12,23 15,24 16,25 M3,20 L4,21 7,22 12,22 15,23 16,25 16,26 15,28 12,29 6,29 3,28 2,26 2,25 3,23 6,22 "
    },
    {
      "dec": "33",
      "width": "10",
      "d": "M5,1 L4,3 5,15 6,3 5,1 M5,3 L5,9 M5,20 L4,21 5,22 6,21 5,20 "
    },
    {
      "dec": "169",
      "width": "24",
      "d": "M 7,9 6,6 v 6 L 7,9 9,7 11,6 h 3 l 3,2 1,2 1,3 v 2 l -1,3 -1,2 -3,2 H 11 L 9,21 7,19 6,17 m 8,-11 1,1 1,2 1,3 v 4 l -1,3 -1,2 -1,1 m 3,-19 2,1 2,2 1,2 1,4 v 3 l -1,4 -1,2 -3,3 -4,1 H 10 L 6,24 3,21 2,19 1,15 V 12 L 2,8 3,6 5,4 7,3 10,2 h 4 l 3,1"
    },
    {
      "dec": "56",
      "width": "20",
      "d": "M8,1 L5,2 4,4 4,7 5,9 8,10 12,10 15,9 16,7 16,4 15,2 12,1 8,1 M8,1 L6,2 5,4 5,7 6,9 8,10 M12,10 L14,9 15,7 15,4 14,2 12,1 M8,10 L5,11 4,12 3,14 3,18 4,20 5,21 8,22 12,22 15,21 16,20 17,18 17,14 16,12 15,11 12,10 M8,10 L6,11 5,12 4,14 4,18 5,20 6,21 8,22 M12,22 L14,21 15,20 16,18 16,14 15,12 14,11 12,10 "
    },
    {
      "dec": "48",
      "width": "20",
      "d": "M9,1 L6,2 4,5 3,10 3,13 4,18 6,21 9,22 11,22 14,21 16,18 17,13 17,10 16,5 14,2 11,1 9,1 M9,1 L7,2 6,3 5,5 4,10 4,13 5,18 6,20 7,21 9,22 M11,22 L13,21 14,20 15,18 16,13 16,10 15,5 14,3 13,2 11,1 "
    },
    {
      "dec": "90",
      "width": "20",
      "d": "M16,1 L3,22 M17,1 L4,22 M4,1 L3,7 3,1 17,1 M3,22 L17,22 17,16 16,22 "
    },
    {
      "dec": "35",
      "width": "22",
      "d": "M11,-3 L4,29 M17,-3 L10,29 M4,10 L18,10 M3,16 L17,16 "
    },
    {
      "dec": "61",
      "width": "26",
      "d": "M4,10 L22,10 M4,16 L22,16 "
    },
    {
      "dec": "80",
      "width": "22",
      "d": "M5,1 L5,22 M6,1 L6,22 M2,1 L14,1 17,2 18,3 19,5 19,8 18,10 17,11 14,12 6,12 M14,1 L16,2 17,3 18,5 18,8 17,10 16,11 14,12 M2,22 L9,22 "
    },
    {
      "dec": "169",
      "width": "24",
      "d": "M 7,9 6,6 v 6 L 7,9 9,7 11,6 h 3 l 3,2 1,2 1,3 v 2 l -1,3 -1,2 -3,2 H 11 L 9,21 7,19 6,17 m 8,-11 1,1 1,2 1,3 v 4 l -1,3 -1,2 -1,1 m 3,-19 2,1 2,2 1,2 1,4 v 3 l -1,4 -1,2 -3,3 -4,1 H 10 L 6,24 3,21 2,19 1,15 V 12 L 2,8 3,6 5,4 7,3 10,2 h 4 l 3,1  "
    },
    {
      "dec": "38",
      "width": "26",
      "d": "M21,9 L20,10 21,11 22,10 22,9 21,8 20,8 19,9 18,11 16,16 14,19 12,21 10,22 7,22 4,21 3,19 3,16 4,14 10,10 12,8 13,6 13,4 12,2 10,1 8,2 7,4 7,6 8,9 10,12 15,19 17,21 20,22 21,22 22,21 22,20 M7,22 L5,21 4,19 4,16 5,14 7,12 M7,6 L8,8 16,19 18,21 20,22 "
    },
    {
      "dec": "115",
      "width": "17",
      "d": "m 13,10 1,-2 v 4 L 13,10 12,9 10,8 H 6 L 4,9 3,10 v 2 l 1,1 2,1 5,2 2,1 1,1 m -11,-7 1,1 2,1 5,2 2,1 1,1 v 3 l -1,1 -2,1 H 7 L 5,21 4,20 3,18 v 4 l 1,-2 "
    },
    {
      "dec": "76",
      "width": "19",
      "d": "M 5,1 V 22 M 6,1 V 22 M 2,1 H 9 M 2,22 h 15 v -6 l -1,6 "
    },
    {
      "dec": "46",
      "width": "8",
      "d": "M4,17 L3,18 4,19 5,18 4,17 "
    },
    {
      "dec": "122",
      "width": "18",
      "d": "M14,8 L3,22 M15,8 L4,22 M4,8 L3,12 3,8 15,8 M3,22 L15,22 15,18 14,22 "
    },
    {
      "dec": "64",
      "width": "28",
      "d": "M18,9 L17,7 15,6 12,6 10,7 9,8 8,11 8,14 9,16 11,17 14,17 16,16 17,14 M12,6 L10,8 9,11 9,14 10,16 11,17 M18,6 L17,14 17,16 19,17 21,17 23,15 24,12 24,10 23,7 22,5 20,3 18,2 15,1 12,1 9,2 7,3 5,5 4,7 3,10 3,13 4,16 5,18 7,20 9,21 12,22 15,22 18,21 20,20 21,19 M19,6 L18,14 18,16 19,17 "
    },
    {
      "dec": "82",
      "width": "22",
      "d": "M5,1 L5,22 M6,1 L6,22 M2,1 L14,1 17,2 18,3 19,5 19,7 18,9 17,10 14,11 6,11 M14,1 L16,2 17,3 18,5 18,7 17,9 16,10 14,11 M2,22 L9,22 M11,11 L13,12 14,13 17,20 18,21 19,21 20,20 M13,12 L14,14 16,21 17,22 19,22 20,20 20,19 "
    },
    {
      "dec": "94",
      "width": "22",
      "d": "m 5,7 6,-5 6,5 M 5,7 11,3 17,7 "
    },
    {
      "dec": "8208",
      "width": "26",
      "d": "M 4,14 H 22 "
    },
    {
      "dec": "8220",
      "width": "15",
      "d": "m 9,6 1,-1 h 1 l 1,1 V 7 L 11,8 H 10 L 9,7 V 4 L 10,2 12,1 M 11,7 V 6 h -1 v 1 h 1 M 10,5 9,4 M 9,6 10,2 M 3,6 4,5 H 5 L 6,6 V 7 L 5,8 H 4 L 3,7 V 4 L 4,2 6,1 M 5,7 V 6 H 4 V 7 H 5 M 4,5 3,4 M 3,6 4,2 "
    },
    {
      "dec": "37",
      "width": "24",
      "d": "M21,1 L3,22 M8,1 L10,3 10,5 9,7 7,8 5,8 3,6 3,4 4,2 6,1 8,1 10,2 13,3 16,3 19,2 21,1 M17,15 L15,16 14,18 14,20 16,22 18,22 20,21 21,19 21,17 19,15 17,15 "
    },
    {
      "dec": "68",
      "width": "22",
      "d": "M5,1 L5,22 M6,1 L6,22 M2,1 L12,1 15,2 17,4 18,6 19,9 19,14 18,17 17,19 15,21 12,22 2,22 M12,1 L14,2 16,4 17,6 18,9 18,14 17,17 16,19 14,21 12,22 "
    },
    {
      "dec": "36",
      "width": "20",
      "d": "M8,-3 L8,26 M12,-3 L12,26 M16,4 L15,5 16,6 17,5 17,4 15,2 12,1 8,1 5,2 3,4 3,6 4,8 5,9 7,10 13,12 15,13 17,15 M3,6 L5,8 7,9 13,11 15,12 16,13 17,15 17,19 15,21 12,22 8,22 5,21 3,19 3,18 4,17 5,18 4,19 "
    },
    {
      "dec": "105",
      "width": "12",
      "d": "M5,1 L4,2 5,3 6,2 5,1 M5,8 L5,22 M6,8 L6,22 M2,8 L6,8 M2,22 L9,22 "
    },
    {
      "dec": "75",
      "width": "20",
      "d": "M5,1 L5,22 M6,1 L6,22 M19,1 L6,14 M11,10 L19,22 M10,10 L18,22 M2,1 L9,1 M15,1 L21,1 M2,22 L9,22 M15,22 L21,22 "
    },
    {
      "dec": "51",
      "width": "20",
      "d": "M4,5 L5,6 4,7 3,6 3,5 4,3 5,2 8,1 12,1 15,2 16,4 16,7 15,9 12,10 9,10 M12,1 L14,2 15,4 15,7 14,9 12,10 M12,10 L14,11 16,13 17,15 17,18 16,20 15,21 12,22 8,22 5,21 4,20 3,18 3,17 4,16 5,17 4,18 M15,12 L16,15 16,18 15,20 14,21 12,22 "
    },
    {
      "dec": "34",
      "width": "18",
      "d": "M5,1 L4,2 4,8 M5,2 L4,8 M5,1 L6,2 4,8 M14,1 L13,2 13,8 M14,2 L13,8 M14,1 L15,2 13,8 "
    },
    {
      "dec": "98",
      "width": "20",
      "d": "M5,1 L5,22 M6,1 L6,22 M6,11 L8,9 10,8 12,8 15,9 17,11 18,14 18,16 17,19 15,21 12,22 10,22 8,21 6,19 M12,8 L14,9 16,11 17,14 17,16 16,19 14,21 12,22 M2,1 L6,1 "
    },
    {
      "dec": "96",
      "width": "12",
      "d": "M4,1 L9,7 M4,1 L3,2 9,7 "
    },
    {
      "dec": "74",
      "width": "16",
      "d": "M10,1 L10,18 9,21 7,22 5,22 3,21 2,19 2,17 3,16 4,17 3,18 M9,1 L9,18 8,21 7,22 M6,1 L13,1 "
    },
    {
      "dec": "58",
      "width": "8",
      "d": "M4,10 L3,11 4,12 5,11 4,10 M4,17 L3,18 4,19 5,18 4,17 "
    },
    {
      "dec": "57",
      "width": "20",
      "d": "M16,8 L15,11 13,13 10,14 9,14 6,13 4,11 3,8 3,7 4,4 6,2 9,1 11,1 14,2 16,4 17,7 17,13 16,17 15,19 13,21 10,22 7,22 5,21 4,19 4,18 5,17 6,18 5,19 M9,14 L7,13 5,11 4,8 4,7 5,4 7,2 9,1 M11,1 L13,2 15,4 16,7 16,13 15,17 14,19 12,21 10,22 "
    },
    {
      "dec": "73",
      "width": "12",
      "d": "M5,1 L5,22 M6,1 L6,22 M2,1 L9,1 M2,22 L9,22 "
    },
    {
      "dec": "84",
      "width": "20",
      "d": "M9,1 L9,22 M10,1 L10,22 M3,1 L2,7 2,1 17,1 17,7 16,1 M6,22 L13,22 "
    },
    {
      "dec": "8211",
      "width": "14",
      "d": "M 2,14 H 12 "
    },
    {
      "dec": "108",
      "width": "12",
      "d": "M5,1 L5,22 M6,1 L6,22 M2,1 L6,1 M2,22 L9,22 "
    },
    {
      "dec": "63",
      "width": "18",
      "d": "M4,5 L5,6 4,7 3,6 3,5 4,3 5,2 7,1 10,1 13,2 14,3 15,5 15,7 14,9 13,10 9,12 9,15 M10,1 L12,2 13,3 14,5 14,7 13,9 11,11 M9,20 L8,21 9,22 10,21 9,20 "
    },
    {
      "dec": "8221",
      "width": "15",
      "d": "M 6,3 5,4 H 4 L 3,3 V 2 L 4,1 H 5 L 6,2 V 5 L 5,7 3,8 M 4,2 V 3 H 5 V 2 H 4 M 5,4 6,5 M 6,3 5,7 M 12,3 11,4 H 10 L 9,3 V 2 l 1,-1 h 1 l 1,1 V 5 L 11,7 9,8 m 1,-6 v 1 h 1 V 2 h -1 m 1,2 1,1 m 0,-2 -1,4 "
    },
    {
      "dec": "338",
      "width": "30",
      "d": "M 9,1 6,2 4,4 3,6 2,10 v 3 l 1,4 1,2 2,2 3,1 h 2 M 11,1 H 9 M 9,1 7,2 5,4 4,6 3,10 v 3 l 1,4 1,2 2,2 2,1 M 14,1 V 22 M 15,1 V 22 M 21,7 v 8 M 11,1 H 27 V 7 L 26,1 M 15,11 h 6 M 11,22 h 16 v -6 l -1,6 "
    },
    {
      "dec": "118",
      "width": "18",
      "d": "M3,8 L9,22 M4,8 L9,20 M15,8 L9,22 M1,8 L7,8 M11,8 L17,8 "
    },
    {
      "dec": "126",
      "width": "24",
      "d": "M3,16 L3,14 4,11 6,10 8,10 10,11 14,14 16,15 18,15 20,14 21,12 M3,14 L4,12 6,11 8,11 10,12 14,15 16,16 18,16 20,15 21,12 21,10 "
    },
    {
      "dec": "42",
      "width": "16",
      "d": "M8,7 L8,19 M3,10 L13,16 M13,10 L3,16 "
    },
    {
      "dec": "106",
      "width": "12",
      "d": "M6,1 L5,2 6,3 7,2 6,1 M7,8 L7,26 6,28 4,29 2,29 1,28 1,27 2,26 3,27 2,28 M6,8 L6,26 5,28 4,29 M3,8 L7,8 "
    },
    {
      "dec": "91",
      "width": "14",
      "d": "M4,-3 L4,29 M5,-3 L5,29 M4,-3 L11,-3 M4,29 L11,29 "
    },
    {
      "dec": "8230",
      "width": "14",
      "d": "m 11,17 -1,1 1,1 1,-1 -1,-1 m -4,0 -1,1 1,1 1,-1 -1,-1 m -4,0 -1,1 1,1 1,-1 -1,-1 "
    },
    {
      "dec": "112",
      "width": "20",
      "d": "M5,8 L5,29 M6,8 L6,29 M6,11 L8,9 10,8 12,8 15,9 17,11 18,14 18,16 17,19 15,21 12,22 10,22 8,21 6,19 M12,8 L14,9 16,11 17,14 17,16 16,19 14,21 12,22 M2,8 L6,8 M2,29 L9,29 "
    },
    {
      "dec": "41",
      "width": "14",
      "d": "M3,-3 L5,-1 7,2 9,6 10,11 10,15 9,20 7,24 5,27 3,29 M5,-1 L7,3 8,6 9,11 9,15 8,20 7,23 5,27 "
    },
    {
      "dec": "78",
      "width": "24",
      "d": "M5,1 L5,22 M6,1 L18,20 M6,3 L18,22 M18,1 L18,22 M2,1 L6,1 M15,1 L21,1 M2,22 L8,22 "
    },
    {
      "dec": "59",
      "width": "8",
      "d": "M4,10 L3,11 4,12 5,11 4,10 M5,18 L4,19 3,18 4,17 5,18 5,20 3,22 "
    },
    {
      "dec": "168",
      "width": "15",
      "d": "M 4 3 L 3 4 L 4 5 L 5 4 L 4 3 z M 11 3 L 10 4 L 11 5 L 12 4 L 11 3 z  "
    },
    {
      "dec": "88",
      "width": "20",
      "d": "M3,1 L16,22 M4,1 L17,22 M17,1 L3,22 M1,1 L7,1 M13,1 L19,1 M1,22 L7,22 M13,22 L19,22 "
    },
    {
      "dec": "8216",
      "width": "7",
      "d": "M 3,7 4,6 5,7 4,8 3,7 V 5 L 5,3 "
    },
    {
      "dec": "89",
      "width": "22",
      "d": "M3,1 L10,12 10,22 M4,1 L11,12 11,22 M18,1 L11,12 M1,1 L7,1 M14,1 L20,1 M7,22 L14,22 "
    },
    {
      "dec": "114",
      "width": "16",
      "d": "M5,8 L5,22 M6,8 L6,22 M6,14 L7,11 9,9 11,8 14,8 15,9 15,10 14,11 13,10 14,9 M2,8 L6,8 M2,22 L9,22 "
    },
    {
      "dec": "116",
      "width": "16",
      "d": "M5,1 L5,18 6,21 8,22 10,22 12,21 13,19 M6,1 L6,18 7,21 8,22 M2,8 L10,8 "
    },
    {
      "dec": "54",
      "width": "20",
      "d": "M15,4 L14,5 15,6 16,5 16,4 15,2 13,1 10,1 7,2 5,4 4,6 3,10 3,16 4,19 6,21 9,22 11,22 14,21 16,19 17,16 17,15 16,12 14,10 11,9 10,9 7,10 5,12 4,15 M10,1 L8,2 6,4 5,6 4,10 4,16 5,19 7,21 9,22 M11,22 L13,21 15,19 16,16 16,15 15,12 13,10 11,9 "
    },
    {
      "dec": "117",
      "width": "22",
      "d": "M5,8 L5,19 6,21 9,22 11,22 14,21 16,19 M6,8 L6,19 7,21 9,22 M16,8 L16,22 M17,8 L17,22 M2,8 L6,8 M13,8 L17,8 M16,22 L20,22 "
    },
    {
      "dec": "124",
      "width": "8",
      "d": "M4,-3 L4,29 "
    },
    {
      "dec": "77",
      "width": "26",
      "d": "M5,1 L5,22 M6,1 L12,19 M5,1 L12,22 M19,1 L12,22 M19,1 L19,22 M20,1 L20,22 M2,1 L6,1 M19,1 L23,1 M2,22 L8,22 M16,22 L23,22 "
    },
    {
      "dec": "123",
      "width": "14",
      "d": "M9,-3 L7,-2 6,-1 5,1 5,3 6,5 7,6 8,8 8,10 6,12 M7,-2 L6,0 6,2 7,4 8,5 9,7 9,9 8,11 4,13 8,15 9,17 9,19 8,21 7,22 6,24 6,26 7,28 M6,14 L8,16 8,18 7,20 6,21 5,23 5,25 6,27 7,28 9,29 "
    },
    {
      "dec": "72",
      "width": "24",
      "d": "M5,1 L5,22 M6,1 L6,22 M18,1 L18,22 M19,1 L19,22 M2,1 L9,1 M15,1 L22,1 M6,11 L18,11 M2,22 L9,22 M15,22 L22,22 "
    },
    {
      "dec": "53",
      "width": "20",
      "d": "M5,1 L3,11 M3,11 L5,9 8,8 11,8 14,9 16,11 17,14 17,16 16,19 14,21 11,22 8,22 5,21 4,20 3,18 3,17 4,16 5,17 4,18 M11,8 L13,9 15,11 16,14 16,16 15,19 13,21 11,22 M5,1 L15,1 M5,2 L10,2 15,1 "
    },
    {
      "dec": "52",
      "width": "20",
      "d": "M12,3 L12,22 M13,1 L13,22 M13,1 L2,16 18,16 M9,22 L16,22 "
    },
    {
      "dec": "8217",
      "width": "7",
      "d": "M 5,4 4,5 3,4 4,3 5,4 V 6 L 3,8 "
    },
    {
      "dec": "40",
      "width": "14",
      "d": "M11,-3 L9,-1 7,2 5,6 4,11 4,15 5,20 7,24 9,27 11,29 M9,-1 L7,3 6,6 5,11 5,15 6,20 7,23 9,27 "
    },
    {
      "dec": "99",
      "width": "18",
      "d": "M15,11 L14,12 15,13 16,12 16,11 14,9 12,8 9,8 6,9 4,11 3,14 3,16 4,19 6,21 9,22 11,22 14,21 16,19 M9,8 L7,9 5,11 4,14 4,16 5,19 7,21 9,22 "
    },
    {
      "dec": "127",
      "width": "16",
      "d": "M0,1 L0,22 1,22 1,1 2,1 2,22 3,22 3,1 4,1 4,22 5,22 5,1 6,1 6,22 7,22 7,1 8,1 8,22 9,22 9,1 10,1 10,22 11,22 11,1 12,1 12,22 13,22 13,1 14,1 14,22 15,22 15,1 16,1 16,22 "
    },
    {
      "dec": "39",
      "width": "10",
      "d": "m 4,1 1,6 M 5,1 v 6 "
    },
    {
      "dec": "92",
      "width": "14",
      "d": "M0,1 L14,25 "
    },
    {
      "dec": "107",
      "width": "20",
      "d": "M5,1 L5,22 M6,1 L6,22 M16,8 L6,18 M11,14 L17,22 M10,14 L16,22 M2,1 L6,1 M13,8 L19,8 M2,22 L9,22 M13,22 L19,22 "
    },
    {
      "dec": "113",
      "width": "20",
      "d": "M15,8 L15,29 M16,8 L16,29 M15,11 L13,9 11,8 9,8 6,9 4,11 3,14 3,16 4,19 6,21 9,22 11,22 13,21 15,19 M9,8 L7,9 5,11 4,14 4,16 5,19 7,21 9,22 M12,29 L19,29 "
    },
    {
      "dec": "67",
      "width": "20",
      "d": "M17,4 L18,7 18,1 17,4 15,2 12,1 10,1 7,2 5,4 4,6 3,9 3,14 4,17 5,19 7,21 10,22 12,22 15,21 17,19 18,17 M10,1 L8,2 6,4 5,6 4,9 4,14 5,17 6,19 8,21 10,22 "
    }
  ]
}