<?xml version="1.0" encoding="UTF-8"?>
<glyph name="quotedbl" format="1">
  <advance width="520"/>
  <unicode hex="0022"/>
  <outline>
    <contour>
      <point x="405" y="666" type="curve" smooth="yes"/>
      <point x="408" y="666" type="line" smooth="yes"/>
      <point x="416" y="665"/>
      <point x="425" y="659"/>
      <point x="429" y="653" type="curve" smooth="yes"/>
      <point x="454" y="628" type="line" smooth="yes"/>
      <point x="458" y="624"/>
      <point x="463" y="614"/>
      <point x="463" y="607" type="curve" smooth="yes"/>
      <point x="463" y="605"/>
      <point x="463" y="600"/>
      <point x="462" y="598" type="curve" smooth="yes"/>
      <point x="405" y="427" type="line"/>
      <point x="405" y="426" type="line"/>
      <point x="404" y="425" type="line" smooth="yes"/>
      <point x="404" y="424"/>
      <point x="403" y="420"/>
      <point x="402" y="419" type="curve" smooth="yes"/>
      <point x="402" y="418"/>
      <point x="399" y="418"/>
      <point x="399" y="417" type="curve" smooth="yes"/>
      <point x="398" y="416"/>
      <point x="397" y="413"/>
      <point x="396" y="412" type="curve" smooth="yes"/>
      <point x="394" y="410" type="line"/>
      <point x="393" y="409" type="line"/>
      <point x="392" y="408" type="line" smooth="yes"/>
      <point x="391" y="408"/>
      <point x="389" y="407"/>
      <point x="388" y="407" type="curve" smooth="yes"/>
      <point x="387" y="407" type="line"/>
      <point x="387" y="406" type="line"/>
      <point x="386" y="406" type="line"/>
      <point x="385" y="406" type="line"/>
      <point x="384" y="406" type="line"/>
      <point x="384" y="405" type="line"/>
      <point x="383" y="405" type="line"/>
      <point x="382" y="405" type="line"/>
      <point x="381" y="405" type="line"/>
      <point x="380" y="405" type="line"/>
      <point x="378" y="405" type="line"/>
      <point x="377" y="405" type="line"/>
      <point x="376" y="405" type="line"/>
      <point x="374" y="405" type="line"/>
      <point x="373" y="405" type="line"/>
      <point x="372" y="405" type="line"/>
      <point x="371" y="405" type="line"/>
      <point x="370" y="405" type="line"/>
      <point x="368" y="406" type="line"/>
      <point x="367" y="406" type="line"/>
      <point x="366" y="406" type="line"/>
      <point x="365" y="407" type="line"/>
      <point x="364" y="407" type="line"/>
      <point x="363" y="408" type="line"/>
      <point x="361" y="408" type="line"/>
      <point x="361" y="409" type="line" smooth="yes"/>
      <point x="360" y="409"/>
      <point x="359" y="410" type="line"/>
      <point x="358" y="411" type="line"/>
      <point x="356" y="412" type="line" smooth="yes"/>
      <point x="355" y="412"/>
      <point x="354" y="414"/>
      <point x="354" y="415" type="curve" smooth="yes"/>
      <point x="354" y="416"/>
      <point x="353" y="416"/>
      <point x="353" y="417" type="curve" smooth="yes"/>
      <point x="353" y="418"/>
      <point x="351" y="418"/>
      <point x="351" y="419" type="curve" smooth="yes"/>
      <point x="351" y="420"/>
      <point x="350" y="420"/>
      <point x="350" y="421" type="curve" smooth="yes"/>
      <point x="350" y="422"/>
      <point x="349" y="424"/>
      <point x="349" y="425" type="curve" smooth="yes"/>
      <point x="349" y="426"/>
      <point x="348" y="426"/>
      <point x="348" y="427" type="curve" smooth="yes"/>
      <point x="348" y="429" type="line"/>
      <point x="348" y="430" type="line"/>
      <point x="348" y="432" type="line"/>
      <point x="348" y="433" type="line"/>
      <point x="348" y="436" type="line"/>
      <point x="348" y="607" type="line" smooth="yes"/>
      <point x="348" y="614"/>
      <point x="351" y="624"/>
      <point x="355" y="628" type="curve" smooth="yes"/>
      <point x="382" y="653" type="line" smooth="yes"/>
      <point x="386" y="660"/>
      <point x="397" y="666"/>
    </contour>
    <contour>
      <point x="144" y="666" type="curve" smooth="yes"/>
      <point x="145" y="666" type="line"/>
      <point x="147" y="666" type="line" smooth="yes"/>
      <point x="155" y="665"/>
      <point x="164" y="659"/>
      <point x="168" y="653" type="curve" smooth="yes"/>
      <point x="195" y="628" type="line" smooth="yes"/>
      <point x="199" y="624"/>
      <point x="202" y="614"/>
      <point x="202" y="607" type="curve" smooth="yes"/>
      <point x="202" y="605"/>
      <point x="202" y="600"/>
      <point x="201" y="598" type="curve" smooth="yes"/>
      <point x="144" y="427" type="line"/>
      <point x="144" y="426" type="line"/>
      <point x="143" y="425" type="line" smooth="yes"/>
      <point x="143" y="424"/>
      <point x="142" y="420"/>
      <point x="141" y="419" type="curve" smooth="yes"/>
      <point x="141" y="418"/>
      <point x="140" y="418"/>
      <point x="140" y="417" type="curve" smooth="yes"/>
      <point x="135" y="412" type="line"/>
      <point x="134" y="410" type="line"/>
      <point x="133" y="410" type="line"/>
      <point x="132" y="409" type="line"/>
      <point x="131" y="408" type="line" smooth="yes"/>
      <point x="130" y="408"/>
      <point x="130" y="407"/>
      <point x="129" y="407" type="curve" smooth="yes"/>
      <point x="126" y="407" type="line"/>
      <point x="126" y="406" type="line"/>
      <point x="125" y="406" type="line"/>
      <point x="124" y="406" type="line"/>
      <point x="123" y="406" type="line"/>
      <point x="123" y="405" type="line"/>
      <point x="121" y="405" type="line"/>
      <point x="120" y="405" type="line"/>
      <point x="119" y="405" type="line"/>
      <point x="118" y="405" type="line"/>
      <point x="117" y="405" type="line"/>
      <point x="116" y="405" type="line"/>
      <point x="113" y="405" type="line"/>
      <point x="112" y="405" type="line"/>
      <point x="111" y="405" type="line"/>
      <point x="110" y="405" type="line"/>
      <point x="109" y="405" type="line"/>
      <point x="109" y="406" type="line"/>
      <point x="108" y="406" type="line"/>
      <point x="107" y="406" type="line"/>
      <point x="106" y="406" type="line"/>
      <point x="104" y="407" type="line"/>
      <point x="103" y="407" type="line"/>
      <point x="102" y="408" type="line"/>
      <point x="101" y="408" type="line"/>
      <point x="100" y="409" type="line"/>
      <point x="98" y="410" type="line"/>
      <point x="98" y="411" type="line"/>
      <point x="96" y="412" type="line" smooth="yes"/>
      <point x="95" y="412"/>
      <point x="94" y="414"/>
      <point x="94" y="415" type="curve" smooth="yes"/>
      <point x="94" y="416"/>
      <point x="92" y="416"/>
      <point x="92" y="417" type="curve" smooth="yes"/>
      <point x="92" y="418"/>
      <point x="90" y="418"/>
      <point x="90" y="419" type="curve" smooth="yes"/>
      <point x="90" y="420"/>
      <point x="89" y="420"/>
      <point x="89" y="421" type="curve" smooth="yes"/>
      <point x="89" y="422"/>
      <point x="88" y="424"/>
      <point x="88" y="425" type="curve" smooth="yes"/>
      <point x="88" y="427" type="line" smooth="yes"/>
      <point x="88" y="428"/>
      <point x="87" y="428"/>
      <point x="87" y="429" type="curve" smooth="yes"/>
      <point x="87" y="430" type="line"/>
      <point x="87" y="432" type="line"/>
      <point x="87" y="433" type="line"/>
      <point x="87" y="436" type="line"/>
      <point x="87" y="607" type="line" smooth="yes"/>
      <point x="87" y="614"/>
      <point x="92" y="624"/>
      <point x="96" y="628" type="curve" smooth="yes"/>
      <point x="121" y="653" type="line" smooth="yes"/>
      <point x="125" y="660"/>
      <point x="136" y="666"/>
    </contour>
  </outline>
  <lib>
    <dict>
      <key>com.fontlab.hintData</key>
      <dict>
        <key>hhints</key>
        <array>
          <dict>
            <key>position</key>
            <integer>408</integer>
            <key>width</key>
            <integer>257</integer>
          </dict>
        </array>
        <key>vhints</key>
        <array>
          <dict>
            <key>position</key>
            <integer>87</integer>
            <key>width</key>
            <integer>116</integer>
          </dict>
          <dict>
            <key>position</key>
            <integer>109</integer>
            <key>width</key>
            <integer>14</integer>
          </dict>
          <dict>
            <key>position</key>
            <integer>348</integer>
            <key>width</key>
            <integer>116</integer>
          </dict>
        </array>
      </dict>
    </dict>
  </lib>
</glyph>
