<?xml version="1.0" encoding="UTF-8" standalone="no"?>
<svg
   xmlns:dc="http://purl.org/dc/elements/1.1/"
   xmlns:cc="http://creativecommons.org/ns#"
   xmlns:rdf="http://www.w3.org/1999/02/22-rdf-syntax-ns#"
   xmlns:svg="http://www.w3.org/2000/svg"
   xmlns="http://www.w3.org/2000/svg"
   xmlns:sodipodi="http://sodipodi.sourceforge.net/DTD/sodipodi-0.dtd"
   xmlns:inkscape="http://www.inkscape.org/namespaces/inkscape"
   data-dec="54"
   width="20"
   height="40"
   version="1.1"
   id="svg4"
   sodipodi:docname="54.svg"
   inkscape:version="0.92.4 (unknown)">
  <metadata
     id="metadata10">
    <rdf:RDF>
      <cc:Work
         rdf:about="">
        <dc:format>image/svg+xml</dc:format>
        <dc:type
           rdf:resource="http://purl.org/dc/dcmitype/StillImage" />
      </cc:Work>
    </rdf:RDF>
  </metadata>
  <defs
     id="defs8" />
  <sodipodi:namedview
     pagecolor="#ffffff"
     bordercolor="#666666"
     borderopacity="1"
     objecttolerance="10"
     gridtolerance="10"
     guidetolerance="10"
     inkscape:pageopacity="0"
     inkscape:pageshadow="2"
     inkscape:window-width="640"
     inkscape:window-height="480"
     id="namedview6"
     showgrid="false"
     inkscape:zoom="5.9"
     inkscape:cx="10"
     inkscape:cy="20"
     inkscape:window-x="0"
     inkscape:window-y="27"
     inkscape:window-maximized="0"
     inkscape:current-layer="svg4" />
  <path
     style="color:#000000;font-style:normal;font-variant:normal;font-weight:normal;font-stretch:normal;font-size:medium;line-height:normal;font-family:sans-serif;font-variant-ligatures:normal;font-variant-position:normal;font-variant-caps:normal;font-variant-numeric:normal;font-variant-alternates:normal;font-feature-settings:normal;text-indent:0;text-align:start;text-decoration:none;text-decoration-line:none;text-decoration-style:solid;text-decoration-color:#000000;letter-spacing:normal;word-spacing:normal;text-transform:none;writing-mode:lr-tb;direction:ltr;text-orientation:mixed;dominant-baseline:auto;baseline-shift:baseline;text-anchor:start;white-space:normal;shape-padding:0;clip-rule:nonzero;display:inline;overflow:visible;visibility:visible;opacity:1;isolation:auto;mix-blend-mode:normal;color-interpolation:sRGB;color-interpolation-filters:linearRGB;solid-color:#000000;solid-opacity:1;vector-effect:none;fill:#000000;fill-opacity:1;fill-rule:nonzero;stroke:none;stroke-width:3;stroke-linecap:round;stroke-linejoin:round;stroke-miterlimit:4;stroke-dasharray:none;stroke-dashoffset:0;stroke-opacity:1;color-rendering:auto;image-rendering:auto;shape-rendering:auto;text-rendering:auto;enable-background:accumulate"
     d="m 9.3535156,10.5 -1.4648437,0.732422 -0.65625,0.65625 -1.6425781,3.285156 0.7636718,3.058594 1.5351563,1.535156 L 9.3535156,20.5 H 10.646484 L 12.111328,19.767578 13.689453,18.189453 14.5,15.755859 V 15.244141 L 13.689453,12.810547 12.111328,11.232422 10.646484,10.5 Z M 10,1.5 h 2 a 1.50015,1.50015 0 0 1 0.669922,0.1582031 l 2,1 a 1.50015,1.50015 0 0 1 0.390625,0.28125 l 1,1 A 1.50015,1.50015 0 1 1 13.939453,6.0605469 L 13.111328,5.2324219 11.646484,4.5 H 10.244141 L 7.9628906,5.2597656 6.359375,7.6640625 5.9316406,8.9472656 l 0.00781,-0.00781 a 1.50015,1.50015 0 0 1 0.390625,-0.28125 l 2,-1 A 1.50015,1.50015 0 0 1 9,7.5 h 2 a 1.50015,1.50015 0 0 1 0.669922,0.1582031 l 2,1 a 1.50015,1.50015 0 0 1 0.390625,0.28125 l 2,1.9999999 a 1.50015,1.50015 0 0 1 0.363281,0.585938 l 1,3 A 1.50015,1.50015 0 0 1 17.5,15 v 1 a 1.50015,1.50015 0 0 1 -0.07617,0.474609 l -1,3 a 1.50015,1.50015 0 0 1 -0.363281,0.585938 l -2,2 a 1.50015,1.50015 0 0 1 -0.390625,0.28125 l -2,1 A 1.50015,1.50015 0 0 1 11,23.5 H 9 A 1.50015,1.50015 0 0 1 8.3300781,23.341797 l -2,-1 a 1.50015,1.50015 0 0 1 -0.390625,-0.28125 l -2,-2 A 1.50015,1.50015 0 0 1 3.5449219,19.363281 L 2.59375,15.558594 A 1.50015,1.50015 0 0 1 2.5,14.857422 V 10 a 1.50015,1.50015 0 0 1 0.076172,-0.4746094 l 1,-3 A 1.50015,1.50015 0 0 1 3.7519531,6.1679688 l 2,-3 A 1.50015,1.50015 0 0 1 6.5253906,2.5761719 l 3,-1 A 1.50015,1.50015 0 0 1 10,1.5 Z"
     id="path2" />
</svg>
