<?xml version="1.0" encoding="UTF-8" standalone="no"?>
<svg
   xmlns:dc="http://purl.org/dc/elements/1.1/"
   xmlns:cc="http://creativecommons.org/ns#"
   xmlns:rdf="http://www.w3.org/1999/02/22-rdf-syntax-ns#"
   xmlns:svg="http://www.w3.org/2000/svg"
   xmlns="http://www.w3.org/2000/svg"
   xmlns:sodipodi="http://sodipodi.sourceforge.net/DTD/sodipodi-0.dtd"
   xmlns:inkscape="http://www.inkscape.org/namespaces/inkscape"
   data-dec="103"
   width="12"
   height="40"
   version="1.1"
   id="svg4"
   sodipodi:docname="103.svg"
   inkscape:version="0.92.4 5da689c313, 2019-01-14">
  <metadata
     id="metadata10">
    <rdf:RDF>
      <cc:Work
         rdf:about="">
        <dc:format>image/svg+xml</dc:format>
        <dc:type
           rdf:resource="http://purl.org/dc/dcmitype/StillImage" />
        <dc:title></dc:title>
      </cc:Work>
    </rdf:RDF>
  </metadata>
  <defs
     id="defs8" />
  <sodipodi:namedview
     pagecolor="#ffffff"
     bordercolor="#666666"
     borderopacity="1"
     objecttolerance="10"
     gridtolerance="10"
     guidetolerance="10"
     inkscape:pageopacity="0"
     inkscape:pageshadow="2"
     inkscape:window-width="1920"
     inkscape:window-height="1043"
     id="namedview6"
     showgrid="false"
     inkscape:zoom="5.9"
     inkscape:cx="6"
     inkscape:cy="20"
     inkscape:window-x="0"
     inkscape:window-y="37"
     inkscape:window-maximized="0"
     inkscape:current-layer="svg4" />
  <path
     id="path2"
     style="fill:none;stroke:#000000;stroke-width:1.22474492;stroke-linecap:round;stroke-linejoin:round"
     d="M 5.3333334,8 4,9 3.3333334,10 2.6666667,12 v 2 L 3.3333334,16 4,17 5.3333334,18 H 6.6666667 L 8,17 8.6666667,16 9.3333334,14 V 12 L 8.6666667,10 8,9 6.6666667,8 H 5.3333334 M 8.6666667,10 9.3333334,9 10.666667,8 V 9 H 10 M 3.3333334,16 2.6666667,17 2,19 v 1 m 0,0 0.6666667,1 2,1 H 8 l 2,1 0.666667,2 v 1 L 10,28 8,29 H 4 L 2,28 1.3333333,26 V 25 L 2,23 4,22" />
</svg>
