<?xml version="1.0" encoding="UTF-8" standalone="no"?>
<svg
   xmlns:dc="http://purl.org/dc/elements/1.1/"
   xmlns:cc="http://creativecommons.org/ns#"
   xmlns:rdf="http://www.w3.org/1999/02/22-rdf-syntax-ns#"
   xmlns:svg="http://www.w3.org/2000/svg"
   xmlns="http://www.w3.org/2000/svg"
   xmlns:sodipodi="http://sodipodi.sourceforge.net/DTD/sodipodi-0.dtd"
   xmlns:inkscape="http://www.inkscape.org/namespaces/inkscape"
   data-dec="94"
   width="22"
   height="40"
   version="1.1"
   id="svg4"
   sodipodi:docname="94.svg"
   inkscape:version="0.92.4 (unknown)">
  <metadata
     id="metadata10">
    <rdf:RDF>
      <cc:Work
         rdf:about="">
        <dc:format>image/svg+xml</dc:format>
        <dc:type
           rdf:resource="http://purl.org/dc/dcmitype/StillImage" />
      </cc:Work>
    </rdf:RDF>
  </metadata>
  <defs
     id="defs8" />
  <sodipodi:namedview
     pagecolor="#ffffff"
     bordercolor="#666666"
     borderopacity="1"
     objecttolerance="10"
     gridtolerance="10"
     guidetolerance="10"
     inkscape:pageopacity="0"
     inkscape:pageshadow="2"
     inkscape:window-width="615"
     inkscape:window-height="417"
     id="namedview6"
     showgrid="false"
     inkscape:zoom="5.9"
     inkscape:cx="11"
     inkscape:cy="20"
     inkscape:window-x="0"
     inkscape:window-y="27"
     inkscape:window-maximized="0"
     inkscape:current-layer="svg4" />
  <path
     style="color:#000000;font-style:normal;font-variant:normal;font-weight:normal;font-stretch:normal;font-size:medium;line-height:normal;font-family:sans-serif;font-variant-ligatures:normal;font-variant-position:normal;font-variant-caps:normal;font-variant-numeric:normal;font-variant-alternates:normal;font-feature-settings:normal;text-indent:0;text-align:start;text-decoration:none;text-decoration-line:none;text-decoration-style:solid;text-decoration-color:#000000;letter-spacing:normal;word-spacing:normal;text-transform:none;writing-mode:lr-tb;direction:ltr;text-orientation:mixed;dominant-baseline:auto;baseline-shift:baseline;text-anchor:start;white-space:normal;shape-padding:0;clip-rule:nonzero;display:inline;overflow:visible;visibility:visible;opacity:1;isolation:auto;mix-blend-mode:normal;color-interpolation:sRGB;color-interpolation-filters:linearRGB;solid-color:#000000;solid-opacity:1;vector-effect:none;fill:#013272;fill-opacity:1;fill-rule:nonzero;stroke:none;stroke-width:1;stroke-linecap:round;stroke-linejoin:round;stroke-miterlimit:4;stroke-dasharray:none;stroke-dashoffset:0;stroke-opacity:1;color-rendering:auto;image-rendering:auto;shape-rendering:auto;text-rendering:auto;enable-background:accumulate"
     d="m 10.978516,9.5 a 0.50005,0.50005 0 0 1 0.287109,0.076172 L 19.25,14.566406 a 0.50005,0.50005 0 0 1 0.0039,0.002 l 0.01172,0.0078 a 0.50005,0.50005 0 0 1 0.0293,0.01953 0.50005,0.50005 0 0 1 0.002,0 0.50005,0.50005 0 0 1 0.03711,0.0293 0.50005,0.50005 0 0 1 0.002,0.002 0.50005,0.50005 0 0 1 0.0332,0.0332 0.50005,0.50005 0 0 1 0.002,0.002 0.50005,0.50005 0 0 1 0.08398,0.121094 0.50005,0.50005 0 0 1 0.002,0.002 0.50005,0.50005 0 0 1 0.0293,0.08203 0.50005,0.50005 0 0 1 0.0039,0.0098 0.50005,0.50005 0 0 1 0,0.002 0.50005,0.50005 0 0 1 0.0098,0.04687 0.50005,0.50005 0 0 1 0,0.002 0.50005,0.50005 0 0 1 0.0059,0.04687 0.50005,0.50005 0 0 1 0,0.002 0.50005,0.50005 0 0 1 0,0.04883 0.50005,0.50005 0 0 1 0,0.002 0.50005,0.50005 0 0 1 -0.0059,0.04883 0.50005,0.50005 0 0 1 0,0.002 0.50005,0.50005 0 0 1 -0.002,0.0078 0.50005,0.50005 0 0 1 -0.0078,0.04101 0.50005,0.50005 0 0 1 -0.0098,0.03125 0.50005,0.50005 0 0 1 -0.0039,0.01367 0.50005,0.50005 0 0 1 0,0.002 0.50005,0.50005 0 0 1 -0.01953,0.04492 0.50005,0.50005 0 0 1 0,0.002 0.50005,0.50005 0 0 1 -0.02344,0.04102 0.50005,0.50005 0 0 1 0,0.002 0.50005,0.50005 0 0 1 -0.01172,0.01563 0.50005,0.50005 0 0 1 -0.04687,0.0625 0.50005,0.50005 0 0 1 -0.002,0.002 0.50005,0.50005 0 0 1 -0.03516,0.0332 0.50005,0.50005 0 0 1 -0.002,0.002 0.50005,0.50005 0 0 1 -0.03711,0.0293 0.50005,0.50005 0 0 1 -0.002,0.002 0.50005,0.50005 0 0 1 -0.0625,0.03711 0.50005,0.50005 0 0 1 -0.214844,0.05664 0.50005,0.50005 0 0 1 -0.002,0 0.50005,0.50005 0 0 1 -0.04883,-0.002 0.50005,0.50005 0 0 1 -0.002,0 0.50005,0.50005 0 0 1 -0.04687,-0.0059 0.50005,0.50005 0 0 1 -0.002,0 0.50005,0.50005 0 0 1 -0.04687,-0.01172 0.50005,0.50005 0 0 1 -0.002,0 0.50005,0.50005 0 0 1 -0.04492,-0.01563 0.50005,0.50005 0 0 1 -0.002,0 0.50005,0.50005 0 0 1 -0.01367,-0.0059 0.50005,0.50005 0 0 1 -0.05273,-0.02539 L 11,11.558594 l -7.765625,3.882812 -0.011719,0.0059 a 0.50005,0.50005 0 0 1 -0.03125,0.01563 0.50005,0.50005 0 0 1 -0.060547,0.02148 A 0.50005,0.50005 0 0 1 3,15.503906 a 0.50005,0.50005 0 0 1 -0.00195,0 0.50005,0.50005 0 0 1 -0.00195,0 0.50005,0.50005 0 0 1 -0.050781,-0.002 0.50005,0.50005 0 0 1 -0.046875,-0.0078 0.50005,0.50005 0 0 1 -0.00195,0 0.50005,0.50005 0 0 1 -0.046875,-0.01172 0.50005,0.50005 0 0 1 -0.00195,0 0.50005,0.50005 0 0 1 -0.044922,-0.01758 0.50005,0.50005 0 0 1 -0.00195,0 0.50005,0.50005 0 0 1 -0.042969,-0.02149 0.50005,0.50005 0 0 1 -0.00195,0 0.50005,0.50005 0 0 1 -0.041016,-0.02539 0.50005,0.50005 0 0 1 -0.00195,0 0.50005,0.50005 0 0 1 -0.015625,-0.01367 0.50005,0.50005 0 0 1 -0.023437,-0.01758 0.50005,0.50005 0 0 1 -0.035156,-0.0332 0.50005,0.50005 0 0 1 -0.035156,-0.03711 0.50005,0.50005 0 0 1 -0.029297,-0.03906 0.50005,0.50005 0 0 1 0,-0.002 0.50005,0.50005 0 0 1 -0.023438,-0.04102 0.50005,0.50005 0 0 1 -0.00195,-0.002 0.50005,0.50005 0 0 1 -0.00977,-0.02539 0.50005,0.50005 0 0 1 -0.00977,-0.02148 0.50005,0.50005 0 0 1 -0.015625,-0.04492 0.50005,0.50005 0 0 1 -0.00977,-0.03906 0.50005,0.50005 0 0 1 -0.00195,-0.01172 0.50005,0.50005 0 0 1 -0.00586,-0.04687 0.50005,0.50005 0 0 1 0,-0.002 0.50005,0.50005 0 0 1 0.00195,-0.09766 0.50005,0.50005 0 0 1 0,-0.002 0.50005,0.50005 0 0 1 0.00781,-0.04883 0.50005,0.50005 0 0 1 0,-0.002 0.50005,0.50005 0 0 1 0.013672,-0.04492 0.50005,0.50005 0 0 1 0,-0.002 0.50005,0.50005 0 0 1 0.00781,-0.01758 0.50005,0.50005 0 0 1 0.011719,-0.0293 0.50005,0.50005 0 0 1 0.021484,-0.04297 0.50005,0.50005 0 0 1 0.00195,-0.002 0.50005,0.50005 0 0 1 0.025391,-0.03906 0.50005,0.50005 0 0 1 0.00195,-0.002 0.50005,0.50005 0 0 1 0.064453,-0.07422 0.50005,0.50005 0 0 1 0.03125,-0.02734 0.50005,0.50005 0 0 1 0.00586,-0.0039 0.50005,0.50005 0 0 1 0.00195,-0.002 0.50005,0.50005 0 0 1 0.011719,-0.0078 0.50005,0.50005 0 0 1 0.039063,-0.02539 L 10.734375,9.5761719 A 0.50005,0.50005 0 0 1 10.978516,9.5 Z"
     id="path2" />
</svg>
