<?xml version="1.0" encoding="UTF-8" standalone="no"?>
<svg
   xmlns:dc="http://purl.org/dc/elements/1.1/"
   xmlns:cc="http://creativecommons.org/ns#"
   xmlns:rdf="http://www.w3.org/1999/02/22-rdf-syntax-ns#"
   xmlns:svg="http://www.w3.org/2000/svg"
   xmlns="http://www.w3.org/2000/svg"
   xmlns:sodipodi="http://sodipodi.sourceforge.net/DTD/sodipodi-0.dtd"
   xmlns:inkscape="http://www.inkscape.org/namespaces/inkscape"
   data-dec="89"
   width="19"
   height="40"
   version="1.1"
   id="svg4"
   sodipodi:docname="89.svg"
   inkscape:version="0.92.4 5da689c313, 2019-01-14">
  <metadata
     id="metadata10">
    <rdf:RDF>
      <cc:Work
         rdf:about="">
        <dc:format>image/svg+xml</dc:format>
        <dc:type
           rdf:resource="http://purl.org/dc/dcmitype/StillImage" />
        <dc:title></dc:title>
      </cc:Work>
    </rdf:RDF>
  </metadata>
  <defs
     id="defs8" />
  <sodipodi:namedview
     pagecolor="#ffffff"
     bordercolor="#666666"
     borderopacity="1"
     objecttolerance="10"
     gridtolerance="10"
     guidetolerance="10"
     inkscape:pageopacity="0"
     inkscape:pageshadow="2"
     inkscape:window-width="1920"
     inkscape:window-height="1043"
     id="namedview6"
     showgrid="false"
     inkscape:zoom="5.9"
     inkscape:cx="9.5"
     inkscape:cy="20"
     inkscape:window-x="0"
     inkscape:window-y="37"
     inkscape:window-maximized="0"
     inkscape:current-layer="svg4" />
  <path
     style="color:#000000;font-style:normal;font-variant:normal;font-weight:normal;font-stretch:normal;font-size:medium;line-height:normal;font-family:sans-serif;font-variant-ligatures:normal;font-variant-position:normal;font-variant-caps:normal;font-variant-numeric:normal;font-variant-alternates:normal;font-feature-settings:normal;text-indent:0;text-align:start;text-decoration:none;text-decoration-line:none;text-decoration-style:solid;text-decoration-color:#000000;letter-spacing:normal;word-spacing:normal;text-transform:none;writing-mode:lr-tb;direction:ltr;text-orientation:mixed;dominant-baseline:auto;baseline-shift:baseline;text-anchor:start;white-space:normal;shape-padding:0;clip-rule:nonzero;display:inline;overflow:visible;visibility:visible;opacity:1;isolation:auto;mix-blend-mode:normal;color-interpolation:sRGB;color-interpolation-filters:linearRGB;solid-color:#000000;solid-opacity:1;vector-effect:none;fill:#000000;fill-opacity:1;fill-rule:nonzero;stroke:none;stroke-width:0.5;stroke-linecap:round;stroke-linejoin:round;stroke-miterlimit:4;stroke-dasharray:none;stroke-dashoffset:0;stroke-opacity:1;color-rendering:auto;image-rendering:auto;shape-rendering:auto;text-rendering:auto;enable-background:accumulate"
     d="M 10.25,21.605469 V 21.75 h 0.144531 z m -1.5,0 L 8.6054688,21.75 H 8.75 Z m 0.5,-8.634766 v 7.990235 a 0.250025,0.250025 0 0 1 0,0.07422 V 21.75 h 0.5 v -0.720703 a 0.250025,0.250025 0 0 1 0,-0.06055 v -6.914062 z m -0.00586,-2.027344 A 0.250025,0.250025 0 0 1 9.25,11 v 0.779297 l 0.5,1.082031 V 12.056641 Z M 5.6738281,4.0292969 8.8125,10.832031 a 0.250025,0.250025 0 0 1 0.3867188,0.01367 L 6.171875,4.1855469 A 0.250025,0.250025 0 0 1 5.8222656,4.1777344 Z M 5.234375,2.1210938 5.1777344,2.1777344 a 0.250025,0.250025 0 0 1 -0.359375,-0.00195 L 5.0644531,2.7089844 5.8652344,3.5097656 Z M 14.605469,1.25 15,1.6445312 15.394531,1.25 Z m -9.2167971,0 0.00195,0.00391 0.00391,-0.00391 z m -0.9980469,0 0.3574219,0.7734375 A 0.250025,0.250025 0 0 1 4.8222656,1.8222656 L 5.0117188,1.6328125 4.8378906,1.25 Z M 3.6054688,1.25 4.0410156,1.6855469 3.8398438,1.25 Z M 3.9863281,0.74609375 A 0.250025,0.250025 0 0 1 4.0371094,0.75 h 0.9257812 a 0.250025,0.250025 0 0 1 0.074219,0 H 6 7 a 0.250025,0.250025 0 0 1 0,0.5 H 6.1035156 L 5.6132812,1.7421875 10.011719,11.419922 14.695312,2.0507812 13.896484,1.25 H 13 a 0.250025,0.250025 0 0 1 0,-0.5 H 14.021484 16 17 a 0.250025,0.250025 0 0 1 0,0.5 h -0.896484 l -0.900391,0.9023438 -0.002,0.00195 a 0.250025,0.250025 0 0 1 -0.002,0.00391 L 10.25,12.056641 v 1.927734 a 0.250025,0.250025 0 0 1 0,0.04883 v 6.861328 L 11.105469,21.75 H 12 a 0.250025,0.250025 0 1 1 0,0.5 h -0.960938 a 0.250025,0.250025 0 0 1 -0.07422,0 h -0.923828 a 0.250025,0.250025 0 0 1 -0.087891,0 H 9.0410156 a 0.250025,0.250025 0 0 1 -0.087891,0 H 8 7 a 0.250025,0.250025 0 0 1 0,-0.5 H 7.8964844 L 8.75,20.894531 V 11.888672 L 4.6503906,3.0058594 3.8222656,2.1777344 2.8964844,1.25 H 2 a 0.250025,0.250025 0 0 1 0,-0.5 h 1.0214844 0.9394531 a 0.250025,0.250025 0 0 1 0.025391,-0.003906 z"
     id="path2" />
</svg>
