<?xml version="1.0" encoding="UTF-8" standalone="no"?>
<svg
   xmlns:dc="http://purl.org/dc/elements/1.1/"
   xmlns:cc="http://creativecommons.org/ns#"
   xmlns:rdf="http://www.w3.org/1999/02/22-rdf-syntax-ns#"
   xmlns:svg="http://www.w3.org/2000/svg"
   xmlns="http://www.w3.org/2000/svg"
   xmlns:sodipodi="http://sodipodi.sourceforge.net/DTD/sodipodi-0.dtd"
   xmlns:inkscape="http://www.inkscape.org/namespaces/inkscape"
   data-dec="339"
   width="29"
   height="40"
   version="1.1"
   id="svg4"
   sodipodi:docname="339.svg"
   inkscape:version="0.92.4 (unknown)">
  <metadata
     id="metadata10">
    <rdf:RDF>
      <cc:Work
         rdf:about="">
        <dc:format>image/svg+xml</dc:format>
        <dc:type
           rdf:resource="http://purl.org/dc/dcmitype/StillImage" />
      </cc:Work>
    </rdf:RDF>
  </metadata>
  <defs
     id="defs8" />
  <sodipodi:namedview
     pagecolor="#ffffff"
     bordercolor="#666666"
     borderopacity="1"
     objecttolerance="10"
     gridtolerance="10"
     guidetolerance="10"
     inkscape:pageopacity="0"
     inkscape:pageshadow="2"
     inkscape:window-width="640"
     inkscape:window-height="480"
     id="namedview6"
     showgrid="false"
     inkscape:zoom="5.9"
     inkscape:cx="14.5"
     inkscape:cy="20"
     inkscape:window-x="0"
     inkscape:window-y="27"
     inkscape:window-maximized="0"
     inkscape:current-layer="svg4" />
  <path
     style="color:#000000;font-style:normal;font-variant:normal;font-weight:normal;font-stretch:normal;font-size:medium;line-height:normal;font-family:sans-serif;font-variant-ligatures:normal;font-variant-position:normal;font-variant-caps:normal;font-variant-numeric:normal;font-variant-alternates:normal;font-feature-settings:normal;text-indent:0;text-align:start;text-decoration:none;text-decoration-line:none;text-decoration-style:solid;text-decoration-color:#000000;letter-spacing:normal;word-spacing:normal;text-transform:none;writing-mode:lr-tb;direction:ltr;text-orientation:mixed;dominant-baseline:auto;baseline-shift:baseline;text-anchor:start;white-space:normal;shape-padding:0;clip-rule:nonzero;display:inline;overflow:visible;visibility:visible;opacity:1;isolation:auto;mix-blend-mode:normal;color-interpolation:sRGB;color-interpolation-filters:linearRGB;solid-color:#000000;solid-opacity:1;vector-effect:none;fill:#013272;fill-opacity:1;fill-rule:nonzero;stroke:none;stroke-width:1;stroke-linecap:round;stroke-linejoin:round;stroke-miterlimit:4;stroke-dasharray:none;stroke-dashoffset:0;stroke-opacity:1;color-rendering:auto;image-rendering:auto;shape-rendering:auto;text-rendering:auto;enable-background:accumulate"
     d="m 16.28125,19.423828 a 0.50005,0.50005 0 0 1 -0.101562,0.04883 l 0.175781,0.175782 z m -12,0 a 0.50005,0.50005 0 0 1 -0.1015625,0.04883 l 0.1757813,0.175782 z m 9.439453,-0.002 -0.07617,0.226563 0.173828,-0.173829 a 0.50005,0.50005 0 0 1 -0.09766,-0.05273 z M 26.5,13.035156 A 0.50005,0.50005 0 0 1 26.082031,13.5 H 26.5 Z M 25.5,13 v 0.5 h 0.419922 A 0.50005,0.50005 0 0 1 25.5,13 Z m -9.144531,-2.648438 -0.173828,0.173829 a 0.50005,0.50005 0 0 1 0.09766,0.05273 z m -2.710938,0 0.07422,0.22461 a 0.50005,0.50005 0 0 1 0.101562,-0.04883 z m -9.2890622,0 -0.1738282,0.173829 a 0.50005,0.50005 0 0 1 0.097656,0.05273 z M 20.117188,8.5 18.296875,9.4101562 17.4375,10.269531 16.5,13.082031 V 13.5 h 8 V 11.117188 L 23.626953,9.3730469 21.882812,8.5 Z M 8.1171875,8.5 6.296875,9.4101562 5.4375,10.269531 4.5,13.082031 v 3.835938 l 0.9375,2.8125 0.859375,0.859375 L 8.1171875,21.5 h 1.765625 L 11.703125,20.589844 12.5625,19.730469 13.5,16.917969 V 16 14 a 0.50005,0.50005 0 0 1 0,-0.01172 v -0.90625 L 12.5625,10.269531 11.703125,9.4101562 9.8828125,8.5 Z M 8.0019531,7.4960938 A 0.50005,0.50005 0 0 1 8.0644531,7.5 h 1.8691407 a 0.50005,0.50005 0 0 1 0.2246092,0.025391 0.50005,0.50005 0 0 1 0.01953,0.00586 l 0.0039,0.00195 2.976562,0.9921875 a 0.50005,0.50005 0 0 1 0.195313,0.1210938 L 15,10.292969 16.646484,8.6464844 a 0.50005,0.50005 0 0 1 0.195313,-0.1210938 l 2.966797,-0.9882812 a 0.50005,0.50005 0 0 1 0.04297,-0.015625 0.50005,0.50005 0 0 1 0.0039,-0.00195 A 0.50005,0.50005 0 0 1 20.064453,7.5 h 1.869141 a 0.50005,0.50005 0 0 1 0.224609,0.025391 0.50005,0.50005 0 0 1 0.01953,0.00586 l 0.0039,0.00195 2.976562,0.9921875 a 0.50005,0.50005 0 0 1 0.195313,0.1210938 l 1,1 a 0.50005,0.50005 0 0 1 0.09375,0.1308594 l 1,2.0000002 A 0.50005,0.50005 0 0 1 27.5,12 v 2 A 0.50005,0.50005 0 0 1 27,14.5 h -1.917969 a 0.50005,0.50005 0 0 1 -0.162109,0 H 16.5 V 16 a 0.50005,0.50005 0 0 1 0,0.01172 v 0.90625 l 0.9375,2.8125 0.859375,0.859375 L 20.117188,21.5 h 1.800781 l 2.8125,-0.9375 1.916015,-1.916016 a 0.50005,0.50005 0 1 1 0.707032,0.707032 l -2,2 a 0.50005,0.50005 0 0 1 -0.195313,0.121093 l -3,1 A 0.50005,0.50005 0 0 1 22,22.5 h -1.933594 a 0.50005,0.50005 0 0 1 -0.224609,-0.02539 0.50005,0.50005 0 0 1 -0.02344,-0.0078 L 16.841797,21.474609 A 0.50005,0.50005 0 0 1 16.646484,21.353516 L 15,19.707031 13.353516,21.353516 a 0.50005,0.50005 0 0 1 -0.195313,0.121093 l -2.966797,0.988282 a 0.50005,0.50005 0 0 1 -0.01563,0.0059 l -0.01758,0.0059 a 0.50005,0.50005 0 0 1 -0.0098,0.0039 0.50005,0.50005 0 0 1 -0.0039,0.002 A 0.50005,0.50005 0 0 1 9.9355469,22.5 H 8.0664062 a 0.50005,0.50005 0 0 1 -0.2246093,-0.02539 l -0.019531,-0.0059 a 0.50005,0.50005 0 0 1 -0.00391,-0.002 L 4.8417969,21.474609 A 0.50005,0.50005 0 0 1 4.6464844,21.353516 l -2,-2 A 0.50005,0.50005 0 0 1 2.5253906,19.158203 l -1,-3 A 0.50005,0.50005 0 0 1 1.5,16 v -2 a 0.50005,0.50005 0 0 1 0.025391,-0.158203 l 1,-3 a 0.50005,0.50005 0 0 1 0.1210938,-0.195313 l 2,-1.9999996 A 0.50005,0.50005 0 0 1 4.8417969,8.5253906 L 7.8007812,7.5390625 a 0.50005,0.50005 0 0 1 0.00391,-0.00195 0.50005,0.50005 0 0 1 0.050781,-0.017578 0.50005,0.50005 0 0 1 0.044922,-0.011719 0.50005,0.50005 0 0 1 0.00977,-0.00195 0.50005,0.50005 0 0 1 0.00391,0 0.50005,0.50005 0 0 1 0.00977,-0.00195 0.50005,0.50005 0 0 1 0.015625,-0.00195 A 0.50005,0.50005 0 0 1 7.953125,7.5 a 0.50005,0.50005 0 0 1 0.015625,-0.00195 0.50005,0.50005 0 0 1 0.00586,0 0.50005,0.50005 0 0 1 0.00195,0 0.50005,0.50005 0 0 1 0.025391,-0.00195 z"
     id="path2" />
</svg>
