<?xml version="1.0" encoding="UTF-8"?>
<glyph name="X" format="1">
  <advance width="635"/>
  <unicode hex="0058"/>
  <outline>
    <contour>
      <point x="201" y="681" type="curve" smooth="yes"/>
      <point x="202" y="681" type="line" smooth="yes"/>
      <point x="203" y="681"/>
      <point x="207" y="680"/>
      <point x="208" y="680" type="curve" smooth="yes"/>
      <point x="226" y="680" type="line" smooth="yes"/>
      <point x="227" y="680"/>
      <point x="230" y="681"/>
      <point x="231" y="681" type="curve" smooth="yes"/>
      <point x="232" y="681"/>
      <point x="237" y="680"/>
      <point x="238" y="680" type="curve" smooth="yes"/>
      <point x="318" y="680" type="line"/>
      <point x="319" y="680" type="line" smooth="yes"/>
      <point x="339" y="680"/>
      <point x="355" y="665"/>
      <point x="355" y="645" type="curve" smooth="yes"/>
      <point x="355" y="625"/>
      <point x="339" y="608"/>
      <point x="319" y="608" type="curve" smooth="yes"/>
      <point x="318" y="608" type="line"/>
      <point x="282" y="608" type="line"/>
      <point x="344" y="420" type="line"/>
      <point x="524" y="608" type="line"/>
      <point x="492" y="608" type="line" smooth="yes"/>
      <point x="472" y="608"/>
      <point x="455" y="625"/>
      <point x="455" y="645" type="curve" smooth="yes"/>
      <point x="455" y="665"/>
      <point x="472" y="680"/>
      <point x="492" y="680" type="curve" smooth="yes"/>
      <point x="603" y="680" type="line" smooth="yes"/>
      <point x="604" y="680"/>
      <point x="607" y="681"/>
      <point x="608" y="681" type="curve" smooth="yes"/>
      <point x="609" y="681"/>
      <point x="613" y="680"/>
      <point x="614" y="680" type="curve" smooth="yes"/>
      <point x="666" y="680" type="line"/>
      <point x="667" y="680" type="line" smooth="yes"/>
      <point x="687" y="680"/>
      <point x="703" y="665"/>
      <point x="703" y="645" type="curve" smooth="yes"/>
      <point x="703" y="625"/>
      <point x="687" y="608"/>
      <point x="667" y="608" type="curve" smooth="yes"/>
      <point x="666" y="608" type="line"/>
      <point x="624" y="608" type="line"/>
      <point x="371" y="342" type="line"/>
      <point x="460" y="73" type="line"/>
      <point x="492" y="73" type="line"/>
      <point x="493" y="73" type="line" smooth="yes"/>
      <point x="513" y="73"/>
      <point x="529" y="56"/>
      <point x="529" y="36" type="curve" smooth="yes"/>
      <point x="529" y="16"/>
      <point x="513" y="0"/>
      <point x="493" y="0" type="curve" smooth="yes"/>
      <point x="492" y="0" type="line"/>
      <point x="440" y="0" type="line"/>
      <point x="434" y="0" type="line"/>
      <point x="429" y="0" type="line"/>
      <point x="411" y="0" type="line"/>
      <point x="406" y="0" type="line"/>
      <point x="399" y="0" type="line"/>
      <point x="318" y="0" type="line" smooth="yes"/>
      <point x="298" y="0"/>
      <point x="282" y="16"/>
      <point x="282" y="36" type="curve" smooth="yes"/>
      <point x="282" y="56"/>
      <point x="298" y="73"/>
      <point x="318" y="73" type="curve" smooth="yes"/>
      <point x="355" y="73" type="line"/>
      <point x="293" y="261" type="line"/>
      <point x="113" y="73" type="line"/>
      <point x="145" y="73" type="line" smooth="yes"/>
      <point x="165" y="73"/>
      <point x="182" y="56"/>
      <point x="182" y="36" type="curve" smooth="yes"/>
      <point x="182" y="16"/>
      <point x="165" y="0"/>
      <point x="145" y="0" type="curve" smooth="yes"/>
      <point x="34" y="0" type="line"/>
      <point x="29" y="0" type="line"/>
      <point x="23" y="0" type="line"/>
      <point x="-29" y="0" type="line"/>
      <point x="-30" y="0" type="line" smooth="yes"/>
      <point x="-50" y="0"/>
      <point x="-66" y="16"/>
      <point x="-66" y="36" type="curve" smooth="yes"/>
      <point x="-66" y="56"/>
      <point x="-50" y="73"/>
      <point x="-30" y="73" type="curve" smooth="yes"/>
      <point x="-29" y="73" type="line"/>
      <point x="13" y="73" type="line"/>
      <point x="266" y="338" type="line"/>
      <point x="177" y="608" type="line"/>
      <point x="145" y="608" type="line"/>
      <point x="144" y="608" type="line" smooth="yes"/>
      <point x="124" y="608"/>
      <point x="108" y="625"/>
      <point x="108" y="645" type="curve" smooth="yes"/>
      <point x="108" y="665"/>
      <point x="124" y="680"/>
      <point x="144" y="680" type="curve" smooth="yes"/>
      <point x="145" y="680" type="line"/>
      <point x="197" y="680" type="line" smooth="yes"/>
      <point x="198" y="680"/>
      <point x="200" y="681"/>
    </contour>
  </outline>
  <lib>
    <dict>
      <key>com.fontlab.hintData</key>
      <dict>
        <key>hhints</key>
        <array>
          <dict>
            <key>position</key>
            <integer>0</integer>
            <key>width</key>
            <integer>73</integer>
          </dict>
          <dict>
            <key>position</key>
            <integer>608</integer>
            <key>width</key>
            <integer>72</integer>
          </dict>
        </array>
      </dict>
    </dict>
  </lib>
</glyph>
