<?xml version="1.0" encoding="UTF-8" standalone="no"?>
<svg
   xmlns:dc="http://purl.org/dc/elements/1.1/"
   xmlns:cc="http://creativecommons.org/ns#"
   xmlns:rdf="http://www.w3.org/1999/02/22-rdf-syntax-ns#"
   xmlns:svg="http://www.w3.org/2000/svg"
   xmlns="http://www.w3.org/2000/svg"
   xmlns:sodipodi="http://sodipodi.sourceforge.net/DTD/sodipodi-0.dtd"
   xmlns:inkscape="http://www.inkscape.org/namespaces/inkscape"
   data-dec="52"
   width="22"
   height="40"
   version="1.1"
   id="svg4"
   sodipodi:docname="52.svg"
   inkscape:version="0.92.4 (unknown)">
  <metadata
     id="metadata10">
    <rdf:RDF>
      <cc:Work
         rdf:about="">
        <dc:format>image/svg+xml</dc:format>
        <dc:type
           rdf:resource="http://purl.org/dc/dcmitype/StillImage" />
      </cc:Work>
    </rdf:RDF>
  </metadata>
  <defs
     id="defs8" />
  <sodipodi:namedview
     pagecolor="#ffffff"
     bordercolor="#666666"
     borderopacity="1"
     objecttolerance="10"
     gridtolerance="10"
     guidetolerance="10"
     inkscape:pageopacity="0"
     inkscape:pageshadow="2"
     inkscape:window-width="640"
     inkscape:window-height="480"
     id="namedview6"
     showgrid="false"
     inkscape:zoom="5.9"
     inkscape:cx="11"
     inkscape:cy="20"
     inkscape:window-x="0"
     inkscape:window-y="27"
     inkscape:window-maximized="0"
     inkscape:current-layer="svg4" />
  <path
     style="color:#000000;font-style:normal;font-variant:normal;font-weight:normal;font-stretch:normal;font-size:medium;line-height:normal;font-family:sans-serif;font-variant-ligatures:normal;font-variant-position:normal;font-variant-caps:normal;font-variant-numeric:normal;font-variant-alternates:normal;font-feature-settings:normal;text-indent:0;text-align:start;text-decoration:none;text-decoration-line:none;text-decoration-style:solid;text-decoration-color:#000000;letter-spacing:normal;word-spacing:normal;text-transform:none;writing-mode:lr-tb;direction:ltr;text-orientation:mixed;dominant-baseline:auto;baseline-shift:baseline;text-anchor:start;white-space:normal;shape-padding:0;clip-rule:nonzero;display:inline;overflow:visible;visibility:visible;opacity:1;isolation:auto;mix-blend-mode:normal;color-interpolation:sRGB;color-interpolation-filters:linearRGB;solid-color:#000000;solid-opacity:1;vector-effect:none;fill:#013272;fill-opacity:1;fill-rule:nonzero;stroke:none;stroke-width:2.5;stroke-linecap:round;stroke-linejoin:round;stroke-miterlimit:4;stroke-dasharray:none;stroke-dashoffset:0;stroke-opacity:1;color-rendering:auto;image-rendering:auto;shape-rendering:auto;text-rendering:auto;enable-background:accumulate"
     d="M 13.376953,6.3925781 5.0195312,14.75 h 5.8496098 z m 3.582031,-6.6582031 a 1.250125,1.250125 0 0 1 0.50586,0.0878906 1.250125,1.250125 0 0 1 0.09766,0.0429688 1.250125,1.250125 0 0 1 0.01563,0.007813 1.250125,1.250125 0 0 1 0.09375,0.05273437 1.250125,1.250125 0 0 1 0.01563,0.0097656 1.250125,1.250125 0 0 1 0.08789,0.06249999 1.250125,1.250125 0 0 1 0.388671,1.47656253 v 0.00195 L 14.371094,14.75 H 18 a 1.250125,1.250125 0 1 1 0,2.5 h -4.34375 l -1.455078,5.09375 A 1.250125,1.250125 0 0 1 10.496094,23.160156 1.250125,1.250125 0 0 1 8.8027344,21.640625 L 10.119141,17.25 H 2 A 1.250125,1.250125 0 0 1 1.1152344,15.115234 L 15.037109,1.1933594 A 1.250125,1.250125 0 0 1 15.207031,1.0234375 L 16.041016,0.18945312 A 1.250125,1.250125 0 0 1 16.958984,-0.265625 Z"
     id="path2" />
</svg>
