<?xml version="1.0" encoding="UTF-8"?>
<glyph name="quotesingle" format="1">
  <advance width="289"/>
  <unicode hex="0027"/>
  <outline>
    <contour>
      <point x="117" y="681" type="line" smooth="yes"/>
      <point x="121" y="681"/>
      <point x="127" y="679"/>
      <point x="130" y="678" type="curve" smooth="yes"/>
      <point x="133" y="680"/>
      <point x="141" y="681"/>
      <point x="145" y="681" type="curve" smooth="yes"/>
      <point x="165" y="681"/>
      <point x="180" y="665"/>
      <point x="180" y="645" type="curve" smooth="yes"/>
      <point x="180" y="472" type="line" smooth="yes"/>
      <point x="180" y="471"/>
      <point x="182" y="470" type="line" smooth="yes"/>
      <point x="182" y="467"/>
      <point x="179" y="461"/>
      <point x="178" y="458" type="curve" smooth="yes"/>
      <point x="178" y="457"/>
      <point x="177" y="455"/>
      <point x="177" y="454" type="curve" smooth="yes"/>
      <point x="177" y="453"/>
      <point x="176" y="452"/>
      <point x="176" y="451" type="curve" smooth="yes"/>
      <point x="175" y="451" type="line" smooth="yes"/>
      <point x="174" y="449"/>
      <point x="173" y="447"/>
      <point x="172" y="446" type="curve" smooth="yes"/>
      <point x="168" y="442" type="line"/>
      <point x="166" y="440" type="line"/>
      <point x="165" y="440" type="line" smooth="yes"/>
      <point x="164" y="439"/>
      <point x="164" y="439"/>
      <point x="163" y="439" type="curve" smooth="yes"/>
      <point x="162" y="439"/>
      <point x="161" y="437"/>
      <point x="160" y="437" type="curve" smooth="yes"/>
      <point x="158" y="437" type="line"/>
      <point x="157" y="436" type="line"/>
      <point x="156" y="436" type="line"/>
      <point x="155" y="436" type="line" smooth="yes"/>
      <point x="154" y="436"/>
      <point x="154" y="434"/>
      <point x="153" y="434" type="curve" smooth="yes"/>
      <point x="150" y="434" type="line"/>
      <point x="148" y="433" type="line"/>
      <point x="146" y="433" type="line"/>
      <point x="145" y="433" type="line"/>
      <point x="143" y="433" type="line" smooth="yes"/>
      <point x="142" y="433"/>
      <point x="142" y="434"/>
      <point x="141" y="434" type="curve" smooth="yes"/>
      <point x="138" y="434" type="line"/>
      <point x="135" y="434" type="line"/>
      <point x="134" y="436" type="line"/>
      <point x="132" y="436" type="line" smooth="yes"/>
      <point x="131" y="436"/>
      <point x="131" y="437"/>
      <point x="130" y="437" type="curve" smooth="yes"/>
      <point x="129" y="437"/>
      <point x="127" y="439"/>
      <point x="126" y="439" type="curve" smooth="yes"/>
      <point x="125" y="439"/>
      <point x="125" y="439"/>
      <point x="124" y="440" type="curve" smooth="yes"/>
      <point x="119" y="446" type="line"/>
      <point x="117" y="448" type="line"/>
      <point x="116" y="448" type="line" smooth="yes"/>
      <point x="116" y="449"/>
      <point x="114" y="450"/>
      <point x="114" y="451" type="curve" smooth="yes"/>
      <point x="114" y="452"/>
      <point x="112" y="453"/>
      <point x="112" y="454" type="curve" smooth="yes"/>
      <point x="112" y="455"/>
      <point x="111" y="457"/>
      <point x="111" y="458" type="curve" smooth="yes"/>
      <point x="111" y="459"/>
      <point x="110" y="460"/>
      <point x="110" y="461" type="curve" smooth="yes"/>
      <point x="110" y="462"/>
      <point x="109" y="465"/>
      <point x="109" y="466" type="curve" smooth="yes"/>
      <point x="80" y="638" type="line" smooth="yes"/>
      <point x="80" y="640"/>
      <point x="79" y="643"/>
      <point x="79" y="645" type="curve" smooth="yes"/>
      <point x="79" y="665"/>
      <point x="96" y="681"/>
      <point x="116" y="681" type="curve" smooth="yes"/>
    </contour>
  </outline>
  <lib>
    <dict>
      <key>com.fontlab.hintData</key>
      <dict>
        <key>hhints</key>
        <array>
          <dict>
            <key>position</key>
            <integer>437</integer>
            <key>width</key>
            <integer>244</integer>
          </dict>
        </array>
        <key>vhints</key>
        <array>
          <dict>
            <key>position</key>
            <integer>79</integer>
            <key>width</key>
            <integer>101</integer>
          </dict>
          <dict>
            <key>position</key>
            <integer>111</integer>
            <key>width</key>
            <integer>67</integer>
          </dict>
        </array>
      </dict>
    </dict>
  </lib>
</glyph>
