<?xml version="1.0" encoding="UTF-8" standalone="no"?>
<svg
   xmlns:dc="http://purl.org/dc/elements/1.1/"
   xmlns:cc="http://creativecommons.org/ns#"
   xmlns:rdf="http://www.w3.org/1999/02/22-rdf-syntax-ns#"
   xmlns:svg="http://www.w3.org/2000/svg"
   xmlns="http://www.w3.org/2000/svg"
   xmlns:sodipodi="http://sodipodi.sourceforge.net/DTD/sodipodi-0.dtd"
   xmlns:inkscape="http://www.inkscape.org/namespaces/inkscape"
   data-dec="37"
   width="24"
   height="40"
   version="1.1"
   id="svg4"
   sodipodi:docname="37.svg"
   inkscape:version="0.92.4 (unknown)">
  <metadata
     id="metadata10">
    <rdf:RDF>
      <cc:Work
         rdf:about="">
        <dc:format>image/svg+xml</dc:format>
        <dc:type
           rdf:resource="http://purl.org/dc/dcmitype/StillImage" />
      </cc:Work>
    </rdf:RDF>
  </metadata>
  <defs
     id="defs8" />
  <sodipodi:namedview
     pagecolor="#ffffff"
     bordercolor="#666666"
     borderopacity="1"
     objecttolerance="10"
     gridtolerance="10"
     guidetolerance="10"
     inkscape:pageopacity="0"
     inkscape:pageshadow="2"
     inkscape:window-width="615"
     inkscape:window-height="417"
     id="namedview6"
     showgrid="false"
     inkscape:zoom="5.9"
     inkscape:cx="12"
     inkscape:cy="20"
     inkscape:window-x="0"
     inkscape:window-y="27"
     inkscape:window-maximized="0"
     inkscape:current-layer="svg4" />
  <path
     style="color:#000000;font-style:normal;font-variant:normal;font-weight:normal;font-stretch:normal;font-size:medium;line-height:normal;font-family:sans-serif;font-variant-ligatures:normal;font-variant-position:normal;font-variant-caps:normal;font-variant-numeric:normal;font-variant-alternates:normal;font-feature-settings:normal;text-indent:0;text-align:start;text-decoration:none;text-decoration-line:none;text-decoration-style:solid;text-decoration-color:#000000;letter-spacing:normal;word-spacing:normal;text-transform:none;writing-mode:lr-tb;direction:ltr;text-orientation:mixed;dominant-baseline:auto;baseline-shift:baseline;text-anchor:start;white-space:normal;shape-padding:0;clip-rule:nonzero;display:inline;overflow:visible;visibility:visible;opacity:1;isolation:auto;mix-blend-mode:normal;color-interpolation:sRGB;color-interpolation-filters:linearRGB;solid-color:#000000;solid-opacity:1;vector-effect:none;fill:#013272;fill-opacity:1;fill-rule:nonzero;stroke:none;stroke-width:1.5;stroke-linecap:round;stroke-linejoin:round;stroke-miterlimit:4;stroke-dasharray:none;stroke-dashoffset:0;stroke-opacity:1;color-rendering:auto;image-rendering:auto;shape-rendering:auto;text-rendering:auto;enable-background:accumulate"
     d="M 17.175781,15.75 15.558594,16.558594 14.75,18.177734 v 1.511719 L 16.310547,21.25 h 1.511719 L 19.441406,20.441406 20.25,18.822266 V 17.310547 L 18.689453,15.75 Z m -0.171875,-1.503906 a 0.750075,0.750075 0 0 1 0.08594,0.0039 H 19 a 0.750075,0.750075 0 0 1 0.53125,0.21875 l 2,2 A 0.750075,0.750075 0 0 1 21.75,17 v 2 a 0.750075,0.750075 0 0 1 -0.08008,0.335938 l -1,2 a 0.750075,0.750075 0 0 1 -0.333984,0.333984 l -2,1 A 0.750075,0.750075 0 0 1 18,22.75 h -2 a 0.750075,0.750075 0 0 1 -0.53125,-0.21875 l -2,-2 A 0.750075,0.750075 0 0 1 13.25,20 v -2 a 0.750075,0.750075 0 0 1 0.08008,-0.335938 l 1,-2 a 0.750075,0.750075 0 0 1 0.333984,-0.333984 L 16.574219,14.375 a 0.750075,0.750075 0 0 1 0.207031,-0.09375 0.750075,0.750075 0 0 1 0.03516,-0.0098 0.750075,0.750075 0 0 1 0.03516,-0.0078 0.750075,0.750075 0 0 1 0.152344,-0.01758 z M 6.1777344,1.75 4.5585938,2.5585938 3.75,4.1777344 V 5.6894531 L 5.3105469,7.25 H 6.8222656 L 8.4414062,6.4414062 9.25,4.8222656 V 3.3105469 L 7.6875,1.75 Z M 7.9921875,0.2421875 A 0.750075,0.750075 0 0 1 8.3886719,0.35546875 L 10.287109,1.3046875 13.121094,2.25 h 2.757812 L 18.712891,1.3046875 20.603516,0.359375 a 0.750075,0.750075 0 0 1 0.757812,-0.0273438 0.750075,0.750075 0 0 1 0.002,0.001953 0.750075,0.750075 0 0 1 0.0625,0.0371094 0.750075,0.750075 0 0 1 0.002,0.001953 0.750075,0.750075 0 0 1 0.05859,0.0429687 0.750075,0.750075 0 0 1 0.002,0.001953 0.750075,0.750075 0 0 1 0.05273,0.0488281 0.750075,0.750075 0 0 1 0.002,0.001953 0.750075,0.750075 0 0 1 0.04883,0.0527344 0.750075,0.750075 0 0 1 0.002,0.001953 0.750075,0.750075 0 0 1 0.04102,0.0585938 0.750075,0.750075 0 0 1 0.002,0.003906 0.750075,0.750075 0 0 1 0.03711,0.0605469 0.750075,0.750075 0 0 1 0.002,0.003906 0.750075,0.750075 0 0 1 0.0293,0.0644531 0.750075,0.750075 0 0 1 0.002,0.003906 0.750075,0.750075 0 0 1 0.02148,0.0683594 0.750075,0.750075 0 0 1 -0.189454,0.73632812 L 3.5703125,22.488281 A 0.75078271,0.75078271 0 1 1 2.4296875,21.511719 L 18.267578,3.0332031 16.236328,3.7109375 A 0.750075,0.750075 0 0 1 16,3.75 H 13 A 0.750075,0.750075 0 0 1 12.763672,3.7109375 L 10.75,3.0390625 V 5 a 0.750075,0.750075 0 0 1 -0.08008,0.3359375 l -1.0000001,2 A 0.750075,0.750075 0 0 1 9.3359375,7.6699219 l -2,1 A 0.750075,0.750075 0 0 1 7,8.75 H 5 A 0.750075,0.750075 0 0 1 4.46875,8.53125 l -2,-2 A 0.750075,0.750075 0 0 1 2.25,6 V 4 a 0.750075,0.750075 0 0 1 0.080078,-0.3359375 l 1,-2 A 0.750075,0.750075 0 0 1 3.6640625,1.3300781 l 2,-0.99999998 A 0.750075,0.750075 0 0 1 6,0.25 h 1.8925781 a 0.750075,0.750075 0 0 1 0.099609,-0.007813 z"
     id="path2" />
</svg>
