<?xml version="1.0" encoding="UTF-8" standalone="no"?>
<svg
   xmlns:dc="http://purl.org/dc/elements/1.1/"
   xmlns:cc="http://creativecommons.org/ns#"
   xmlns:rdf="http://www.w3.org/1999/02/22-rdf-syntax-ns#"
   xmlns:svg="http://www.w3.org/2000/svg"
   xmlns="http://www.w3.org/2000/svg"
   xmlns:sodipodi="http://sodipodi.sourceforge.net/DTD/sodipodi-0.dtd"
   xmlns:inkscape="http://www.inkscape.org/namespaces/inkscape"
   data-dec="103"
   width="20"
   height="40"
   version="1.1"
   id="svg4"
   sodipodi:docname="103.svg"
   inkscape:version="0.92.4 5da689c313, 2019-01-14">
  <metadata
     id="metadata10">
    <rdf:RDF>
      <cc:Work
         rdf:about="">
        <dc:format>image/svg+xml</dc:format>
        <dc:type
           rdf:resource="http://purl.org/dc/dcmitype/StillImage" />
        <dc:title></dc:title>
      </cc:Work>
    </rdf:RDF>
  </metadata>
  <defs
     id="defs8" />
  <sodipodi:namedview
     pagecolor="#ffffff"
     bordercolor="#666666"
     borderopacity="1"
     objecttolerance="10"
     gridtolerance="10"
     guidetolerance="10"
     inkscape:pageopacity="0"
     inkscape:pageshadow="2"
     inkscape:window-width="1920"
     inkscape:window-height="1043"
     id="namedview6"
     showgrid="false"
     inkscape:zoom="5.9"
     inkscape:cx="10"
     inkscape:cy="20"
     inkscape:window-x="0"
     inkscape:window-y="37"
     inkscape:window-maximized="0"
     inkscape:current-layer="svg4" />
  <path
     style="color:#000000;font-style:normal;font-variant:normal;font-weight:normal;font-stretch:normal;font-size:medium;line-height:normal;font-family:sans-serif;font-variant-ligatures:normal;font-variant-position:normal;font-variant-caps:normal;font-variant-numeric:normal;font-variant-alternates:normal;font-feature-settings:normal;text-indent:0;text-align:start;text-decoration:none;text-decoration-line:none;text-decoration-style:solid;text-decoration-color:#000000;letter-spacing:normal;word-spacing:normal;text-transform:none;writing-mode:lr-tb;direction:ltr;text-orientation:mixed;dominant-baseline:auto;baseline-shift:baseline;text-anchor:start;white-space:normal;shape-padding:0;clip-rule:nonzero;display:inline;overflow:visible;visibility:visible;opacity:1;isolation:auto;mix-blend-mode:normal;color-interpolation:sRGB;color-interpolation-filters:linearRGB;solid-color:#000000;solid-opacity:1;vector-effect:none;fill:#000000;fill-opacity:1;fill-rule:nonzero;stroke:none;stroke-width:1.5;stroke-linecap:round;stroke-linejoin:round;stroke-miterlimit:4;stroke-dasharray:none;stroke-dashoffset:0;stroke-opacity:1;color-rendering:auto;image-rendering:auto;shape-rendering:auto;text-rendering:auto;enable-background:accumulate"
     d="M 8.1777344,9.75 6.4433594,10.617188 5.65625,11.404297 4.75,14.121094 v 1.757812 L 5.65625,18.595703 6.4433594,19.382812 8.1777344,20.25 H 10.822266 L 14.25,18.537109 V 11.462891 L 10.822266,9.75 Z M 15.988281,7.2402344 a 0.750075,0.750075 0 0 1 0.533203,0.2109375 0.750075,0.750075 0 0 1 0.0039,0.00391 0.750075,0.750075 0 0 1 0.0039,0.00391 0.750075,0.750075 0 0 1 0.04687,0.048828 0.750075,0.750075 0 0 1 0.0039,0.00586 A 0.750075,0.750075 0 0 1 16.75,8.1230469 V 23 a 0.750075,0.750075 0 0 1 -0.03906,0.236328 l -1,3 A 0.750075,0.750075 0 0 1 15.53125,26.53125 l -2,2 a 0.750075,0.750075 0 0 1 -0.195312,0.138672 l -2,1 A 0.750075,0.750075 0 0 1 11,29.75 H 8 a 0.750075,0.750075 0 0 1 -0.3359375,-0.08008 l -2,-1 A 0.750075,0.750075 0 0 1 5.46875,28.53125 l -1.9375,-1.9375 a 0.750075,0.750075 0 0 1 -0.2617188,-0.800781 0.750075,0.750075 0 0 1 0,-0.0039 0.750075,0.750075 0 0 1 0.011719,-0.03516 0.750075,0.750075 0 0 1 0.013672,-0.03516 0.750075,0.750075 0 0 1 0.029297,-0.06641 0.750075,0.750075 0 0 1 0.00195,-0.002 0.750075,0.750075 0 0 1 0.035156,-0.0625 0.750075,0.750075 0 0 1 0.00195,-0.002 A 0.750075,0.750075 0 0 1 4.0917969,25.25 H 6 a 0.750075,0.750075 0 0 1 0.53125,0.21875 L 7.4433594,26.382812 9.1777344,27.25 H 10.822266 L 12.556641,26.382812 13.34375,25.595703 14.25,22.878906 V 20.8125 l -0.71875,0.71875 a 0.750075,0.750075 0 0 1 -0.195312,0.138672 l -2,1 A 0.750075,0.750075 0 0 1 11,22.75 H 8 a 0.750075,0.750075 0 0 1 -0.3359375,-0.08008 l -2,-1 A 0.750075,0.750075 0 0 1 5.46875,21.53125 l -2,-2 A 0.750075,0.750075 0 0 1 3.2890625,19.236328 l -1,-3 A 0.750075,0.750075 0 0 1 2.25,16 v -2 a 0.750075,0.750075 0 0 1 0.039063,-0.236328 l 1,-3 A 0.750075,0.750075 0 0 1 3.46875,10.46875 l 2,-2 A 0.750075,0.750075 0 0 1 5.6640625,8.3300781 l 2,-1 A 0.750075,0.750075 0 0 1 8,7.25 h 3 a 0.750075,0.750075 0 0 1 0.335938,0.080078 l 2,1 A 0.750075,0.750075 0 0 1 13.53125,8.46875 L 14.25,9.1875 V 8 A 0.750075,0.750075 0 0 1 15,7.25 h 0.876953 a 0.750075,0.750075 0 0 1 0.111328,-0.00977 z"
     id="path2" />
</svg>
