<?xml version="1.0" encoding="UTF-8" standalone="no"?>
<svg
   xmlns:dc="http://purl.org/dc/elements/1.1/"
   xmlns:cc="http://creativecommons.org/ns#"
   xmlns:rdf="http://www.w3.org/1999/02/22-rdf-syntax-ns#"
   xmlns:svg="http://www.w3.org/2000/svg"
   xmlns="http://www.w3.org/2000/svg"
   xmlns:sodipodi="http://sodipodi.sourceforge.net/DTD/sodipodi-0.dtd"
   xmlns:inkscape="http://www.inkscape.org/namespaces/inkscape"
   data-dec="85"
   width="26"
   height="40"
   version="1.1"
   id="svg4"
   sodipodi:docname="85.svg"
   inkscape:version="0.92.4 (unknown)">
  <metadata
     id="metadata10">
    <rdf:RDF>
      <cc:Work
         rdf:about="">
        <dc:format>image/svg+xml</dc:format>
        <dc:type
           rdf:resource="http://purl.org/dc/dcmitype/StillImage" />
      </cc:Work>
    </rdf:RDF>
  </metadata>
  <defs
     id="defs8" />
  <sodipodi:namedview
     pagecolor="#ffffff"
     bordercolor="#666666"
     borderopacity="1"
     objecttolerance="10"
     gridtolerance="10"
     guidetolerance="10"
     inkscape:pageopacity="0"
     inkscape:pageshadow="2"
     inkscape:window-width="615"
     inkscape:window-height="417"
     id="namedview6"
     showgrid="false"
     inkscape:zoom="5.9"
     inkscape:cx="13"
     inkscape:cy="20"
     inkscape:window-x="0"
     inkscape:window-y="27"
     inkscape:window-maximized="0"
     inkscape:current-layer="svg4" />
  <path
     style="color:#000000;font-style:normal;font-variant:normal;font-weight:normal;font-stretch:normal;font-size:medium;line-height:normal;font-family:sans-serif;font-variant-ligatures:normal;font-variant-position:normal;font-variant-caps:normal;font-variant-numeric:normal;font-variant-alternates:normal;font-feature-settings:normal;text-indent:0;text-align:start;text-decoration:none;text-decoration-line:none;text-decoration-style:solid;text-decoration-color:#000000;letter-spacing:normal;word-spacing:normal;text-transform:none;writing-mode:lr-tb;direction:ltr;text-orientation:mixed;dominant-baseline:auto;baseline-shift:baseline;text-anchor:start;white-space:normal;shape-padding:0;clip-rule:nonzero;display:inline;overflow:visible;visibility:visible;opacity:1;isolation:auto;mix-blend-mode:normal;color-interpolation:sRGB;color-interpolation-filters:linearRGB;solid-color:#000000;solid-opacity:1;vector-effect:none;fill:#013272;fill-opacity:1;fill-rule:nonzero;stroke:none;stroke-width:0.30000001;stroke-linecap:round;stroke-linejoin:round;stroke-miterlimit:4;stroke-dasharray:none;stroke-dashoffset:0;stroke-opacity:1;color-rendering:auto;image-rendering:auto;shape-rendering:auto;text-rendering:auto;enable-background:accumulate"
     d="m 9.9453125,1.84375 -0.021484,0.00586 -0.00586,0.021484 z m -2.0097656,-0.041016 -0.1289063,0.4746094 0.328125,0.65625 A 0.15023831,0.15023831 0 0 1 7.8652344,3.0664062 L 7.6875,2.7128906 5.1445312,12.037109 4.1503906,16.017578 v 2.947266 L 5.1054688,20.876953 7.4453125,21.65625 5.8945312,20.105469 A 0.15001501,0.15001501 0 0 1 5.8496094,20 v -4 a 0.15001501,0.15001501 0 0 1 0.00391,-0.03711 l 1,-4 a 0.15001501,0.15001501 0 0 1 0.00195,-0.002 L 9.3320312,2.8789062 9.1054688,3.1054688 A 0.15001501,0.15001501 0 1 1 8.8945312,2.8945312 L 9.4902344,2.2988281 9.5820312,1.9648438 9.0683594,2.1347656 a 0.15001501,0.15001501 0 0 1 -0.013672,0.00586 l -0.00781,0.00195 a 0.15001501,0.15001501 0 0 1 -0.050781,0.00781 0.15001501,0.15001501 0 0 1 -0.00391,0 0.15001501,0.15001501 0 0 1 -0.00977,-0.00195 0.15001501,0.15001501 0 0 1 -0.00391,0 0.15001501,0.15001501 0 0 1 -0.011719,-0.00195 0.15001501,0.15001501 0 0 1 -0.00391,0 0.15001501,0.15001501 0 0 1 -0.00977,-0.00391 h -0.00391 a 0.15001501,0.15001501 0 0 1 -0.013672,-0.00586 L 8.8535156,2.109375 6.1445312,12.037109 5.1503906,16.017578 V 19.9375 l 0.9550782,0.957031 a 0.15001501,0.15001501 0 1 1 -0.2109376,0.210938 l -1,-1 A 0.15001501,0.15001501 0 0 1 4.8496094,20 v -4 a 0.15001501,0.15001501 0 0 1 0.00391,-0.03711 l 1,-4 a 0.15001501,0.15001501 0 0 1 0.00195,-0.002 L 8.5683594,2.0136719 Z M 7.4960938,1.65625 7.6054688,1.875 7.6523438,1.7089844 Z M 20.636719,1.1503906 22,1.8320312 23.363281,1.1503906 Z m -9.576172,0 -0.0059,0.00586 0.01953,-0.00586 z m -0.947266,0 -0.0957,0.3515625 0.404297,-0.1347656 0.216797,-0.2167969 z m -0.9999998,0 L 8.9316406,1.8183594 9,1.8417969 9.6757812,1.6171875 9.8046875,1.1503906 Z m -1,0 -0.097656,0.3632813 0.6308594,0.2109375 0.1582031,-0.5742188 z m -0.8710937,0 0.064453,0.1269532 0.4238282,0.140625 0.074219,-0.2675782 z M 6.9863281,0.84765625 a 0.15001501,0.15001501 0 0 1 0.03125,0.001953 h 0.9609375 a 0.15001501,0.15001501 0 0 1 0.044922,0 h 0.9550781 a 0.15001501,0.15001501 0 0 1 0.044922,0 h 0.9550781 a 0.15001501,0.15001501 0 0 1 0.044922,0 h 0.958984 a 0.15001501,0.15001501 0 0 1 0.0293,0 h 0.980469 0.01562 H 13 A 0.15039061,0.15039061 0 1 1 13,1.1503906 H 12.023438 L 10.578125,1.6328125 9.7597656,2.4511719 7.1445312,12.037109 6.1503906,16.017578 V 19.9375 l 1.9101563,1.912109 h 3.9160151 l 2.94336,-0.980468 1.949219,-1.949219 0.988281,-2.964844 L 21.822266,2.078125 19.964844,1.1503906 H 19 a 0.15039061,0.15039061 0 1 1 0,-0.30078122 h 0.980469 0.0293 3.976562 0.0293 H 25 A 0.15039061,0.15039061 0 1 1 25,1.1503906 H 24.035156 L 22.126953,2.1054688 18.144531,16.041016 a 0.15001501,0.15001501 0 0 1 -0.002,0.0059 l -1,3 a 0.15001501,0.15001501 0 0 1 -0.03711,0.05859 l -2,2 a 0.15001501,0.15001501 0 0 1 -0.05859,0.03711 l -3,1 A 0.15001501,0.15001501 0 0 1 12,22.150391 H 8.015625 a 0.15001501,0.15001501 0 0 1 -0.048828,-0.0039 0.15001501,0.15001501 0 0 1 -0.00977,-0.002 0.15001501,0.15001501 0 0 1 -0.00391,-0.002 l -0.00977,-0.002 A 0.15001501,0.15001501 0 0 1 7.9375,22.136719 L 4.953125,21.142578 a 0.15001501,0.15001501 0 0 1 -0.087891,-0.07617 l -1,-2 A 0.15001501,0.15001501 0 0 1 3.8496094,19 v -3 a 0.15001501,0.15001501 0 0 1 0.00391,-0.03711 l 1,-4 a 0.15001501,0.15001501 0 0 1 0.00195,-0.002 L 7.4882812,2.3105469 7.09375,1.5234375 5.9765625,1.1503906 H 5 A 0.15039068,0.15039068 0 1 1 5,0.84960938 h 0.9882812 0.015625 0.96875 a 0.15001501,0.15001501 0 0 1 0.013672,-0.001953 z"
     id="path2" />
</svg>
