<?xml version="1.0" encoding="UTF-8"?>
<glyph name="glyph24" format="1">
  <advance width="202"/>
  <unicode hex="2019"/>
  <outline>
    <contour>
      <point x="116" y="607" type="curve" smooth="yes"/>
      <point x="123" y="607"/>
      <point x="132" y="604"/>
      <point x="136" y="600" type="curve" smooth="yes"/>
      <point x="162" y="573" type="line" smooth="yes"/>
      <point x="169" y="569"/>
      <point x="174" y="558"/>
      <point x="174" y="550" type="curve" smooth="yes"/>
      <point x="174" y="546" type="line"/>
      <point x="174" y="492" type="line" smooth="yes"/>
      <point x="174" y="485"/>
      <point x="169" y="475"/>
      <point x="165" y="471" type="curve" smooth="yes"/>
      <point x="108" y="414" type="line" smooth="yes"/>
      <point x="104" y="410"/>
      <point x="94" y="405"/>
      <point x="87" y="405" type="curve" smooth="yes"/>
      <point x="71" y="405"/>
      <point x="57" y="417"/>
      <point x="57" y="433" type="curve" smooth="yes"/>
      <point x="57" y="440"/>
      <point x="62" y="450"/>
      <point x="66" y="454" type="curve" smooth="yes"/>
      <point x="106" y="494" type="line" smooth="yes"/>
      <point x="103" y="495"/>
      <point x="98" y="498"/>
      <point x="96" y="500" type="curve" smooth="yes"/>
      <point x="66" y="529" type="line" smooth="yes"/>
      <point x="62" y="533"/>
      <point x="58" y="543"/>
      <point x="58" y="550" type="curve" smooth="yes"/>
      <point x="58" y="557"/>
      <point x="62" y="566"/>
      <point x="66" y="570" type="curve" smooth="yes"/>
      <point x="96" y="600" type="line" smooth="yes"/>
      <point x="100" y="604"/>
      <point x="109" y="607"/>
    </contour>
  </outline>
  <lib>
    <dict>
      <key>com.fontlab.hintData</key>
      <dict>
        <key>hhints</key>
        <array>
          <dict>
            <key>position</key>
            <integer>405</integer>
            <key>width</key>
            <integer>202</integer>
          </dict>
        </array>
        <key>vhints</key>
        <array>
          <dict>
            <key>position</key>
            <integer>57</integer>
            <key>width</key>
            <integer>117</integer>
          </dict>
        </array>
      </dict>
    </dict>
  </lib>
</glyph>
