<?xml version="1.0" encoding="UTF-8" standalone="no"?>
<svg
   xmlns:dc="http://purl.org/dc/elements/1.1/"
   xmlns:cc="http://creativecommons.org/ns#"
   xmlns:rdf="http://www.w3.org/1999/02/22-rdf-syntax-ns#"
   xmlns:svg="http://www.w3.org/2000/svg"
   xmlns="http://www.w3.org/2000/svg"
   xmlns:sodipodi="http://sodipodi.sourceforge.net/DTD/sodipodi-0.dtd"
   xmlns:inkscape="http://www.inkscape.org/namespaces/inkscape"
   data-dec="145"
   width="24"
   height="40"
   version="1.1"
   id="svg4"
   sodipodi:docname="145.svg"
   inkscape:version="0.92.4 5da689c313, 2019-01-14">
  <metadata
     id="metadata10">
    <rdf:RDF>
      <cc:Work
         rdf:about="">
        <dc:format>image/svg+xml</dc:format>
        <dc:type
           rdf:resource="http://purl.org/dc/dcmitype/StillImage" />
        <dc:title></dc:title>
      </cc:Work>
    </rdf:RDF>
  </metadata>
  <defs
     id="defs8" />
  <sodipodi:namedview
     pagecolor="#ffffff"
     bordercolor="#666666"
     borderopacity="1"
     objecttolerance="10"
     gridtolerance="10"
     guidetolerance="10"
     inkscape:pageopacity="0"
     inkscape:pageshadow="2"
     inkscape:window-width="1920"
     inkscape:window-height="1043"
     id="namedview6"
     showgrid="false"
     inkscape:zoom="5.9"
     inkscape:cx="12"
     inkscape:cy="20"
     inkscape:window-x="0"
     inkscape:window-y="37"
     inkscape:window-maximized="0"
     inkscape:current-layer="svg4" />
  <path
     style="color:#000000;font-style:normal;font-variant:normal;font-weight:normal;font-stretch:normal;font-size:medium;line-height:normal;font-family:sans-serif;font-variant-ligatures:normal;font-variant-position:normal;font-variant-caps:normal;font-variant-numeric:normal;font-variant-alternates:normal;font-feature-settings:normal;text-indent:0;text-align:start;text-decoration:none;text-decoration-line:none;text-decoration-style:solid;text-decoration-color:#000000;letter-spacing:normal;word-spacing:normal;text-transform:none;writing-mode:lr-tb;direction:ltr;text-orientation:mixed;dominant-baseline:auto;baseline-shift:baseline;text-anchor:start;white-space:normal;shape-padding:0;clip-rule:nonzero;display:inline;overflow:visible;visibility:visible;opacity:1;isolation:auto;mix-blend-mode:normal;color-interpolation:sRGB;color-interpolation-filters:linearRGB;solid-color:#000000;solid-opacity:1;vector-effect:none;fill:#000000;fill-opacity:1;fill-rule:nonzero;stroke:none;stroke-width:0.5;stroke-linecap:round;stroke-linejoin:round;stroke-miterlimit:4;stroke-dasharray:none;stroke-dashoffset:0;stroke-opacity:1;color-rendering:auto;image-rendering:auto;shape-rendering:auto;text-rendering:auto;enable-background:accumulate"
     d="m 16.570312,8.9238281 0.666016,1.9980469 A 0.250025,0.250025 0 0 1 17.25,11 v 4 a 0.250025,0.250025 0 0 1 -0.02734,0.111328 l -1,2 a 0.250025,0.250025 0 0 1 -0.04492,0.06641 l -1.908203,1.908204 0.582031,-0.291016 1.94336,-1.94336 L 17.75,14.941406 V 11.058594 L 16.794922,9.1484375 Z M 9.7753906,6.890625 9.1484375,7.2050781 8.25,8.1035156 V 8.75 H 8.8457031 Z M 12.992188,5.7480469 a 0.250025,0.250025 0 0 1 0.02344,0.00195 0.250025,0.250025 0 0 1 0.002,0 0.250025,0.250025 0 0 1 0.002,0 0.250025,0.250025 0 0 1 0.04102,0.00781 0.250025,0.250025 0 0 1 0.0059,0 0.250025,0.250025 0 0 1 0.02344,0.00781 0.250025,0.250025 0 0 1 0.05273,0.027344 l 1.96875,0.984375 a 0.250025,0.250025 0 0 1 0.02734,0.013672 0.250025,0.250025 0 0 1 0.01953,0.015625 0.250025,0.250025 0 0 1 0.01953,0.015625 l 1,1 a 0.250025,0.250025 0 0 1 0.0098,0.011719 l 0.990234,0.9882812 a 0.250025,0.250025 0 0 1 0.04492,0.066406 l 1,2.0000001 A 0.250025,0.250025 0 0 1 18.25,11 v 4 a 0.250025,0.250025 0 0 1 -0.02734,0.111328 l -1,2 a 0.250025,0.250025 0 0 1 -0.04492,0.06641 l -2,2 a 0.250025,0.250025 0 0 1 -0.06641,0.04492 l -2,1 A 0.250025,0.250025 0 0 1 13,20.25 h -0.976562 a 0.250025,0.250025 0 0 1 -0.04883,0 H 10 a 0.250025,0.250025 0 0 1 -0.1113281,-0.02734 l -2,-1 a 0.250025,0.250025 0 0 1 -0.066406,-0.04492 l -1,-1 A 0.25135412,0.25135412 0 1 1 7.1777344,17.822266 L 8.1484375,18.794922 10.058594,19.75 h 1.884765 l 1.908203,-0.955078 1.94336,-1.94336 L 16.75,14.941406 v -3.90039 L 15.78125,8.1347656 14.851562,7.2050781 12.943359,6.25 h -0.002 -1.83789 L 10.205078,7.1484375 9.2226562,9.1113281 A 0.250025,0.250025 0 0 1 9,9.25 H 8 A 0.250025,0.250025 0 0 1 7.75,9 V 8 a 0.250025,0.250025 0 0 1 0.072266,-0.1777344 l 1,-1 a 0.250025,0.250025 0 0 1 0.066406,-0.044922 l 1.9707031,-0.984375 a 0.250025,0.250025 0 0 1 0.0293,-0.015625 0.250025,0.250025 0 0 1 0.03711,-0.015625 0.250025,0.250025 0 0 1 0.02539,-0.00586 0.250025,0.250025 0 0 1 0.02344,-0.00391 A 0.250025,0.250025 0 0 1 11,5.75 h 1.966797 a 0.250025,0.250025 0 0 1 0.02539,-0.00195 z M 10.041016,2.25 7.0957031,3.2304688 5.1484375,4.2050781 3.2050781,6.1484375 2.2363281,8.0878906 1.25,12.03125 v 2.9375 l 0.9863281,3.943359 0.96875,1.939453 2.921875,2.921876 L 10.03125,24.75 h 3.9375 l 3.904297,-0.976562 2.921875,-2.921876 0.96875,-1.939453 L 22.75,14.96875 v -2.9375 L 21.763672,8.0878906 20.794922,6.1484375 18.851562,4.2050781 16.904297,3.2324219 13.958984,2.25 Z M 10,1.75 h 4 a 0.250025,0.250025 0 0 1 0.07813,0.013672 l 3,1 a 0.250025,0.250025 0 0 1 0.0332,0.013672 l 2,1 a 0.250025,0.250025 0 0 1 0.06641,0.044922 l 2,2 a 0.250025,0.250025 0 0 1 0.04492,0.066406 l 1,2 a 0.250025,0.250025 0 0 1 0.01953,0.050781 l 1,3.9999999 A 0.250025,0.250025 0 0 1 23.25,12 v 3 a 0.250025,0.250025 0 0 1 -0.0078,0.06055 l -1,4 a 0.250025,0.250025 0 0 1 -0.01953,0.05078 l -1,2 a 0.250025,0.250025 0 0 1 -0.04492,0.06641 l -3,3 a 0.250025,0.250025 0 0 1 -0.117187,0.06445 l -4,1 A 0.250025,0.250025 0 0 1 14,25.25 h -4 a 0.250025,0.250025 0 0 1 -0.060547,-0.0078 l -4,-1 a 0.250025,0.250025 0 0 1 -0.1171875,-0.06445 l -3,-3 a 0.250025,0.250025 0 0 1 -0.044922,-0.06641 l -1,-2 a 0.250025,0.250025 0 0 1 -0.019531,-0.05078 l -1,-4 A 0.250025,0.250025 0 0 1 0.75,15 v -3 a 0.250025,0.250025 0 0 1 0.007813,-0.06055 l 1,-3.9999999 a 0.250025,0.250025 0 0 1 0.019531,-0.050781 l 1,-2 a 0.250025,0.250025 0 0 1 0.044922,-0.066406 l 2,-2 a 0.250025,0.250025 0 0 1 0.066406,-0.044922 L 6.8535156,2.7949219 a 0.250025,0.250025 0 0 1 0.035156,-0.017578 0.250025,0.250025 0 0 1 0.00977,-0.00586 0.250025,0.250025 0 0 1 0.00586,-0.00195 0.250025,0.250025 0 0 1 0.046875,-0.015625 L 9.921875,1.7636719 A 0.250025,0.250025 0 0 1 10,1.75 Z"
     id="path2" />
</svg>
