<?xml version="1.0" encoding="UTF-8" standalone="no"?>
<svg
   xmlns:dc="http://purl.org/dc/elements/1.1/"
   xmlns:cc="http://creativecommons.org/ns#"
   xmlns:rdf="http://www.w3.org/1999/02/22-rdf-syntax-ns#"
   xmlns:svg="http://www.w3.org/2000/svg"
   xmlns="http://www.w3.org/2000/svg"
   xmlns:sodipodi="http://sodipodi.sourceforge.net/DTD/sodipodi-0.dtd"
   xmlns:inkscape="http://www.inkscape.org/namespaces/inkscape"
   data-dec="57"
   width="22"
   height="40"
   version="1.1"
   id="svg4"
   sodipodi:docname="57.svg"
   inkscape:version="0.92.4 (unknown)">
  <metadata
     id="metadata10">
    <rdf:RDF>
      <cc:Work
         rdf:about="">
        <dc:format>image/svg+xml</dc:format>
        <dc:type
           rdf:resource="http://purl.org/dc/dcmitype/StillImage" />
      </cc:Work>
    </rdf:RDF>
  </metadata>
  <defs
     id="defs8" />
  <sodipodi:namedview
     pagecolor="#ffffff"
     bordercolor="#666666"
     borderopacity="1"
     objecttolerance="10"
     gridtolerance="10"
     guidetolerance="10"
     inkscape:pageopacity="0"
     inkscape:pageshadow="2"
     inkscape:window-width="640"
     inkscape:window-height="480"
     id="namedview6"
     showgrid="false"
     inkscape:zoom="5.9"
     inkscape:cx="11"
     inkscape:cy="20"
     inkscape:window-x="0"
     inkscape:window-y="27"
     inkscape:window-maximized="0"
     inkscape:current-layer="svg4" />
  <path
     style="color:#000000;font-style:normal;font-variant:normal;font-weight:normal;font-stretch:normal;font-size:medium;line-height:normal;font-family:sans-serif;font-variant-ligatures:normal;font-variant-position:normal;font-variant-caps:normal;font-variant-numeric:normal;font-variant-alternates:normal;font-feature-settings:normal;text-indent:0;text-align:start;text-decoration:none;text-decoration-line:none;text-decoration-style:solid;text-decoration-color:#000000;letter-spacing:normal;word-spacing:normal;text-transform:none;writing-mode:lr-tb;direction:ltr;text-orientation:mixed;dominant-baseline:auto;baseline-shift:baseline;text-anchor:start;white-space:normal;shape-padding:0;clip-rule:nonzero;display:inline;overflow:visible;visibility:visible;opacity:1;isolation:auto;mix-blend-mode:normal;color-interpolation:sRGB;color-interpolation-filters:linearRGB;solid-color:#000000;solid-opacity:1;vector-effect:none;fill:#013272;fill-opacity:1;fill-rule:nonzero;stroke:none;stroke-width:2;stroke-linecap:round;stroke-linejoin:round;stroke-miterlimit:4;stroke-dasharray:none;stroke-dashoffset:0;stroke-opacity:1;color-rendering:auto;image-rendering:auto;shape-rendering:auto;text-rendering:auto;enable-background:accumulate"
     d="M 11.236328,2 9.5917969,2.8222656 8.875,3.5410156 8,6.1621094 V 9.7636719 L 8.8222656,11.408203 9.4140625,12 H 11.763672 L 13.408203,11.177734 14.177734,10.408203 15,8.7636719 V 4.2363281 L 14.177734,2.5917969 13.585938,2 Z m 2.753906,-2.00976563 a 1.0001,1.0001 0 0 1 0.521485,0.14648438 l 1.935547,0.96875005 a 1.0001,1.0001 0 0 1 0.259765,0.1875 l 1,1 a 1.0001,1.0001 0 0 1 0.242188,0.390625 l 1,3 A 1.0001,1.0001 0 0 1 19,6 v 3 a 1.0001,1.0001 0 0 1 -0.0293,0.2421875 l -1,4.0000005 a 1.0001,1.0001 0 0 1 -0.02148,0.07422 l -1,3 a 1.0001,1.0001 0 0 1 -0.117188,0.238282 l -2,3 a 1.0001,1.0001 0 0 1 -0.125,0.152343 l -2,2 a 1.0001,1.0001 0 0 1 -0.390625,0.242188 l -2.9941404,0.998047 -0.00586,0.002 A 1.0001,1.0001 0 0 1 8.8808594,23 H 6 A 1.0001,1.0001 0 0 1 5.5527344,22.894531 l -2,-1 A 1.0001,1.0001 0 0 1 3.1054688,21.447266 l -1,-2 A 1.0001,1.0001 0 0 1 2,19 v -2 a 1.0001,1.0001 0 0 1 1,-1 h 2 a 1.0001,1.0001 0 0 1 1,1 v 2 A 1.0001,1.0001 0 0 1 5,20 H 4.6191406 L 4.7460938,20.253906 6.2363281,21 h 2.5273438 l 1.5507811,-0.775391 1.818359,-2.726562 0.941407,-1.880859 0.814453,-2.44336 -1.441406,0.720703 A 1.0001,1.0001 0 0 1 12,14 H 9.1464844 A 1.0001,1.0001 0 0 1 8.4882812,13.863281 l -1.9355468,-0.96875 a 1.0001,1.0001 0 0 1 -0.2597656,-0.1875 l -1,-1 a 1.0001,1.0001 0 0 1 -0.1875,-0.259765 l -1,-2.0000004 A 1.0001,1.0001 0 0 1 4,9 V 6 A 1.0001,1.0001 0 0 1 4.1054688,5.5527344 l 1,-2 a 1.0001,1.0001 0 0 1 0.1875,-0.2597656 l 2,-2 A 1.0001,1.0001 0 0 1 7.6835938,1.0507812 L 10.677734,0.05273437 a 1.0001,1.0001 0 0 1 0.0059,-0.0019531 A 1.0001,1.0001 0 0 1 11.119141,0 h 2.734375 a 1.0001,1.0001 0 0 1 0.136718,-0.00976563 z"
     id="path2" />
</svg>
