<?xml version="1.0" encoding="UTF-8" standalone="no"?>
<svg
   xmlns:dc="http://purl.org/dc/elements/1.1/"
   xmlns:cc="http://creativecommons.org/ns#"
   xmlns:rdf="http://www.w3.org/1999/02/22-rdf-syntax-ns#"
   xmlns:svg="http://www.w3.org/2000/svg"
   xmlns="http://www.w3.org/2000/svg"
   xmlns:sodipodi="http://sodipodi.sourceforge.net/DTD/sodipodi-0.dtd"
   xmlns:inkscape="http://www.inkscape.org/namespaces/inkscape"
   data-dec="8230"
   width="15"
   height="40"
   version="1.1"
   id="svg4"
   sodipodi:docname="8230.svg"
   inkscape:version="0.92.4 (unknown)">
  <metadata
     id="metadata10">
    <rdf:RDF>
      <cc:Work
         rdf:about="">
        <dc:format>image/svg+xml</dc:format>
        <dc:type
           rdf:resource="http://purl.org/dc/dcmitype/StillImage" />
      </cc:Work>
    </rdf:RDF>
  </metadata>
  <defs
     id="defs8" />
  <sodipodi:namedview
     pagecolor="#ffffff"
     bordercolor="#666666"
     borderopacity="1"
     objecttolerance="10"
     gridtolerance="10"
     guidetolerance="10"
     inkscape:pageopacity="0"
     inkscape:pageshadow="2"
     inkscape:window-width="640"
     inkscape:window-height="480"
     id="namedview6"
     showgrid="false"
     inkscape:zoom="5.9"
     inkscape:cx="7.5"
     inkscape:cy="20"
     inkscape:window-x="0"
     inkscape:window-y="27"
     inkscape:window-maximized="0"
     inkscape:current-layer="svg4" />
  <path
     style="color:#000000;font-style:normal;font-variant:normal;font-weight:normal;font-stretch:normal;font-size:medium;line-height:normal;font-family:sans-serif;font-variant-ligatures:normal;font-variant-position:normal;font-variant-caps:normal;font-variant-numeric:normal;font-variant-alternates:normal;font-feature-settings:normal;text-indent:0;text-align:start;text-decoration:none;text-decoration-line:none;text-decoration-style:solid;text-decoration-color:#000000;letter-spacing:normal;word-spacing:normal;text-transform:none;writing-mode:lr-tb;direction:ltr;text-orientation:mixed;dominant-baseline:auto;baseline-shift:baseline;text-anchor:start;white-space:normal;shape-padding:0;clip-rule:nonzero;display:inline;overflow:visible;visibility:visible;opacity:1;isolation:auto;mix-blend-mode:normal;color-interpolation:sRGB;color-interpolation-filters:linearRGB;solid-color:#000000;solid-opacity:1;vector-effect:none;fill:#013272;fill-opacity:1;fill-rule:nonzero;stroke:none;stroke-width:2;stroke-linecap:round;stroke-linejoin:round;stroke-miterlimit:4;stroke-dasharray:none;stroke-dashoffset:0;stroke-opacity:1;color-rendering:auto;image-rendering:auto;shape-rendering:auto;text-rendering:auto;enable-background:accumulate"
     d="M 1.9804688,16.990234 A 1.0001,1.0001 0 0 1 2.1464844,17 H 3 a 1.0001,1.0001 0 0 1 0.7070312,0.292969 l 1,1 A 1.0001,1.0001 0 0 1 5,19 1.0001,1.0001 0 0 1 5.2929688,18.292969 L 6.1894531,17.396484 A 1.0001,1.0001 0 0 1 6.5742188,17.089844 1.0001,1.0001 0 0 1 6.609375,17.074219 1.0001,1.0001 0 0 1 7.1464844,17 H 8 a 1.0001,1.0001 0 0 1 0.7070312,0.292969 l 1,1 A 1.0001,1.0001 0 0 1 10,19 1.0001,1.0001 0 0 1 10.292969,18.292969 l 0.896484,-0.896485 a 1.0001,1.0001 0 0 1 0.384766,-0.30664 1.0001,1.0001 0 0 1 0.03516,-0.01563 A 1.0001,1.0001 0 0 1 12.146484,17 H 13 a 1.0001,1.0001 0 0 1 0.707031,0.292969 l 1,1 A 1.0001,1.0001 0 0 1 15,19 v 1 a 1.0001,1.0001 0 0 1 -0.292969,0.707031 l -1,1 A 1.0001,1.0001 0 0 1 13,22 h -1 a 1.0001,1.0001 0 0 1 -0.707031,-0.292969 l -1,-1 A 1.0001,1.0001 0 0 1 10,20 1.0001,1.0001 0 0 1 9.7070312,20.707031 l -1,1 A 1.0001,1.0001 0 0 1 8,22 H 7 A 1.0001,1.0001 0 0 1 6.2929688,21.707031 l -1,-1 A 1.0001,1.0001 0 0 1 5,20 1.0001,1.0001 0 0 1 4.7070312,20.707031 l -1,1 A 1.0001,1.0001 0 0 1 3,22 H 2 A 1.0001,1.0001 0 0 1 1.2929688,21.707031 l -1.00000005,-1 A 1.0001,1.0001 0 0 1 0,20 V 19 A 1.0001,1.0001 0 0 1 0.29296875,18.292969 L 1.1894531,17.396484 a 1.0001,1.0001 0 0 1 0.3847657,-0.30664 1.0001,1.0001 0 0 1 0.035156,-0.01563 1.0001,1.0001 0 0 1 0.3710938,-0.08398 z"
     id="path2" />
</svg>
