<?xml version="1.0" encoding="UTF-8" standalone="no"?>
<svg
   xmlns:dc="http://purl.org/dc/elements/1.1/"
   xmlns:cc="http://creativecommons.org/ns#"
   xmlns:rdf="http://www.w3.org/1999/02/22-rdf-syntax-ns#"
   xmlns:svg="http://www.w3.org/2000/svg"
   xmlns="http://www.w3.org/2000/svg"
   xmlns:sodipodi="http://sodipodi.sourceforge.net/DTD/sodipodi-0.dtd"
   xmlns:inkscape="http://www.inkscape.org/namespaces/inkscape"
   data-dec="104"
   width="22"
   height="40"
   version="1.1"
   id="svg4"
   sodipodi:docname="104.svg"
   inkscape:version="0.92.4 (unknown)">
  <metadata
     id="metadata10">
    <rdf:RDF>
      <cc:Work
         rdf:about="">
        <dc:format>image/svg+xml</dc:format>
        <dc:type
           rdf:resource="http://purl.org/dc/dcmitype/StillImage" />
      </cc:Work>
    </rdf:RDF>
  </metadata>
  <defs
     id="defs8" />
  <sodipodi:namedview
     pagecolor="#ffffff"
     bordercolor="#666666"
     borderopacity="1"
     objecttolerance="10"
     gridtolerance="10"
     guidetolerance="10"
     inkscape:pageopacity="0"
     inkscape:pageshadow="2"
     inkscape:window-width="640"
     inkscape:window-height="480"
     id="namedview6"
     showgrid="false"
     inkscape:zoom="5.9"
     inkscape:cx="11"
     inkscape:cy="20"
     inkscape:window-x="0"
     inkscape:window-y="27"
     inkscape:window-maximized="0"
     inkscape:current-layer="svg4" />
  <path
     style="color:#000000;font-style:normal;font-variant:normal;font-weight:normal;font-stretch:normal;font-size:medium;line-height:normal;font-family:sans-serif;font-variant-ligatures:normal;font-variant-position:normal;font-variant-caps:normal;font-variant-numeric:normal;font-variant-alternates:normal;font-feature-settings:normal;text-indent:0;text-align:start;text-decoration:none;text-decoration-line:none;text-decoration-style:solid;text-decoration-color:#000000;letter-spacing:normal;word-spacing:normal;text-transform:none;writing-mode:lr-tb;direction:ltr;text-orientation:mixed;dominant-baseline:auto;baseline-shift:baseline;text-anchor:start;white-space:normal;shape-padding:0;clip-rule:nonzero;display:inline;overflow:visible;visibility:visible;opacity:1;isolation:auto;mix-blend-mode:normal;color-interpolation:sRGB;color-interpolation-filters:linearRGB;solid-color:#000000;solid-opacity:1;vector-effect:none;fill:#013272;fill-opacity:1;fill-rule:nonzero;stroke:none;stroke-width:2;stroke-linecap:round;stroke-linejoin:round;stroke-miterlimit:4;stroke-dasharray:none;stroke-dashoffset:0;stroke-opacity:1;color-rendering:auto;image-rendering:auto;shape-rendering:auto;text-rendering:auto;enable-background:accumulate"
     d="M 7.9667969,-0.01367188 A 1.0001,1.0001 0 0 1 8.1660156,0 H 8.8457031 A 1.0001,1.0001 0 0 1 9.1660156,0 H 10 a 1.0001,1.0001 0 0 1 0.960938,1.2753906 L 8.8203125,8.765625 9.2929688,8.2929688 a 1.0001,1.0001 0 0 1 0.2597656,-0.1875 l 1.9999996,-1 A 1.0001,1.0001 0 0 1 12,7 h 2 a 1.0001,1.0001 0 0 1 0.447266,0.1054688 l 1.853515,0.9277343 a 1.0001,1.0001 0 0 1 0.632813,0.5957031 l 0.960937,1.9238278 A 1.0001,1.0001 0 0 1 18,11 v 3 a 1.0001,1.0001 0 0 1 -0.07227,0.371094 L 16,19.191406 v 1.394532 L 16.414062,21 h 1.171876 l 1.591796,-1.591797 0.927735,-1.855469 a 1.0001163,1.0001163 0 1 1 1.789062,0.894532 l -1,2 a 1.0001,1.0001 0 0 1 -0.1875,0.259765 l -2,2 A 1.0001,1.0001 0 0 1 18,23 H 16 A 1.0001,1.0001 0 0 1 15.292969,22.707031 L 14.396484,21.810547 A 1.0001,1.0001 0 0 1 14.066406,21.371094 L 13.105469,19.447266 A 1.0001,1.0001 0 0 1 13,19 v -3 a 1.0001,1.0001 0 0 1 0.07227,-0.371094 L 15,10.808594 V 9.6191406 L 13.763672,9 H 12.236328 L 10.591797,9.8222656 8.8222656,11.591797 6.9355469,15.367188 5.0058594,22.119141 a 1.0001,1.0001 0 0 1 -0.3378906,0.634765 1.0001,1.0001 0 0 1 -0.058594,0.04883 1.0001,1.0001 0 0 1 -0.042969,0.03125 A 1.0001,1.0001 0 0 1 3.8339844,23 H 3.1542969 A 1.0001,1.0001 0 0 1 2.8339844,23 H 2 A 1.0001,1.0001 0 0 1 1.0390625,21.724609 L 6.5683594,2.3730469 6.4902344,2.21875 5.8359375,2 H 5 A 1.0001,1.0001 0 1 1 5,0 H 5.90625 A 1.0001,1.0001 0 0 1 6.0742188,0 H 6.84375 a 1.0001,1.0001 0 0 1 0.3046875,0 h 0.6972656 a 1.0001,1.0001 0 0 1 0.1210938,-0.01367188 z"
     id="path2" />
</svg>
