<?xml version="1.0" encoding="UTF-8" standalone="no"?>
<svg
   xmlns:dc="http://purl.org/dc/elements/1.1/"
   xmlns:cc="http://creativecommons.org/ns#"
   xmlns:rdf="http://www.w3.org/1999/02/22-rdf-syntax-ns#"
   xmlns:svg="http://www.w3.org/2000/svg"
   xmlns="http://www.w3.org/2000/svg"
   xmlns:sodipodi="http://sodipodi.sourceforge.net/DTD/sodipodi-0.dtd"
   xmlns:inkscape="http://www.inkscape.org/namespaces/inkscape"
   data-dec="187"
   width="15"
   height="40"
   version="1.1"
   id="svg4"
   sodipodi:docname="187.svg"
   inkscape:version="0.92.4 (unknown)">
  <metadata
     id="metadata10">
    <rdf:RDF>
      <cc:Work
         rdf:about="">
        <dc:format>image/svg+xml</dc:format>
        <dc:type
           rdf:resource="http://purl.org/dc/dcmitype/StillImage" />
      </cc:Work>
    </rdf:RDF>
  </metadata>
  <defs
     id="defs8" />
  <sodipodi:namedview
     pagecolor="#ffffff"
     bordercolor="#666666"
     borderopacity="1"
     objecttolerance="10"
     gridtolerance="10"
     guidetolerance="10"
     inkscape:pageopacity="0"
     inkscape:pageshadow="2"
     inkscape:window-width="615"
     inkscape:window-height="417"
     id="namedview6"
     showgrid="false"
     inkscape:zoom="5.9"
     inkscape:cx="7.5"
     inkscape:cy="20"
     inkscape:window-x="0"
     inkscape:window-y="27"
     inkscape:window-maximized="0"
     inkscape:current-layer="svg4" />
  <path
     style="color:#000000;font-style:normal;font-variant:normal;font-weight:normal;font-stretch:normal;font-size:medium;line-height:normal;font-family:sans-serif;font-variant-ligatures:normal;font-variant-position:normal;font-variant-caps:normal;font-variant-numeric:normal;font-variant-alternates:normal;font-feature-settings:normal;text-indent:0;text-align:start;text-decoration:none;text-decoration-line:none;text-decoration-style:solid;text-decoration-color:#000000;letter-spacing:normal;word-spacing:normal;text-transform:none;writing-mode:lr-tb;direction:ltr;text-orientation:mixed;dominant-baseline:auto;baseline-shift:baseline;text-anchor:start;white-space:normal;shape-padding:0;clip-rule:nonzero;display:inline;overflow:visible;visibility:visible;opacity:1;isolation:auto;mix-blend-mode:normal;color-interpolation:sRGB;color-interpolation-filters:linearRGB;solid-color:#000000;solid-opacity:1;vector-effect:none;fill:#013272;fill-opacity:1;fill-rule:nonzero;stroke:none;stroke-width:1;stroke-linecap:round;stroke-linejoin:round;stroke-miterlimit:4;stroke-dasharray:none;stroke-dashoffset:0;stroke-opacity:1;color-rendering:auto;image-rendering:auto;shape-rendering:auto;text-rendering:auto;enable-background:accumulate"
     d="m 8.9863281,7.4941406 a 0.50005,0.50005 0 0 1 0.021484,0 0.50005,0.50005 0 0 1 0.037109,0.00195 0.50005,0.50005 0 0 1 0.025391,0.00391 0.50005,0.50005 0 0 1 0.023437,0.00391 0.50005,0.50005 0 0 1 0.039063,0.00977 0.50005,0.50005 0 0 1 0.00586,0.00195 0.50005,0.50005 0 0 1 0.00391,0 0.50005,0.50005 0 0 1 0.00586,0.00195 0.50005,0.50005 0 0 1 0.00586,0.00195 0.50005,0.50005 0 0 1 0.03125,0.011719 0.50005,0.50005 0 0 1 0.00391,0.00195 0.50005,0.50005 0 0 1 0.041016,0.019531 0.50005,0.50005 0 0 1 0.00391,0.00195 0.50005,0.50005 0 0 1 0.011719,0.00586 0.50005,0.50005 0 0 1 0.013672,0.00977 0.50005,0.50005 0 0 1 0.017578,0.00977 0.50005,0.50005 0 0 1 0.00977,0.00781 0.50005,0.50005 0 0 1 0.023437,0.017578 0.50005,0.50005 0 0 1 0.00586,0.00586 0.50005,0.50005 0 0 1 0.035156,0.03125 0.50005,0.50005 0 0 1 0.00195,0.00195 0.50005,0.50005 0 0 1 0.03125,0.035156 0.50005,0.50005 0 0 1 0.00391,0.00391 0.50005,0.50005 0 0 1 0.00586,0.00781 l 4.9902348,5.9882818 a 0.50005,0.50005 0 0 1 -0.05859,0.699218 l -6.9863282,5.988282 a 0.50005,0.50005 0 0 1 -0.011719,0.0098 l -0.00195,0.002 a 0.50005,0.50005 0 0 1 -0.027344,0.02344 0.50005,0.50005 0 0 1 -0.023437,0.01563 0.50005,0.50005 0 0 1 -0.017578,0.01172 0.50005,0.50005 0 0 1 -0.00977,0.0078 0.50005,0.50005 0 0 1 -0.00391,0.002 0.50005,0.50005 0 0 1 -0.021484,0.01172 0.50005,0.50005 0 0 1 -0.00977,0.0059 0.50005,0.50005 0 0 1 -0.044922,0.01953 0.50005,0.50005 0 0 1 -0.011719,0.0039 0.50005,0.50005 0 0 1 -0.00391,0.002 0.50005,0.50005 0 0 1 -0.042969,0.01172 0.50005,0.50005 0 0 1 -0.048828,0.0078 0.50005,0.50005 0 0 1 -0.017578,0.002 0.50005,0.50005 0 0 1 -0.021484,0.002 0.50005,0.50005 0 0 1 -0.050781,0 0.50005,0.50005 0 0 1 -0.011719,0 0.50005,0.50005 0 0 1 -0.023437,-0.002 0.50005,0.50005 0 0 1 -0.025391,-0.0039 0.50005,0.50005 0 0 1 -0.00391,0 0.50005,0.50005 0 0 1 -0.00586,-0.002 0.50005,0.50005 0 0 1 -0.023437,-0.0059 0.50005,0.50005 0 0 1 -0.00391,0 0.50005,0.50005 0 0 1 -0.011719,-0.0039 0.50005,0.50005 0 0 1 -0.00391,0 0.50005,0.50005 0 0 1 -0.039063,-0.01367 0.50005,0.50005 0 0 1 -0.00391,-0.002 0.50005,0.50005 0 0 1 -0.03125,-0.01172 0.50005,0.50005 0 0 1 -0.00391,-0.0039 0.50005,0.50005 0 0 1 -0.013672,-0.0078 0.50005,0.50005 0 0 1 -0.044922,-0.02539 0.50005,0.50005 0 0 1 -0.00977,-0.0078 0.50005,0.50005 0 0 1 -0.013672,-0.0098 0.50005,0.50005 0 0 1 -0.00391,-0.002 0.50005,0.50005 0 0 1 -0.00586,-0.0059 0.50005,0.50005 0 0 1 -0.00391,-0.002 0.50005,0.50005 0 0 1 -0.00586,-0.0059 0.50005,0.50005 0 0 1 -0.03125,-0.02734 0.50005,0.50005 0 0 1 -0.00195,-0.002 0.50005,0.50005 0 0 1 -0.025391,-0.02539 0.50005,0.50005 0 0 1 -0.00586,-0.0078 0.50005,0.50005 0 0 1 -0.00195,-0.002 0.50005,0.50005 0 0 1 -0.00195,-0.002 0.50005,0.50005 0 0 1 -0.00391,-0.0039 0.50005,0.50005 0 0 1 -0.00977,-0.01562 0.50005,0.50005 0 0 1 -0.00781,-0.0078 0.50005,0.50005 0 0 1 -0.00586,-0.0098 0.50005,0.50005 0 0 1 -0.00195,-0.0039 0.50005,0.50005 0 0 1 -0.017578,-0.0293 0.50005,0.50005 0 0 1 -0.00586,-0.0098 0.50005,0.50005 0 0 1 -0.00195,-0.002 0.50005,0.50005 0 0 1 -0.00195,-0.0059 0.50005,0.50005 0 0 1 -0.00586,-0.0098 0.50005,0.50005 0 0 1 -0.011719,-0.02734 0.50005,0.50005 0 0 1 -0.00195,-0.0039 0.50005,0.50005 0 0 1 -0.011719,-0.03125 0.50005,0.50005 0 0 1 -0.00195,-0.0059 0.50005,0.50005 0 0 1 -0.00195,-0.0059 0.50005,0.50005 0 0 1 -0.00195,-0.0039 0.50005,0.50005 0 0 1 -0.00391,-0.01758 0.50005,0.50005 0 0 1 -0.00586,-0.02539 0.50005,0.50005 0 0 1 -0.00195,-0.0059 0.50005,0.50005 0 0 1 -0.00195,-0.0098 0.50005,0.50005 0 0 1 -0.00391,-0.03516 0.50005,0.50005 0 0 1 -0.00391,-0.03906 0.50005,0.50005 0 0 1 0,-0.0059 0.50005,0.50005 0 0 1 0,-0.01367 0.50005,0.50005 0 0 1 0.00391,-0.03711 0.50005,0.50005 0 0 1 0,-0.0039 0.50005,0.50005 0 0 1 0,-0.0039 0.50005,0.50005 0 0 1 0.00195,-0.01172 0.50005,0.50005 0 0 1 0.00195,-0.02344 0.50005,0.50005 0 0 1 0.00195,-0.0059 0.50005,0.50005 0 0 1 0.00195,-0.0078 0.50005,0.50005 0 0 1 0.011719,-0.04492 0.50005,0.50005 0 0 1 0.00195,-0.0039 0.50005,0.50005 0 0 1 0.015625,-0.04297 0.50005,0.50005 0 0 1 0.00195,-0.0039 0.50005,0.50005 0 0 1 0.013672,-0.03125 0.50005,0.50005 0 0 1 0.00586,-0.0098 0.50005,0.50005 0 0 1 0.00586,-0.0098 0.50005,0.50005 0 0 1 0.00195,-0.002 0.50005,0.50005 0 0 1 0.021484,-0.03516 0.50005,0.50005 0 0 1 0.00586,-0.0098 0.50005,0.50005 0 0 1 0.00586,-0.0059 0.50005,0.50005 0 0 1 0.00781,-0.01172 0.50005,0.50005 0 0 1 0.00586,-0.0059 0.50005,0.50005 0 0 1 0.00195,-0.002 0.50005,0.50005 0 0 1 0.00195,-0.0039 L 11.40625,13.931641 8.5703125,8.2578125 a 0.50005,0.50005 0 0 1 -0.00195,-0.00391 0.50005,0.50005 0 0 1 -0.00195,-0.00195 0.50005,0.50005 0 0 1 -0.00195,-0.00391 0.50005,0.50005 0 0 1 -0.027344,-0.056641 0.50005,0.50005 0 0 1 -0.013672,-0.03125 0.50005,0.50005 0 0 1 0,-0.00195 0.50005,0.50005 0 0 1 -0.00391,-0.013672 0.50005,0.50005 0 0 1 0,-0.00195 0.50005,0.50005 0 0 1 -0.00977,-0.029297 0.50005,0.50005 0 0 1 0,-0.00391 0.50005,0.50005 0 0 1 -0.00195,-0.011719 A 0.50005,0.50005 0 0 1 8.5,8.0644531 a 0.50005,0.50005 0 0 1 0,-0.00391 0.50005,0.50005 0 0 1 -0.00391,-0.046875 0.50005,0.50005 0 0 1 0,-0.00391 0.50005,0.50005 0 0 1 0,-0.00781 0.50005,0.50005 0 0 1 0,-0.00391 0.50005,0.50005 0 0 1 0.00195,-0.048828 0.50005,0.50005 0 0 1 0,-0.00391 0.50005,0.50005 0 0 1 0.00586,-0.035156 0.50005,0.50005 0 0 1 0,-0.00195 0.50005,0.50005 0 0 1 0.00391,-0.019531 0.50005,0.50005 0 0 1 0.00391,-0.023437 0.50005,0.50005 0 0 1 0.00195,-0.00391 0.50005,0.50005 0 0 1 0.00391,-0.011719 0.50005,0.50005 0 0 1 0.00977,-0.03125 0.50005,0.50005 0 0 1 0.00195,-0.00391 0.50005,0.50005 0 0 1 0.00586,-0.011719 0.50005,0.50005 0 0 1 0.011719,-0.03125 0.50005,0.50005 0 0 1 0.00195,-0.00195 0.50005,0.50005 0 0 1 0.017578,-0.03125 0.50005,0.50005 0 0 1 0.00586,-0.00977 0.50005,0.50005 0 0 1 0.00195,-0.00391 0.50005,0.50005 0 0 1 0.00781,-0.00977 0.50005,0.50005 0 0 1 0.019531,-0.027344 0.50005,0.50005 0 0 1 0.00195,-0.00391 0.50005,0.50005 0 0 1 0.00391,-0.00391 0.50005,0.50005 0 0 1 0.00391,-0.00586 0.50005,0.50005 0 0 1 0.00977,-0.00977 0.50005,0.50005 0 0 1 0.00195,-0.00195 0.50005,0.50005 0 0 1 0.011719,-0.013672 0.50005,0.50005 0 0 1 0.011719,-0.00977 0.50005,0.50005 0 0 1 0.023437,-0.023437 0.50005,0.50005 0 0 1 0.00195,-0.00195 0.50005,0.50005 0 0 1 0.00781,-0.00586 0.50005,0.50005 0 0 1 0.019531,-0.015625 0.50005,0.50005 0 0 1 0.013672,-0.00977 0.50005,0.50005 0 0 1 0.039063,-0.023437 0.50005,0.50005 0 0 1 0.00391,-0.00195 0.50005,0.50005 0 0 1 0.00977,-0.00586 0.50005,0.50005 0 0 1 0.011719,-0.00586 0.50005,0.50005 0 0 1 0.019531,-0.00977 0.50005,0.50005 0 0 1 0.00391,-0.00195 0.50005,0.50005 0 0 1 0.011719,-0.00391 0.50005,0.50005 0 0 1 0.046875,-0.015625 0.50005,0.50005 0 0 1 0.00977,-0.00195 0.50005,0.50005 0 0 1 0.021484,-0.00586 0.50005,0.50005 0 0 1 0.017578,-0.00391 0.50005,0.50005 0 0 1 0.048828,-0.00586 0.50005,0.50005 0 0 1 0.029297,-0.00195 z m -6,0 a 0.50005,0.50005 0 0 1 0.021484,0 0.50005,0.50005 0 0 1 0.037109,0.00195 0.50005,0.50005 0 0 1 0.025391,0.00391 0.50005,0.50005 0 0 1 0.023437,0.00391 0.50005,0.50005 0 0 1 0.039063,0.00977 0.50005,0.50005 0 0 1 0.00586,0.00195 0.50005,0.50005 0 0 1 0.00391,0 0.50005,0.50005 0 0 1 0.00586,0.00195 0.50005,0.50005 0 0 1 0.00586,0.00195 0.50005,0.50005 0 0 1 0.03125,0.011719 0.50005,0.50005 0 0 1 0.00391,0.00195 0.50005,0.50005 0 0 1 0.041016,0.019531 0.50005,0.50005 0 0 1 0.00391,0.00195 0.50005,0.50005 0 0 1 0.011719,0.00586 0.50005,0.50005 0 0 1 0.013672,0.00977 0.50005,0.50005 0 0 1 0.017578,0.00977 0.50005,0.50005 0 0 1 0.033203,0.025391 0.50005,0.50005 0 0 1 0.00586,0.00586 0.50005,0.50005 0 0 1 0.035156,0.03125 0.50005,0.50005 0 0 1 0.00195,0.00195 0.50005,0.50005 0 0 1 0.03125,0.035156 0.50005,0.50005 0 0 1 0.00391,0.00391 0.50005,0.50005 0 0 1 0.00586,0.00781 l 4.9902344,5.9902348 a 0.50005,0.50005 0 0 1 -0.058594,0.699218 l -6.9863281,5.988282 a 0.50005,0.50005 0 0 1 -0.011719,0.0098 l -0.00195,0.002 a 0.50005,0.50005 0 0 1 -0.027344,0.02344 0.50005,0.50005 0 0 1 -0.023437,0.01563 0.50005,0.50005 0 0 1 -0.017578,0.01172 0.50005,0.50005 0 0 1 -0.00977,0.0078 0.50005,0.50005 0 0 1 -0.00391,0.002 0.50005,0.50005 0 0 1 -0.021484,0.0098 0.50005,0.50005 0 0 1 -0.00977,0.0059 0.50005,0.50005 0 0 1 -0.044922,0.01953 0.50005,0.50005 0 0 1 -0.011719,0.0039 0.50005,0.50005 0 0 1 -0.00391,0.002 0.50005,0.50005 0 0 1 -0.042969,0.01172 0.50005,0.50005 0 0 1 -0.048828,0.0078 0.50005,0.50005 0 0 1 -0.017578,0.002 0.50005,0.50005 0 0 1 -0.021484,0.002 0.50005,0.50005 0 0 1 -0.0507813,0 0.50005,0.50005 0 0 1 -0.0117187,0 0.50005,0.50005 0 0 1 -0.003906,0 0.50005,0.50005 0 0 1 -0.0195312,-0.002 0.50005,0.50005 0 0 1 -0.0117188,-0.002 0.50005,0.50005 0 0 1 -0.0136719,-0.002 0.50005,0.50005 0 0 1 -0.003906,0 0.50005,0.50005 0 0 1 -0.005859,-0.002 0.50005,0.50005 0 0 1 -0.0234375,-0.0059 0.50005,0.50005 0 0 1 -0.003906,0 0.50005,0.50005 0 0 1 -0.0117188,-0.0039 0.50005,0.50005 0 0 1 -0.003906,0 0.50005,0.50005 0 0 1 -0.0332031,-0.01172 0.50005,0.50005 0 0 1 -0.005859,-0.002 0.50005,0.50005 0 0 1 -0.003906,-0.002 0.50005,0.50005 0 0 1 -0.03125,-0.01172 0.50005,0.50005 0 0 1 -0.003906,-0.0039 0.50005,0.50005 0 0 1 -0.0117188,-0.0039 0.50005,0.50005 0 0 1 -0.001953,-0.002 0.50005,0.50005 0 0 1 -0.0292969,-0.01563 0.50005,0.50005 0 0 1 0,-0.0039 0.50005,0.50005 0 0 1 -0.015625,-0.0078 0.50005,0.50005 0 0 1 -0.009766,-0.0078 0.50005,0.50005 0 0 1 -0.0136719,-0.0098 0.50005,0.50005 0 0 1 -0.003906,-0.002 0.50005,0.50005 0 0 1 -0.005859,-0.0059 0.50005,0.50005 0 0 1 -0.003906,-0.002 0.50005,0.50005 0 0 1 -0.005859,-0.0059 0.50005,0.50005 0 0 1 -0.03125,-0.02734 0.50005,0.50005 0 0 1 -0.001953,-0.002 0.50005,0.50005 0 0 1 -0.0253906,-0.02539 0.50005,0.50005 0 0 1 -0.005859,-0.0078 0.50005,0.50005 0 0 1 -0.001953,-0.002 0.50005,0.50005 0 0 1 -0.001953,-0.002 0.50005,0.50005 0 0 1 -0.003906,-0.0039 0.50005,0.50005 0 0 1 -0.009766,-0.01562 0.50005,0.50005 0 0 1 -0.007813,-0.0078 0.50005,0.50005 0 0 1 -0.005859,-0.0098 0.50005,0.50005 0 0 1 -0.001953,-0.0039 0.50005,0.50005 0 0 1 -0.0175781,-0.0293 0.50005,0.50005 0 0 1 -0.005859,-0.0098 0.50005,0.50005 0 0 1 -0.001953,-0.002 0.50005,0.50005 0 0 1 -0.001953,-0.0059 0.50005,0.50005 0 0 1 -0.005859,-0.0098 0.50005,0.50005 0 0 1 -0.0117188,-0.02734 0.50005,0.50005 0 0 1 -0.001953,-0.0039 0.50005,0.50005 0 0 1 -0.0117187,-0.03125 0.50005,0.50005 0 0 1 -0.001953,-0.0059 0.50005,0.50005 0 0 1 -0.001953,-0.0059 0.50005,0.50005 0 0 1 -0.001953,-0.0039 0.50005,0.50005 0 0 1 -0.003906,-0.01758 0.50005,0.50005 0 0 1 -0.005859,-0.02539 0.50005,0.50005 0 0 1 -0.001953,-0.0059 0.50005,0.50005 0 0 1 -0.001953,-0.0098 0.50005,0.50005 0 0 1 -0.003906,-0.03516 0.50005,0.50005 0 0 1 -0.003906,-0.03906 0.50005,0.50005 0 0 1 0,-0.0059 0.50005,0.50005 0 0 1 0,-0.01367 0.50005,0.50005 0 0 1 0.003906,-0.03711 0.50005,0.50005 0 0 1 0,-0.0039 0.50005,0.50005 0 0 1 0,-0.0039 0.50005,0.50005 0 0 1 0.001953,-0.01172 0.50005,0.50005 0 0 1 0.001953,-0.02344 0.50005,0.50005 0 0 1 0.001953,-0.0059 0.50005,0.50005 0 0 1 0.001953,-0.0078 0.50005,0.50005 0 0 1 0.0117187,-0.04492 0.50005,0.50005 0 0 1 0.001953,-0.0039 0.50005,0.50005 0 0 1 0.015625,-0.04297 0.50005,0.50005 0 0 1 0.001953,-0.0039 0.50005,0.50005 0 0 1 0.0136719,-0.03125 0.50005,0.50005 0 0 1 0.005859,-0.0098 0.50005,0.50005 0 0 1 0.005859,-0.0098 0.50005,0.50005 0 0 1 0.001953,-0.002 0.50005,0.50005 0 0 1 0.0214844,-0.03516 0.50005,0.50005 0 0 1 0.005859,-0.0098 0.50005,0.50005 0 0 1 0.005859,-0.0059 0.50005,0.50005 0 0 1 0.007813,-0.01172 0.50005,0.50005 0 0 1 0.005859,-0.0059 0.50005,0.50005 0 0 1 0.001953,-0.002 0.50005,0.50005 0 0 1 0.001953,-0.0039 L 5.40625,13.931641 2.5703125,8.2578125 a 0.50005,0.50005 0 0 1 -0.00195,-0.00391 0.50005,0.50005 0 0 1 -0.00195,-0.00195 0.50005,0.50005 0 0 1 -0.00195,-0.00391 0.50005,0.50005 0 0 1 -0.027344,-0.056641 0.50005,0.50005 0 0 1 -0.013672,-0.03125 0.50005,0.50005 0 0 1 0,-0.00195 0.50005,0.50005 0 0 1 -0.00391,-0.013672 0.50005,0.50005 0 0 1 0,-0.00195 0.50005,0.50005 0 0 1 -0.00977,-0.029297 0.50005,0.50005 0 0 1 0,-0.00391 0.50005,0.50005 0 0 1 -0.00195,-0.011719 A 0.50005,0.50005 0 0 1 2.5,8.0644531 a 0.50005,0.50005 0 0 1 0,-0.00391 0.50005,0.50005 0 0 1 -0.00391,-0.046875 0.50005,0.50005 0 0 1 0,-0.00391 0.50005,0.50005 0 0 1 0,-0.00781 0.50005,0.50005 0 0 1 0,-0.00391 0.50005,0.50005 0 0 1 0.00195,-0.048828 0.50005,0.50005 0 0 1 0,-0.00391 0.50005,0.50005 0 0 1 0.00586,-0.035156 0.50005,0.50005 0 0 1 0,-0.00195 0.50005,0.50005 0 0 1 0.00391,-0.019531 0.50005,0.50005 0 0 1 0.00391,-0.023437 0.50005,0.50005 0 0 1 0.00195,-0.00391 0.50005,0.50005 0 0 1 0.00391,-0.011719 0.50005,0.50005 0 0 1 0.00977,-0.03125 0.50005,0.50005 0 0 1 0.00195,-0.00391 0.50005,0.50005 0 0 1 0.00586,-0.011719 0.50005,0.50005 0 0 1 0.011719,-0.03125 0.50005,0.50005 0 0 1 0.00195,-0.00195 0.50005,0.50005 0 0 1 0.017578,-0.03125 0.50005,0.50005 0 0 1 0.00586,-0.00977 0.50005,0.50005 0 0 1 0.00195,-0.00391 0.50005,0.50005 0 0 1 0.00781,-0.00977 0.50005,0.50005 0 0 1 0.019531,-0.027344 0.50005,0.50005 0 0 1 0.00195,-0.00391 0.50005,0.50005 0 0 1 0.00391,-0.00391 0.50005,0.50005 0 0 1 0.013672,-0.015625 0.50005,0.50005 0 0 1 0.00195,-0.00195 0.50005,0.50005 0 0 1 0.011719,-0.013672 0.50005,0.50005 0 0 1 0.011719,-0.00977 0.50005,0.50005 0 0 1 0.023437,-0.023437 0.50005,0.50005 0 0 1 0.00195,-0.00195 0.50005,0.50005 0 0 1 0.00586,-0.00391 0.50005,0.50005 0 0 1 0.00391,-0.00391 0.50005,0.50005 0 0 1 0.00195,-0.00195 0.50005,0.50005 0 0 1 0.015625,-0.011719 0.50005,0.50005 0 0 1 0.013672,-0.00977 0.50005,0.50005 0 0 1 0.039063,-0.023437 0.50005,0.50005 0 0 1 0.00391,-0.00195 0.50005,0.50005 0 0 1 0.00977,-0.00586 0.50005,0.50005 0 0 1 0.011719,-0.00586 0.50005,0.50005 0 0 1 0.019531,-0.00977 0.50005,0.50005 0 0 1 0.015625,-0.00586 0.50005,0.50005 0 0 1 0.03125,-0.011719 0.50005,0.50005 0 0 1 0.015625,-0.00391 0.50005,0.50005 0 0 1 0.03125,-0.00781 0.50005,0.50005 0 0 1 0.017578,-0.00391 0.50005,0.50005 0 0 1 0.048828,-0.00586 0.50005,0.50005 0 0 1 0.029297,-0.00195 z"
     id="path2" />
</svg>
