{
  "fontname": "Times-Mono",
  "height": 40,
  "data-date": "la date",
  "chars": [
    {
      "dec": "111",
      "width": "12",
      "d": "m 5.3333334,8 -2,1 L 2,11 1.3333333,14 v 2 L 2,19 l 1.3333334,2 2,1 h 1.3333333 l 2,-1 L 10,19 10.666667,16 V 14 L 10,11 8.6666667,9 l -2,-1 H 5.3333334"
    },
    {
      "dec": "83",
      "width": "12",
      "d": "M 10.2,1 V 7 L 9.6,4 8.4,2 6.6,1 H 4.8 L 3,2 1.8,4 v 3 l 1.2,2 1.2,1 3.6,1 1.2,1 0.6,1 0.6,2 v 3 L 9,21 7.2,22 H 5.4 L 3.6,21 2.4,19 1.8,16 v 6"
    },
    {
      "dec": "43",
      "width": "12",
      "d": "M 6,4 V 22 M 1.8461538,13 h 8.3076922"
    },
    {
      "dec": "81",
      "width": "12",
      "d": "M 5.4545455,1 3.8181818,2 2.7272728,4 2.1818182,6 1.6363636,10 v 3 l 0.5454546,4 0.5454546,2 1.090909,2 1.6363637,1 H 6.5454546 L 8.1818182,21 9.2727274,19 9.8181819,17 10.363636,13 V 10 L 9.8181819,6 9.2727274,4 8.1818182,2 6.5454546,1 H 5.4545455 M 3.8181818,21 V 19 L 4.3636364,17 5.4545455,16 H 6 l 1.0909091,1 0.5454546,2 m 0,0 0.5454545,3 0.5454546,2 0.5454546,1 h 0.5454545 l 0.5454541,-1"
    },
    {
      "dec": "86",
      "width": "12",
      "d": "M 1.8,1 6,22 M 10.2,1 6,22 M 0.6,1 h 3 m 4.8,0 h 3"
    },
    {
      "dec": "70",
      "width": "12",
      "d": "M 3.5294118,1 V 22 M 7.7647059,8 v 6 M 1.4117647,1 H 12 V 6 M 3.5294118,11 H 7.7647059 M 1.4117647,22 h 4.9411764"
    },
    {
      "dec": "50",
      "width": "12",
      "d": "M 1.8,6 H 2.4 V 7 L 1.8,6 V 5 L 2.4,3 3,2 4.8,1 H 7.2 L 9,2 9.6,3 10.2,5 v 2 l -0.6,2 -1.8,2 -3,2 -1.2,1 -1.2,2 -0.6,3 v 3 m 0,-2 0.6,-1 h 1.2 m 0,0 3,3 H 9 l 0.6,-1 0.6,-2 v -2"
    },
    {
      "dec": "180",
      "width": "12",
      "d": "M 9,2 3,7"
    },
    {
      "dec": "100",
      "width": "12",
      "d": "m 8.8421053,1 v 6 15 m 0,-11 L 7.5789474,9 6.3157895,8 H 4.4210526 L 3.1578947,9 1.8947368,11 1.2631579,14 v 2 l 0.6315789,3 1.2631579,2 1.2631579,1 H 6.3157895 L 7.5789474,21 8.8421053,19 M 6.9473684,1 h 1.8947369 m 0,21 h 1.8947367"
    },
    {
      "dec": "102",
      "width": "12",
      "d": "M 11,3 H 10 V 4 L 11,3 V 2 L 10,1 H 8 L 6,2 5,4 V 22 M 2,8 H 8 M 2,22 h 6"
    },
    {
      "dec": "121",
      "width": "12",
      "d": "m 2.6666667,8 4,14 M 10.666667,8 6.6666667,22 5.3333334,26 4,28 2.6666667,29 H 2 L 1.3333333,28 2,27 v 1 M 1.3333333,8 h 3.3333334 m 4,0 H 12"
    },
    {
      "dec": "93",
      "width": "12",
      "d": "m 8.5714286,-3 v 32 m -6,-32 h 6 m -6,32 h 6"
    },
    {
      "dec": "109",
      "width": "12",
      "d": "M 2,8 V 22 M 2,11 2.8,9 3.6,8 H 4.8 L 5.6,9 6,11 V 22 M 6,11 6.8,9 7.6,8 H 8.8 L 9.6,9 10,11 V 22 M 0.8,8 H 2 M 0.8,22 h 2.4 m 1.6,0 h 2.4 m 1.2,0 h 2.8"
    },
    {
      "dec": "45",
      "width": "12",
      "d": "M 1.3333333,14 H 10.666666"
    },
    {
      "dec": "184",
      "width": "12",
      "d": "M 4.8,26 H 7.2 L 9.6,25 7.2,24 H 4.8 l 4.8,-2"
    },
    {
      "dec": "120",
      "width": "12",
      "d": "m 2.5263158,8 6.9473685,14 m 0,-14 -6.9473685,14 M 1.2631579,8 H 4.4210526 M 7.5789474,8 H 10.736842 M 1.2631579,22 h 3.1578947 m 3.1578948,0 h 3.1578946"
    },
    {
      "dec": "71",
      "width": "12",
      "d": "M 9,1 V 7 L 8.5,4 7.5,2 6,1 H 5 L 3.5,2 2.5,4 2,6 1.5,9 v 5 l 0.5,3 0.5,2 1,2 1.5,1 H 6 L 7.5,21 9,18 m 0,-4 v 8 M 7.5,14 h 3"
    },
    {
      "dec": "65",
      "width": "12",
      "d": "M 6,1 1.8,22 M 6,1 10.2,22 M 3,16 h 6 m -8.4,6 h 3 m 4.8,0 h 3"
    },
    {
      "dec": "104",
      "width": "12",
      "d": "M 3,1 V 22 M 3,12 4.2,9 5.4,8 H 7.2 L 8.4,9 9,11 V 22 M 1.2,1 H 3 M 1.2,22 h 3.6 m 2.4,0 h 3.6"
    },
    {
      "dec": "60",
      "width": "12",
      "d": "m 10,4 -8,9 8,9"
    },
    {
      "dec": "49",
      "width": "12",
      "d": "M 3,5 4.5,4 6,1 v 21 m -3,0 h 6"
    },
    {
      "dec": "97",
      "width": "12",
      "d": "m 2.8235294,10 v 1 H 2.1176471 V 10 L 2.8235294,9 4.2352941,8 h 2.8235294 l 1.4117647,1 0.7058824,2 m 0,0 v 8 l 0.7058823,2 0.7058821,1 h 0.705883 M 9.1764706,13 7.7647059,14 H 3.5294118 l -1.4117647,1 -0.7058824,2 v 2 l 0.7058824,2 1.4117647,1 h 2.117647 l 2.1176471,-1 1.4117647,-2"
    },
    {
      "dec": "187",
      "width": "12",
      "d": "M 6,20 11.142857,14 6,8 M 0.85714286,20 6,14 0.85714286,8"
    },
    {
      "dec": "171",
      "width": "12",
      "d": "M 6,20 0.85714286,14 6,8 M 11.142857,20 6,14 11.142857,8"
    },
    {
      "dec": "79",
      "width": "12",
      "d": "M 5.4545455,1 3.8181818,2 2.7272728,4 2.1818182,6 1.6363636,10 v 3 l 0.5454546,4 0.5454546,2 1.090909,2 1.6363637,1 H 6.5454546 L 8.1818182,21 9.2727274,19 9.8181819,17 10.363636,13 V 10 L 9.8181819,6 9.2727274,4 8.1818182,2 6.5454546,1 H 5.4545455"
    },
    {
      "dec": "44",
      "width": "12",
      "d": "M 7.5,18 6,19 4.5,18 6,17 7.5,18 v 2 l -3,2"
    },
    {
      "dec": "66",
      "width": "12",
      "d": "M 2.8571429,1 V 22 M 1.1428571,1 H 7.4285714 L 9.1428571,2 9.7142857,3 10.285714,5 V 7 L 9.7142857,9 9.1428571,10 7.4285714,11 m -4.5714285,0 h 4.5714285 l 1.7142857,1 0.5714286,1 0.5714283,2 v 3 L 9.7142857,20 9.1428571,21 7.4285714,22 H 1.1428571"
    },
    {
      "dec": "101",
      "width": "12",
      "d": "m 1.5,14 h 9 V 12 L 9.75,10 9,9 7.5,8 H 5.25 l -1.5,1 -1.5,2 -0.75,3 v 2 l 0.75,3 1.5,2 1.5,1 H 7.5 L 9,21 10.5,19"
    },
    {
      "dec": "87",
      "width": "12",
      "d": "M 2,1 4,22 M 6,1 4,22 M 6,1 8,22 M 10,1 8,22 M 0.5,1 h 3 m 5,0 h 3"
    },
    {
      "dec": "85",
      "width": "12",
      "d": "m 2.6086957,1 v 15 l 0.5217391,3 1.0434782,2 1.0434783,1 H 6.7826087 L 7.826087,21 8.8695652,19 9.3913043,16 V 1 M 1.0434783,1 H 4.173913 m 3.652174,0 h 3.130435"
    },
    {
      "dec": "110",
      "width": "12",
      "d": "M 3,8 V 22 M 3,12 4.2,9 5.4,8 H 7.2 L 8.4,9 9,11 V 22 M 1.2,8 H 3 M 1.2,22 h 3.6 m 2.4,0 h 3.6"
    },
    {
      "dec": "119",
      "width": "12",
      "d": "M 2,8 4,22 M 6,8 4,22 M 6,8 8,22 M 10,8 8,22 M 0.5,8 h 3 m 5,0 h 3"
    },
    {
      "dec": "47",
      "width": "12",
      "d": "M 10.909091,-3 1.0909091,29"
    },
    {
      "dec": "125",
      "width": "12",
      "d": "M 4.2857143,-3 6,-2 6.8571429,-1 7.7142857,1 V 3 L 6.8571429,5 6,6 5.1428572,8 v 2 l 1.7142857,2 m 0,0 1.7142857,1 -1.7142857,1 m 0,0 -1.7142857,2 v 2 L 6,20 l 0.8571429,1 0.8571428,2 v 2 L 6.8571429,27 6,28 4.2857143,29"
    },
    {
      "dec": "55",
      "width": "12",
      "d": "m 1.3333333,1 v 6 m 0,-2 L 2,3 3.3333334,1 H 4.6666667 L 8,4 H 9.3333334 L 10,3 10.666667,1 m 0,0 V 4 L 10,7 7.3333334,12 6.6666667,14 6,17 v 5"
    },
    {
      "dec": "339",
      "width": "12",
      "d": "M 3.2,8 2,9 1.2,11 0.8,14 v 2 l 0.4,3 0.8,2 1.2,1 H 4 L 5.2,21 6,19 6.4,16 V 14 L 6,11 5.2,9 4,8 H 3.2 m 3.2,6 h 4.8 V 12 L 10.8,10 10.4,9 9.6,8 H 8.4 L 7.6,9 6.8,11 6.4,14 v 2 l 0.4,3 0.8,2 0.8,1 h 1.2 l 0.8,-1 0.8,-2"
    },
    {
      "dec": "62",
      "width": "12",
      "d": "m 2,4 8,9 -8,9"
    },
    {
      "dec": "95",
      "width": "12",
      "d": "M 0,28 H 12"
    },
    {
      "dec": "69",
      "width": "12",
      "d": "M 3.1578947,1 V 22 M 6.9473684,8 v 6 M 1.2631579,1 H 10.736842 V 5 M 3.1578947,11 H 6.9473684 M 1.2631579,22 h 9.4736841 v -4"
    },
    {
      "dec": "8212",
      "width": "12",
      "d": "M 0,14 H 12"
    },
    {
      "dec": "103",
      "width": "12",
      "d": "M 5.3333334,8 4,9 3.3333334,10 2.6666667,12 v 2 L 3.3333334,16 4,17 5.3333334,18 H 6.6666667 L 8,17 8.6666667,16 9.3333334,14 V 12 L 8.6666667,10 8,9 6.6666667,8 H 5.3333334 M 8.6666667,10 9.3333334,9 10.666667,8 V 9 H 10 M 3.3333334,16 2.6666667,17 2,19 v 1 m 0,0 0.6666667,1 2,1 H 8 l 2,1 0.666667,2 v 1 L 10,28 8,29 H 4 L 2,28 1.3333333,26 V 25 L 2,23 4,22"
    },
    {
      "dec": "33",
      "width": "12",
      "d": "M 6,1 V 15 M 6,20 4.8,21 6,22 7.2,21 6,20"
    },
    {
      "dec": "56",
      "width": "12",
      "d": "M 4.9411765,1 2.8235294,2 2.1176471,4 v 3 l 0.7058823,2 2.1176471,1 h 2.117647 L 9.1764706,9 9.8823529,7 V 4 L 9.1764706,2 7.0588235,1 h -2.117647 m 0,9 -2.1176471,1 -0.7058823,1 -0.7058824,2 v 4 l 0.7058824,2 0.7058823,1 2.1176471,1 h 2.117647 L 9.1764706,21 9.8823529,20 10.588235,18 V 14 L 9.8823529,12 9.1764706,11 7.0588235,10"
    },
    {
      "dec": "48",
      "width": "12",
      "d": "m 5.3333334,1 -2,1 L 2,5 1.3333333,10 v 3 L 2,18 l 1.3333334,3 2,1 h 1.3333333 l 2,-1 L 10,18 10.666667,13 V 10 L 10,5 8.6666667,2 l -2,-1 H 5.3333334"
    },
    {
      "dec": "90",
      "width": "12",
      "d": "M 10.2,1 1.8,22 M 1.8,5 V 1 h 8.4 M 1.8,22 h 8.4 v -4"
    },
    {
      "dec": "35",
      "width": "12",
      "d": "M 6,-3 2.1818182,29 M 9.2727274,-3 5.4545455,29 M 2.1818182,10 h 7.6363637 m -8.1818183,6 h 7.6363638"
    },
    {
      "dec": "61",
      "width": "12",
      "d": "M 1.8461538,10 H 10.153846 M 1.8461538,16 H 10.153846"
    },
    {
      "dec": "80",
      "width": "12",
      "d": "M 3,1 V 22 M 1.2,1 h 6 L 9,2 9.6,3 10.2,5 V 8 L 9.6,10 9,11 7.2,12 H 3 M 1.2,22 h 3.6"
    },
    {
      "dec": "169",
      "width": "12",
      "d": "m 4,10 0.5,-2 1,-1 h 1 l 1,1 1,3 v 5 l -1,3 -1,1 h -1 L 4.5,19 4,18 m 3,-15 1.5,1 1,2 0.5,2 0.5,4 v 3 L 10,19 9.5,21 8.5,23 7,24 H 5 L 3.5,23 2.5,21 2,19 1.5,15 V 12 L 2,8 2.5,6 3.5,4 5,3 h 2"
    },
    {
      "dec": "38",
      "width": "12",
      "d": "m 10.956522,10 h -0.521739 v 1 l 0.521739,-1 V 9 L 10.434783,8 H 9.9130435 L 9.3913043,9 8.8695652,11 7.826087,16 6.7826087,19 5.7391304,21 4.6956522,22 H 3.1304348 L 1.5652174,21 1.0434783,19 V 16 L 1.5652174,14 4.6956522,10 5.7391304,8 6.2608696,6 V 4 L 5.7391304,2 4.6956522,1 3.6521739,2 3.1304348,4 v 2 l 0.5217391,3 1.0434783,3 2.6086956,7 1.0434783,2 1.5652174,1 h 0.5217395 l 0.521739,-1 v -1"
    },
    {
      "dec": "115",
      "width": "12",
      "d": "m 9.3333334,9 v 3 L 8.6666667,10 8,9 6.6666667,8 H 4 L 2.6666667,9 2,10 v 2 L 2.6666667,13 4,14 l 3.3333334,1 1.3333333,1 0.6666667,1 v 3 L 8.6666667,21 7.3333334,22 H 4.6666667 L 3.3333334,21 2.6666667,20 2,18 v 4"
    },
    {
      "dec": "76",
      "width": "12",
      "d": "M 3.3333334,1 V 22 M 1.3333333,1 H 5.3333334 M 1.3333333,22 h 9.3333337 v -4"
    },
    {
      "dec": "46",
      "width": "12",
      "d": "M 6,17 4.5,18 6,19 7.5,18 6,17"
    },
    {
      "dec": "122",
      "width": "12",
      "d": "M 10.4,8 1.6,22 m 0,-12 V 8 h 8.8 M 1.6,22 h 8.8 v -2"
    },
    {
      "dec": "64",
      "width": "12",
      "d": "M 7.2857143,7 6.4285714,6 H 5.1428572 L 4.2857143,7 3.8571429,8 3.4285714,11 v 3 l 0.4285715,2 0.8571428,1 H 6 L 6.8571429,16 7.2857143,14 M 7.7142857,6 7.2857143,14 v 2 l 0.8571429,1 H 9 L 9.8571429,15 10.285714,12 V 10 L 9.8571429,7 9.4285715,5 8.5714286,3 7.7142857,2 6.4285714,1 H 5.1428572 L 3.8571429,2 3,3 2.1428571,5 1.7142857,7 1.2857143,10 v 3 L 1.7142857,16 2.1428571,18 3,20 3.8571429,21 5.1428572,22 H 6.4285714 L 7.7142857,21 8.5714286,20 9,19"
    },
    {
      "dec": "82",
      "width": "12",
      "d": "M 2.8571429,1 V 22 M 1.1428571,1 H 7.4285714 L 9.1428571,2 9.7142857,3 10.285714,5 V 7 L 9.7142857,9 9.1428571,10 7.4285714,11 H 2.8571429 M 1.1428571,22 h 3.4285715 m 1.1428571,-11 1.1428571,1 0.5714286,1 1.7142857,8 0.5714286,1 h 0.5714283 l 0.571429,-1 m 0,0 v -1"
    },
    {
      "dec": "94",
      "width": "12",
      "d": "M 6,5 1.5,11 M 6,5 l 4.5,6"
    },
    {
      "dec": "8208",
      "width": "12",
      "d": "M 1.8461538,14 H 10.153846"
    },
    {
      "dec": "8201",
      "width": "12",
      "d": "M 0,0"
    },
    {
      "dec": "8220",
      "width": "12",
      "d": "M 2.5714286,7 3.4285714,6 4.2857143,7 3.4285714,8 2.5714286,7 V 5 L 4.2857143,3 M 7.7142857,7 8.5714286,6 9.4285715,7 8.5714286,8 7.7142857,7 V 5 L 9.4285715,3"
    },
    {
      "dec": "37",
      "width": "12",
      "d": "m 10.5,1 -9,21 M 4,1 5,3 v 2 l -0.5,2 -1,1 h -1 L 1.5,6 V 4 L 2,2 3,1 H 4 L 5,2 6.5,3 H 8 l 1.5,-1 1,-1 m -2,14 -1,1 -0.5,2 v 2 l 1,2 h 1 l 1,-1 0.5,-2 v -2 l -1,-2 h -1"
    },
    {
      "dec": "68",
      "width": "12",
      "d": "M 2.8571429,1 V 22 M 1.1428571,1 H 6.2857143 L 8,2 9.1428571,4 9.7142857,6 10.285714,9 v 5 L 9.7142857,17 9.1428571,19 8,21 6.2857143,22 H 1.1428571"
    },
    {
      "dec": "36",
      "width": "12",
      "d": "M 4.8,-3 V 26 M 7.2,-3 v 29 m 3,-21 H 9.6 V 6 L 10.2,5 V 4 L 9,2 7.2,1 H 4.8 L 3,2 1.8,4 v 2 m 0,0 1.2,2 1.2,1 3.6,2 1.2,1 0.6,1 0.6,2 v 3 L 9,21 7.2,22 H 4.8 L 3,21 1.8,19 v -1 l 0.6,-1 v 1 H 1.8"
    },
    {
      "dec": "105",
      "width": "12",
      "d": "M 4.8,1 3.6,2 4.8,3 6,2 4.8,1 M 6,8 V 22 M 2.4,8 H 6 M 2.4,22 h 7.2"
    },
    {
      "dec": "75",
      "width": "12",
      "d": "M 3,1 V 22 M 10.8,1 3,14 m 2.4,-4 4.8,12 M 1.2,1 H 4.8 M 9,1 h 3 M 1.2,22 h 3.6 m 3.6,0 H 12"
    },
    {
      "dec": "51",
      "width": "12",
      "d": "m 1.8947368,6 h 0.631579 V 7 L 1.8947368,6 V 5 L 2.5263158,3 3.1578947,2 5.0526316,1 h 1.8947368 l 1.8947369,1 0.631579,2 V 7 L 8.8421053,9 6.9473684,10 H 5.6842105 m 1.2631579,0 1.263158,1 1.2631579,2 0.6315787,2 v 3 l -0.6315787,2 -0.631579,1 -1.8947369,1 H 5.0526316 L 3.1578947,21 2.5263158,20 1.8947368,18 v -1 l 0.631579,-1 v 1 h -0.631579"
    },
    {
      "dec": "34",
      "width": "12",
      "d": "M 3,1 V 8 M 9,1 v 7"
    },
    {
      "dec": "98",
      "width": "12",
      "d": "m 2.6666667,1 v 21 m 0,-11 L 4,9 5.3333334,8 h 2 L 8.6666667,9 10,11 l 0.666667,2 v 3 L 10,19 8.6666667,21 7.3333334,22 h -2 L 4,21 2.6666667,19 M 0.66666667,1 H 2.6666667"
    },
    {
      "dec": "96",
      "width": "12",
      "d": "M 3,2 9,7"
    },
    {
      "dec": "74",
      "width": "12",
      "d": "M 7.7142857,1 V 18 L 6.8571429,21 5.1428572,22 H 3.4285714 L 1.7142857,21 0.85714286,19 V 17 L 1.7142857,16 v 1 0 H 0.85714286 M 5.1428572,1 h 5.1428568"
    },
    {
      "dec": "58",
      "width": "12",
      "d": "M 6,10 4.5,11 6,12 7.5,11 6,10 M 6,17 4.5,18 6,19 7.5,18 6,17"
    },
    {
      "dec": "57",
      "width": "12",
      "d": "M 10.588235,8 9.8823529,11 8.4705882,13 6.3529411,14 H 5.6470588 L 3.5294118,13 2.1176471,11 1.4117647,8 V 7 L 2.1176471,4 3.5294118,2 5.6470588,1 h 0.7058823 l 2.1176471,1 1.4117647,2 0.7058821,3 v 6 L 9.8823529,17 9.1764706,19 7.7647059,21 6.3529411,22 H 4.2352941 L 2.8235294,21 2.1176471,19 v -1 l 0.7058823,-1 v 1 H 2.1176471"
    },
    {
      "dec": "73",
      "width": "12",
      "d": "M 6,1 V 22 M 2.4,1 H 9.6 M 2.4,22 h 7.2"
    },
    {
      "dec": "84",
      "width": "12",
      "d": "M 6,1 V 22 M 1.3333333,5 V 1 H 10.666667 V 5 M 4,22 h 4"
    },
    {
      "dec": "8211",
      "width": "12",
      "d": "M 1.7142857,14 H 10.285714"
    },
    {
      "dec": "108",
      "width": "12",
      "d": "M 6,1 V 22 M 2.4,1 H 6 M 2.4,22 h 7.2"
    },
    {
      "dec": "63",
      "width": "12",
      "d": "M 1.6,6 H 2.4 V 7 L 1.6,6 V 5 L 2.4,3 3.2,2 4.8,1 h 2.4 l 1.6,1 0.8,1 0.8,2 V 7 L 9.6,9 8.8,10 6.4,12 v 3 m 0,5 -0.8,1 0.8,1 0.8,-1 -0.8,-1"
    },
    {
      "dec": "8221",
      "width": "12",
      "d": "M 9.4285715,4 8.5714286,5 7.7142857,4 8.5714286,3 9.4285715,4 V 6 L 7.7142857,8 M 4.2857143,4 3.4285714,5 2.5714286,4 3.4285714,3 4.2857143,4 V 6 L 2.5714286,8"
    },
    {
      "dec": "338",
      "width": "12",
      "d": "M 3.8571429,1 2.5714286,2 1.7142857,4 1.2857143,6 0.85714286,10 v 3 l 0.42857144,4 0.4285714,2 0.8571429,2 1.2857143,1 h 0.8571428 m 0,-21 H 3.8571429 M 6,1 V 22 M 8.5714286,8 v 6 M 4.7142857,1 H 11.142857 V 7 M 6,11 H 8.5714286 M 4.7142857,22 h 6.4285713 v -5"
    },
    {
      "dec": "118",
      "width": "12",
      "d": "M 2,8 6,22 M 10,8 6,22 M 0.66666667,8 H 4 m 4,0 h 3.333333"
    },
    {
      "dec": "126",
      "width": "12",
      "d": "M 1.5,16 V 14 L 2,11 3,10 h 1 l 1,1 2,3 1,1 h 1 l 1,-1 0.5,-2 m 0,0 v -2"
    },
    {
      "dec": "42",
      "width": "12",
      "d": "m 6,7 v 12 m -3.75,-9 7.5,6 m 0,-6 -7.5,6"
    },
    {
      "dec": "106",
      "width": "12",
      "d": "M 7.2,1 6,2 7.2,3 8.4,2 7.2,1 M 8.4,8 V 26 L 7.2,28 4.8,29 H 2.4 L 1.2,28 v -1 l 1.2,-1 v 1 H 1.2 M 3.6,8 h 4.8"
    },
    {
      "dec": "91",
      "width": "12",
      "d": "m 3.4285714,-3 v 32 m 0,-32 H 9.4285715 M 3.4285714,29 h 6.0000001"
    },
    {
      "dec": "8230",
      "width": "12",
      "d": "M 9.4285715,17 8.5714286,18 9.4285715,19 10.285714,18 9.4285715,17 M 6,17 5.1428572,18 6,19 6.8571429,18 6,17 m -3.4285714,0 -0.8571429,1 0.8571429,1 0.8571428,-1 -0.8571428,-1"
    },
    {
      "dec": "112",
      "width": "12",
      "d": "m 3.1578947,8 v 21 m 0,-18 1.2631579,-2 1.2631579,-1 h 1.8947369 l 1.2631579,1 1.2631577,2 0.631579,2 v 3 l -0.631579,3 -1.2631577,2 -1.2631579,1 H 5.6842105 L 4.4210526,21 3.1578947,19 M 1.2631579,8 H 3.1578947 M 1.2631579,29 h 3.7894737"
    },
    {
      "dec": "41",
      "width": "12",
      "d": "M 2.5714286,-3 4.2857143,-1 6,2 7.7142857,6 8.5714286,11 v 4 L 7.7142857,20 6,24 4.2857143,27 2.5714286,29"
    },
    {
      "dec": "78",
      "width": "12",
      "d": "m 2.7272728,1 v 21 m 0,-21 6.5454546,21 m 0,-21 V 22 M 1.0909091,1 H 2.7272728 M 7.6363637,1 H 10.909091 M 1.0909091,22 h 3.2727273"
    },
    {
      "dec": "59",
      "width": "12",
      "d": "M 6,10 4.5,11 6,12 7.5,11 6,10 M 7.5,18 6,19 4.5,18 6,17 7.5,18 v 2 l -3,2"
    },
    {
      "dec": "168",
      "width": "12",
      "d": "M 3.2,3 2.4,4 3.2,5 4,4 Z M 8.8,3 8,4 8.8,5 9.6,4 Z"
    },
    {
      "dec": "88",
      "width": "12",
      "d": "m 1.8,1 8.4,21 M 10.2,1 1.8,22 M 0.6,1 h 3 m 4.8,0 h 3 M 0.6,22 h 3 m 4.8,0 h 3"
    },
    {
      "dec": "8216",
      "width": "12",
      "d": "M 5.1428571,7 6.8571428,6 8.5714285,7 6.8571428,8 5.1428571,7 V 5 L 8.5714285,3"
    },
    {
      "dec": "89",
      "width": "12",
      "d": "M 1.8,1 6,12 V 22 M 10.2,1 6,12 M 0.6,1 h 3 m 4.8,0 h 3 M 4.2,22 h 3.6"
    },
    {
      "dec": "114",
      "width": "12",
      "d": "m 3.75,8 v 14 m 0,-8 L 4.5,11 6,9 7.5,8 h 2.25 l 0.75,1 v 1 l -0.75,1 v -1 0 M 1.5,8 H 3.75 M 1.5,22 H 6"
    },
    {
      "dec": "116",
      "width": "12",
      "d": "m 4.2857143,1 v 17 l 0.8571429,3 1.7142857,1 H 8.5714286 L 10.285714,21 M 1.7142857,8 h 6"
    },
    {
      "dec": "54",
      "width": "12",
      "d": "M 9.6,5 H 9 V 6 L 9.6,5 V 4 L 9,2 7.8,1 H 6 L 4.2,2 3,4 2.4,6 1.8,10 v 6 l 0.6,3 1.2,2 1.8,1 h 1.2 l 1.8,-1 1.2,-2 0.6,-3 V 15 L 9.6,12 8.4,10 7.2,9 H 5.4 L 4.2,10 3,12 1.8,16 v 0"
    },
    {
      "dec": "117",
      "width": "12",
      "d": "m 2.8571429,8 v 11 l 0.5714285,2 1.1428572,1 H 6.2857143 L 8,21 9.1428571,19 m 0,-11 v 14 m -8,-14 h 1.7142858 m 3.9999999,0 h 2.2857143 m 0,14 h 1.7142859"
    },
    {
      "dec": "124",
      "width": "12",
      "d": "M 6,-3 V 29"
    },
    {
      "dec": "77",
      "width": "12",
      "d": "M 2.5,1 V 22 M 2.5,1 6,22 M 9.5,1 6,22 M 9.5,1 V 22 M 1,1 h 1.5 m 7,0 H 11 M 1,22 h 3 m 4,0 h 3"
    },
    {
      "dec": "123",
      "width": "12",
      "d": "M 7.7142857,-3 6,-2 5.1428572,-1 4.2857143,1 V 3 L 5.1428572,5 6,6 6.8571429,8 v 2 l -1.7142857,2 m 0,0 -1.7142858,1 1.7142858,1 m 0,0 1.7142857,2 v 2 L 6,20 5.1428572,21 4.2857143,23 v 2 L 5.1428572,27 6,28 7.7142857,29"
    },
    {
      "dec": "72",
      "width": "12",
      "d": "M 2.6086957,1 V 22 M 9.3913043,1 V 22 M 1.0434783,1 H 4.173913 m 3.652174,0 h 3.130435 M 2.6086957,11 H 9.3913043 M 1.0434783,22 H 4.173913 m 3.652174,0 h 3.130435"
    },
    {
      "dec": "53",
      "width": "12",
      "d": "M 2.6666667,1 1.3333333,11 m 0,0 1.3333334,-2 2,-1 h 2 l 2,1 L 10,11 l 0.666667,3 v 2 L 10,19 l -1.3333333,2 -2,1 h -2 l -2,-1 L 2,20 1.3333333,18 V 17 L 2,16 v 1 H 1.3333333 M 2.6666667,1 h 6.6666667"
    },
    {
      "dec": "52",
      "width": "12",
      "d": "m 7.2,1 v 21 m 0,-21 -6,15 h 9 M 5.4,22 H 9"
    },
    {
      "dec": "8217",
      "width": "12",
      "d": "M 8.5714285,4 6.8571428,5 5.1428571,4 6.8571428,3 8.5714285,4 V 6 L 5.1428571,8"
    },
    {
      "dec": "40",
      "width": "12",
      "d": "M 9.4285715,-3 7.7142857,-1 6,2 4.2857143,6 3.4285714,11 v 4 L 4.2857143,20 6,24 l 1.7142857,3 1.7142858,2"
    },
    {
      "dec": "99",
      "width": "12",
      "d": "M 10,12 H 8.6666667 L 9.3333334,13 10,12 V 11 L 8.6666667,9 7.3333334,8 h -2 L 4,9 2.6666667,11 2,14 v 2 L 2.6666667,19 4,21 5.3333334,22 h 2 L 8.6666667,21 10,19"
    },
    {
      "dec": "127",
      "width": "12",
      "d": "M 0,1 V 22 H 0.75 V 1 H 1.5 V 22 H 2.25 V 1 H 3 V 22 H 3.75 V 1 H 4.5 V 22 H 5.25 V 1 H 6 V 22 H 6.75 V 1 H 7.5 V 22 H 8.25 V 1 H 9 V 22 H 9.75 V 1 h 0.75 v 21 h 0.75 V 1 H 12 v 21"
    },
    {
      "dec": "39",
      "width": "12",
      "d": "M 6,1 V 6"
    },
    {
      "dec": "92",
      "width": "12",
      "d": "M 0,1 12,25"
    },
    {
      "dec": "107",
      "width": "12",
      "d": "M 3,1 V 22 M 9,8 3,18 M 5.4,14 9,22 M 1.2,1 H 3 m 4.2,7 h 3.6 M 1.2,22 h 3.6 m 2.4,0 h 3.6"
    },
    {
      "dec": "113",
      "width": "12",
      "d": "m 8.8421053,8 v 21 m 0,-18 L 7.5789474,9 6.3157895,8 H 4.4210526 L 3.1578947,9 1.8947368,11 1.2631579,14 v 2 l 0.6315789,3 1.2631579,2 1.2631579,1 H 6.3157895 L 7.5789474,21 8.8421053,19 M 6.9473684,29 h 3.7894736"
    },
    {
      "dec": "67",
      "width": "12",
      "d": "M 10.8,1 V 7 L 10.2,4 9,2 7.2,1 H 6 L 4.2,2 3,4 2.4,6 1.8,9 v 5 l 0.6,3 0.6,2 1.2,2 1.8,1 h 1.2 l 1.8,-1 1.2,-2 0.6,-2"
    }
  ]
}