<?xml version="1.0" encoding="UTF-8" standalone="no"?>
<svg
   xmlns:dc="http://purl.org/dc/elements/1.1/"
   xmlns:cc="http://creativecommons.org/ns#"
   xmlns:rdf="http://www.w3.org/1999/02/22-rdf-syntax-ns#"
   xmlns:svg="http://www.w3.org/2000/svg"
   xmlns="http://www.w3.org/2000/svg"
   xmlns:sodipodi="http://sodipodi.sourceforge.net/DTD/sodipodi-0.dtd"
   xmlns:inkscape="http://www.inkscape.org/namespaces/inkscape"
   data-dec="40"
   width="16"
   height="40"
   version="1.1"
   id="svg4"
   sodipodi:docname="40.svg"
   inkscape:version="0.92.4 (unknown)">
  <metadata
     id="metadata10">
    <rdf:RDF>
      <cc:Work
         rdf:about="">
        <dc:format>image/svg+xml</dc:format>
        <dc:type
           rdf:resource="http://purl.org/dc/dcmitype/StillImage" />
      </cc:Work>
    </rdf:RDF>
  </metadata>
  <defs
     id="defs8" />
  <sodipodi:namedview
     pagecolor="#ffffff"
     bordercolor="#666666"
     borderopacity="1"
     objecttolerance="10"
     gridtolerance="10"
     guidetolerance="10"
     inkscape:pageopacity="0"
     inkscape:pageshadow="2"
     inkscape:window-width="640"
     inkscape:window-height="480"
     id="namedview6"
     showgrid="false"
     inkscape:zoom="5.9"
     inkscape:cx="8"
     inkscape:cy="20"
     inkscape:window-x="0"
     inkscape:window-y="27"
     inkscape:window-maximized="0"
     inkscape:current-layer="svg4" />
  <path
     style="color:#000000;font-style:normal;font-variant:normal;font-weight:normal;font-stretch:normal;font-size:medium;line-height:normal;font-family:sans-serif;font-variant-ligatures:normal;font-variant-position:normal;font-variant-caps:normal;font-variant-numeric:normal;font-variant-alternates:normal;font-feature-settings:normal;text-indent:0;text-align:start;text-decoration:none;text-decoration-line:none;text-decoration-style:solid;text-decoration-color:#000000;letter-spacing:normal;word-spacing:normal;text-transform:none;writing-mode:lr-tb;direction:ltr;text-orientation:mixed;dominant-baseline:auto;baseline-shift:baseline;text-anchor:start;white-space:normal;shape-padding:0;clip-rule:nonzero;display:inline;overflow:visible;visibility:visible;opacity:1;isolation:auto;mix-blend-mode:normal;color-interpolation:sRGB;color-interpolation-filters:linearRGB;solid-color:#000000;solid-opacity:1;vector-effect:none;fill:#013272;fill-opacity:1;fill-rule:nonzero;stroke:none;stroke-width:0.5;stroke-linecap:round;stroke-linejoin:round;stroke-miterlimit:4;stroke-dasharray:none;stroke-dashoffset:0;stroke-opacity:1;color-rendering:auto;image-rendering:auto;shape-rendering:auto;text-rendering:auto;enable-background:accumulate"
     d="M 8.6914062,2.6621094 8.1933594,3.1601562 6.2167969,6.125 4.2382812,10.082031 3.25,15.025391 v 3.949218 l 0.9921875,4.960938 0.2226563,0.666015 -0.7109376,-3.552734 A 0.250025,0.250025 0 0 1 3.75,21 v -5 a 0.250025,0.250025 0 0 1 0.00391,-0.04883 l 1,-5 a 0.250025,0.250025 0 0 1 0.00977,-0.0293 l 1,-3 a 0.250025,0.250025 0 0 1 0.013672,-0.033203 l 2,-4 a 0.250025,0.250025 0 0 1 0.023437,-0.039063 z m 6.3144528,-5.9160156 a 0.250025,0.250025 0 0 1 0.144532,0.453125 L 11.177734,0.1796875 8.2128906,4.1328125 6.2324219,8.0957031 5.2421875,11.064453 4.25,16.025391 v 4.949218 l 0.9921875,4.960938 0.9882813,2.96875 a 0.250025,0.250025 0 0 1 0.011719,0.0332 0.250025,0.250025 0 0 1 0.00391,0.01367 0.250025,0.250025 0 0 1 0.00195,0.01172 0.250025,0.250025 0 0 1 0.00195,0.01367 0.250025,0.250025 0 0 1 0,0.0098 0.250025,0.250025 0 0 1 0.00195,0.01563 0.250025,0.250025 0 0 1 0,0.0098 0.250025,0.250025 0 0 1 -0.00195,0.01367 0.250025,0.250025 0 0 1 -0.00195,0.01172 0.250025,0.250025 0 0 1 -0.00195,0.01367 0.250025,0.250025 0 0 1 -0.00195,0.0098 0.250025,0.250025 0 0 1 -0.00391,0.01367 0.250025,0.250025 0 0 1 -0.00781,0.02539 0.250025,0.250025 0 0 1 -0.00391,0.0098 0.250025,0.250025 0 0 1 -0.00586,0.01172 0.250025,0.250025 0 0 1 -0.00586,0.0098 0.250025,0.250025 0 0 1 -0.00781,0.01172 0.250025,0.250025 0 0 1 -0.015625,0.01953 0.250025,0.250025 0 0 1 -0.00586,0.0078 0.250025,0.250025 0 0 1 -0.011719,0.01367 0.250025,0.250025 0 0 1 -0.00586,0.0059 0.250025,0.250025 0 0 1 -0.011719,0.0078 0.250025,0.250025 0 0 1 -0.00781,0.0078 0.250025,0.250025 0 0 1 -0.015625,0.0098 0.250025,0.250025 0 0 1 -0.00586,0.0039 0.250025,0.250025 0 0 1 -0.033203,0.01563 0.250025,0.250025 0 0 1 -0.00195,0.002 0.250025,0.250025 0 0 1 -0.017578,0.0059 0.250025,0.250025 0 0 1 -0.033203,0.0078 0.250025,0.250025 0 0 1 -0.033203,0.0039 0.250025,0.250025 0 0 1 -0.025391,-0.002 0.250025,0.250025 0 0 1 -0.023437,-0.002 0.250025,0.250025 0 0 1 -0.013672,-0.002 0.250025,0.250025 0 0 1 -0.011719,-0.0039 0.250025,0.250025 0 0 1 -0.013672,-0.0039 0.250025,0.250025 0 0 1 -0.00977,-0.0039 0.250025,0.250025 0 0 1 -0.013672,-0.0059 0.250025,0.250025 0 0 1 -0.00977,-0.0039 0.250025,0.250025 0 0 1 -0.00586,-0.0039 0.250025,0.250025 0 0 1 -0.011719,-0.0059 0.250025,0.250025 0 0 1 -0.00977,-0.0059 0.250025,0.250025 0 0 1 -0.00977,-0.0078 0.250025,0.250025 0 0 1 -0.015625,-0.01172 0.250025,0.250025 0 0 1 -0.00781,-0.0078 0.250025,0.250025 0 0 1 -0.00977,-0.0098 0.250025,0.250025 0 0 1 -0.00781,-0.0078 0.250025,0.250025 0 0 1 -0.00781,-0.01172 0.250025,0.250025 0 0 1 -0.025391,-0.04297 l -0.00586,-0.0098 a 0.250025,0.250025 0 0 1 -0.00195,-0.0059 L 4.7773438,27.111328 a 0.250025,0.250025 0 0 1 -0.013672,-0.0332 l -1,-3 a 0.250025,0.250025 0 0 1 -0.00977,-0.0293 l -1,-5 A 0.250025,0.250025 0 0 1 2.75,19 v -4 a 0.250025,0.250025 0 0 1 0.00391,-0.04883 l 1,-5.0000001 a 0.250025,0.250025 0 0 1 0.023438,-0.0625 l 2,-4 a 0.250025,0.250025 0 0 1 0.013672,-0.027344 l 2,-3 a 0.250025,0.250025 0 0 1 0.03125,-0.039063 l 2.9882814,-2.9863281 a 0.250025,0.250025 0 0 1 0.01172,-0.0136719 0.250025,0.250025 0 0 1 0.0059,-0.003906 0.250025,0.250025 0 0 1 0.002,-0.001953 0.250025,0.250025 0 0 1 0.03711,-0.0292969 0.250025,0.250025 0 0 1 0.002,-0.001953 l 3.980468,-2.98437505 a 0.250025,0.250025 0 0 1 0.13086,-0.052734 0.250025,0.250025 0 0 1 0.02539,-0.00195 z"
     id="path2" />
</svg>
