<?xml version="1.0" encoding="UTF-8" standalone="no"?>
<svg
   xmlns:dc="http://purl.org/dc/elements/1.1/"
   xmlns:cc="http://creativecommons.org/ns#"
   xmlns:rdf="http://www.w3.org/1999/02/22-rdf-syntax-ns#"
   xmlns:svg="http://www.w3.org/2000/svg"
   xmlns="http://www.w3.org/2000/svg"
   xmlns:sodipodi="http://sodipodi.sourceforge.net/DTD/sodipodi-0.dtd"
   xmlns:inkscape="http://www.inkscape.org/namespaces/inkscape"
   data-dec="97"
   width="17"
   height="40"
   version="1.1"
   id="svg4"
   sodipodi:docname="97.svg"
   inkscape:version="0.92.4 (unknown)">
  <metadata
     id="metadata10">
    <rdf:RDF>
      <cc:Work
         rdf:about="">
        <dc:format>image/svg+xml</dc:format>
        <dc:type
           rdf:resource="http://purl.org/dc/dcmitype/StillImage" />
      </cc:Work>
    </rdf:RDF>
  </metadata>
  <defs
     id="defs8" />
  <sodipodi:namedview
     pagecolor="#ffffff"
     bordercolor="#666666"
     borderopacity="1"
     objecttolerance="10"
     gridtolerance="10"
     guidetolerance="10"
     inkscape:pageopacity="0"
     inkscape:pageshadow="2"
     inkscape:window-width="640"
     inkscape:window-height="480"
     id="namedview6"
     showgrid="false"
     inkscape:zoom="5.9"
     inkscape:cx="8.5"
     inkscape:cy="20"
     inkscape:window-x="0"
     inkscape:window-y="27"
     inkscape:window-maximized="0"
     inkscape:current-layer="svg4" />
  <path
     style="color:#000000;font-style:normal;font-variant:normal;font-weight:normal;font-stretch:normal;font-size:medium;line-height:normal;font-family:sans-serif;font-variant-ligatures:normal;font-variant-position:normal;font-variant-caps:normal;font-variant-numeric:normal;font-variant-alternates:normal;font-feature-settings:normal;text-indent:0;text-align:start;text-decoration:none;text-decoration-line:none;text-decoration-style:solid;text-decoration-color:#000000;letter-spacing:normal;word-spacing:normal;text-transform:none;writing-mode:lr-tb;direction:ltr;text-orientation:mixed;dominant-baseline:auto;baseline-shift:baseline;text-anchor:start;white-space:normal;shape-padding:0;clip-rule:nonzero;display:inline;overflow:visible;visibility:visible;opacity:1;isolation:auto;mix-blend-mode:normal;color-interpolation:sRGB;color-interpolation-filters:linearRGB;solid-color:#000000;solid-opacity:1;vector-effect:none;fill:#000000;fill-opacity:1;fill-rule:nonzero;stroke:none;stroke-width:1.5;stroke-linecap:round;stroke-linejoin:round;stroke-miterlimit:4;stroke-dasharray:none;stroke-dashoffset:0;stroke-opacity:1;color-rendering:auto;image-rendering:auto;shape-rendering:auto;text-rendering:auto;enable-background:accumulate"
     d="M 10.25,13.916016 6.3710938,14.691406 4.6171875,16.443359 3.75,18.177734 v 1.644532 L 4.4628906,21.25 h 2.359375 L 8.5566406,20.382812 10.25,18.6875 Z M 10.011719,7.2402344 a 0.750075,0.750075 0 0 1 0.519531,0.2285156 0.750075,0.750075 0 0 1 0.01367,0.011719 l 0.0098,0.011719 0.976562,0.9765625 1,1 A 0.750075,0.750075 0 0 1 12.75,10 v 2 7 1.689453 l 0.398438,0.398438 1.515624,-0.757813 a 0.750075,0.750075 0 1 1 0.671876,1.339844 l -1.888672,0.943359 a 0.750075,0.750075 0 0 1 -0.835938,0.03125 L 10.664062,21.669922 A 0.750075,0.750075 0 0 1 10.25,21 v -0.1875 l -0.71875,0.71875 a 0.750075,0.750075 0 0 1 -0.1953125,0.138672 l -2,1 A 0.750075,0.750075 0 0 1 7,22.75 H 4.1230469 A 0.750075,0.750075 0 0 1 3.46875,22.53125 l -0.013672,-0.01172 a 0.750075,0.750075 0 0 1 -0.00977,-0.01172 L 1.46875,20.53125 A 0.750075,0.750075 0 0 1 1.25,20 v -2 a 0.750075,0.750075 0 0 1 0.080078,-0.335938 l 1,-2 A 0.750075,0.750075 0 0 1 2.5839844,15.375 l 2.9824218,-1.988281 a 0.750075,0.750075 0 0 1 0.017578,-0.01172 0.750075,0.750075 0 0 1 0.00195,-0.002 0.750075,0.750075 0 0 1 0.359375,-0.126953 L 10.25,12.384766 V 10.177734 L 9.5371094,8.75 H 7.1777344 L 5.6132812,9.53125 v 0.00195 L 4.7109375,12.236328 A 0.750075,0.750075 0 0 1 4,12.75 H 3 A 0.750075,0.750075 0 0 1 2.25,12 v -1 a 0.750075,0.750075 0 0 1 0.21875,-0.53125 l 2,-2 a 0.750075,0.750075 0 0 1 0.011719,-0.00977 0.750075,0.750075 0 0 1 0.1835937,-0.1289063 l 2,-1 a 0.750075,0.750075 0 0 1 0.042969,-0.021484 0.750075,0.750075 0 0 1 0.00586,-0.00195 0.750075,0.750075 0 0 1 0.066406,-0.023437 A 0.750075,0.750075 0 0 1 7.0898438,7.25 h 2.7871093 a 0.750075,0.750075 0 0 1 0.1347659,-0.00977 z"
     id="path2" />
</svg>
