<?xml version="1.0" encoding="UTF-8" standalone="no"?>
<svg
   xmlns:dc="http://purl.org/dc/elements/1.1/"
   xmlns:cc="http://creativecommons.org/ns#"
   xmlns:rdf="http://www.w3.org/1999/02/22-rdf-syntax-ns#"
   xmlns:svg="http://www.w3.org/2000/svg"
   xmlns="http://www.w3.org/2000/svg"
   xmlns:sodipodi="http://sodipodi.sourceforge.net/DTD/sodipodi-0.dtd"
   xmlns:inkscape="http://www.inkscape.org/namespaces/inkscape"
   data-dec="8220"
   width="15"
   height="40"
   version="1.1"
   id="svg4"
   sodipodi:docname="8220.svg"
   inkscape:version="0.92.4 (unknown)">
  <metadata
     id="metadata10">
    <rdf:RDF>
      <cc:Work
         rdf:about="">
        <dc:format>image/svg+xml</dc:format>
        <dc:type
           rdf:resource="http://purl.org/dc/dcmitype/StillImage" />
      </cc:Work>
    </rdf:RDF>
  </metadata>
  <defs
     id="defs8" />
  <sodipodi:namedview
     pagecolor="#ffffff"
     bordercolor="#666666"
     borderopacity="1"
     objecttolerance="10"
     gridtolerance="10"
     guidetolerance="10"
     inkscape:pageopacity="0"
     inkscape:pageshadow="2"
     inkscape:window-width="640"
     inkscape:window-height="480"
     id="namedview6"
     showgrid="false"
     inkscape:zoom="5.9"
     inkscape:cx="7.5"
     inkscape:cy="20"
     inkscape:window-x="0"
     inkscape:window-y="27"
     inkscape:window-maximized="0"
     inkscape:current-layer="svg4" />
  <path
     style="color:#000000;font-style:normal;font-variant:normal;font-weight:normal;font-stretch:normal;font-size:medium;line-height:normal;font-family:sans-serif;font-variant-ligatures:normal;font-variant-position:normal;font-variant-caps:normal;font-variant-numeric:normal;font-variant-alternates:normal;font-feature-settings:normal;text-indent:0;text-align:start;text-decoration:none;text-decoration-line:none;text-decoration-style:solid;text-decoration-color:#000000;letter-spacing:normal;word-spacing:normal;text-transform:none;writing-mode:lr-tb;direction:ltr;text-orientation:mixed;dominant-baseline:auto;baseline-shift:baseline;text-anchor:start;white-space:normal;shape-padding:0;clip-rule:nonzero;display:inline;overflow:visible;visibility:visible;opacity:1;isolation:auto;mix-blend-mode:normal;color-interpolation:sRGB;color-interpolation-filters:linearRGB;solid-color:#000000;solid-opacity:1;vector-effect:none;fill:#000000;fill-opacity:1;fill-rule:nonzero;stroke:none;stroke-width:2;stroke-linecap:round;stroke-linejoin:round;stroke-miterlimit:4;stroke-dasharray:none;stroke-dashoffset:0;stroke-opacity:1;color-rendering:auto;image-rendering:auto;shape-rendering:auto;text-rendering:auto;enable-background:accumulate"
     d="m 12.003906,-0.00585938 a 1.0001,1.0001 0 0 1 0.44336,1.90039058 L 10.859375,2.6894531 10.53125,4 H 11 a 1.0001,1.0001 0 0 1 0.707031,0.2929688 l 1,1 A 1.0001,1.0001 0 0 1 13,6 v 1 a 1.0001,1.0001 0 0 1 -0.292969,0.7070312 l -1,1 A 1.0001,1.0001 0 0 1 11,9 H 10 A 1.0001,1.0001 0 0 1 9.2929688,8.7070312 l -1,-1 A 1.0001,1.0001 0 0 1 8,7 V 6.1464844 A 1.0001,1.0001 0 0 1 8,5.8730469 V 4.1308594 a 1.0001,1.0001 0 0 1 0.1757812,-0.71875 L 9.078125,1.609375 A 1.0001,1.0001 0 0 1 9.6835938,1.0410156 L 11.552734,0.10546875 a 1.0001,1.0001 0 0 1 0.451172,-0.11132813 z m -5.9999998,0 A 1.0001,1.0001 0 0 1 6.4472656,1.8945312 L 4.859375,2.6894531 4.53125,4 H 5 a 1.0001,1.0001 0 0 1 0.7070312,0.2929688 l 1,1 A 1.0001,1.0001 0 0 1 7,6 V 7 A 1.0001,1.0001 0 0 1 6.7070312,7.7070312 l -1,1 A 1.0001,1.0001 0 0 1 5,9 H 4 A 1.0001,1.0001 0 0 1 3.2929688,8.7070312 l -1,-1 A 1.0001,1.0001 0 0 1 2,7 V 6.1464844 A 1.0001,1.0001 0 0 1 2,5.8730469 V 4.1308594 a 1.0001,1.0001 0 0 1 0.1757812,-0.71875 L 3.078125,1.609375 A 1.0001,1.0001 0 0 1 3.6835938,1.0410156 L 5.5527344,0.10546875 a 1.0001,1.0001 0 0 1 0.4511718,-0.11132813 z"
     id="path2" />
</svg>
