<?xml version="1.0" encoding="UTF-8" standalone="no"?>
<svg
   xmlns:dc="http://purl.org/dc/elements/1.1/"
   xmlns:cc="http://creativecommons.org/ns#"
   xmlns:rdf="http://www.w3.org/1999/02/22-rdf-syntax-ns#"
   xmlns:svg="http://www.w3.org/2000/svg"
   xmlns="http://www.w3.org/2000/svg"
   xmlns:sodipodi="http://sodipodi.sourceforge.net/DTD/sodipodi-0.dtd"
   xmlns:inkscape="http://www.inkscape.org/namespaces/inkscape"
   data-dec="47"
   width="24"
   height="40"
   version="1.1"
   id="svg4"
   sodipodi:docname="47.svg"
   inkscape:version="0.92.4 5da689c313, 2019-01-14">
  <metadata
     id="metadata10">
    <rdf:RDF>
      <cc:Work
         rdf:about="">
        <dc:format>image/svg+xml</dc:format>
        <dc:type
           rdf:resource="http://purl.org/dc/dcmitype/StillImage" />
        <dc:title></dc:title>
      </cc:Work>
    </rdf:RDF>
  </metadata>
  <defs
     id="defs8" />
  <sodipodi:namedview
     pagecolor="#ffffff"
     bordercolor="#666666"
     borderopacity="1"
     objecttolerance="10"
     gridtolerance="10"
     guidetolerance="10"
     inkscape:pageopacity="0"
     inkscape:pageshadow="2"
     inkscape:window-width="1920"
     inkscape:window-height="1043"
     id="namedview6"
     showgrid="false"
     inkscape:zoom="5.9"
     inkscape:cx="12"
     inkscape:cy="20"
     inkscape:window-x="0"
     inkscape:window-y="37"
     inkscape:window-maximized="0"
     inkscape:current-layer="svg4" />
  <path
     style="color:#000000;font-style:normal;font-variant:normal;font-weight:normal;font-stretch:normal;font-size:medium;line-height:normal;font-family:sans-serif;font-variant-ligatures:normal;font-variant-position:normal;font-variant-caps:normal;font-variant-numeric:normal;font-variant-alternates:normal;font-feature-settings:normal;text-indent:0;text-align:start;text-decoration:none;text-decoration-line:none;text-decoration-style:solid;text-decoration-color:#000000;letter-spacing:normal;word-spacing:normal;text-transform:none;writing-mode:lr-tb;direction:ltr;text-orientation:mixed;dominant-baseline:auto;baseline-shift:baseline;text-anchor:start;white-space:normal;shape-padding:0;clip-rule:nonzero;display:inline;overflow:visible;visibility:visible;opacity:1;isolation:auto;mix-blend-mode:normal;color-interpolation:sRGB;color-interpolation-filters:linearRGB;solid-color:#000000;solid-opacity:1;vector-effect:none;fill:#000000;fill-opacity:1;fill-rule:nonzero;stroke:none;stroke-width:0.5;stroke-linecap:round;stroke-linejoin:round;stroke-miterlimit:4;stroke-dasharray:none;stroke-dashoffset:0;stroke-opacity:1;color-rendering:auto;image-rendering:auto;shape-rendering:auto;text-rendering:auto;enable-background:accumulate"
     d="M 20.146484,-2.75 2.4277344,28.75 H 2.8535156 L 20.572266,-2.75 Z M 20.001953,-3.2539062 A 0.250025,0.250025 0 0 1 20.039062,-3.25 H 21 a 0.250025,0.250025 0 0 1 0.21875,0.3730469 L 3.234375,29.09375 a 0.250025,0.250025 0 0 1 -0.00195,0.0059 0.250025,0.250025 0 0 1 -0.037109,0.05859 0.250025,0.250025 0 0 1 -0.015625,0.01758 0.250025,0.250025 0 0 1 -0.050781,0.04102 0.250025,0.250025 0 0 1 -0.021484,0.0098 0.250025,0.250025 0 0 1 -0.019531,0.0098 0.250025,0.250025 0 0 1 -0.013672,0.0039 A 0.250025,0.250025 0 0 1 2.9609375,29.25 H 2 A 0.250025,0.250025 0 0 1 1.78125,28.876953 L 19.765625,-3.09375 a 0.250025,0.250025 0 0 1 0.002,-0.00586 0.250025,0.250025 0 0 1 0.03711,-0.058594 0.250025,0.250025 0 0 1 0.01758,-0.019531 0.250025,0.250025 0 0 1 0.01563,-0.015625 0.250025,0.250025 0 0 1 0.0332,-0.023437 0.250025,0.250025 0 0 1 0.0078,-0.00391 0.250025,0.250025 0 0 1 0.002,-0.00195 0.250025,0.250025 0 0 1 0.01172,-0.00391 0.250025,0.250025 0 0 1 0.01953,-0.00977 0.250025,0.250025 0 0 1 0.01367,-0.00391 0.250025,0.250025 0 0 1 0.07617,-0.013672 z"
     id="path2" />
</svg>
