<?xml version="1.0" encoding="UTF-8" standalone="no"?>
<svg
   xmlns:dc="http://purl.org/dc/elements/1.1/"
   xmlns:cc="http://creativecommons.org/ns#"
   xmlns:rdf="http://www.w3.org/1999/02/22-rdf-syntax-ns#"
   xmlns:svg="http://www.w3.org/2000/svg"
   xmlns="http://www.w3.org/2000/svg"
   xmlns:sodipodi="http://sodipodi.sourceforge.net/DTD/sodipodi-0.dtd"
   xmlns:inkscape="http://www.inkscape.org/namespaces/inkscape"
   data-dec="69"
   id="dec_69"
   width="20"
   height="40"
   version="1.1"
   sodipodi:docname="69.svg"
   inkscape:version="0.91 r13725">
  <metadata
     id="metadata9">
    <rdf:RDF>
      <cc:Work
         rdf:about="">
        <dc:format>image/svg+xml</dc:format>
        <dc:type
           rdf:resource="http://purl.org/dc/dcmitype/StillImage" />
      </cc:Work>
    </rdf:RDF>
  </metadata>
  <defs
     id="defs7" />
  <sodipodi:namedview
     pagecolor="#ffffff"
     bordercolor="#666666"
     borderopacity="1"
     objecttolerance="10"
     gridtolerance="10"
     guidetolerance="10"
     inkscape:pageopacity="0"
     inkscape:pageshadow="2"
     inkscape:window-width="1333"
     inkscape:window-height="744"
     id="namedview5"
     showgrid="true"
     inkscape:zoom="23.6"
     inkscape:cx="3.1991521"
     inkscape:cy="31.546611"
     inkscape:window-x="33"
     inkscape:window-y="924"
     inkscape:window-maximized="1"
     inkscape:current-layer="dec_69">
    <inkscape:grid
       type="xygrid"
       id="grid821" />
  </sodipodi:namedview>
  <path
     style="color:#000000;font-style:normal;font-variant:normal;font-weight:normal;font-stretch:normal;font-size:medium;line-height:normal;font-family:sans-serif;text-indent:0;text-align:start;text-decoration:none;text-decoration-line:none;text-decoration-style:solid;text-decoration-color:#000000;letter-spacing:normal;word-spacing:normal;text-transform:none;direction:ltr;block-progression:tb;writing-mode:lr-tb;baseline-shift:baseline;text-anchor:start;white-space:normal;clip-rule:nonzero;display:inline;overflow:visible;visibility:visible;opacity:1;isolation:auto;mix-blend-mode:normal;color-interpolation:sRGB;color-interpolation-filters:linearRGB;solid-color:#000000;solid-opacity:1;fill:#000000;fill-opacity:1;fill-rule:nonzero;stroke:none;stroke-width:1;stroke-linecap:round;stroke-linejoin:round;stroke-miterlimit:4;stroke-dasharray:none;stroke-dashoffset:0;stroke-opacity:1;color-rendering:auto;image-rendering:auto;shape-rendering:auto;text-rendering:auto;enable-background:accumulate"
     d="M 3.9921875 0.4921875 A 0.50005 0.50005 0 0 0 3.6757812 0.61328125 A 0.50005 0.50005 0 0 0 3.65625 0.62890625 A 0.50005 0.50005 0 0 0 3.6386719 0.64648438 A 0.50005 0.50005 0 0 0 3.6367188 0.65039062 A 0.50005 0.50005 0 0 0 3.6054688 0.68359375 A 0.50005 0.50005 0 0 0 3.6035156 0.6875 A 0.50005 0.50005 0 0 0 3.5 1.0820312 L 3.5 22 A 0.50005 0.50005 0 0 0 4 22.5 L 17 22.5 A 0.50005 0.50005 0 0 0 17.5 22 L 17.5 20 A 0.50005 0.50005 0 0 0 17 19.5 L 6.5 19.5 L 6.5 12.5 L 11.919922 12.5 A 0.50005 0.50005 0 0 0 12.324219 12.386719 A 0.50005 0.50005 0 0 0 12.328125 12.384766 A 0.50005 0.50005 0 0 0 12.361328 12.353516 A 0.50005 0.50005 0 0 0 12.363281 12.349609 A 0.50005 0.50005 0 0 0 12.394531 12.316406 A 0.50005 0.50005 0 0 0 12.396484 12.3125 A 0.50005 0.50005 0 0 0 12.5 11.917969 L 12.5 10 A 0.50005 0.50005 0 0 0 12 9.5 L 6.5 9.5 L 6.5 3.5 L 17 3.5 A 0.50005 0.50005 0 0 0 17.5 3 L 17.5 1.0800781 A 0.50005 0.50005 0 0 0 17.386719 0.67578125 A 0.50005 0.50005 0 0 0 17.384766 0.671875 A 0.50005 0.50005 0 0 0 17.353516 0.63867188 A 0.50005 0.50005 0 0 0 17.349609 0.63671875 A 0.50005 0.50005 0 0 0 17.316406 0.60546875 A 0.50005 0.50005 0 0 0 17.3125 0.60351562 A 0.50005 0.50005 0 0 0 16.917969 0.5 L 4.0800781 0.5 A 0.50005 0.50005 0 0 0 3.9921875 0.4921875 z M 4.5 1.5 L 4.9179688 1.5 A 0.50005 0.50005 0 0 0 4.6757812 1.6132812 A 0.50005 0.50005 0 0 0 4.65625 1.6289062 A 0.50005 0.50005 0 0 0 4.6386719 1.6464844 A 0.50005 0.50005 0 0 0 4.6367188 1.6503906 A 0.50005 0.50005 0 0 0 4.6054688 1.6835938 A 0.50005 0.50005 0 0 0 4.6035156 1.6875 A 0.50005 0.50005 0 0 0 4.5 1.9199219 L 4.5 1.5 z M 16.035156 1.5 L 16.5 1.5 L 16.5 1.9179688 A 0.50005 0.50005 0 0 0 16.035156 1.5 z M 16.5 2.0800781 L 16.5 2.5 L 16 2.5 A 0.50005 0.50005 0 0 0 16.5 2.0800781 z M 5.5 2.5 L 6 2.5 A 0.50005 0.50005 0 0 0 5.5 3 L 5.5 2.5 z M 5.5 10 A 0.50005 0.50005 0 0 0 6 10.5 L 5.5 10.5 L 5.5 10 z M 11.035156 10.5 L 11.5 10.5 L 11.5 10.917969 A 0.50005 0.50005 0 0 0 11.035156 10.5 z M 11.5 11.080078 L 11.5 11.5 L 11 11.5 A 0.50005 0.50005 0 0 0 11.5 11.080078 z M 5.5 11.5 L 6 11.5 A 0.50005 0.50005 0 0 0 5.5 12 L 5.5 11.5 z M 5.5 20 A 0.50005 0.50005 0 0 0 6 20.5 L 5.5 20.5 L 5.5 20 z M 16.035156 20.5 L 16.5 20.5 L 16.5 20.917969 A 0.50005 0.50005 0 0 0 16.035156 20.5 z M 16.5 21.080078 L 16.5 21.5 L 16 21.5 A 0.50005 0.50005 0 0 0 16.5 21.080078 z M 4.5 21.082031 A 0.50005 0.50005 0 0 0 4.6132812 21.324219 A 0.50005 0.50005 0 0 0 4.6289062 21.34375 A 0.50005 0.50005 0 0 0 4.6464844 21.361328 A 0.50005 0.50005 0 0 0 4.6503906 21.363281 A 0.50005 0.50005 0 0 0 4.6835938 21.394531 A 0.50005 0.50005 0 0 0 4.6875 21.396484 A 0.50005 0.50005 0 0 0 4.9199219 21.5 L 4.5 21.5 L 4.5 21.082031 z "
     id="path819" />
</svg>
