<?xml version="1.0" encoding="UTF-8" standalone="no"?>
<svg
   xmlns:dc="http://purl.org/dc/elements/1.1/"
   xmlns:cc="http://creativecommons.org/ns#"
   xmlns:rdf="http://www.w3.org/1999/02/22-rdf-syntax-ns#"
   xmlns:svg="http://www.w3.org/2000/svg"
   xmlns="http://www.w3.org/2000/svg"
   xmlns:sodipodi="http://sodipodi.sourceforge.net/DTD/sodipodi-0.dtd"
   xmlns:inkscape="http://www.inkscape.org/namespaces/inkscape"
   data-dec="34"
   width="18"
   height="40"
   version="1.1"
   id="svg4"
   sodipodi:docname="34.svg"
   inkscape:version="0.92.4 (unknown)">
  <metadata
     id="metadata10">
    <rdf:RDF>
      <cc:Work
         rdf:about="">
        <dc:format>image/svg+xml</dc:format>
        <dc:type
           rdf:resource="http://purl.org/dc/dcmitype/StillImage" />
      </cc:Work>
    </rdf:RDF>
  </metadata>
  <defs
     id="defs8" />
  <sodipodi:namedview
     pagecolor="#ffffff"
     bordercolor="#666666"
     borderopacity="1"
     objecttolerance="10"
     gridtolerance="10"
     guidetolerance="10"
     inkscape:pageopacity="0"
     inkscape:pageshadow="2"
     inkscape:window-width="640"
     inkscape:window-height="480"
     id="namedview6"
     showgrid="false"
     inkscape:zoom="5.9"
     inkscape:cx="9"
     inkscape:cy="20"
     inkscape:window-x="0"
     inkscape:window-y="27"
     inkscape:window-maximized="0"
     inkscape:current-layer="svg4" />
  <path
     style="color:#000000;font-style:normal;font-variant:normal;font-weight:normal;font-stretch:normal;font-size:medium;line-height:normal;font-family:sans-serif;font-variant-ligatures:normal;font-variant-position:normal;font-variant-caps:normal;font-variant-numeric:normal;font-variant-alternates:normal;font-feature-settings:normal;text-indent:0;text-align:start;text-decoration:none;text-decoration-line:none;text-decoration-style:solid;text-decoration-color:#000000;letter-spacing:normal;word-spacing:normal;text-transform:none;writing-mode:lr-tb;direction:ltr;text-orientation:mixed;dominant-baseline:auto;baseline-shift:baseline;text-anchor:start;white-space:normal;shape-padding:0;clip-rule:nonzero;display:inline;overflow:visible;visibility:visible;opacity:1;isolation:auto;mix-blend-mode:normal;color-interpolation:sRGB;color-interpolation-filters:linearRGB;solid-color:#000000;solid-opacity:1;vector-effect:none;fill:#013272;fill-opacity:1;fill-rule:nonzero;stroke:none;stroke-width:1.5;stroke-linecap:round;stroke-linejoin:round;stroke-miterlimit:4;stroke-dasharray:none;stroke-dashoffset:0;stroke-opacity:1;color-rendering:auto;image-rendering:auto;shape-rendering:auto;text-rendering:auto;enable-background:accumulate"
     d="m 15.974609,0.24023438 a 0.750075,0.750075 0 0 1 0.529297,0.19140624 0.750075,0.750075 0 0 1 1.185547,0.86328128 l -2.984375,6.9609375 a 0.750075,0.750075 0 0 1 -0.01172,0.027344 l -0.0039,0.011719 a 0.750075,0.750075 0 0 1 -0.02148,0.048828 0.750075,0.750075 0 0 1 -0.03711,0.064453 0.750075,0.750075 0 0 1 -0.04297,0.0625 0.750075,0.750075 0 0 1 -0.04883,0.056641 0.750075,0.750075 0 0 1 -0.111328,0.095703 0.750075,0.750075 0 0 1 -0.002,0.00195 0.750075,0.750075 0 0 1 -0.0039,0.00195 0.750075,0.750075 0 0 1 -0.06055,0.037109 0.750075,0.750075 0 0 1 -0.06641,0.033203 0.750075,0.750075 0 0 1 -0.07031,0.027344 0.750075,0.750075 0 0 1 -0.07226,0.019531 0.750075,0.750075 0 0 1 -0.07031,0.011719 0.750075,0.750075 0 0 1 -0.0039,0 0.750075,0.750075 0 0 1 -0.0098,0 0.750075,0.750075 0 0 1 -0.05664,0.00391 0.750075,0.750075 0 0 1 -0.0293,-0.00195 0.750075,0.750075 0 0 1 -0.0332,0 0.750075,0.750075 0 0 1 -0.02149,-0.00195 0.750075,0.750075 0 0 1 -0.01172,-0.00195 0.750075,0.750075 0 0 1 -0.05469,-0.00586 0.750075,0.750075 0 0 1 -0.03516,-0.00781 0.750075,0.750075 0 0 1 -0.03125,-0.00781 0.750075,0.750075 0 0 1 -0.04297,-0.015625 0.750075,0.750075 0 0 1 -0.0332,-0.00977 0.750075,0.750075 0 0 1 -0.02734,-0.013672 0.750075,0.750075 0 0 1 -0.03711,-0.015625 0.750075,0.750075 0 0 1 -0.03516,-0.021484 0.750075,0.750075 0 0 1 -0.0332,-0.019531 0.750075,0.750075 0 0 1 -0.03125,-0.021484 0.750075,0.750075 0 0 1 -0.02539,-0.017578 0.750075,0.750075 0 0 1 -0.0332,-0.03125 0.750075,0.750075 0 0 1 -0.02539,-0.021484 0.750075,0.750075 0 0 1 -0.04297,-0.046875 0.750075,0.750075 0 0 1 -0.04687,-0.060547 0.750075,0.750075 0 0 1 -0.03906,-0.0625 0.750075,0.750075 0 0 1 -0.05859,-0.1308594 0.750075,0.750075 0 0 1 -0.0039,-0.013672 0.750075,0.750075 0 0 1 -0.01563,-0.066406 0.750075,0.750075 0 0 1 -0.01758,-0.1386719 0.750075,0.750075 0 0 1 0,-0.015625 0.750075,0.750075 0 0 1 0.0039,-0.056641 0.750075,0.750075 0 0 1 0,-0.015625 0.750075,0.750075 0 0 1 0.03906,-0.1777344 l 1.990235,-6.96484372 a 0.750075,0.750075 0 0 1 0.695312,-0.5546875 z m -8.9999996,0 A 0.750075,0.750075 0 0 1 7.5039062,0.43164062 0.750075,0.750075 0 0 1 8.6894531,1.2949219 l -2.984375,6.9609375 a 0.750075,0.750075 0 0 1 -0.011719,0.027344 l -0.00391,0.011719 a 0.750075,0.750075 0 0 1 -0.021484,0.048828 0.750075,0.750075 0 0 1 -0.037109,0.064453 0.750075,0.750075 0 0 1 -0.042969,0.0625 0.750075,0.750075 0 0 1 -0.048828,0.056641 0.750075,0.750075 0 0 1 -0.1113281,0.095703 0.750075,0.750075 0 0 1 -0.00195,0.00195 0.750075,0.750075 0 0 1 -0.00391,0.00195 0.750075,0.750075 0 0 1 -0.060547,0.037109 0.750075,0.750075 0 0 1 -0.066406,0.033203 0.750075,0.750075 0 0 1 -0.070312,0.027344 0.750075,0.750075 0 0 1 -0.072266,0.019531 0.750075,0.750075 0 0 1 -0.070313,0.011719 0.750075,0.750075 0 0 1 -0.00391,0 0.750075,0.750075 0 0 1 -0.00977,0 0.750075,0.750075 0 0 1 -0.056641,0.00391 0.750075,0.750075 0 0 1 -0.029297,-0.00195 0.750075,0.750075 0 0 1 -0.033203,0 0.750075,0.750075 0 0 1 -0.087891,-0.00977 0.750075,0.750075 0 0 1 -0.035156,-0.00781 0.750075,0.750075 0 0 1 -0.03125,-0.00781 A 0.750075,0.750075 0 0 1 4.7519531,8.7167969 0.750075,0.750075 0 0 1 4.71875,8.7070312 0.750075,0.750075 0 0 1 4.6914062,8.6933594 0.750075,0.750075 0 0 1 4.6542969,8.6777344 0.750075,0.750075 0 0 1 4.6191406,8.65625 0.750075,0.750075 0 0 1 4.5859375,8.6367188 0.750075,0.750075 0 0 1 4.5546875,8.6152344 0.750075,0.750075 0 0 1 4.5292969,8.5976562 0.750075,0.750075 0 0 1 4.4960938,8.5664062 0.750075,0.750075 0 0 1 4.4707031,8.5449219 0.750075,0.750075 0 0 1 4.4277344,8.4980469 0.750075,0.750075 0 0 1 4.3808594,8.4375 0.750075,0.750075 0 0 1 4.3417969,8.375 0.750075,0.750075 0 0 1 4.2832031,8.2441406 a 0.750075,0.750075 0 0 1 -0.00391,-0.013672 0.750075,0.750075 0 0 1 -0.015625,-0.066406 0.750075,0.750075 0 0 1 -0.017578,-0.1386719 0.750075,0.750075 0 0 1 0,-0.015625 A 0.750075,0.750075 0 0 1 4.25,7.953125 0.750075,0.750075 0 0 1 4.25,7.9375 0.750075,0.750075 0 0 1 4.2890625,7.7597656 L 6.2792969,0.79492188 a 0.750075,0.750075 0 0 1 0.6953125,-0.5546875 z"
     id="path2" />
</svg>
