<?xml version="1.0" encoding="UTF-8"?>
<glyph name="guillemotleft" format="2">
  <advance width="404"/>
  <unicode hex="00AB"/>
  <outline>
    <contour>
      <point x="376" y="434" type="curve" smooth="yes"/>
      <point x="384" y="434"/>
      <point x="390" y="427"/>
      <point x="390" y="419" type="curve" smooth="yes"/>
      <point x="390" y="416"/>
      <point x="388" y="411"/>
      <point x="386" y="409" type="curve" smooth="yes"/>
      <point x="223" y="245" type="line"/>
      <point x="386" y="82" type="line" smooth="yes"/>
      <point x="388" y="80"/>
      <point x="390" y="75"/>
      <point x="390" y="72" type="curve" smooth="yes"/>
      <point x="390" y="64"/>
      <point x="384" y="57"/>
      <point x="376" y="57" type="curve" smooth="yes"/>
      <point x="373" y="57"/>
      <point x="368" y="60"/>
      <point x="366" y="62" type="curve" smooth="yes"/>
      <point x="192" y="235" type="line" smooth="yes"/>
      <point x="190" y="237"/>
      <point x="188" y="242"/>
      <point x="188" y="245" type="curve" smooth="yes"/>
      <point x="188" y="248"/>
      <point x="190" y="254"/>
      <point x="192" y="256" type="curve" smooth="yes"/>
      <point x="366" y="430" type="line" smooth="yes"/>
      <point x="368" y="432"/>
      <point x="373" y="434"/>
    </contour>
    <contour>
      <point x="202" y="434" type="curve" smooth="yes"/>
      <point x="210" y="434"/>
      <point x="217" y="427"/>
      <point x="217" y="419" type="curve" smooth="yes"/>
      <point x="217" y="416"/>
      <point x="215" y="411"/>
      <point x="213" y="409" type="curve" smooth="yes"/>
      <point x="50" y="245" type="line"/>
      <point x="213" y="82" type="line" smooth="yes"/>
      <point x="215" y="80"/>
      <point x="218" y="75"/>
      <point x="218" y="72" type="curve" smooth="yes"/>
      <point x="218" y="64"/>
      <point x="210" y="57"/>
      <point x="202" y="57" type="curve" smooth="yes"/>
      <point x="199" y="57"/>
      <point x="194" y="60"/>
      <point x="192" y="62" type="curve" smooth="yes"/>
      <point x="19" y="235" type="line" smooth="yes"/>
      <point x="17" y="237"/>
      <point x="14" y="242"/>
      <point x="14" y="245" type="curve" smooth="yes"/>
      <point x="14" y="248"/>
      <point x="17" y="254"/>
      <point x="19" y="256" type="curve" smooth="yes"/>
      <point x="192" y="430" type="line" smooth="yes"/>
      <point x="194" y="432"/>
      <point x="199" y="434"/>
    </contour>
  </outline>
  <lib>
    <dict>
      <key>com.fontlab.hintData</key>
      <dict>
        <key>hhints</key>
        <array>
          <dict>
            <key>position</key>
            <integer>413</integer>
            <key>width</key>
            <integer>22</integer>
          </dict>
        </array>
      </dict>
    </dict>
  </lib>
</glyph>
