<?xml version="1.0" encoding="UTF-8" standalone="no"?>
<svg
   xmlns:dc="http://purl.org/dc/elements/1.1/"
   xmlns:cc="http://creativecommons.org/ns#"
   xmlns:rdf="http://www.w3.org/1999/02/22-rdf-syntax-ns#"
   xmlns:svg="http://www.w3.org/2000/svg"
   xmlns="http://www.w3.org/2000/svg"
   xmlns:sodipodi="http://sodipodi.sourceforge.net/DTD/sodipodi-0.dtd"
   xmlns:inkscape="http://www.inkscape.org/namespaces/inkscape"
   data-dec="121"
   width="20"
   height="40"
   version="1.1"
   id="svg4"
   sodipodi:docname="121.svg"
   inkscape:version="0.92.4 (unknown)">
  <metadata
     id="metadata10">
    <rdf:RDF>
      <cc:Work
         rdf:about="">
        <dc:format>image/svg+xml</dc:format>
        <dc:type
           rdf:resource="http://purl.org/dc/dcmitype/StillImage" />
      </cc:Work>
    </rdf:RDF>
  </metadata>
  <defs
     id="defs8" />
  <sodipodi:namedview
     pagecolor="#ffffff"
     bordercolor="#666666"
     borderopacity="1"
     objecttolerance="10"
     gridtolerance="10"
     guidetolerance="10"
     inkscape:pageopacity="0"
     inkscape:pageshadow="2"
     inkscape:window-width="640"
     inkscape:window-height="480"
     id="namedview6"
     showgrid="false"
     inkscape:zoom="5.9"
     inkscape:cx="10"
     inkscape:cy="20"
     inkscape:window-x="0"
     inkscape:window-y="27"
     inkscape:window-maximized="0"
     inkscape:current-layer="svg4" />
  <path
     style="color:#000000;font-style:normal;font-variant:normal;font-weight:normal;font-stretch:normal;font-size:medium;line-height:normal;font-family:sans-serif;font-variant-ligatures:normal;font-variant-position:normal;font-variant-caps:normal;font-variant-numeric:normal;font-variant-alternates:normal;font-feature-settings:normal;text-indent:0;text-align:start;text-decoration:none;text-decoration-line:none;text-decoration-style:solid;text-decoration-color:#000000;letter-spacing:normal;word-spacing:normal;text-transform:none;writing-mode:lr-tb;direction:ltr;text-orientation:mixed;dominant-baseline:auto;baseline-shift:baseline;text-anchor:start;white-space:normal;shape-padding:0;clip-rule:nonzero;display:inline;overflow:visible;visibility:visible;opacity:1;isolation:auto;mix-blend-mode:normal;color-interpolation:sRGB;color-interpolation-filters:linearRGB;solid-color:#000000;solid-opacity:1;vector-effect:none;fill:#013272;fill-opacity:1;fill-rule:nonzero;stroke:none;stroke-width:2.5;stroke-linecap:round;stroke-linejoin:round;stroke-miterlimit:4;stroke-dasharray:none;stroke-dashoffset:0;stroke-opacity:1;color-rendering:auto;image-rendering:auto;shape-rendering:auto;text-rendering:auto;enable-background:accumulate"
     d="m 17.958984,6.734375 a 1.250125,1.250125 0 0 1 0.544922,0.1035156 1.250125,1.250125 0 0 1 1.697266,1.5058594 l -4,14 a 1.250125,1.250125 0 0 1 -0.01563,0.05078 l -1,3 a 1.250125,1.250125 0 0 1 -0.144531,0.298828 l -2,3 a 1.250125,1.250125 0 0 1 -0.646485,0.492188 L 9.4804688,30.15625 a 1.250125,1.250125 0 0 1 -0.019531,0.0078 A 1.250125,1.250125 0 0 1 8.8554688,30.25 H 6 A 1.250125,1.250125 0 0 1 5.4414062,30.117188 l -2,-1 A 1.250125,1.250125 0 0 1 3.1152344,28.884766 l -1,-1 A 1.250125,1.250125 0 0 1 1.75,27 v -1 a 1.250125,1.250125 0 0 1 0.3652344,-0.884766 l 1,-1 a 1.250125,1.250125 0 0 1 1.7695312,0 l 1,1 a 1.250125,1.250125 0 0 1 0,1.769532 L 5.4453125,27.324219 6.2949219,27.75 h 2.4121093 l 1.4374998,-0.71875 1.722657,-2.585938 0.794921,-2.384765 a 1.250125,1.250125 0 0 1 -0.103515,0.05664 l -2,1 A 1.250125,1.250125 0 0 1 10,23.25 H 8.1796875 A 1.250125,1.250125 0 0 1 7.3554688,23.074219 L 5.4414062,22.117188 A 1.250125,1.250125 0 0 1 5.1152344,21.884766 l -1,-1 A 1.250125,1.250125 0 0 1 3.75,20 v -2 a 1.250125,1.250125 0 0 1 0.064453,-0.394531 L 5.75,11.796875 V 9.5175781 L 5.4824219,9.25 H 4.5175781 l -1.4902343,1.490234 -0.9101563,1.81836 a 1.250125,1.250125 0 1 1 -2.234375,-1.117188 l 1,-1.9999998 A 1.250125,1.250125 0 0 1 1.1152344,9.1152344 l 2,-2 A 1.250125,1.250125 0 0 1 4,6.75 h 1.8203125 a 1.250125,1.250125 0 0 1 0.3320313,0 H 7 a 1.250125,1.250125 0 0 1 0.8847656,0.3652344 l 1,1 A 1.250125,1.250125 0 0 1 9.25,9 v 3 a 1.250125,1.250125 0 0 1 -0.064453,0.394531 L 7.25,18.203125 v 1.279297 L 8.5195312,20.75 h 1.1855469 l 1.5546879,-0.777344 1.71289,-1.71289 1.855469,-3.708985 1.970703,-6.894531 a 1.250125,1.250125 0 0 1 1.160156,-0.921875 z"
     id="path2" />
</svg>
