<?xml version="1.0" encoding="UTF-8" standalone="no"?>
<svg
   xmlns:dc="http://purl.org/dc/elements/1.1/"
   xmlns:cc="http://creativecommons.org/ns#"
   xmlns:rdf="http://www.w3.org/1999/02/22-rdf-syntax-ns#"
   xmlns:svg="http://www.w3.org/2000/svg"
   xmlns="http://www.w3.org/2000/svg"
   xmlns:sodipodi="http://sodipodi.sourceforge.net/DTD/sodipodi-0.dtd"
   xmlns:inkscape="http://www.inkscape.org/namespaces/inkscape"
   data-dec="126"
   width="24"
   height="40"
   version="1.1"
   id="svg4"
   sodipodi:docname="126.svg"
   inkscape:version="0.92.4 (unknown)">
  <metadata
     id="metadata10">
    <rdf:RDF>
      <cc:Work
         rdf:about="">
        <dc:format>image/svg+xml</dc:format>
        <dc:type
           rdf:resource="http://purl.org/dc/dcmitype/StillImage" />
      </cc:Work>
    </rdf:RDF>
  </metadata>
  <defs
     id="defs8" />
  <sodipodi:namedview
     pagecolor="#ffffff"
     bordercolor="#666666"
     borderopacity="1"
     objecttolerance="10"
     gridtolerance="10"
     guidetolerance="10"
     inkscape:pageopacity="0"
     inkscape:pageshadow="2"
     inkscape:window-width="615"
     inkscape:window-height="417"
     id="namedview6"
     showgrid="false"
     inkscape:zoom="5.9"
     inkscape:cx="12"
     inkscape:cy="20"
     inkscape:window-x="0"
     inkscape:window-y="27"
     inkscape:window-maximized="0"
     inkscape:current-layer="svg4" />
  <path
     style="color:#000000;font-style:normal;font-variant:normal;font-weight:normal;font-stretch:normal;font-size:medium;line-height:normal;font-family:sans-serif;font-variant-ligatures:normal;font-variant-position:normal;font-variant-caps:normal;font-variant-numeric:normal;font-variant-alternates:normal;font-feature-settings:normal;text-indent:0;text-align:start;text-decoration:none;text-decoration-line:none;text-decoration-style:solid;text-decoration-color:#000000;letter-spacing:normal;word-spacing:normal;text-transform:none;writing-mode:lr-tb;direction:ltr;text-orientation:mixed;dominant-baseline:auto;baseline-shift:baseline;text-anchor:start;white-space:normal;shape-padding:0;clip-rule:nonzero;display:inline;overflow:visible;visibility:visible;opacity:1;isolation:auto;mix-blend-mode:normal;color-interpolation:sRGB;color-interpolation-filters:linearRGB;solid-color:#000000;solid-opacity:1;vector-effect:none;fill:#013272;fill-opacity:1;fill-rule:nonzero;stroke:none;stroke-width:1;stroke-linecap:round;stroke-linejoin:round;stroke-miterlimit:4;stroke-dasharray:none;stroke-dashoffset:0;stroke-opacity:1;color-rendering:auto;image-rendering:auto;shape-rendering:auto;text-rendering:auto;enable-background:accumulate"
     d="M 20.992188,9.4921875 A 0.50005,0.50005 0 0 1 21.5,10 v 1.933594 a 0.50005,0.50005 0 0 1 -0.02539,0.224609 0.50005,0.50005 0 0 1 -0.0059,0.01953 l -0.002,0.0039 -0.992188,2.976562 a 0.50005,0.50005 0 0 1 -0.251953,0.289063 l -2,1 A 0.50005,0.50005 0 0 1 18,16.5 h -2 a 0.50005,0.50005 0 0 1 -0.222656,-0.05273 l -2,-1 a 0.50005,0.50005 0 0 1 -0.07813,-0.04687 L 9.7363281,12.427734 7.8828125,11.5 H 6.1171875 L 4.3730469,12.373047 3.5,14.117188 V 16 a 0.50005,0.50005 0 1 1 -1,0 v -1.933594 a 0.50005,0.50005 0 0 1 0.025391,-0.224609 l 0.00586,-0.01953 a 0.50005,0.50005 0 0 1 0.00195,-0.0039 l 0.9921875,-2.976562 a 0.50005,0.50005 0 0 1 0.2519532,-0.289063 l 2,-0.9999996 A 0.50005,0.50005 0 0 1 6,9.5 h 2 a 0.50005,0.50005 0 0 1 0.2226562,0.052734 l 1.9999998,0.9999996 a 0.50005,0.50005 0 0 1 0.07813,0.04687 L 14.263672,13.572266 16.117188,14.5 h 1.765624 L 19.626953,13.626953 20.5,11.882812 V 10 a 0.50005,0.50005 0 0 1 0.492188,-0.5078125 z"
     id="path2" />
</svg>
