<?xml version="1.0" encoding="UTF-8" standalone="no"?>
<svg
   xmlns:dc="http://purl.org/dc/elements/1.1/"
   xmlns:cc="http://creativecommons.org/ns#"
   xmlns:rdf="http://www.w3.org/1999/02/22-rdf-syntax-ns#"
   xmlns:svg="http://www.w3.org/2000/svg"
   xmlns="http://www.w3.org/2000/svg"
   xmlns:sodipodi="http://sodipodi.sourceforge.net/DTD/sodipodi-0.dtd"
   xmlns:inkscape="http://www.inkscape.org/namespaces/inkscape"
   data-dec="55"
   width="17"
   height="40"
   version="1.1"
   id="svg4"
   sodipodi:docname="55.svg"
   inkscape:version="0.92.4 (unknown)">
  <metadata
     id="metadata10">
    <rdf:RDF>
      <cc:Work
         rdf:about="">
        <dc:format>image/svg+xml</dc:format>
        <dc:type
           rdf:resource="http://purl.org/dc/dcmitype/StillImage" />
      </cc:Work>
    </rdf:RDF>
  </metadata>
  <defs
     id="defs8" />
  <sodipodi:namedview
     pagecolor="#ffffff"
     bordercolor="#666666"
     borderopacity="1"
     objecttolerance="10"
     gridtolerance="10"
     guidetolerance="10"
     inkscape:pageopacity="0"
     inkscape:pageshadow="2"
     inkscape:window-width="640"
     inkscape:window-height="480"
     id="namedview6"
     showgrid="false"
     inkscape:zoom="5.9"
     inkscape:cx="8.5"
     inkscape:cy="20"
     inkscape:window-x="0"
     inkscape:window-y="27"
     inkscape:window-maximized="0"
     inkscape:current-layer="svg4" />
  <path
     style="color:#000000;font-style:normal;font-variant:normal;font-weight:normal;font-stretch:normal;font-size:medium;line-height:normal;font-family:sans-serif;font-variant-ligatures:normal;font-variant-position:normal;font-variant-caps:normal;font-variant-numeric:normal;font-variant-alternates:normal;font-feature-settings:normal;text-indent:0;text-align:start;text-decoration:none;text-decoration-line:none;text-decoration-style:solid;text-decoration-color:#000000;letter-spacing:normal;word-spacing:normal;text-transform:none;writing-mode:lr-tb;direction:ltr;text-orientation:mixed;dominant-baseline:auto;baseline-shift:baseline;text-anchor:start;white-space:normal;shape-padding:0;clip-rule:nonzero;display:inline;overflow:visible;visibility:visible;opacity:1;isolation:auto;mix-blend-mode:normal;color-interpolation:sRGB;color-interpolation-filters:linearRGB;solid-color:#000000;solid-opacity:1;vector-effect:none;fill:#000000;fill-opacity:1;fill-rule:nonzero;stroke:none;stroke-width:1.5;stroke-linecap:round;stroke-linejoin:round;stroke-miterlimit:4;stroke-dasharray:none;stroke-dashoffset:0;stroke-opacity:1;color-rendering:auto;image-rendering:auto;shape-rendering:auto;text-rendering:auto;enable-background:accumulate"
     d="m 14.996094,0.24023438 a 0.750075,0.750075 0 0 1 0.0098,0 0.750075,0.750075 0 0 1 0.06641,0.003906 0.750075,0.750075 0 0 1 0.06445,0.007812 0.750075,0.750075 0 0 1 0.0098,0.001953 0.750075,0.750075 0 0 1 0.0078,0.001953 0.750075,0.750075 0 0 1 0.04492,0.0117187 0.750075,0.750075 0 0 1 0.01953,0.003906 0.750075,0.750075 0 0 1 0.0293,0.009766 0.750075,0.750075 0 0 1 0.02148,0.007813 0.750075,0.750075 0 0 1 0.04687,0.0195313 0.750075,0.750075 0 0 1 0.01172,0.005859 0.750075,0.750075 0 0 1 0.05469,0.0292969 0.750075,0.750075 0 0 1 0.0625,0.0410156 0.750075,0.750075 0 0 1 0.05469,0.0449219 0.750075,0.750075 0 0 1 0.0039,0.001953 0.750075,0.750075 0 0 1 0.0332,0.03125 0.750075,0.750075 0 0 1 0.02149,0.0214844 0.750075,0.750075 0 0 1 0.01172,0.015625 0.750075,0.750075 0 0 1 0.0293,0.0332031 0.750075,0.750075 0 0 1 0.0059,0.007813 0.750075,0.750075 0 0 1 0.01172,0.0175781 0.750075,0.750075 0 0 1 0.0059,0.007813 0.750075,0.750075 0 0 1 0.0078,0.0117188 0.750075,0.750075 0 0 1 0.01563,0.0253906 0.750075,0.750075 0 0 1 0.01758,0.0273438 0.750075,0.750075 0 0 1 0.01367,0.0273437 0.750075,0.750075 0 0 1 0.0059,0.0117188 0.750075,0.750075 0 0 1 -0.04102,0.73242192 L 6.6894531,22.294922 A 0.750075,0.750075 0 0 1 6,22.75 H 5.1074219 a 0.750075,0.750075 0 0 1 -0.7246094,-0.310547 0.750075,0.750075 0 0 1 -0.029297,-0.04297 0.750075,0.750075 0 0 1 -0.037109,-0.06641 0.750075,0.750075 0 0 1 0.054688,-0.753906 L 13.335938,2.75 H 4.1757812 L 2.3359375,3.6699219 A 0.750075,0.750075 0 0 1 1.3300781,2.6640625 L 2.2753906,0.77539062 A 0.750075,0.750075 0 0 1 2.6015625,0.35742188 0.750075,0.750075 0 0 1 2.6230469,0.34570312 0.750075,0.750075 0 0 1 2.6542969,0.328125 0.750075,0.750075 0 0 1 2.7070312,0.3046875 0.750075,0.750075 0 0 1 3.125,0.25 h 1.7753906 a 0.750075,0.750075 0 0 1 0.2050782,0 h 9.7792972 a 0.750075,0.750075 0 0 1 0.06055,-0.007813 0.750075,0.750075 0 0 1 0.05078,-0.001953 z"
     id="path2" />
</svg>
