<?xml version="1.0" encoding="UTF-8" standalone="no"?>
<svg
   xmlns:dc="http://purl.org/dc/elements/1.1/"
   xmlns:cc="http://creativecommons.org/ns#"
   xmlns:rdf="http://www.w3.org/1999/02/22-rdf-syntax-ns#"
   xmlns:svg="http://www.w3.org/2000/svg"
   xmlns="http://www.w3.org/2000/svg"
   xmlns:sodipodi="http://sodipodi.sourceforge.net/DTD/sodipodi-0.dtd"
   xmlns:inkscape="http://www.inkscape.org/namespaces/inkscape"
   data-dec="180"
   width="12"
   height="40"
   version="1.1"
   id="svg4"
   sodipodi:docname="180.svg"
   inkscape:version="0.92.4 (unknown)">
  <metadata
     id="metadata10">
    <rdf:RDF>
      <cc:Work
         rdf:about="">
        <dc:format>image/svg+xml</dc:format>
        <dc:type
           rdf:resource="http://purl.org/dc/dcmitype/StillImage" />
      </cc:Work>
    </rdf:RDF>
  </metadata>
  <defs
     id="defs8" />
  <sodipodi:namedview
     pagecolor="#ffffff"
     bordercolor="#666666"
     borderopacity="1"
     objecttolerance="10"
     gridtolerance="10"
     guidetolerance="10"
     inkscape:pageopacity="0"
     inkscape:pageshadow="2"
     inkscape:window-width="640"
     inkscape:window-height="480"
     id="namedview6"
     showgrid="false"
     inkscape:zoom="5.9"
     inkscape:cx="6"
     inkscape:cy="20"
     inkscape:window-x="0"
     inkscape:window-y="27"
     inkscape:window-maximized="0"
     inkscape:current-layer="svg4" />
  <path
     style="color:#000000;font-style:normal;font-variant:normal;font-weight:normal;font-stretch:normal;font-size:medium;line-height:normal;font-family:sans-serif;font-variant-ligatures:normal;font-variant-position:normal;font-variant-caps:normal;font-variant-numeric:normal;font-variant-alternates:normal;font-feature-settings:normal;text-indent:0;text-align:start;text-decoration:none;text-decoration-line:none;text-decoration-style:solid;text-decoration-color:#000000;letter-spacing:normal;word-spacing:normal;text-transform:none;writing-mode:lr-tb;direction:ltr;text-orientation:mixed;dominant-baseline:auto;baseline-shift:baseline;text-anchor:start;white-space:normal;shape-padding:0;clip-rule:nonzero;display:inline;overflow:visible;visibility:visible;opacity:1;isolation:auto;mix-blend-mode:normal;color-interpolation:sRGB;color-interpolation-filters:linearRGB;solid-color:#000000;solid-opacity:1;vector-effect:none;fill:#013272;fill-opacity:1;fill-rule:nonzero;stroke:none;stroke-width:2.5;stroke-linecap:round;stroke-linejoin:round;stroke-miterlimit:4;stroke-dasharray:none;stroke-dashoffset:0;stroke-opacity:1;color-rendering:auto;image-rendering:auto;shape-rendering:auto;text-rendering:auto;enable-background:accumulate"
     d="M 7.9863281,-0.26367188 A 1.250125,1.250125 0 0 1 9.0195312,0.25 L 9.8847656,1.1152344 A 1.250125,1.250125 0 0 1 9.8007812,2.9609375 L 3.8261719,7.9394531 A 1.250125,1.250125 0 0 1 3.8007812,7.9609375 1.250125,1.250125 0 0 1 3.7324219,8.015625 1.250125,1.250125 0 0 1 3.6289062,8.0839844 1.250125,1.250125 0 0 1 3.1601562,8.25 a 1.250125,1.250125 0 0 1 -0.25,0.00977 1.250125,1.250125 0 0 1 -0.125,-0.013672 A 1.250125,1.250125 0 0 1 2.6640625,8.21875 1.250125,1.250125 0 0 1 2.578125,8.1914062 1.250125,1.250125 0 0 1 2.5332031,8.1757812 1.250125,1.250125 0 0 1 2.4296875,8.1308594 1.250125,1.250125 0 0 1 2.3554688,8.0878906 1.250125,1.250125 0 0 1 2.3105469,8.0625 1.250125,1.250125 0 0 1 2.2636719,8.0292969 1.250125,1.250125 0 0 1 2.2148438,7.9941406 1.250125,1.250125 0 0 1 2.125,7.9160156 1.250125,1.250125 0 0 1 2.0527344,7.8417969 1.250125,1.250125 0 0 1 2.0351562,7.8222656 1.250125,1.250125 0 0 1 1.9980469,7.7734375 1.250125,1.250125 0 0 1 1.9511719,7.7109375 1.250125,1.250125 0 0 1 1.8867188,7.6035156 1.250125,1.250125 0 0 1 1.8339844,7.4941406 1.250125,1.250125 0 0 1 1.828125,7.4804688 1.250125,1.250125 0 0 1 1.7910156,7.3730469 1.250125,1.250125 0 0 1 1.7382812,7.0019531 a 1.250125,1.250125 0 0 1 0.00781,-0.125 A 1.250125,1.250125 0 0 1 1.765625,6.7539062 1.250125,1.250125 0 0 1 1.796875,6.6328125 1.250125,1.250125 0 0 1 2.0625,6.1699219 L 6.9160156,0.34765625 a 1.250125,1.250125 0 0 1 1.0078125,-0.60546875 1.250125,1.250125 0 0 1 0.0625,-0.005859 z"
     id="path2" />
</svg>
