<?xml version="1.0" encoding="UTF-8" standalone="no"?>
<svg
   xmlns:dc="http://purl.org/dc/elements/1.1/"
   xmlns:cc="http://creativecommons.org/ns#"
   xmlns:rdf="http://www.w3.org/1999/02/22-rdf-syntax-ns#"
   xmlns:svg="http://www.w3.org/2000/svg"
   xmlns="http://www.w3.org/2000/svg"
   xmlns:sodipodi="http://sodipodi.sourceforge.net/DTD/sodipodi-0.dtd"
   xmlns:inkscape="http://www.inkscape.org/namespaces/inkscape"
   data-dec="126"
   width="24"
   height="40"
   version="1.1"
   id="svg4"
   sodipodi:docname="126.svg"
   inkscape:version="0.92.4 (unknown)">
  <metadata
     id="metadata10">
    <rdf:RDF>
      <cc:Work
         rdf:about="">
        <dc:format>image/svg+xml</dc:format>
        <dc:type
           rdf:resource="http://purl.org/dc/dcmitype/StillImage" />
      </cc:Work>
    </rdf:RDF>
  </metadata>
  <defs
     id="defs8" />
  <sodipodi:namedview
     pagecolor="#ffffff"
     bordercolor="#666666"
     borderopacity="1"
     objecttolerance="10"
     gridtolerance="10"
     guidetolerance="10"
     inkscape:pageopacity="0"
     inkscape:pageshadow="2"
     inkscape:window-width="640"
     inkscape:window-height="480"
     id="namedview6"
     showgrid="false"
     inkscape:zoom="5.9"
     inkscape:cx="12"
     inkscape:cy="20"
     inkscape:window-x="0"
     inkscape:window-y="27"
     inkscape:window-maximized="0"
     inkscape:current-layer="svg4" />
  <path
     style="color:#000000;font-style:normal;font-variant:normal;font-weight:normal;font-stretch:normal;font-size:medium;line-height:normal;font-family:sans-serif;font-variant-ligatures:normal;font-variant-position:normal;font-variant-caps:normal;font-variant-numeric:normal;font-variant-alternates:normal;font-feature-settings:normal;text-indent:0;text-align:start;text-decoration:none;text-decoration-line:none;text-decoration-style:solid;text-decoration-color:#000000;letter-spacing:normal;word-spacing:normal;text-transform:none;writing-mode:lr-tb;direction:ltr;text-orientation:mixed;dominant-baseline:auto;baseline-shift:baseline;text-anchor:start;white-space:normal;shape-padding:0;clip-rule:nonzero;display:inline;overflow:visible;visibility:visible;opacity:1;isolation:auto;mix-blend-mode:normal;color-interpolation:sRGB;color-interpolation-filters:linearRGB;solid-color:#000000;solid-opacity:1;vector-effect:none;fill:#013272;fill-opacity:1;fill-rule:nonzero;stroke:none;stroke-width:2;stroke-linecap:round;stroke-linejoin:round;stroke-miterlimit:4;stroke-dasharray:none;stroke-dashoffset:0;stroke-opacity:1;color-rendering:auto;image-rendering:auto;shape-rendering:auto;text-rendering:auto;enable-background:accumulate"
     d="M 20.984375,8.9863281 A 1.0001,1.0001 0 0 1 22,10 v 1.890625 a 1.0001,1.0001 0 0 1 -0.05078,0.425781 l -0.002,0.0078 a 1.0001,1.0001 0 0 1 -0.01172,0.03125 l -0.986328,2.960937 a 1.0001,1.0001 0 0 1 -0.501953,0.578125 l -2,1 A 1.0001,1.0001 0 0 1 18,17 h -2 a 1.0001,1.0001 0 0 1 -0.447266,-0.105469 l -2,-1 a 1.0001,1.0001 0 0 1 -0.152343,-0.09375 L 9.4726562,12.853516 7.7636719,12 H 6.2363281 L 4.7460938,12.746094 4,14.236328 V 16 a 1.0001,1.0001 0 1 1 -2,0 v -1.890625 a 1.0001,1.0001 0 0 1 0.050781,-0.425781 l 0.013672,-0.03906 0.9863281,-2.960937 a 1.0001,1.0001 0 0 1 0.5019532,-0.578125 l 2,-1.0000002 A 1.0001,1.0001 0 0 1 6,9 h 2 a 1.0001,1.0001 0 0 1 0.4472656,0.1054688 l 2.0000004,1.0000002 a 1.0001,1.0001 0 0 1 0.152343,0.09375 L 14.527344,13.146484 16.236328,14 h 1.527344 L 19.253906,13.253906 20,11.763672 V 10 a 1.0001,1.0001 0 0 1 0.984375,-1.0136719 z"
     id="path2" />
</svg>
