<?xml version="1.0" encoding="UTF-8" standalone="no"?>
<svg
   xmlns:dc="http://purl.org/dc/elements/1.1/"
   xmlns:cc="http://creativecommons.org/ns#"
   xmlns:rdf="http://www.w3.org/1999/02/22-rdf-syntax-ns#"
   xmlns:svg="http://www.w3.org/2000/svg"
   xmlns="http://www.w3.org/2000/svg"
   xmlns:sodipodi="http://sodipodi.sourceforge.net/DTD/sodipodi-0.dtd"
   xmlns:inkscape="http://www.inkscape.org/namespaces/inkscape"
   data-dec="90"
   width="22"
   height="40"
   version="1.1"
   id="svg4"
   sodipodi:docname="90.svg"
   inkscape:version="0.92.4 (unknown)">
  <metadata
     id="metadata10">
    <rdf:RDF>
      <cc:Work
         rdf:about="">
        <dc:format>image/svg+xml</dc:format>
        <dc:type
           rdf:resource="http://purl.org/dc/dcmitype/StillImage" />
      </cc:Work>
    </rdf:RDF>
  </metadata>
  <defs
     id="defs8" />
  <sodipodi:namedview
     pagecolor="#ffffff"
     bordercolor="#666666"
     borderopacity="1"
     objecttolerance="10"
     gridtolerance="10"
     guidetolerance="10"
     inkscape:pageopacity="0"
     inkscape:pageshadow="2"
     inkscape:window-width="615"
     inkscape:window-height="417"
     id="namedview6"
     showgrid="false"
     inkscape:zoom="5.9"
     inkscape:cx="11"
     inkscape:cy="20"
     inkscape:window-x="0"
     inkscape:window-y="27"
     inkscape:window-maximized="0"
     inkscape:current-layer="svg4" />
  <path
     style="color:#000000;font-style:normal;font-variant:normal;font-weight:normal;font-stretch:normal;font-size:medium;line-height:normal;font-family:sans-serif;font-variant-ligatures:normal;font-variant-position:normal;font-variant-caps:normal;font-variant-numeric:normal;font-variant-alternates:normal;font-feature-settings:normal;text-indent:0;text-align:start;text-decoration:none;text-decoration-line:none;text-decoration-style:solid;text-decoration-color:#000000;letter-spacing:normal;word-spacing:normal;text-transform:none;writing-mode:lr-tb;direction:ltr;text-orientation:mixed;dominant-baseline:auto;baseline-shift:baseline;text-anchor:start;white-space:normal;shape-padding:0;clip-rule:nonzero;display:inline;overflow:visible;visibility:visible;opacity:1;isolation:auto;mix-blend-mode:normal;color-interpolation:sRGB;color-interpolation-filters:linearRGB;solid-color:#000000;solid-opacity:1;vector-effect:none;fill:#013272;fill-opacity:1;fill-rule:nonzero;stroke:none;stroke-width:0.30000001;stroke-linecap:round;stroke-linejoin:round;stroke-miterlimit:4;stroke-dasharray:none;stroke-dashoffset:0;stroke-opacity:1;color-rendering:auto;image-rendering:auto;shape-rendering:auto;text-rendering:auto;enable-background:accumulate"
     d="m 13.177734,21.611328 -0.953125,0.238281 h 0.714844 z m 0.970704,-0.242187 -0.408204,0.101562 -0.378906,0.378906 h 0.544922 z m 0.304687,-0.611329 -0.296875,0.296876 0.169922,-0.04102 z m 1.205078,-1.205078 -0.533203,0.533204 -0.416016,0.830078 0.253907,-0.0625 a 0.1511116,0.1511116 0 1 1 0.07422,0.292968 l -0.505859,0.126954 -0.289062,0.576171 h 0.65039 z m 0.53125,-1.597656 -0.642578,1.28711 0.322266,-0.322266 z M 6.453125,3.7578125 6.1308594,4.0800781 5.8105469,5.0449219 Z M 7.84375,1.9453125 7.6738281,1.9863281 7.546875,2.2421875 Z M 20.068359,1.1503906 2.3261719,21.849609 H 2.9316406 L 20.673828,1.1503906 Z m -1,0 L 1.3261719,21.849609 H 1.9316406 L 19.673828,1.1503906 Z m -10.0078121,0 -0.2382813,0.2382813 0.953125,-0.2382813 z m -0.9667969,0 L 7.8515625,1.6308594 8.2597656,1.5292969 8.6386719,1.1503906 Z m -0.9863281,0 -0.765625,2.296875 L 6.875,2.9140625 7.2910156,2.0839844 7.0371094,2.1464844 A 0.15111186,0.15111186 0 0 1 6.9628906,1.8535156 L 7.46875,1.7265625 7.7578125,1.1503906 Z M 7.9941406,0.84765625 a 0.15001501,0.15001501 0 0 1 0.029297,0.001953 h 0.9589844 a 0.15001501,0.15001501 0 0 1 0.029297,0 h 1.9765622 0.03125 7.966797 a 0.15001501,0.15001501 0 0 1 0.0293,0 h 0.970703 a 0.15001501,0.15001501 0 0 1 0.0293,0 h 0.970703 a 0.15001501,0.15001501 0 0 1 0.02344,0 0.15001501,0.15001501 0 0 1 0.0059,0 0.15001501,0.15001501 0 0 1 0.0098,0.001953 0.15001501,0.15001501 0 0 1 0.0039,0 0.15001501,0.15001501 0 0 1 0.01172,0.003906 0.15001501,0.15001501 0 0 1 0.0039,0 0.15001501,0.15001501 0 0 1 0.0098,0.003906 0.15001501,0.15001501 0 0 1 0.01367,0.005859 0.15001501,0.15001501 0 0 1 0.02539,0.015625 0.15001501,0.15001501 0 0 1 0.0039,0.001953 0.15001501,0.15001501 0 0 1 0.0078,0.007813 0.15001501,0.15001501 0 0 1 0.002,0.001953 0.15001501,0.15001501 0 0 1 0.0078,0.009766 0.15001501,0.15001501 0 0 1 0.0098,0.0117188 0.15001501,0.15001501 0 0 1 0.002,0.001953 0.15001501,0.15001501 0 0 1 0.0059,0.009766 0.15001501,0.15001501 0 0 1 0.002,0.003906 0.15001501,0.15001501 0 0 1 0.0039,0.009766 0.15001501,0.15001501 0 0 1 0.002,0.003906 0.15001501,0.15001501 0 0 1 0.0039,0.009766 0.15001501,0.15001501 0 0 1 0.002,0.003906 0.15001501,0.15001501 0 0 1 0.002,0.0117188 0.15001501,0.15001501 0 0 1 0,0.003906 0.15001501,0.15001501 0 0 1 0.002,0.009766 0.15001501,0.15001501 0 0 1 0,0.003906 0.15001501,0.15001501 0 0 1 -0.002,0.0449219 0.15001501,0.15001501 0 0 1 -0.002,0.011719 0.15001501,0.15001501 0 0 1 -0.002,0.00391 0.15001501,0.15001501 0 0 1 -0.0039,0.00977 0.15001501,0.15001501 0 0 1 -0.002,0.00391 0.15001501,0.15001501 0 0 1 -0.0078,0.013672 0.15001501,0.15001501 0 0 1 -0.0039,0.00781 0.15001501,0.15001501 0 0 1 -0.01953,0.023438 l -0.0059,0.00586 a 0.15001501,0.15001501 0 0 1 -0.0039,0.00391 L 3.3261719,21.849609 h 7.6523441 l 2.615234,-0.654297 1.28125,-1.28125 1.986328,-3.970703 a 0.15001501,0.15001501 0 0 1 0.0039,-0.0098 0.15001501,0.15001501 0 0 1 0.002,-0.0039 0.15001501,0.15001501 0 0 1 0.0039,-0.0059 0.15001501,0.15001501 0 0 1 0.0039,-0.0078 0.15001501,0.15001501 0 0 1 0.0039,-0.0059 0.15001501,0.15001501 0 0 1 0.0039,-0.0059 0.15001501,0.15001501 0 0 1 0.0059,-0.0059 0.15001501,0.15001501 0 0 1 0.0059,-0.0059 0.15001501,0.15001501 0 0 1 0.0039,-0.0039 0.15001501,0.15001501 0 0 1 0.0059,-0.0059 0.15001501,0.15001501 0 0 1 0.0059,-0.0039 0.15001501,0.15001501 0 0 1 0.01172,-0.0078 0.15001501,0.15001501 0 0 1 0.02148,-0.01172 0.15001501,0.15001501 0 0 1 0.0059,-0.002 0.15001501,0.15001501 0 0 1 0.01367,-0.0039 0.15001501,0.15001501 0 0 1 0.0059,-0.002 0.15001501,0.15001501 0 0 1 0.0039,0 0.15001501,0.15001501 0 0 1 0.0293,-0.0039 0.15001501,0.15001501 0 0 1 0.0059,0 0.15001501,0.15001501 0 0 1 0.02344,0.0039 0.15001501,0.15001501 0 0 1 0.0059,0.002 0.15001501,0.15001501 0 0 1 0.0098,0.002 0.15001501,0.15001501 0 0 1 0.02344,0.0098 0.15001501,0.15001501 0 0 1 0.0039,0.002 0.15001501,0.15001501 0 0 1 0.01172,0.0078 0.15001501,0.15001501 0 0 1 0.04883,0.05664 0.15001501,0.15001501 0 0 1 0.0039,0.0059 0.15001501,0.15001501 0 0 1 0.002,0.0078 0.15001501,0.15001501 0 0 1 0.002,0.0059 0.15001501,0.15001501 0 0 1 0.002,0.0078 0.15001501,0.15001501 0 0 1 0.002,0.0059 0.15001501,0.15001501 0 0 1 0.002,0.0078 0.15001501,0.15001501 0 0 1 0.002,0.0078 0.15001501,0.15001501 0 0 1 0,0.0078 0.15001501,0.15001501 0 0 1 0,0.0059 0.15001501,0.15001501 0 0 1 0,0.0098 0.15001501,0.15001501 0 0 1 0,0.0059 0.15001501,0.15001501 0 0 1 -0.002,0.0078 0.15001501,0.15001501 0 0 1 0,0.0078 0.15001501,0.15001501 0 0 1 -0.002,0.0078 0.15001501,0.15001501 0 0 1 -0.002,0.0059 0.15001501,0.15001501 0 0 1 -0.002,0.0078 0.15001501,0.15001501 0 0 1 -0.0078,0.01953 l -0.986328,2.960938 a 0.15001501,0.15001501 0 0 1 -0.0078,0.0293 l -0.0039,0.0059 -0.994141,2.984375 A 0.15001501,0.15001501 0 0 1 15,22.150391 h -0.978516 a 0.15001501,0.15001501 0 0 1 -0.04492,0 h -0.958984 a 0.15001501,0.15001501 0 0 1 -0.0293,0 h -1.976562 -0.03125 -7.9667971 a 0.15001501,0.15001501 0 0 1 -0.029297,0 H 2.0136719 a 0.15001501,0.15001501 0 0 1 -0.029297,0 H 1.0136719 a 0.15001501,0.15001501 0 0 1 -0.0234375,0 0.15001501,0.15001501 0 0 1 -0.005859,0 0.15001501,0.15001501 0 0 1 -0.009766,-0.002 0.15001501,0.15001501 0 0 1 -0.003906,0 0.15001501,0.15001501 0 0 1 -0.0117187,-0.0039 0.15001501,0.15001501 0 0 1 -0.003906,0 0.15001501,0.15001501 0 0 1 -0.009766,-0.0039 0.15001501,0.15001501 0 0 1 -0.0136719,-0.0059 0.15001501,0.15001501 0 0 1 -0.003906,-0.002 0.15001501,0.15001501 0 0 1 -0.009766,-0.0059 0.15001501,0.15001501 0 0 1 -0.003906,-0.002 0.15001501,0.15001501 0 0 1 -0.007813,-0.0059 0.15001501,0.15001501 0 0 1 -0.003906,-0.002 0.15001501,0.15001501 0 0 1 -0.007813,-0.0078 0.15001501,0.15001501 0 0 1 -0.001953,-0.002 0.15001501,0.15001501 0 0 1 -0.007813,-0.0098 0.15001501,0.15001501 0 0 1 -0.009766,-0.01172 0.15001501,0.15001501 0 0 1 -0.001953,-0.002 0.15001501,0.15001501 0 0 1 -0.003906,-0.0059 0.15001501,0.15001501 0 0 1 -0.001953,-0.0059 0.15001501,0.15001501 0 0 1 -0.005859,-0.01172 0.15001501,0.15001501 0 0 1 -0.001953,-0.0039 0.15001501,0.15001501 0 0 1 -0.003906,-0.0098 0.15001501,0.15001501 0 0 1 -0.001953,-0.0039 0.15001501,0.15001501 0 0 1 -0.001953,-0.0078 0.15001501,0.15001501 0 0 1 0,-0.0078 0.15001501,0.15001501 0 0 1 -0.001953,-0.0098 0.15001501,0.15001501 0 0 1 0,-0.0039 0.15001501,0.15001501 0 0 1 0.001953,-0.04492 0.15001501,0.15001501 0 0 1 0.001953,-0.01172 0.15001501,0.15001501 0 0 1 0.001953,-0.0039 0.15001501,0.15001501 0 0 1 0.003906,-0.0098 0.15001501,0.15001501 0 0 1 0.001953,-0.0039 0.15001501,0.15001501 0 0 1 0.007813,-0.01367 0.15001501,0.15001501 0 0 1 0.003906,-0.0078 0.15001501,0.15001501 0 0 1 0.0195312,-0.02344 0.15001501,0.15001501 0 0 1 0.005859,-0.0059 l 0.003906,-0.0039 L 18.673828,1.1503906 H 11.021484 L 8.40625,1.8046875 7.125,3.0859375 5.1386719,7.0566406 l -0.00391,0.00977 a 0.15001501,0.15001501 0 0 1 -0.044922,0.054688 0.15001501,0.15001501 0 0 1 -0.011719,0.00781 0.15001501,0.15001501 0 0 1 -0.00781,0.00586 0.15001501,0.15001501 0 0 1 -0.019531,0.00781 0.15001501,0.15001501 0 0 1 -0.013672,0.00391 0.15001501,0.15001501 0 0 1 -0.00977,0.00195 0.15001501,0.15001501 0 0 1 -0.00781,0.00195 0.15001501,0.15001501 0 0 1 -0.021484,0.00195 0.15001501,0.15001501 0 0 1 -0.00586,0 0.15001501,0.15001501 0 0 1 -0.00977,-0.00195 0.15001501,0.15001501 0 0 1 -0.00586,0 0.15001501,0.15001501 0 0 1 -0.023437,-0.00586 0.15001501,0.15001501 0 0 1 -0.00586,-0.00195 0.15001501,0.15001501 0 0 1 -0.00781,-0.00195 0.15001501,0.15001501 0 0 1 -0.00586,-0.00391 0.15001501,0.15001501 0 0 1 -0.00781,-0.00391 0.15001501,0.15001501 0 0 1 -0.011719,-0.00781 0.15001501,0.15001501 0 0 1 -0.00586,-0.00391 0.15001501,0.15001501 0 0 1 -0.00586,-0.00586 0.15001501,0.15001501 0 0 1 -0.00586,-0.00391 0.15001501,0.15001501 0 0 1 -0.00586,-0.00586 0.15001501,0.15001501 0 0 1 -0.00391,-0.00391 0.15001501,0.15001501 0 0 1 -0.00586,-0.00781 0.15001501,0.15001501 0 0 1 -0.00391,-0.00391 0.15001501,0.15001501 0 0 1 -0.00391,-0.00781 0.15001501,0.15001501 0 0 1 -0.00391,-0.00586 0.15001501,0.15001501 0 0 1 -0.00391,-0.00781 0.15001501,0.15001501 0 0 1 -0.00391,-0.00586 0.15001501,0.15001501 0 0 1 -0.00195,-0.00781 0.15001501,0.15001501 0 0 1 -0.00195,-0.00586 0.15001501,0.15001501 0 0 1 -0.00195,-0.00781 0.15001501,0.15001501 0 0 1 -0.00195,-0.00586 0.15001501,0.15001501 0 0 1 -0.00195,-0.00781 0.15001501,0.15001501 0 0 1 -0.00195,-0.00781 0.15001501,0.15001501 0 0 1 0,-0.00781 0.15001501,0.15001501 0 0 1 0,-0.00586 0.15001501,0.15001501 0 0 1 0,-0.00977 0.15001501,0.15001501 0 0 1 0,-0.00586 0.15001501,0.15001501 0 0 1 0.00195,-0.00781 0.15001501,0.15001501 0 0 1 0,-0.00781 0.15001501,0.15001501 0 0 1 0.00195,-0.00586 0.15001501,0.15001501 0 0 1 0.00195,-0.00781 0.15001501,0.15001501 0 0 1 0.00195,-0.00781 l 0.00195,-0.00586 a 0.15001501,0.15001501 0 0 1 0.00586,-0.013672 L 5.8515625,3.9726562 A 0.15001501,0.15001501 0 0 1 5.8632812,3.9375 L 6.8574219,0.953125 A 0.15001501,0.15001501 0 0 1 7,0.84960938 h 0.9785156 a 0.15001501,0.15001501 0 0 1 0.015625,-0.001953 z"
     id="path2" />
</svg>
