<?xml version="1.0" encoding="UTF-8"?>
<glyph name="bar" format="1">
  <advance width="231"/>
  <unicode hex="007C"/>
  <outline>
    <contour>
      <point x="116" y="738" type="curve" smooth="yes"/>
      <point x="120" y="738"/>
      <point x="123" y="736"/>
      <point x="123" y="732" type="curve" smooth="yes"/>
      <point x="123" y="-195" type="line" smooth="yes"/>
      <point x="123" y="-199"/>
      <point x="120" y="-202"/>
      <point x="116" y="-202" type="curve" smooth="yes"/>
      <point x="112" y="-202"/>
      <point x="109" y="-199"/>
      <point x="109" y="-195" type="curve" smooth="yes"/>
      <point x="109" y="732" type="line" smooth="yes"/>
      <point x="109" y="736"/>
      <point x="112" y="738"/>
    </contour>
  </outline>
  <lib>
    <dict>
      <key>com.fontlab.hintData</key>
      <dict>
        <key>vhints</key>
        <array>
          <dict>
            <key>position</key>
            <integer>109</integer>
            <key>width</key>
            <integer>14</integer>
          </dict>
        </array>
      </dict>
    </dict>
  </lib>
</glyph>
