<?xml version="1.0" encoding="UTF-8" standalone="no"?>
<svg
   xmlns:dc="http://purl.org/dc/elements/1.1/"
   xmlns:cc="http://creativecommons.org/ns#"
   xmlns:rdf="http://www.w3.org/1999/02/22-rdf-syntax-ns#"
   xmlns:svg="http://www.w3.org/2000/svg"
   xmlns="http://www.w3.org/2000/svg"
   xmlns:sodipodi="http://sodipodi.sourceforge.net/DTD/sodipodi-0.dtd"
   xmlns:inkscape="http://www.inkscape.org/namespaces/inkscape"
   data-dec="69"
   width="19"
   height="40"
   version="1.1"
   id="svg4"
   sodipodi:docname="69.svg"
   inkscape:version="0.92.4 (unknown)">
  <metadata
     id="metadata10">
    <rdf:RDF>
      <cc:Work
         rdf:about="">
        <dc:format>image/svg+xml</dc:format>
        <dc:type
           rdf:resource="http://purl.org/dc/dcmitype/StillImage" />
      </cc:Work>
    </rdf:RDF>
  </metadata>
  <defs
     id="defs8" />
  <sodipodi:namedview
     pagecolor="#ffffff"
     bordercolor="#666666"
     borderopacity="1"
     objecttolerance="10"
     gridtolerance="10"
     guidetolerance="10"
     inkscape:pageopacity="0"
     inkscape:pageshadow="2"
     inkscape:window-width="640"
     inkscape:window-height="480"
     id="namedview6"
     showgrid="false"
     inkscape:zoom="5.9"
     inkscape:cx="9.5"
     inkscape:cy="20"
     inkscape:window-x="0"
     inkscape:window-y="27"
     inkscape:window-maximized="0"
     inkscape:current-layer="svg4" />
  <path
     style="color:#000000;font-style:normal;font-variant:normal;font-weight:normal;font-stretch:normal;font-size:medium;line-height:normal;font-family:sans-serif;font-variant-ligatures:normal;font-variant-position:normal;font-variant-caps:normal;font-variant-numeric:normal;font-variant-alternates:normal;font-feature-settings:normal;text-indent:0;text-align:start;text-decoration:none;text-decoration-line:none;text-decoration-style:solid;text-decoration-color:#000000;letter-spacing:normal;word-spacing:normal;text-transform:none;writing-mode:lr-tb;direction:ltr;text-orientation:mixed;dominant-baseline:auto;baseline-shift:baseline;text-anchor:start;white-space:normal;shape-padding:0;clip-rule:nonzero;display:inline;overflow:visible;visibility:visible;opacity:1;isolation:auto;mix-blend-mode:normal;color-interpolation:sRGB;color-interpolation-filters:linearRGB;solid-color:#000000;solid-opacity:1;vector-effect:none;fill:#000000;fill-opacity:1;fill-rule:nonzero;stroke:none;stroke-width:1.5;stroke-linecap:round;stroke-linejoin:round;stroke-miterlimit:4;stroke-dasharray:none;stroke-dashoffset:0;stroke-opacity:1;color-rendering:auto;image-rendering:auto;shape-rendering:auto;text-rendering:auto;enable-background:accumulate"
     d="M 3.9882812,0.24023438 A 0.750075,0.750075 0 0 1 4.1230469,0.25 h 0.7539062 a 0.750075,0.750075 0 0 1 0.2460938,0 h 6.8105471 a 0.750075,0.750075 0 0 1 0.11914,0 H 17 A 0.750075,0.750075 0 0 1 17.75,1 V 4 A 0.750075,0.750075 0 0 1 16.330078,4.3359375 L 15.484375,2.6445312 11.904297,1.75 H 5.75 v 8.5 h 6.074219 L 13.556641,9.3828125 14.46875,8.46875 A 0.750075,0.750075 0 0 1 15.75,9 v 1.876953 a 0.750075,0.750075 0 0 1 0,0.246094 V 13 a 0.750075,0.750075 0 0 1 -1.28125,0.53125 L 13.556641,12.617188 11.824219,11.75 H 5.75 v 8.9375 L 6.3125,21.25 h 6.568359 l 2.832032,-0.945312 1.951171,-0.97461 a 0.750075,0.750075 0 0 1 1.00586,1.00586 l -1,2 A 0.750075,0.750075 0 0 1 17,22.75 h -3.945312 a 0.750075,0.750075 0 0 1 -0.126954,0 H 6.1074219 a 0.750075,0.750075 0 0 1 -0.1992188,0 H 5.1230469 a 0.750075,0.750075 0 0 1 -0.2460938,0 H 4.1230469 a 0.750075,0.750075 0 0 1 -0.2460938,0 H 3 2 a 0.750075,0.750075 0 0 1 0,-1.5 H 2.6894531 L 3.25,20.6875 V 2.3125 L 2.6894531,1.75 H 2 a 0.750075,0.750075 0 0 1 0,-1.5 h 1 0.8769531 a 0.750075,0.750075 0 0 1 0.1113281,-0.009766 z"
     id="path2" />
</svg>
