<?xml version="1.0" encoding="UTF-8" standalone="no"?>
<svg
   xmlns:dc="http://purl.org/dc/elements/1.1/"
   xmlns:cc="http://creativecommons.org/ns#"
   xmlns:rdf="http://www.w3.org/1999/02/22-rdf-syntax-ns#"
   xmlns:svg="http://www.w3.org/2000/svg"
   xmlns="http://www.w3.org/2000/svg"
   xmlns:sodipodi="http://sodipodi.sourceforge.net/DTD/sodipodi-0.dtd"
   xmlns:inkscape="http://www.inkscape.org/namespaces/inkscape"
   data-dec="83"
   width="20"
   height="40"
   version="1.1"
   id="svg4"
   sodipodi:docname="83.svg"
   inkscape:version="0.92.4 5da689c313, 2019-01-14">
  <metadata
     id="metadata10">
    <rdf:RDF>
      <cc:Work
         rdf:about="">
        <dc:format>image/svg+xml</dc:format>
        <dc:type
           rdf:resource="http://purl.org/dc/dcmitype/StillImage" />
        <dc:title></dc:title>
      </cc:Work>
    </rdf:RDF>
  </metadata>
  <defs
     id="defs8" />
  <sodipodi:namedview
     pagecolor="#ffffff"
     bordercolor="#666666"
     borderopacity="1"
     objecttolerance="10"
     gridtolerance="10"
     guidetolerance="10"
     inkscape:pageopacity="0"
     inkscape:pageshadow="2"
     inkscape:window-width="1920"
     inkscape:window-height="1043"
     id="namedview6"
     showgrid="false"
     inkscape:zoom="5.9"
     inkscape:cx="10"
     inkscape:cy="20"
     inkscape:window-x="0"
     inkscape:window-y="37"
     inkscape:window-maximized="0"
     inkscape:current-layer="svg4" />
  <path
     style="color:#000000;font-style:normal;font-variant:normal;font-weight:normal;font-stretch:normal;font-size:medium;line-height:normal;font-family:sans-serif;font-variant-ligatures:normal;font-variant-position:normal;font-variant-caps:normal;font-variant-numeric:normal;font-variant-alternates:normal;font-feature-settings:normal;text-indent:0;text-align:start;text-decoration:none;text-decoration-line:none;text-decoration-style:solid;text-decoration-color:#000000;letter-spacing:normal;word-spacing:normal;text-transform:none;writing-mode:lr-tb;direction:ltr;text-orientation:mixed;dominant-baseline:auto;baseline-shift:baseline;text-anchor:start;white-space:normal;shape-padding:0;clip-rule:nonzero;display:inline;overflow:visible;visibility:visible;opacity:1;isolation:auto;mix-blend-mode:normal;color-interpolation:sRGB;color-interpolation-filters:linearRGB;solid-color:#000000;solid-opacity:1;vector-effect:none;fill:#000000;fill-opacity:1;fill-rule:nonzero;stroke:none;stroke-width:3;stroke-linecap:round;stroke-linejoin:round;stroke-miterlimit:4;stroke-dasharray:none;stroke-dashoffset:0;stroke-opacity:1;color-rendering:auto;image-rendering:auto;shape-rendering:auto;text-rendering:auto;enable-background:accumulate"
     d="m 8,-0.5 h 4 a 1.50015,1.50015 0 0 1 0.474609,0.0761719 l 3,1 a 1.50015,1.50015 0 0 1 0.585938,0.36328124 l 2,1.99999998 a 1.50015,1.50015 0 1 1 -2.121094,2.1210938 l -1.75,-1.75 L 11.755859,2.5 H 8.2441406 L 5.8105469,3.3105469 4.5,4.6210938 v 1.0253906 l 0.7324219,1.4648437 0.65625,0.65625 1.6875,0.84375 5.8984371,1.9648439 a 1.50015,1.50015 0 0 1 0.195313,0.08203 l 2,1 a 1.50015,1.50015 0 0 1 0.390625,0.28125 l 1,1 a 1.50015,1.50015 0 0 1 0.28125,0.390625 l 1,2 A 1.50015,1.50015 0 0 1 18.5,16 v 3 a 1.50015,1.50015 0 0 1 -0.439453,1.060547 l -2,2 a 1.50015,1.50015 0 0 1 -0.585938,0.363281 l -3,1 A 1.50015,1.50015 0 0 1 12,23.5 H 8 a 1.50015,1.50015 0 0 1 -0.4746094,-0.07617 l -3,-1 A 1.50015,1.50015 0 0 1 3.9394531,22.060547 l -2,-2 a 1.50015,1.50015 0 1 1 2.1210938,-2.121094 l 1.75,1.75 L 8.2441406,20.5 H 11.755859 L 14.189453,19.689453 15.5,18.378906 v -2.02539 l -0.732422,-1.464844 -0.65625,-0.65625 -1.6875,-0.84375 -5.8984374,-1.964844 a 1.50015,1.50015 0 0 1 -0.1953125,-0.08203 l -2,-1 a 1.50015,1.50015 0 0 1 -0.390625,-0.28125 l -1,-1.0000001 a 1.50015,1.50015 0 0 1 -0.28125,-0.390625 l -1,-2 A 1.50015,1.50015 0 0 1 1.5,6 V 4 A 1.50015,1.50015 0 0 1 1.9394531,2.9394531 l 2,-1.99999998 A 1.50015,1.50015 0 0 1 4.5253906,0.57617188 l 3,-1 A 1.50015,1.50015 0 0 1 8,-0.5 Z"
     id="path2" />
</svg>
