<?xml version="1.0" encoding="UTF-8"?>
<glyph name="W" format="1">
  <advance width="694"/>
  <unicode hex="0057"/>
  <outline>
    <contour>
      <point x="125" y="585" type="line"/>
      <point x="126" y="579" type="line"/>
      <point x="147" y="558" type="line" smooth="yes"/>
      <point x="148" y="557"/>
      <point x="150" y="555"/>
      <point x="150" y="554" type="curve" smooth="yes"/>
      <point x="150" y="552"/>
      <point x="147" y="550"/>
      <point x="145" y="550" type="curve" smooth="yes"/>
      <point x="144" y="550"/>
      <point x="143" y="550"/>
      <point x="142" y="551" type="curve" smooth="yes"/>
      <point x="130" y="563" type="line"/>
      <point x="228" y="51" type="line"/>
      <point x="228" y="148" type="line"/>
      <point x="146" y="580" type="line"/>
      <point x="145" y="579" type="line"/>
      <point x="143" y="579" type="line"/>
    </contour>
    <contour>
      <point x="539" y="608" type="line"/>
      <point x="579" y="588" type="line"/>
      <point x="618" y="608" type="line"/>
    </contour>
    <contour>
      <point x="382" y="608" type="line"/>
      <point x="468" y="150" type="line"/>
      <point x="468" y="148" type="line"/>
      <point x="468" y="48" type="line"/>
      <point x="487" y="150" type="line"/>
      <point x="402" y="608" type="line"/>
    </contour>
    <contour>
      <point x="353" y="608" type="line"/>
      <point x="459" y="51" type="line"/>
      <point x="459" y="148" type="line"/>
      <point x="373" y="608" type="line"/>
    </contour>
    <contour>
      <point x="206" y="608" type="line"/>
      <point x="202" y="603" type="line"/>
      <point x="213" y="608" type="line"/>
    </contour>
    <contour>
      <point x="179" y="608" type="line"/>
      <point x="182" y="592" type="line"/>
      <point x="189" y="596" type="line"/>
      <point x="196" y="608" type="line"/>
    </contour>
    <contour>
      <point x="150" y="608" type="line"/>
      <point x="235" y="150" type="line"/>
      <point x="235" y="148" type="line"/>
      <point x="235" y="48" type="line"/>
      <point x="256" y="150" type="line"/>
      <point x="179" y="557" type="line"/>
      <point x="177" y="552" type="line" smooth="yes"/>
      <point x="176" y="551"/>
      <point x="175" y="550"/>
      <point x="174" y="550" type="curve" smooth="yes"/>
      <point x="172" y="550"/>
      <point x="169" y="552"/>
      <point x="169" y="554" type="curve" smooth="yes"/>
      <point x="169" y="557" type="line"/>
      <point x="177" y="571" type="line"/>
      <point x="176" y="580" type="line"/>
      <point x="174" y="579" type="line" smooth="yes"/>
      <point x="172" y="579"/>
      <point x="169" y="581"/>
      <point x="169" y="583" type="curve" smooth="yes"/>
      <point x="169" y="584"/>
      <point x="171" y="586"/>
      <point x="172" y="587" type="curve" smooth="yes"/>
      <point x="174" y="588" type="line"/>
      <point x="170" y="608" type="line"/>
    </contour>
    <contour>
      <point x="121" y="608" type="line"/>
      <point x="123" y="595" type="line"/>
      <point x="145" y="587" type="line"/>
      <point x="141" y="608" type="line"/>
    </contour>
    <contour>
      <point x="97" y="608" type="line"/>
      <point x="103" y="602" type="line"/>
      <point x="114" y="598" type="line"/>
      <point x="112" y="608" type="line"/>
    </contour>
    <contour>
      <point x="85" y="608" type="line"/>
      <point x="86" y="607" type="line"/>
    </contour>
    <contour>
      <point x="87" y="617" type="line"/>
      <point x="87" y="616" type="line"/>
      <point x="116" y="616" type="line"/>
      <point x="116" y="617" type="line"/>
      <point x="117" y="616" type="line"/>
      <point x="144" y="616" type="line"/>
      <point x="145" y="617" type="line"/>
      <point x="145" y="616" type="line"/>
      <point x="173" y="616" type="line"/>
      <point x="174" y="617" type="line"/>
      <point x="174" y="616" type="line"/>
      <point x="202" y="616" type="line"/>
      <point x="202" y="617" type="line"/>
      <point x="204" y="616" type="line"/>
      <point x="231" y="616" type="line"/>
      <point x="232" y="616" type="line"/>
      <point x="261" y="616" type="line" smooth="yes"/>
      <point x="263" y="616"/>
      <point x="265" y="615"/>
      <point x="265" y="613" type="curve" smooth="yes"/>
      <point x="265" y="611"/>
      <point x="263" y="608"/>
      <point x="261" y="608" type="curve" smooth="yes"/>
      <point x="232" y="608" type="line"/>
      <point x="196" y="590" type="line"/>
      <point x="186" y="570" type="line"/>
      <point x="261" y="173" type="line"/>
      <point x="343" y="612" type="line"/>
      <point x="343" y="614" type="line"/>
      <point x="343" y="615" type="line"/>
      <point x="344" y="615" type="line"/>
      <point x="344" y="616" type="line"/>
      <point x="345" y="616" type="line"/>
      <point x="346" y="616" type="line"/>
      <point x="348" y="617" type="line"/>
      <point x="348" y="616" type="line"/>
      <point x="376" y="616" type="line"/>
      <point x="376" y="617" type="line"/>
      <point x="376" y="616" type="line"/>
      <point x="405" y="616" type="line"/>
      <point x="405" y="617" type="line"/>
      <point x="406" y="616" type="line"/>
      <point x="407" y="616" type="line"/>
      <point x="408" y="616" type="line"/>
      <point x="408" y="615" type="line"/>
      <point x="409" y="615" type="line"/>
      <point x="409" y="614" type="line"/>
      <point x="409" y="613" type="line"/>
      <point x="409" y="612" type="line"/>
      <point x="492" y="172" type="line"/>
      <point x="574" y="581" type="line"/>
      <point x="520" y="608" type="line"/>
      <point x="492" y="608" type="line" smooth="yes"/>
      <point x="490" y="608"/>
      <point x="487" y="611"/>
      <point x="487" y="613" type="curve" smooth="yes"/>
      <point x="487" y="615"/>
      <point x="490" y="616"/>
      <point x="492" y="616" type="curve" smooth="yes"/>
      <point x="520" y="616" type="line"/>
      <point x="521" y="616" type="line"/>
      <point x="637" y="616" type="line"/>
      <point x="666" y="616" type="line" smooth="yes"/>
      <point x="668" y="616"/>
      <point x="670" y="615"/>
      <point x="670" y="613" type="curve" smooth="yes"/>
      <point x="670" y="611"/>
      <point x="668" y="608"/>
      <point x="666" y="608" type="curve" smooth="yes"/>
      <point x="638" y="608" type="line"/>
      <point x="583" y="581" type="line"/>
      <point x="496" y="148" type="line"/>
      <point x="496" y="147" type="line"/>
      <point x="468" y="4" type="line"/>
      <point x="468" y="3" type="line"/>
      <point x="468" y="2" type="line"/>
      <point x="466" y="2" type="line"/>
      <point x="466" y="1" type="line"/>
      <point x="465" y="1" type="line"/>
      <point x="465" y="0" type="line"/>
      <point x="464" y="0" type="line"/>
      <point x="463" y="0" type="line"/>
      <point x="462" y="0" type="line"/>
      <point x="461" y="0" type="line"/>
      <point x="461" y="1" type="line"/>
      <point x="460" y="1" type="line"/>
      <point x="460" y="2" type="line"/>
      <point x="459" y="2" type="line"/>
      <point x="459" y="3" type="line"/>
      <point x="459" y="4" type="line"/>
      <point x="348" y="588" type="line"/>
      <point x="265" y="148" type="line"/>
      <point x="265" y="147" type="line"/>
      <point x="235" y="4" type="line"/>
      <point x="235" y="3" type="line"/>
      <point x="235" y="2" type="line"/>
      <point x="235" y="1" type="line"/>
      <point x="234" y="1" type="line"/>
      <point x="233" y="0" type="line"/>
      <point x="232" y="0" type="line"/>
      <point x="231" y="0" type="line"/>
      <point x="230" y="0" type="line"/>
      <point x="229" y="1" type="line"/>
      <point x="228" y="1" type="line"/>
      <point x="228" y="2" type="line"/>
      <point x="228" y="3" type="line"/>
      <point x="228" y="4" type="line"/>
      <point x="119" y="574" type="line"/>
      <point x="99" y="594" type="line"/>
      <point x="57" y="608" type="line"/>
      <point x="29" y="608" type="line" smooth="yes"/>
      <point x="27" y="608"/>
      <point x="24" y="611"/>
      <point x="24" y="613" type="curve" smooth="yes"/>
      <point x="24" y="615"/>
      <point x="27" y="616"/>
      <point x="29" y="616" type="curve" smooth="yes"/>
      <point x="57" y="616" type="line"/>
      <point x="58" y="616" type="line"/>
      <point x="87" y="616" type="line"/>
    </contour>
  </outline>
  <lib>
    <dict>
      <key>com.fontlab.hintData</key>
      <dict>
        <key>hhints</key>
        <array>
          <dict>
            <key>position</key>
            <integer>0</integer>
            <key>width</key>
            <integer>23</integer>
          </dict>
          <dict>
            <key>position</key>
            <integer>608</integer>
            <key>width</key>
            <integer>8</integer>
          </dict>
        </array>
        <key>vhints</key>
        <array>
          <dict>
            <key>position</key>
            <integer>141</integer>
            <key>width</key>
            <integer>9</integer>
          </dict>
          <dict>
            <key>position</key>
            <integer>170</integer>
            <key>width</key>
            <integer>9</integer>
          </dict>
          <dict>
            <key>position</key>
            <integer>228</integer>
            <key>width</key>
            <integer>8</integer>
          </dict>
          <dict>
            <key>position</key>
            <integer>343</integer>
            <key>width</key>
            <integer>66</integer>
          </dict>
          <dict>
            <key>position</key>
            <integer>373</integer>
            <key>width</key>
            <integer>9</integer>
          </dict>
          <dict>
            <key>position</key>
            <integer>459</integer>
            <key>width</key>
            <integer>9</integer>
          </dict>
        </array>
      </dict>
    </dict>
  </lib>
</glyph>
