 { 
 	"name":{

 		"label": "Name",
 		"type": "text",
 		"no_spec_char": 1,
 		"required": 1,
 		"maxlength": 20,
 		"pattern": ".{3,20}",
 		"title": "Between 3 and 20 characters"
 	},

 	"pass":{

 		"label": "Password",
 		"type": "password",
 		"required": 1,
 		"maxlength": 50,
 		"pattern": ".{8,50}",
 		"title": "Between 8 and 50 characters"
 	},

 	"pass_confirm":{

 		"label": "Password again",
 		"type": "password",
 		"required": 1,
 		"maxlength": 50,
 		"pattern": ".{8,50}",
 		"title": "Between 8 and 50 characters"
 	},

 	"admin":{

 		"label":"Admin",
 		"type":"radio",
 		"required":1,
 		"values":[
 			{
 				"name":1,
 				"label":"Yes"
 			},
 			{
 				"name":0,
 				"label":"No",
 				"checked": 1

 			}
 		]
 	}
 }