This is MetaPost, version 1.9991 (TeX Live 2016/Debian) (kpathsea version 6.2.2)  14 OCT 2022 16:34
**dessin.mp
(/usr/share/texlive/texmf-dist/metapost/base/mpost.mp
(/usr/share/texlive/texmf-dist/metapost/base/plain.mp
Preloading the plain mem file, version 1.005) ) (./dessin.mp (./def.mp)
(/usr/share/texlive/texmf-dist/metapost/base/boxes.mp)
! A statement can't begin with `withcolor'.
<to be read again> 
                   withcolor
l.55   drawboxed(a,b,c,d,e,f,g) withcolor
                                          blue;
I was looking for the beginning of a new statement.
If you just proceed without changing anything, I'll ignore
everything up to the next `;'. Please insert a semicolon
now in front of anything that you don't want me to delete.
(See Chapter 27 of The METAFONTbook for an example.)

! Extra tokens will be flushed.
<to be read again> 
                   withcolor
l.55   drawboxed(a,b,c,d,e,f,g) withcolor
                                          blue;
I've just read as much of that statement as I could fathom,
so a semicolon should have been next. It's very puzzling...
but I'll try to get myself back together, by ignoring
everything up to the next `;'. Please insert a semicolon
now in front of anything that you don't want me to delete.
(See Chapter 27 of The METAFONTbook for an example.)

 [1{psfonts.map}<cmr10.pfb>] )
1 output file written: dessin.1

