{
  "font_family": "Hershey-Noailles-symbolic",
  "font_size": 10,
  "glyphs": ["t", "a"],
  "color_pick": ["#0000fe"],
  "colors_glyphs": ["white", "white", "blue"],
  "frequency": [1, 1],
  "rotate": 0,
  "var_rotate": [0, 0],
  "translate_x": 0,
  "increment_transx": 0,
  "translate_y": 0,
  "increment_transy": 0,
  "scan": ["all"]
}
