<?xml version="1.0"?>
<!-- Created by MetaPost 2.000 on 2017.10.27:1716 -->
<svg version="1.1" xmlns="http://www.w3.org/2000/svg" xmlns:xlink="http://www.w3.org/1999/xlink" width="797.509277" height="797.509277" viewBox="0 0 797.509277 797.509277">
<!-- Original BoundingBox: -0.250000 -0.250000 797.259277 797.259277 -->
  <path d="M0.000000 797.000000L398.504639 -0.009277L797.009277 797.000000" style="stroke:rgb(0.000000%,0.000000%,0.000000%); stroke-width: 0.500000;stroke-linecap: round;stroke-linejoin: round;stroke-miterlimit: 10.000000;fill: none;"></path>
</svg>
