# Generated by Visualization Toolkit
v -12.32383827062672 -32.390168420053584 -25
v -12.32383827062672 -32.39016842005359 25
v -31.860394695090413 13.635074252568442 -25
v -31.860394695090413 13.635074252568439 25
v -31.860394695090413 13.635074252568442 -25
v -12.32383827062672 -32.39016842005359 25
v 35.542414108900175 -12.072149738611344 -25
v 16.005857684436485 33.953092934010684 -25
v 35.542414108900175 -12.072149738611348 25
v 16.005857684436485 33.953092934010684 25
v 35.542414108900175 -12.072149738611348 25
v 16.005857684436485 33.953092934010684 -25
v -12.32383827062672 -32.390168420053584 -25
v 35.542414108900175 -12.072149738611344 -25
v -12.32383827062672 -32.39016842005359 25
v 35.542414108900175 -12.072149738611348 25
v -12.32383827062672 -32.39016842005359 25
v 35.542414108900175 -12.072149738611344 -25
v -31.860394695090413 13.635074252568442 -25
v -31.860394695090413 13.635074252568439 25
v 16.005857684436485 33.953092934010684 -25
v 16.005857684436485 33.953092934010684 25
v 16.005857684436485 33.953092934010684 -25
v -31.860394695090413 13.635074252568439 25
v -12.32383827062672 -32.390168420053584 -25
v -31.860394695090413 13.635074252568442 -25
v 35.542414108900175 -12.072149738611344 -25
v 16.005857684436485 33.953092934010684 -25
v 35.542414108900175 -12.072149738611344 -25
v -31.860394695090413 13.635074252568442 -25
v -12.32383827062672 -32.39016842005359 25
v 35.542414108900175 -12.072149738611348 25
v -31.860394695090413 13.635074252568439 25
v 16.005857684436485 33.953092934010684 25
v -31.860394695090413 13.635074252568439 25
v 35.542414108900175 -12.072149738611348 25
f 1 2 3
f 4 5 6
f 7 8 9
f 10 11 12
f 13 14 15
f 16 17 18
f 19 20 21
f 22 23 24
f 25 26 27
f 28 29 30
f 31 32 33
f 34 35 36
