# Aspose.3D Wavefront OBJ Exporter
# Copyright 2004-2021 Aspose Pty Ltd.
# File created: 8/31/2021 8:03:54 AM


#
# object ascii
#

v -5 -5 -5
v -5 -5 5
v -5 5 -5
v -5 5 5
v -5 5 -5
v -5 -5 5
v 5 -5 -5
v 5 5 -5
v 5 -5 5
v 5 5 5
v 5 -5 5
v 5 5 -5
v -5 -5 -5
v 5 -5 -5
v -5 -5 5
v 5 -5 5
v -5 -5 5
v 5 -5 -5
v -5 5 -5
v -5 5 5
v 5 5 -5
v 5 5 5
v 5 5 -5
v -5 5 5
v -5 -5 -5
v -5 5 -5
v 5 -5 -5
v 5 5 -5
v 5 -5 -5
v -5 5 -5
v -5 -5 5
v 5 -5 5
v -5 5 5
v 5 5 5
v -5 5 5
v 5 -5 5
# 36 vertices

vn -1 0 0
vn 1 0 0
vn -1 0 0
vn 1 0 0
vn -1 0 0
vn 1 0 0
vn -1 0 0
vn 1 0 0
vn -1 0 0
vn 1 0 0
vn -1 0 0
vn 1 0 0
# 12 vertex normals

g ascii
s 1
f 1//1 2//1 3//1
f 4//2 5//2 6//2
f 7//3 8//3 9//3
f 10//4 11//4 12//4
f 13//5 14//5 15//5
f 16//6 17//6 18//6
f 19//7 20//7 21//7
f 22//8 23//8 24//8
f 25//9 26//9 27//9
f 28//10 29//10 30//10
f 31//11 32//11 33//11
f 34//12 35//12 36//12
#12 polygons

