{
    "layer": "top", 						// Waybar at top layer
    "position": "bottom", 					// Waybar position (top|bottom|left|right)
    "height": 45, 							// Waybar height (to be removed for auto height)
    "spacing": 0, 							// Gaps between modules (4px)
    "gtk-layer-shell": true,
    "fixed-center": true,
    
    // # LEFT MODULES #
    // #______________#
    "modules-left": [
    "custom/wofi_launcher", 
    "hyprland/workspaces", 
    "wlr/taskbar"
    ],
    
    // # CENTER MODULES #
    // #________________#
    //"modules-center": ["wlr/taskbar"],
    
    // # RIGHT MODULES #
    // #_______________#
    "modules-right": [
		"temperature", 
		"cpu", 
		"memory", 
		//"pulseaudio", 
		//"pulseaudio#microphone", 
		"hyprland/language", 
		"clock", 
		"tray",
		"custom/notification"
		//"custom/power_btn"
    ],
    
    // # MODULES # :
    // #_________#
    
    // Launcher :
    "custom/wofi_launcher": {
        "format": "",
        "on-click": "rofi -show drun -theme ~/.config/waybar/rofi/config.rasi",
        "tooltip": false
    },
    
    // Workspaces :
	"hyprland/workspaces": {
        "disable-scroll": true,
        "all-outputs": true,
        "on-click": "activate",
        //"persistent_workspaces": {
        //    "1": [],
        //    "2": [],
        //    "3": [],
        //    "4": [],
        //    "5": [],
        //    "6": [],
        //    "7": [],
        //    "8": [],
        //    "9": [],
        //    "10": []
        //},
        "format": "{icon}",
         "format-icons": {
             "urgent": "",
             "active": "",
             "default": ""
        }
    },
    
	// Windows :
    "hyprland/window": {
        "format": "{}",
        "max-length": 60,
		"separate-outputs": false
    },

	// Taskbar :
    "wlr/taskbar": {
        "format": "{icon}",
        "icon-size": 30,
        "tooltip-format": "{title}",
        "icon-theme" : "Papirus-Dark",
        "on-click": "activate",
        "on-click-right": "minimize",
        //"on-click-right": "close",
    },
    
    // Temperature :
    "temperature": {
        "thermal-zone": 1,
        "hwmon-path": ["/sys/class/hwmon/hwmon1/temp1_input"],
        "format": "<span color=\"#9d6d89\"></span> {temperatureC}°C",
        "critical-threshold": 65,
        "format-critical": "<span color=\"#9d6d89\"></span> {temperatureC}°C",
        "tooltip": false,
        "max-length": 10,
    },
    
    // CPU :
    "cpu": {
        "format": "<span color=\"#9d6d89\"></span> {usage}%",
        "tooltip": true,
        "max-length": 10,
    },
 
    // Memory :
    "memory": {
        "format": "<span color=\"#9d6d89\"></span> {used:0.1f} GB",
        "tooltip": false,
        "max-length": 10,
    },
    
    "pulseaudio": {
        "format": "{icon} {volume}%",
        "format-muted": "<span color=\"#9d6d89\"></span>",
        "on-click": "pamixer -t",
        "on-click-right": "pavucontrol",
        "on-scroll-up": "pamixer -i 5",
        "on-scroll-down": "pamixer -d 5",
        "scroll-step": 5,
        "format-icons": {
            "headphone": "",
            "hands-free": "",
            "headset": "",
            "phone": "",
            "portable": "",
            "car": "",
            "default": [
				"<span color=\"#9d6d89\"></span>", 
				"<span color=\"#9d6d89\"></span>", 
				"<span color=\"#9d6d89\"></span>"
            ]
        }
    },

    "pulseaudio#microphone": {
        "format": "{format_source}",
        "format-source": "<span color=\"#9d6d89\"></span> {volume}%",
        "format-source-muted": "<span color=\"#9d6d89\"></span>",
        "on-click": "pamixer --default-source -t",
        "on-click-right": "pavucontrol",
        "on-scroll-up": "pamixer --default-source -i 5",
        "on-scroll-down": "pamixer --default-source -d 5",
        "scroll-step": 5
    },

    // Keyboard Layouts :
	"hyprland/language": {
		"format": "{}",
		"format-fr": "🇫🇷",
		"format-ar": "🇩🇿"
	},
    
    // Clock :
    "clock": {
        // "tooltip-format": "<big>{:%Y %B}</big>\n<tt><small>{calendar}</small></tt>",
        "format": "<span color=\"#9d6d89\"></span> {:%H : %M}",
        "tooltip-format": "{:%A %d %B | %H:%M}",
        //"format-alt": "<span color=\"#9d6d89\"></span> {:%A %d %B | %H:%M}"
    },
  
	// Systray :
    "tray": {
        "icon-size": 21,
        "spacing": 15
    },
    
    "custom/notification": {
        "tooltip": false,
        "format": "{icon}",
        "format-icons": {
            "notification": "<span foreground='red'><sup></sup></span>",
            "none": "",
            "dnd-notification": "<span foreground='red'><sup></sup></span>",
            "dnd-none": "",
            "inhibited-notification": "<span foreground='red'><sup></sup></span>",
            "inhibited-none": "",
            "dnd-inhibited-notification": "<span foreground='red'><sup></sup></span>",
            "dnd-inhibited-none": ""
        },
        "return-type": "json",
        "exec-if": "which swaync-client",
        "exec": "swaync-client -swb",
        "on-click": "swaync-client -t -sw",
        "escape": true
    },
    
    "custom/power_btn": {
        "format": "",
        "on-click": "wlogout",
        "tooltip": false
    },

}
