Base path: 'C:/Program Files/Unity/Hub/Editor/2019.3.3f1/Editor/2021.3.24f1/Editor/Data', plugins path 'C:/Program Files/Unity/Hub/Editor/2019.3.3f1/Editor/2021.3.24f1/Editor/Data/PlaybackEngines'
Cmd: initializeCompiler

Cmd: shutdown
