%YAML 1.1
%TAG !u! tag:unity3d.com,2011:
--- !u!1045 &1
EditorBuildSettings:
  m_ObjectHideFlags: 0
  serializedVersion: 2
  m_Scenes:
  - enabled: 1
    path: Assets/Project/CarCoin/Scenes/GameScene.unity
    guid: 14a30207793797f4c9ad2e425ad53762
  - enabled: 1
    path: Assets/Project/CarCoin/Scenes/Menu.unity
    guid: c71f4fec25ac7e64f8d48a7225cc5905
  m_configObjects: {}
