Library\Bee\artifacts\mvdfrm\UnityEditor.UI.ref.dll_4C98D3F7040CD4F5.mvfrm
Library\Bee\artifacts\mvdfrm\UnityEngine.UI.ref.dll_08FEAA520A2EFD60.mvfrm
Library\Bee\artifacts\mvdfrm\UnityEditor.Graphs.dll_BCB614A34391FCA0.mvfrm
Library\Bee\artifacts\mvdfrm\UnityEditor.CoreModule.dll_76A6DDD9D8E9606E.mvfrm
Library\Bee\artifacts\mvdfrm\UnityEditor.DeviceSimulatorModule.dll_832F8C1DC7A19AB3.mvfrm
Library\Bee\artifacts\mvdfrm\UnityEditor.DiagnosticsModule.dll_65C8F135366B6841.mvfrm
Library\Bee\artifacts\mvdfrm\UnityEditor.dll_976E5AF2FC161DC7.mvfrm
Library\Bee\artifacts\mvdfrm\UnityEditor.GraphViewModule.dll_C39EE01956E48DF8.mvfrm
Library\Bee\artifacts\mvdfrm\UnityEditor.PackageManagerUIModule.dll_214983A18968304A.mvfrm
Library\Bee\artifacts\mvdfrm\UnityEditor.QuickSearchModule.dll_F0D872428F42649A.mvfrm
Library\Bee\artifacts\mvdfrm\UnityEditor.SceneTemplateModule.dll_DD014EBBAB3B9A5B.mvfrm
Library\Bee\artifacts\mvdfrm\UnityEditor.TextCoreFontEngineModule.dll_995A4960EF991E2C.mvfrm
Library\Bee\artifacts\mvdfrm\UnityEditor.TextCoreTextEngineModule.dll_E1427FD27F1CD74A.mvfrm
Library\Bee\artifacts\mvdfrm\UnityEditor.UIBuilderModule.dll_18278D35C99D072C.mvfrm
Library\Bee\artifacts\mvdfrm\UnityEditor.UIElementsModule.dll_6644C757080E44EA.mvfrm
Library\Bee\artifacts\mvdfrm\UnityEditor.UIElementsSamplesModule.dll_88319D346B955923.mvfrm
Library\Bee\artifacts\mvdfrm\UnityEditor.UIServiceModule.dll_51199E98B2D45746.mvfrm
Library\Bee\artifacts\mvdfrm\UnityEditor.UnityConnectModule.dll_CD4861AA12204624.mvfrm
Library\Bee\artifacts\mvdfrm\UnityEngine.AccessibilityModule.dll_0FA6BA52ABB1C1F8.mvfrm
Library\Bee\artifacts\mvdfrm\UnityEngine.AIModule.dll_E8D2671CC24A6D02.mvfrm
Library\Bee\artifacts\mvdfrm\UnityEngine.AndroidJNIModule.dll_E48DB02A512DB3C0.mvfrm
Library\Bee\artifacts\mvdfrm\UnityEngine.AnimationModule.dll_92245C423141629E.mvfrm
Library\Bee\artifacts\mvdfrm\UnityEngine.ARModule.dll_A2452C201F67CBCB.mvfrm
Library\Bee\artifacts\mvdfrm\UnityEngine.AssetBundleModule.dll_34C1A533F1A9198C.mvfrm
Library\Bee\artifacts\mvdfrm\UnityEngine.AudioModule.dll_BB090056442BEC10.mvfrm
Library\Bee\artifacts\mvdfrm\UnityEngine.ClothModule.dll_21F15D511E48CAF4.mvfrm
Library\Bee\artifacts\mvdfrm\UnityEngine.ClusterInputModule.dll_4CE4D6BFC3A818EA.mvfrm
Library\Bee\artifacts\mvdfrm\UnityEngine.ClusterRendererModule.dll_88DC4E8F375CA837.mvfrm
Library\Bee\artifacts\mvdfrm\UnityEngine.CoreModule.dll_99C7B12C80EECB99.mvfrm
Library\Bee\artifacts\mvdfrm\UnityEngine.CrashReportingModule.dll_89FEEF865FDE18D1.mvfrm
Library\Bee\artifacts\mvdfrm\UnityEngine.DirectorModule.dll_D5E586C72EF0B7F6.mvfrm
Library\Bee\artifacts\mvdfrm\UnityEngine.dll_CA12A1CB5A89AAAC.mvfrm
Library\Bee\artifacts\mvdfrm\UnityEngine.DSPGraphModule.dll_DB36E830A1518917.mvfrm
Library\Bee\artifacts\mvdfrm\UnityEngine.GameCenterModule.dll_0EDAFA45176EA4B1.mvfrm
Library\Bee\artifacts\mvdfrm\UnityEngine.GIModule.dll_810EB02A5DF9551C.mvfrm
Library\Bee\artifacts\mvdfrm\UnityEngine.GridModule.dll_7738CD1A99436190.mvfrm
Library\Bee\artifacts\mvdfrm\UnityEngine.HotReloadModule.dll_136D1A480C747E20.mvfrm
Library\Bee\artifacts\mvdfrm\UnityEngine.ImageConversionModule.dll_F4CE4C3FB981602B.mvfrm
Library\Bee\artifacts\mvdfrm\UnityEngine.IMGUIModule.dll_F3689FBD0A5D7FF1.mvfrm
Library\Bee\artifacts\mvdfrm\UnityEngine.InputLegacyModule.dll_C606C052899ACF7D.mvfrm
Library\Bee\artifacts\mvdfrm\UnityEngine.InputModule.dll_217EC806BA6410B4.mvfrm
Library\Bee\artifacts\mvdfrm\UnityEngine.JSONSerializeModule.dll_6FBE438EAAED2282.mvfrm
Library\Bee\artifacts\mvdfrm\UnityEngine.LocalizationModule.dll_8B31A1125B240BE3.mvfrm
Library\Bee\artifacts\mvdfrm\UnityEngine.ParticleSystemModule.dll_DD1138D2CDEFA45F.mvfrm
Library\Bee\artifacts\mvdfrm\UnityEngine.PerformanceReportingModule.dll_D5CA1BCE91963958.mvfrm
Library\Bee\artifacts\mvdfrm\UnityEngine.Physics2DModule.dll_DECA4C32D23E5A33.mvfrm
Library\Bee\artifacts\mvdfrm\UnityEngine.PhysicsModule.dll_71F3E319F340B8E1.mvfrm
Library\Bee\artifacts\mvdfrm\UnityEngine.ProfilerModule.dll_082BBFFDC84A3F03.mvfrm
Library\Bee\artifacts\mvdfrm\UnityEngine.RuntimeInitializeOnLoadManagerInitializerModule.dll_FB3479A61528B0FC.mvfrm
Library\Bee\artifacts\mvdfrm\UnityEngine.ScreenCaptureModule.dll_89A5F113BF594EE4.mvfrm
Library\Bee\artifacts\mvdfrm\UnityEngine.SharedInternalsModule.dll_78DF8B1530AF5B7B.mvfrm
Library\Bee\artifacts\mvdfrm\UnityEngine.SpriteMaskModule.dll_F8076CD538DE3A2B.mvfrm
Library\Bee\artifacts\mvdfrm\UnityEngine.SpriteShapeModule.dll_4E22D28EA74B5196.mvfrm
Library\Bee\artifacts\mvdfrm\UnityEngine.StreamingModule.dll_46B9499280C919DC.mvfrm
Library\Bee\artifacts\mvdfrm\UnityEngine.SubstanceModule.dll_23645DDBCC1C17EA.mvfrm
Library\Bee\artifacts\mvdfrm\UnityEngine.SubsystemsModule.dll_62B4D3370726223E.mvfrm
Library\Bee\artifacts\mvdfrm\UnityEngine.TerrainModule.dll_8C3A5E88C8FF01CF.mvfrm
Library\Bee\artifacts\mvdfrm\UnityEngine.TerrainPhysicsModule.dll_DD8BE1A5E7329EEC.mvfrm
Library\Bee\artifacts\mvdfrm\UnityEngine.TextCoreFontEngineModule.dll_17B9C4B40296DCF7.mvfrm
Library\Bee\artifacts\mvdfrm\UnityEngine.TextCoreTextEngineModule.dll_5FA1FB25921A9615.mvfrm
Library\Bee\artifacts\mvdfrm\UnityEngine.TextRenderingModule.dll_B2E5631E7690CED9.mvfrm
Library\Bee\artifacts\mvdfrm\UnityEngine.TilemapModule.dll_2B36C609E0BBE2D8.mvfrm
Library\Bee\artifacts\mvdfrm\UnityEngine.TLSModule.dll_9B12C7B774146975.mvfrm
Library\Bee\artifacts\mvdfrm\UnityEngine.UIElementsModule.dll_66F3349F0A525E35.mvfrm
Library\Bee\artifacts\mvdfrm\UnityEngine.UIElementsNativeModule.dll_6BC33836FAE0A06C.mvfrm
Library\Bee\artifacts\mvdfrm\UnityEngine.UIModule.dll_E446054A1E9172AE.mvfrm
Library\Bee\artifacts\mvdfrm\UnityEngine.UmbraModule.dll_35DDAC6ED1529783.mvfrm
Library\Bee\artifacts\mvdfrm\UnityEngine.UNETModule.dll_2C6DF915CDFDC112.mvfrm
Library\Bee\artifacts\mvdfrm\UnityEngine.UnityAnalyticsCommonModule.dll_7108D912AB7ED7B6.mvfrm
Library\Bee\artifacts\mvdfrm\UnityEngine.UnityAnalyticsModule.dll_FCB0A99C7A16F65B.mvfrm
Library\Bee\artifacts\mvdfrm\UnityEngine.UnityConnectModule.dll_BAA7E5B90CA846CF.mvfrm
Library\Bee\artifacts\mvdfrm\UnityEngine.UnityCurlModule.dll_C540FD73A155548B.mvfrm
Library\Bee\artifacts\mvdfrm\UnityEngine.UnityTestProtocolModule.dll_43F45326C590AE79.mvfrm
Library\Bee\artifacts\mvdfrm\UnityEngine.UnityWebRequestAssetBundleModule.dll_B99F77F6F547E56C.mvfrm
Library\Bee\artifacts\mvdfrm\UnityEngine.UnityWebRequestAudioModule.dll_4DC66FAD180103F0.mvfrm
Library\Bee\artifacts\mvdfrm\UnityEngine.UnityWebRequestModule.dll_066D53E9C475FAAA.mvfrm
Library\Bee\artifacts\mvdfrm\UnityEngine.UnityWebRequestTextureModule.dll_7FA42A9FEE1477C5.mvfrm
Library\Bee\artifacts\mvdfrm\UnityEngine.UnityWebRequestWWWModule.dll_2A64408181DA5281.mvfrm
Library\Bee\artifacts\mvdfrm\UnityEngine.VehiclesModule.dll_4DA88046A91A8791.mvfrm
Library\Bee\artifacts\mvdfrm\UnityEngine.VFXModule.dll_1BF160264A81D2E2.mvfrm
Library\Bee\artifacts\mvdfrm\UnityEngine.VideoModule.dll_E01284C106BE07B5.mvfrm
Library\Bee\artifacts\mvdfrm\UnityEngine.VirtualTexturingModule.dll_904FECA5D38F20F7.mvfrm
Library\Bee\artifacts\mvdfrm\UnityEngine.VRModule.dll_37182BCFC04BF826.mvfrm
Library\Bee\artifacts\mvdfrm\UnityEngine.WindModule.dll_10168C5512254A02.mvfrm
Library\Bee\artifacts\mvdfrm\UnityEngine.XRModule.dll_69D6EED449864584.mvfrm
Library\Bee\artifacts\mvdfrm\UnityEditor.WindowsStandalone.Extensions.dll_EFA2931C82B81612.mvfrm
Library\Bee\artifacts\mvdfrm\Unity.Plastic.Antlr3.Runtime.dll_872C5909907E780B.mvfrm
Library\Bee\artifacts\mvdfrm\Unity.Plastic.Newtonsoft.Json.dll_F9638212178422FA.mvfrm
Library\Bee\artifacts\mvdfrm\Unity.VisualScripting.IonicZip.dll_929D72D42150FEA8.mvfrm
Library\Bee\artifacts\mvdfrm\Unity.VisualScripting.YamlDotNet.dll_3E33BD71ADB3DE54.mvfrm
Library\Bee\artifacts\mvdfrm\Unity.VisualScripting.TextureAssets.dll_D551E6C56E813C4C.mvfrm
Library\Bee\artifacts\mvdfrm\Unity.VisualScripting.Antlr3.Runtime.dll_EFA0E452DE7CEE73.mvfrm