%YAML 1.1
%TAG !u! tag:unity3d.com,2011:
--- !u!114 &11400000
MonoBehaviour:
  m_ObjectHideFlags: 0
  m_CorrespondingSourceObject: {fileID: 0}
  m_PrefabInstance: {fileID: 0}
  m_PrefabAsset: {fileID: 0}
  m_GameObject: {fileID: 0}
  m_Enabled: 1
  m_EditorHideFlags: 0
  m_Script: {fileID: 11500000, guid: 2054efa3ce896bf49856dae97ea4c5f2, type: 3}
  m_Name: NeoFpsEditorPrefs
  m_EditorClassIdentifier: 
  m_FirstRun: 0
  m_ShowHubOnStart: 0
  m_CurrentLayerSettingsVersion: 0
  m_CurrentPhysicsSettingsVersion: 0
  m_CurrentInputSettingsVersion: 0
  m_CurrentPlayerSettingsVersion: 0
  m_CurrentBuildSettingsVersion: 0
  m_CurrentNeoFPSVersion: 1124
  m_RenderPipeline: 0
