%YAML 1.1
%TAG !u! tag:unity3d.com,2011:
--- !u!1045 &1
EditorBuildSettings:
  m_ObjectHideFlags: 0
  serializedVersion: 2
  m_Scenes:
  - enabled: 1
    path: Assets/NeoFPS/Samples/SinglePlayer/Scenes/MainMenu/MainMenu.unity
    guid: 77d5557736483054eb2f3f00d8f8709e
  - enabled: 1
    path: Assets/NeoFPS/Samples/SinglePlayer/Scenes/LoadingScreen/Loading.unity
    guid: 223220eb03f54e74bb906fb42659ba97
  - enabled: 1
    path: Assets/NeoFPS/Samples/SinglePlayer/Scenes/FeatureDemos/Template/FeatureDemo_Template.unity
    guid: 2b96d9ab2d2ae0340969f6886e2c4c87
  m_configObjects:
    com.unity.input.settings: {fileID: 11400000, guid: 9eb07e2d669e9c94e9d7d3c782a916f7,
      type: 2}
