%YAML 1.1
%TAG !u! tag:unity3d.com,2011:
--- !u!1045 &1
EditorBuildSettings:
  m_ObjectHideFlags: 0
  serializedVersion: 2
  m_Scenes:
  - enabled: 1
    path: Assets/Scenes/MenuScene3.unity
    guid: 6742fc7cd167a124da89d45865edd8bc
  - enabled: 1
    path: Assets/Scenes/SampleScene3.unity
    guid: 5b0643bf819e7704fa88a01110989d08
  m_configObjects: {}
