{
  "hash": "afc59a69",
  "browserHash": "5de18d6e",
  "optimized": {
    "vue": {
      "src": "../../../node_modules/vue/dist/vue.runtime.esm-browser.js",
      "file": "vue.js",
      "fileHash": "7f5da3b2",
      "needsInterop": false
    },
    "vitepress > @vue/devtools-api": {
      "src": "../../../node_modules/@vue/devtools-api/lib/esm/index.js",
      "file": "vitepress___@vue_devtools-api.js",
      "fileHash": "8882d4a7",
      "needsInterop": false
    },
    "@theme/index": {
      "src": "../../../node_modules/vitepress/dist/client/theme-default/index.js",
      "file": "@theme_index.js",
      "fileHash": "89fd2327",
      "needsInterop": false
    }
  },
  "chunks": {
    "chunk-PFTMKJPF": {
      "file": "chunk-PFTMKJPF.js"
    }
  }
}