{
    "Payloads": [
        {
            "FwVersion": "2",
            "Guid": "2a5aa852-b856-4d97-baa9-5c5f4421551f",
            "HardwareInstance": "0",
            "LowestSupportedVersion": "1",
            "MonotonicCount": "0",
            "Payload": "u-boot-rb2.img",
            "UpdateImageIndex": "1",
            "OpenSslSignerPrivateCertFile": "CRT.pem",
            "OpenSslTrustedPublicCertFile": "CRT.pub.pem",
            "OpenSslOtherPublicCertFile":   "CRT.pub.pem"
        }
    ]
}
