{
  "kernel_config": "$kernel_config",
  "dtb": "$dtb",
  "kernel": "$kernel",
  "rootfs": {
    "tarxz": "$rootfs_tarxz",
    "console": {
      "tarxz": "$rootfs_console_tarxz"
    },
    "kselftest": {
      "tarxz": "$rootfs_kselftest_tarxz"
    },
    "tux": {
      "tarxz": "$rootfs_tux_tarxz"
    }
  },
  "modules": "$modules",
  "modules_compression": "targz"
}
