group.name,project.name,build.name,build.datetime,environment.name,test.name,test.status
lkft,linux-next-master,next-20190902,2019-09-02T13:13:07.070920Z,x86,build/build_process,pass
lkft,linux-next-master,next-20190902,2019-09-02T13:13:07.070920Z,x86,boot-lkft-kselftests-master-597/x86,fail
lkft,linux-next-master,next-20190902,2019-09-02T13:13:07.070920Z,x86,boot-lkft-libhugetlbfs-master-597/x86,fail
lkft,linux-next-master,next-20190902,2019-09-02T13:13:07.070920Z,x86,boot-lkft-kselftests-vsyscall-mode-none-master-597/x86,fail
lkft,linux-next-master,next-20190902,2019-09-02T13:13:07.070920Z,hi6220-hikey,build/build_process,pass
lkft,linux-next-master,next-20190902,2019-09-02T13:13:07.070920Z,i386,build/build_process,pass
lkft,linux-next-master,next-20190902,2019-09-02T13:13:07.070920Z,dragonboard-410c,build/build_process,pass
lkft,linux-next-master,next-20190902,2019-09-02T13:13:07.070920Z,x15,build/build_process,pass
lkft,linux-next-master,next-20190902,2019-09-02T13:13:07.070920Z,juno-r2,build/build_process,pass
lkft,linux-next-master,next-20190902,2019-09-02T13:13:07.070920Z,i386,boot-lkft-ltp-cap_bounds-cpuhotplug-fcntl-locktests-master-597/x86,fail
lkft,linux-next-master,next-20190902,2019-09-02T13:13:07.070920Z,i386,boot-lkft-ltp-sched-master-597/x86,fail
lkft,linux-next-master,next-20190902,2019-09-02T13:13:07.070920Z,qemu_arm,boot-lkft-ltp-filecaps-fs_bind-fs_perms_simple-fsx-master-597/qemu-arm,fail
lkft,linux-next-master,next-20190902,2019-09-02T13:13:07.070920Z,i386,boot-lkft-ltp-nptl-pty-securebits-master-597/x86,fail
lkft,linux-next-master,next-20190902,2019-09-02T13:13:07.070920Z,i386,boot-lkft-ltp-filecaps-fs_bind-fs_perms_simple-fsx-master-597/x86,fail
lkft,linux-next-master,next-20190902,2019-09-02T13:13:07.070920Z,i386,boot-lkft-ltp-timers-master-597/x86,fail
lkft,linux-next-master,next-20190902,2019-09-02T13:13:07.070920Z,i386,boot-lkft-ltp-syscalls-master-597/x86,fail
lkft,linux-next-master,next-20190902,2019-09-02T13:13:07.070920Z,i386,boot-lkft-network-basic-tests-master-597/x86,fail
lkft,linux-next-master,next-20190902,2019-09-02T13:13:07.070920Z,i386,boot-lkft-v4l2-compliance-master-597/x86,fail
lkft,linux-next-master,next-20190902,2019-09-02T13:13:07.070920Z,qemu_x86_64,boot-lkft-ltp-io-dio-master-597/qemu,fail
lkft,linux-next-master,next-20190902,2019-09-02T13:13:07.070920Z,dragonboard-410c,install-android-platform-tools-r2600/install-adb,pass
lkft,linux-next-master,next-20190902,2019-09-02T13:13:07.070920Z,dragonboard-410c,boot-lkft-libgpiod-master-597/dragonboard-410c,fail
lkft,linux-next-master,next-20190902,2019-09-02T13:13:07.070920Z,dragonboard-410c,install-android-platform-tools-r2600/install-fastboot,pass
lkft,linux-next-master,next-20190902,2019-09-02T13:13:07.070920Z,i386,boot-lkft-perf-master-597/x86,fail
lkft,linux-next-master,next-20190902,2019-09-02T13:13:07.070920Z,qemu_arm,boot-lkft-ltp-nptl-pty-securebits-master-597/qemu-arm,fail
lkft,linux-next-master,next-20190902,2019-09-02T13:13:07.070920Z,dragonboard-410c,install-android-platform-tools-r2600/install-adb,pass
lkft,linux-next-master,next-20190902,2019-09-02T13:13:07.070920Z,dragonboard-410c,boot-lkft-ltp-containers-master-597/dragonboard-410c,fail
lkft,linux-next-master,next-20190902,2019-09-02T13:13:07.070920Z,dragonboard-410c,install-android-platform-tools-r2600/install-fastboot,pass
lkft,linux-next-master,next-20190902,2019-09-02T13:13:07.070920Z,dragonboard-410c,install-android-platform-tools-r2600/install-adb,pass
lkft,linux-next-master,next-20190902,2019-09-02T13:13:07.070920Z,dragonboard-410c,boot-lkft-kselftests-master-597/dragonboard-410c,fail
lkft,linux-next-master,next-20190902,2019-09-02T13:13:07.070920Z,dragonboard-410c,install-android-platform-tools-r2600/install-fastboot,pass
lkft,linux-next-master,next-20190902,2019-09-02T13:13:07.070920Z,dragonboard-410c,boot-lkft-libhugetlbfs-master-597/dragonboard-410c,fail
lkft,linux-next-master,next-20190902,2019-09-02T13:13:07.070920Z,dragonboard-410c,install-android-platform-tools-r2600/install-adb,pass
lkft,linux-next-master,next-20190902,2019-09-02T13:13:07.070920Z,dragonboard-410c,install-android-platform-tools-r2600/install-fastboot,pass
lkft,linux-next-master,next-20190902,2019-09-02T13:13:07.070920Z,dragonboard-410c,boot-lkft-ltp-cve-master-597/dragonboard-410c,fail
lkft,linux-next-master,next-20190902,2019-09-02T13:13:07.070920Z,dragonboard-410c,install-android-platform-tools-r2600/install-adb,pass
lkft,linux-next-master,next-20190902,2019-09-02T13:13:07.070920Z,dragonboard-410c,install-android-platform-tools-r2600/install-fastboot,pass
lkft,linux-next-master,next-20190902,2019-09-02T13:13:07.070920Z,qemu_x86_64,boot-lkft-v4l2-compliance-master-597/qemu,fail
lkft,linux-next-master,next-20190902,2019-09-02T13:13:07.070920Z,dragonboard-410c,boot-lkft-ltp-hugetlb-mm-master-597/dragonboard-410c,fail
lkft,linux-next-master,next-20190902,2019-09-02T13:13:07.070920Z,dragonboard-410c,install-android-platform-tools-r2600/install-adb,pass
lkft,linux-next-master,next-20190902,2019-09-02T13:13:07.070920Z,dragonboard-410c,install-android-platform-tools-r2600/install-fastboot,pass
lkft,linux-next-master,next-20190902,2019-09-02T13:13:07.070920Z,dragonboard-410c,install-android-platform-tools-r2600/install-adb,pass
lkft,linux-next-master,next-20190902,2019-09-02T13:13:07.070920Z,dragonboard-410c,install-android-platform-tools-r2600/install-fastboot,pass
lkft,linux-next-master,next-20190902,2019-09-02T13:13:07.070920Z,dragonboard-410c,boot-lkft-ltp-io-dio-master-597/dragonboard-410c,fail
lkft,linux-next-master,next-20190902,2019-09-02T13:13:07.070920Z,qemu_arm,boot-lkft-ltp-cap_bounds-cpuhotplug-fcntl-locktests-master-597/qemu-arm,fail
lkft,linux-next-master,next-20190902,2019-09-02T13:13:07.070920Z,qemu_arm,boot-lkft-ltp-syscalls-master-597/qemu-arm,fail
lkft,linux-next-master,next-20190902,2019-09-02T13:13:07.070920Z,dragonboard-410c,install-android-platform-tools-r2600/install-adb,pass
lkft,linux-next-master,next-20190902,2019-09-02T13:13:07.070920Z,dragonboard-410c,boot-lkft-ltp-fs-master-597/dragonboard-410c,fail
lkft,linux-next-master,next-20190902,2019-09-02T13:13:07.070920Z,dragonboard-410c,install-android-platform-tools-r2600/install-fastboot,pass
lkft,linux-next-master,next-20190902,2019-09-02T13:13:07.070920Z,x15,install-android-platform-tools-r2600/install-adb,pass
lkft,linux-next-master,next-20190902,2019-09-02T13:13:07.070920Z,x15,boot-lkft-ssuite-master-597/x15,fail
lkft,linux-next-master,next-20190902,2019-09-02T13:13:07.070920Z,x15,install-android-platform-tools-r2600/install-fastboot,pass
lkft,linux-next-master,next-20190902,2019-09-02T13:13:07.070920Z,qemu_arm,boot-lkft-ltp-timers-master-597/qemu-arm,fail
lkft,linux-next-master,next-20190902,2019-09-02T13:13:07.070920Z,qemu_arm,boot-lkft-v4l2-compliance-master-597/qemu-arm,fail
lkft,linux-next-master,next-20190902,2019-09-02T13:13:07.070920Z,dragonboard-410c,install-android-platform-tools-r2600/install-adb,pass
lkft,linux-next-master,next-20190902,2019-09-02T13:13:07.070920Z,dragonboard-410c,boot-lkft-ltp-math-commands-master-597/dragonboard-410c,fail
lkft,linux-next-master,next-20190902,2019-09-02T13:13:07.070920Z,dragonboard-410c,install-android-platform-tools-r2600/install-fastboot,pass
lkft,linux-next-master,next-20190902,2019-09-02T13:13:07.070920Z,x15,boot-lkft-v4l2-compliance-master-597/x15,fail
lkft,linux-next-master,next-20190902,2019-09-02T13:13:07.070920Z,x15,install-android-platform-tools-r2600/install-adb,pass
lkft,linux-next-master,next-20190902,2019-09-02T13:13:07.070920Z,x15,install-android-platform-tools-r2600/install-fastboot,pass
lkft,linux-next-master,next-20190902,2019-09-02T13:13:07.070920Z,dragonboard-410c,boot-lkft-ltp-ipc-master-597/dragonboard-410c,fail
lkft,linux-next-master,next-20190902,2019-09-02T13:13:07.070920Z,dragonboard-410c,install-android-platform-tools-r2600/install-adb,pass
lkft,linux-next-master,next-20190902,2019-09-02T13:13:07.070920Z,dragonboard-410c,install-android-platform-tools-r2600/install-fastboot,pass
lkft,linux-next-master,next-20190902,2019-09-02T13:13:07.070920Z,qemu_arm,boot-lkft-perf-master-597/qemu-arm,fail
lkft,linux-next-master,next-20190902,2019-09-02T13:13:07.070920Z,dragonboard-410c,install-android-platform-tools-r2600/install-adb,pass
lkft,linux-next-master,next-20190902,2019-09-02T13:13:07.070920Z,dragonboard-410c,install-android-platform-tools-r2600/install-fastboot,pass
lkft,linux-next-master,next-20190902,2019-09-02T13:13:07.070920Z,dragonboard-410c,boot-lkft-ltp-sched-master-597/dragonboard-410c,fail
lkft,linux-next-master,next-20190902,2019-09-02T13:13:07.070920Z,x15,install-android-platform-tools-r2600/install-adb,pass
lkft,linux-next-master,next-20190902,2019-09-02T13:13:07.070920Z,x15,install-android-platform-tools-r2600/install-fastboot,pass
lkft,linux-next-master,next-20190902,2019-09-02T13:13:07.070920Z,x15,boot-lkft-kselftests-master-597/x15,fail
lkft,linux-next-master,next-20190902,2019-09-02T13:13:07.070920Z,x15,install-android-platform-tools-r2600/install-adb,pass
lkft,linux-next-master,next-20190902,2019-09-02T13:13:07.070920Z,x15,install-android-platform-tools-r2600/install-fastboot,pass
lkft,linux-next-master,next-20190902,2019-09-02T13:13:07.070920Z,x15,boot-lkft-libgpiod-master-597/x15,fail
lkft,linux-next-master,next-20190902,2019-09-02T13:13:07.070920Z,qemu_arm64,boot-lkft-ltp-cve-master-597/qemu-arm,fail
lkft,linux-next-master,next-20190902,2019-09-02T13:13:07.070920Z,x15,install-android-platform-tools-r2600/install-adb,pass
lkft,linux-next-master,next-20190902,2019-09-02T13:13:07.070920Z,x15,boot-lkft-libhugetlbfs-master-597/x15,fail
lkft,linux-next-master,next-20190902,2019-09-02T13:13:07.070920Z,x15,install-android-platform-tools-r2600/install-fastboot,pass
lkft,linux-next-master,next-20190902,2019-09-02T13:13:07.070920Z,x15,boot-lkft-ltp-containers-master-597/x15,fail
lkft,linux-next-master,next-20190902,2019-09-02T13:13:07.070920Z,x15,install-android-platform-tools-r2600/install-adb,pass
lkft,linux-next-master,next-20190902,2019-09-02T13:13:07.070920Z,x15,install-android-platform-tools-r2600/install-fastboot,pass
lkft,linux-next-master,next-20190902,2019-09-02T13:13:07.070920Z,x15,install-android-platform-tools-r2600/install-adb,pass
lkft,linux-next-master,next-20190902,2019-09-02T13:13:07.070920Z,x15,install-android-platform-tools-r2600/install-fastboot,pass
lkft,linux-next-master,next-20190902,2019-09-02T13:13:07.070920Z,x15,boot-lkft-ltp-hugetlb-mm-master-597/x15,fail
lkft,linux-next-master,next-20190902,2019-09-02T13:13:07.070920Z,x15,install-android-platform-tools-r2600/install-adb,pass
lkft,linux-next-master,next-20190902,2019-09-02T13:13:07.070920Z,x15,boot-lkft-ltp-io-dio-master-597/x15,fail
lkft,linux-next-master,next-20190902,2019-09-02T13:13:07.070920Z,x15,install-android-platform-tools-r2600/install-fastboot,pass
lkft,linux-next-master,next-20190902,2019-09-02T13:13:07.070920Z,x15,install-android-platform-tools-r2600/install-adb,pass
lkft,linux-next-master,next-20190902,2019-09-02T13:13:07.070920Z,x15,boot-lkft-ltp-ipc-master-597/x15,fail
lkft,linux-next-master,next-20190902,2019-09-02T13:13:07.070920Z,x15,install-android-platform-tools-r2600/install-fastboot,pass
lkft,linux-next-master,next-20190902,2019-09-02T13:13:07.070920Z,x15,install-android-platform-tools-r2600/install-adb,pass
lkft,linux-next-master,next-20190902,2019-09-02T13:13:07.070920Z,x15,boot-lkft-ltp-fs-master-597/x15,fail
lkft,linux-next-master,next-20190902,2019-09-02T13:13:07.070920Z,x15,install-android-platform-tools-r2600/install-fastboot,pass
lkft,linux-next-master,next-20190902,2019-09-02T13:13:07.070920Z,x15,install-android-platform-tools-r2600/install-adb,pass
lkft,linux-next-master,next-20190902,2019-09-02T13:13:07.070920Z,x15,boot-lkft-ltp-sched-master-597/x15,fail
lkft,linux-next-master,next-20190902,2019-09-02T13:13:07.070920Z,x15,install-android-platform-tools-r2600/install-fastboot,pass
lkft,linux-next-master,next-20190902,2019-09-02T13:13:07.070920Z,x15,install-android-platform-tools-r2600/install-adb,pass
lkft,linux-next-master,next-20190902,2019-09-02T13:13:07.070920Z,x15,boot-lkft-ltp-filecaps-fs_bind-fs_perms_simple-fsx-master-597/x15,fail
lkft,linux-next-master,next-20190902,2019-09-02T13:13:07.070920Z,x15,install-android-platform-tools-r2600/install-fastboot,pass
lkft,linux-next-master,next-20190902,2019-09-02T13:13:07.070920Z,x15,install-android-platform-tools-r2600/install-adb,pass
lkft,linux-next-master,next-20190902,2019-09-02T13:13:07.070920Z,x15,boot-lkft-ltp-cap_bounds-cpuhotplug-fcntl-locktests-master-597/x15,fail
lkft,linux-next-master,next-20190902,2019-09-02T13:13:07.070920Z,x15,install-android-platform-tools-r2600/install-fastboot,pass
lkft,linux-next-master,next-20190902,2019-09-02T13:13:07.070920Z,x15,install-android-platform-tools-r2600/install-adb,pass
lkft,linux-next-master,next-20190902,2019-09-02T13:13:07.070920Z,x15,boot-lkft-ltp-math-commands-master-597/x15,fail
lkft,linux-next-master,next-20190902,2019-09-02T13:13:07.070920Z,x15,install-android-platform-tools-r2600/install-fastboot,pass
lkft,linux-next-master,next-20190902,2019-09-02T13:13:07.070920Z,qemu_arm,boot-lkft-kselftests-master-597/qemu-arm,fail
lkft,linux-next-master,next-20190902,2019-09-02T13:13:07.070920Z,qemu_arm,boot-lkft-libgpiod-master-597/qemu-arm,fail
lkft,linux-next-master,next-20190902,2019-09-02T13:13:07.070920Z,qemu_arm,boot-lkft-libhugetlbfs-master-597/qemu-arm,fail
lkft,linux-next-master,next-20190902,2019-09-02T13:13:07.070920Z,x15,install-android-platform-tools-r2600/install-adb,pass
lkft,linux-next-master,next-20190902,2019-09-02T13:13:07.070920Z,x15,boot-lkft-ltp-nptl-pty-securebits-master-597/x15,fail
lkft,linux-next-master,next-20190902,2019-09-02T13:13:07.070920Z,x15,install-android-platform-tools-r2600/install-fastboot,pass
lkft,linux-next-master,next-20190902,2019-09-02T13:13:07.070920Z,x15,install-android-platform-tools-r2600/install-adb,pass
lkft,linux-next-master,next-20190902,2019-09-02T13:13:07.070920Z,x15,boot-lkft-ltp-syscalls-master-597/x15,fail
lkft,linux-next-master,next-20190902,2019-09-02T13:13:07.070920Z,x15,install-android-platform-tools-r2600/install-fastboot,pass
lkft,linux-next-master,next-20190902,2019-09-02T13:13:07.070920Z,qemu_x86_64,boot-lkft-ltp-hugetlb-mm-master-597/qemu,fail
lkft,linux-next-master,next-20190902,2019-09-02T13:13:07.070920Z,qemu_x86_64,boot-lkft-ltp-cve-master-597/qemu,fail
lkft,linux-next-master,next-20190902,2019-09-02T13:13:07.070920Z,x15,install-android-platform-tools-r2600/install-adb,pass
lkft,linux-next-master,next-20190902,2019-09-02T13:13:07.070920Z,x15,boot-lkft-ltp-open-posix-master-597/x15,fail
lkft,linux-next-master,next-20190902,2019-09-02T13:13:07.070920Z,x15,install-android-platform-tools-r2600/install-fastboot,pass
lkft,linux-next-master,next-20190902,2019-09-02T13:13:07.070920Z,qemu_arm,boot-lkft-ltp-containers-master-597/qemu-arm,fail
lkft,linux-next-master,next-20190902,2019-09-02T13:13:07.070920Z,x15,install-android-platform-tools-r2600/install-adb,pass
lkft,linux-next-master,next-20190902,2019-09-02T13:13:07.070920Z,x15,boot-lkft-ltp-timers-master-597/x15,fail
lkft,linux-next-master,next-20190902,2019-09-02T13:13:07.070920Z,x15,install-android-platform-tools-r2600/install-fastboot,pass
lkft,linux-next-master,next-20190902,2019-09-02T13:13:07.070920Z,qemu_x86_64,boot-lkft-libhugetlbfs-master-597/qemu,fail
lkft,linux-next-master,next-20190902,2019-09-02T13:13:07.070920Z,qemu_x86_64,boot-lkft-kselftests-master-597/qemu,fail
lkft,linux-next-master,next-20190902,2019-09-02T13:13:07.070920Z,qemu_x86_64,boot-lkft-ltp-containers-master-597/qemu,fail
lkft,linux-next-master,next-20190902,2019-09-02T13:13:07.070920Z,qemu_x86_64,boot-lkft-libgpiod-master-597/qemu,fail
lkft,linux-next-master,next-20190902,2019-09-02T13:13:07.070920Z,qemu_x86_64,boot-lkft-ltp-fs-master-597/qemu,fail
lkft,linux-next-master,next-20190902,2019-09-02T13:13:07.070920Z,qemu_x86_64,boot-lkft-ltp-sched-master-597/qemu,fail
lkft,linux-next-master,next-20190902,2019-09-02T13:13:07.070920Z,qemu_x86_64,boot-lkft-ltp-nptl-pty-securebits-master-597/qemu,fail
lkft,linux-next-master,next-20190902,2019-09-02T13:13:07.070920Z,qemu_x86_64,boot-lkft-ltp-syscalls-master-597/qemu,fail
lkft,linux-next-master,next-20190902,2019-09-02T13:13:07.070920Z,qemu_x86_64,boot-lkft-ltp-ipc-master-597/qemu,fail
lkft,linux-next-master,next-20190902,2019-09-02T13:13:07.070920Z,qemu_x86_64,boot-lkft-ltp-math-commands-master-597/qemu,fail
lkft,linux-next-master,next-20190902,2019-09-02T13:13:07.070920Z,qemu_x86_64,boot-lkft-ltp-cap_bounds-cpuhotplug-fcntl-locktests-master-597/qemu,fail
lkft,linux-next-master,next-20190902,2019-09-02T13:13:07.070920Z,qemu_x86_64,boot-lkft-ltp-timers-master-597/qemu,fail
lkft,linux-next-master,next-20190902,2019-09-02T13:13:07.070920Z,qemu_x86_64,boot-lkft-perf-master-597/qemu,fail
lkft,linux-next-master,next-20190902,2019-09-02T13:13:07.070920Z,qemu_x86_64,boot-lkft-ltp-filecaps-fs_bind-fs_perms_simple-fsx-master-597/qemu,fail
lkft,linux-next-master,next-20190902,2019-09-02T13:13:07.070920Z,x86,boot-lkft-kselftests-vsyscall-mode-native-master-597/x86,fail
lkft,linux-next-master,next-20190902,2019-09-02T13:13:07.070920Z,x86,boot-lkft-libgpiod-master-597/x86,fail
lkft,linux-next-master,next-20190902,2019-09-02T13:13:07.070920Z,x86,boot-lkft-ltp-containers-master-597/x86,fail
lkft,linux-next-master,next-20190902,2019-09-02T13:13:07.070920Z,x86,boot-lkft-ltp-fs-master-597/x86,fail
lkft,linux-next-master,next-20190902,2019-09-02T13:13:07.070920Z,x86,boot-lkft-ltp-io-dio-master-597/x86,fail
lkft,linux-next-master,next-20190902,2019-09-02T13:13:07.070920Z,x86,boot-lkft-ltp-math-commands-master-597/x86,fail
lkft,linux-next-master,next-20190902,2019-09-02T13:13:07.070920Z,x86,boot-lkft-kvm-unit-tests-master-597/x86,fail
lkft,linux-next-master,next-20190902,2019-09-02T13:13:07.070920Z,qemu_arm64,boot-lkft-kselftests-master-597/qemu-arm,fail
lkft,linux-next-master,next-20190902,2019-09-02T13:13:07.070920Z,x86,boot-lkft-ltp-nptl-pty-securebits-master-597/x86,fail
lkft,linux-next-master,next-20190902,2019-09-02T13:13:07.070920Z,x86,boot-lkft-ltp-sched-master-597/x86,fail
lkft,linux-next-master,next-20190902,2019-09-02T13:13:07.070920Z,x86,boot-lkft-ltp-cve-master-597/x86,fail
lkft,linux-next-master,next-20190902,2019-09-02T13:13:07.070920Z,x86,boot-lkft-ltp-hugetlb-mm-master-597/x86,fail
lkft,linux-next-master,next-20190902,2019-09-02T13:13:07.070920Z,x86,boot-lkft-ltp-syscalls-master-597/x86,fail
lkft,linux-next-master,next-20190902,2019-09-02T13:13:07.070920Z,x86,boot-lkft-perf-master-597/x86,fail
lkft,linux-next-master,next-20190902,2019-09-02T13:13:07.070920Z,x86,boot-lkft-ltp-timers-master-597/x86,fail
lkft,linux-next-master,next-20190902,2019-09-02T13:13:07.070920Z,qemu_arm64,boot-lkft-libgpiod-master-597/qemu-arm,fail
lkft,linux-next-master,next-20190902,2019-09-02T13:13:07.070920Z,x86,boot-lkft-ssuite-master-597/x86,fail
lkft,linux-next-master,next-20190902,2019-09-02T13:13:07.070920Z,x86,boot-lkft-ltp-ipc-master-597/x86,fail
lkft,linux-next-master,next-20190902,2019-09-02T13:13:07.070920Z,x86,boot-lkft-ltp-open-posix-master-597/x86,fail
lkft,linux-next-master,next-20190902,2019-09-02T13:13:07.070920Z,x86,boot-lkft-ltp-filecaps-fs_bind-fs_perms_simple-fsx-master-597/x86,fail
lkft,linux-next-master,next-20190902,2019-09-02T13:13:07.070920Z,qemu_arm64,boot-lkft-libhugetlbfs-master-597/qemu-arm,fail
lkft,linux-next-master,next-20190902,2019-09-02T13:13:07.070920Z,x86,boot-lkft-ltp-cap_bounds-cpuhotplug-fcntl-locktests-master-597/x86,fail
lkft,linux-next-master,next-20190902,2019-09-02T13:13:07.070920Z,x86,boot-lkft-v4l2-compliance-master-597/x86,fail
lkft,linux-next-master,next-20190902,2019-09-02T13:13:07.070920Z,x86,boot-lkft-network-basic-tests-master-597/x86,fail
lkft,linux-next-master,next-20190902,2019-09-02T13:13:07.070920Z,qemu_arm,boot-lkft-ltp-cve-master-597/qemu-arm,fail
lkft,linux-next-master,next-20190902,2019-09-02T13:13:07.070920Z,hi6220-hikey,boot-lkft-kselftests-master-597/hi6220-hikey-r2,fail
lkft,linux-next-master,next-20190902,2019-09-02T13:13:07.070920Z,hi6220-hikey,install-android-platform-tools-r2600/install-adb,pass
lkft,linux-next-master,next-20190902,2019-09-02T13:13:07.070920Z,hi6220-hikey,install-android-platform-tools-r2600/install-fastboot,pass
lkft,linux-next-master,next-20190902,2019-09-02T13:13:07.070920Z,hi6220-hikey,install-android-platform-tools-r2600/install-adb,pass
lkft,linux-next-master,next-20190902,2019-09-02T13:13:07.070920Z,hi6220-hikey,boot-lkft-libgpiod-master-597/hi6220-hikey-r2,fail
lkft,linux-next-master,next-20190902,2019-09-02T13:13:07.070920Z,hi6220-hikey,install-android-platform-tools-r2600/install-fastboot,pass
lkft,linux-next-master,next-20190902,2019-09-02T13:13:07.070920Z,qemu_arm64,boot-lkft-ltp-fs-master-597/qemu-arm,fail
lkft,linux-next-master,next-20190902,2019-09-02T13:13:07.070920Z,hi6220-hikey,install-android-platform-tools-r2600/install-adb,pass
lkft,linux-next-master,next-20190902,2019-09-02T13:13:07.070920Z,hi6220-hikey,boot-lkft-ltp-containers-master-597/hi6220-hikey-r2,fail
lkft,linux-next-master,next-20190902,2019-09-02T13:13:07.070920Z,hi6220-hikey,install-android-platform-tools-r2600/install-fastboot,pass
lkft,linux-next-master,next-20190902,2019-09-02T13:13:07.070920Z,hi6220-hikey,install-android-platform-tools-r2600/install-adb,pass
lkft,linux-next-master,next-20190902,2019-09-02T13:13:07.070920Z,hi6220-hikey,boot-lkft-libhugetlbfs-master-597/hi6220-hikey-r2,fail
lkft,linux-next-master,next-20190902,2019-09-02T13:13:07.070920Z,hi6220-hikey,install-android-platform-tools-r2600/install-fastboot,pass
lkft,linux-next-master,next-20190902,2019-09-02T13:13:07.070920Z,qemu_i386,boot-lkft-libgpiod-master-597/qemu,fail
lkft,linux-next-master,next-20190902,2019-09-02T13:13:07.070920Z,hi6220-hikey,boot-lkft-ltp-cve-master-597/hi6220-hikey-r2,fail
lkft,linux-next-master,next-20190902,2019-09-02T13:13:07.070920Z,hi6220-hikey,install-android-platform-tools-r2600/install-adb,pass
lkft,linux-next-master,next-20190902,2019-09-02T13:13:07.070920Z,hi6220-hikey,install-android-platform-tools-r2600/install-fastboot,pass
lkft,linux-next-master,next-20190902,2019-09-02T13:13:07.070920Z,hi6220-hikey,install-android-platform-tools-r2600/install-adb,pass
lkft,linux-next-master,next-20190902,2019-09-02T13:13:07.070920Z,hi6220-hikey,install-android-platform-tools-r2600/install-fastboot,pass
lkft,linux-next-master,next-20190902,2019-09-02T13:13:07.070920Z,hi6220-hikey,install-android-platform-tools-r2600/install-adb,pass
lkft,linux-next-master,next-20190902,2019-09-02T13:13:07.070920Z,hi6220-hikey,boot-lkft-ltp-fs-master-597/hi6220-hikey-r2,fail
lkft,linux-next-master,next-20190902,2019-09-02T13:13:07.070920Z,hi6220-hikey,install-android-platform-tools-r2600/install-fastboot,pass
lkft,linux-next-master,next-20190902,2019-09-02T13:13:07.070920Z,qemu_i386,boot-lkft-kselftests-master-597/qemu,fail
lkft,linux-next-master,next-20190902,2019-09-02T13:13:07.070920Z,hi6220-hikey,install-android-platform-tools-r2600/install-adb,pass
lkft,linux-next-master,next-20190902,2019-09-02T13:13:07.070920Z,hi6220-hikey,install-android-platform-tools-r2600/install-fastboot,pass
lkft,linux-next-master,next-20190902,2019-09-02T13:13:07.070920Z,hi6220-hikey,boot-lkft-ltp-hugetlb-mm-master-597/hi6220-hikey-r2,fail
lkft,linux-next-master,next-20190902,2019-09-02T13:13:07.070920Z,hi6220-hikey,install-android-platform-tools-r2600/install-adb,pass
lkft,linux-next-master,next-20190902,2019-09-02T13:13:07.070920Z,hi6220-hikey,boot-lkft-ltp-ipc-master-597/hi6220-hikey-r2,fail
lkft,linux-next-master,next-20190902,2019-09-02T13:13:07.070920Z,hi6220-hikey,install-android-platform-tools-r2600/install-fastboot,pass
lkft,linux-next-master,next-20190902,2019-09-02T13:13:07.070920Z,qemu_i386,boot-lkft-libhugetlbfs-master-597/qemu,fail
lkft,linux-next-master,next-20190902,2019-09-02T13:13:07.070920Z,hi6220-hikey,install-android-platform-tools-r2600/install-adb,pass
lkft,linux-next-master,next-20190902,2019-09-02T13:13:07.070920Z,hi6220-hikey,install-android-platform-tools-r2600/install-fastboot,pass
lkft,linux-next-master,next-20190902,2019-09-02T13:13:07.070920Z,qemu_i386,boot-lkft-ltp-containers-master-597/qemu,fail
lkft,linux-next-master,next-20190902,2019-09-02T13:13:07.070920Z,qemu_arm,boot-lkft-ltp-fs-master-597/qemu-arm,fail
lkft,linux-next-master,next-20190902,2019-09-02T13:13:07.070920Z,qemu_i386,boot-lkft-ltp-cve-master-597/qemu,fail
lkft,linux-next-master,next-20190902,2019-09-02T13:13:07.070920Z,hi6220-hikey,install-android-platform-tools-r2600/install-adb,pass
lkft,linux-next-master,next-20190902,2019-09-02T13:13:07.070920Z,hi6220-hikey,install-android-platform-tools-r2600/install-fastboot,pass
lkft,linux-next-master,next-20190902,2019-09-02T13:13:07.070920Z,qemu_i386,boot-lkft-ltp-fs-master-597/qemu,fail
lkft,linux-next-master,next-20190902,2019-09-02T13:13:07.070920Z,qemu_i386,boot-lkft-ltp-hugetlb-mm-master-597/qemu,fail
lkft,linux-next-master,next-20190902,2019-09-02T13:13:07.070920Z,hi6220-hikey,install-android-platform-tools-r2600/install-adb,pass
lkft,linux-next-master,next-20190902,2019-09-02T13:13:07.070920Z,hi6220-hikey,boot-lkft-ltp-filecaps-fs_bind-fs_perms_simple-fsx-master-597/hi6220-hikey-r2,fail
lkft,linux-next-master,next-20190902,2019-09-02T13:13:07.070920Z,hi6220-hikey,install-android-platform-tools-r2600/install-fastboot,pass
lkft,linux-next-master,next-20190902,2019-09-02T13:13:07.070920Z,qemu_i386,boot-lkft-ltp-io-dio-master-597/qemu,fail
lkft,linux-next-master,next-20190902,2019-09-02T13:13:07.070920Z,hi6220-hikey,install-android-platform-tools-r2600/install-adb,pass
lkft,linux-next-master,next-20190902,2019-09-02T13:13:07.070920Z,hi6220-hikey,install-android-platform-tools-r2600/install-fastboot,pass
lkft,linux-next-master,next-20190902,2019-09-02T13:13:07.070920Z,hi6220-hikey,boot-lkft-ltp-nptl-pty-securebits-master-597/hi6220-hikey-r2,fail
lkft,linux-next-master,next-20190902,2019-09-02T13:13:07.070920Z,hi6220-hikey,install-android-platform-tools-r2600/install-adb,pass
lkft,linux-next-master,next-20190902,2019-09-02T13:13:07.070920Z,hi6220-hikey,install-android-platform-tools-r2600/install-fastboot,pass
lkft,linux-next-master,next-20190902,2019-09-02T13:13:07.070920Z,hi6220-hikey,boot-lkft-ltp-syscalls-master-597/hi6220-hikey-r2,fail
lkft,linux-next-master,next-20190902,2019-09-02T13:13:07.070920Z,hi6220-hikey,install-android-platform-tools-r2600/install-adb,pass
lkft,linux-next-master,next-20190902,2019-09-02T13:13:07.070920Z,hi6220-hikey,boot-lkft-ltp-cap_bounds-cpuhotplug-fcntl-locktests-master-597/hi6220-hikey-r2,fail
lkft,linux-next-master,next-20190902,2019-09-02T13:13:07.070920Z,hi6220-hikey,install-android-platform-tools-r2600/install-fastboot,pass
lkft,linux-next-master,next-20190902,2019-09-02T13:13:07.070920Z,qemu_i386,boot-lkft-ltp-ipc-master-597/qemu,fail
lkft,linux-next-master,next-20190902,2019-09-02T13:13:07.070920Z,qemu_i386,boot-lkft-ltp-math-commands-master-597/qemu,fail
lkft,linux-next-master,next-20190902,2019-09-02T13:13:07.070920Z,hi6220-hikey,boot-lkft-network-basic-tests-master-597/hi6220-hikey-r2,fail
lkft,linux-next-master,next-20190902,2019-09-02T13:13:07.070920Z,hi6220-hikey,install-android-platform-tools-r2600/install-adb,pass
lkft,linux-next-master,next-20190902,2019-09-02T13:13:07.070920Z,hi6220-hikey,install-android-platform-tools-r2600/install-fastboot,pass
lkft,linux-next-master,next-20190902,2019-09-02T13:13:07.070920Z,qemu_i386,boot-lkft-ltp-sched-master-597/qemu,fail
lkft,linux-next-master,next-20190902,2019-09-02T13:13:07.070920Z,hi6220-hikey,boot-lkft-perf-master-597/hi6220-hikey-r2,fail
lkft,linux-next-master,next-20190902,2019-09-02T13:13:07.070920Z,hi6220-hikey,install-android-platform-tools-r2600/install-adb,pass
lkft,linux-next-master,next-20190902,2019-09-02T13:13:07.070920Z,hi6220-hikey,install-android-platform-tools-r2600/install-fastboot,pass
lkft,linux-next-master,next-20190902,2019-09-02T13:13:07.070920Z,qemu_arm,boot-lkft-ltp-hugetlb-mm-master-597/qemu-arm,fail
lkft,linux-next-master,next-20190902,2019-09-02T13:13:07.070920Z,hi6220-hikey,install-android-platform-tools-r2600/install-adb,pass
lkft,linux-next-master,next-20190902,2019-09-02T13:13:07.070920Z,hi6220-hikey,install-android-platform-tools-r2600/install-fastboot,pass
lkft,linux-next-master,next-20190902,2019-09-02T13:13:07.070920Z,hi6220-hikey,boot-lkft-ltp-timers-master-597/hi6220-hikey-r2,fail
lkft,linux-next-master,next-20190902,2019-09-02T13:13:07.070920Z,qemu_i386,boot-lkft-ltp-filecaps-fs_bind-fs_perms_simple-fsx-master-597/qemu,fail
lkft,linux-next-master,next-20190902,2019-09-02T13:13:07.070920Z,hi6220-hikey,install-android-platform-tools-r2600/install-adb,pass
lkft,linux-next-master,next-20190902,2019-09-02T13:13:07.070920Z,hi6220-hikey,install-android-platform-tools-r2600/install-fastboot,pass
lkft,linux-next-master,next-20190902,2019-09-02T13:13:07.070920Z,hi6220-hikey,boot-lkft-v4l2-compliance-master-597/hi6220-hikey-r2,fail
lkft,linux-next-master,next-20190902,2019-09-02T13:13:07.070920Z,qemu_i386,boot-lkft-ltp-nptl-pty-securebits-master-597/qemu,fail
lkft,linux-next-master,next-20190902,2019-09-02T13:13:07.070920Z,qemu_i386,boot-lkft-ltp-cap_bounds-cpuhotplug-fcntl-locktests-master-597/qemu,fail
lkft,linux-next-master,next-20190902,2019-09-02T13:13:07.070920Z,qemu_i386,boot-lkft-ltp-syscalls-master-597/qemu,fail
lkft,linux-next-master,next-20190902,2019-09-02T13:13:07.070920Z,qemu_i386,boot-lkft-ltp-timers-master-597/qemu,fail
lkft,linux-next-master,next-20190902,2019-09-02T13:13:07.070920Z,x15,install-android-platform-tools-r2600/install-adb,pass
lkft,linux-next-master,next-20190902,2019-09-02T13:13:07.070920Z,x15,boot-lkft-network-basic-tests-master-597/x15,fail
lkft,linux-next-master,next-20190902,2019-09-02T13:13:07.070920Z,x15,install-android-platform-tools-r2600/install-fastboot,pass
lkft,linux-next-master,next-20190902,2019-09-02T13:13:07.070920Z,qemu_i386,boot-lkft-perf-master-597/qemu,fail
lkft,linux-next-master,next-20190902,2019-09-02T13:13:07.070920Z,qemu_arm,boot-lkft-ltp-io-dio-master-597/qemu-arm,fail
lkft,linux-next-master,next-20190902,2019-09-02T13:13:07.070920Z,qemu_i386,boot-lkft-v4l2-compliance-master-597/qemu,fail
lkft,linux-next-master,next-20190902,2019-09-02T13:13:07.070920Z,i386,boot-lkft-libgpiod-master-597/x86,fail
lkft,linux-next-master,next-20190902,2019-09-02T13:13:07.070920Z,i386,boot-lkft-kselftests-master-597/x86,fail
lkft,linux-next-master,next-20190902,2019-09-02T13:13:07.070920Z,qemu_arm,boot-lkft-ltp-ipc-master-597/qemu-arm,fail
lkft,linux-next-master,next-20190902,2019-09-02T13:13:07.070920Z,i386,boot-lkft-libhugetlbfs-master-597/x86,fail
lkft,linux-next-master,next-20190902,2019-09-02T13:13:07.070920Z,qemu_arm64,boot-lkft-ltp-containers-master-597/qemu-arm,fail
lkft,linux-next-master,next-20190902,2019-09-02T13:13:07.070920Z,i386,boot-lkft-ltp-containers-master-597/x86,fail
lkft,linux-next-master,next-20190902,2019-09-02T13:13:07.070920Z,i386,boot-lkft-ltp-hugetlb-mm-master-597/x86,fail
lkft,linux-next-master,next-20190902,2019-09-02T13:13:07.070920Z,i386,boot-lkft-ltp-cve-master-597/x86,fail
lkft,linux-next-master,next-20190902,2019-09-02T13:13:07.070920Z,qemu_arm,boot-lkft-ltp-sched-master-597/qemu-arm,fail
lkft,linux-next-master,next-20190902,2019-09-02T13:13:07.070920Z,i386,boot-lkft-ltp-fs-master-597/x86,fail
lkft,linux-next-master,next-20190902,2019-09-02T13:13:07.070920Z,x15,install-android-platform-tools-r2600/install-adb,pass
lkft,linux-next-master,next-20190902,2019-09-02T13:13:07.070920Z,x15,install-android-platform-tools-r2600/install-fastboot,pass
lkft,linux-next-master,next-20190902,2019-09-02T13:13:07.070920Z,x15,boot-lkft-perf-master-597/x15,fail
lkft,linux-next-master,next-20190902,2019-09-02T13:13:07.070920Z,i386,boot-lkft-ltp-math-commands-master-597/x86,fail
lkft,linux-next-master,next-20190902,2019-09-02T13:13:07.070920Z,i386,boot-lkft-ltp-io-dio-master-597/x86,fail
lkft,linux-next-master,next-20190902,2019-09-02T13:13:07.070920Z,i386,boot-lkft-ltp-ipc-master-597/x86,fail
lkft,linux-next-master,next-20190902,2019-09-02T13:13:07.070920Z,qemu_arm64,boot-lkft-ltp-hugetlb-mm-master-597/qemu-arm,fail
lkft,linux-next-master,next-20190902,2019-09-02T13:13:07.070920Z,qemu_arm64,boot-lkft-ltp-io-dio-master-597/qemu-arm,fail
lkft,linux-next-master,next-20190902,2019-09-02T13:13:07.070920Z,qemu_arm,boot-lkft-ltp-math-commands-master-597/qemu-arm,fail
lkft,linux-next-master,next-20190902,2019-09-02T13:13:07.070920Z,i386,boot-lkft-ltp-open-posix-master-597/x86,fail
lkft,linux-next-master,next-20190902,2019-09-02T13:13:07.070920Z,qemu_arm64,boot-lkft-ltp-math-commands-master-597/qemu-arm,fail
lkft,linux-next-master,next-20190902,2019-09-02T13:13:07.070920Z,qemu_arm64,boot-lkft-ltp-sched-master-597/qemu-arm,fail
lkft,linux-next-master,next-20190902,2019-09-02T13:13:07.070920Z,qemu_arm64,boot-lkft-ltp-ipc-master-597/qemu-arm,fail
lkft,linux-next-master,next-20190902,2019-09-02T13:13:07.070920Z,qemu_arm64,boot-lkft-ltp-syscalls-master-597/qemu-arm,fail
lkft,linux-next-master,next-20190902,2019-09-02T13:13:07.070920Z,qemu_arm64,boot-lkft-ltp-filecaps-fs_bind-fs_perms_simple-fsx-master-597/qemu-arm,fail
lkft,linux-next-master,next-20190902,2019-09-02T13:13:07.070920Z,qemu_arm64,boot-lkft-ltp-timers-master-597/qemu-arm,fail
lkft,linux-next-master,next-20190902,2019-09-02T13:13:07.070920Z,qemu_arm64,boot-lkft-ltp-nptl-pty-securebits-master-597/qemu-arm,fail
lkft,linux-next-master,next-20190902,2019-09-02T13:13:07.070920Z,qemu_arm64,boot-lkft-ltp-cap_bounds-cpuhotplug-fcntl-locktests-master-597/qemu-arm,fail
lkft,linux-next-master,next-20190902,2019-09-02T13:13:07.070920Z,qemu_arm64,boot-lkft-v4l2-compliance-master-597/qemu-arm,fail
lkft,linux-next-master,next-20190902,2019-09-02T13:13:07.070920Z,juno-r2,boot-lkft-kselftests-master-597/juno-r2,fail
lkft,linux-next-master,next-20190902,2019-09-02T13:13:07.070920Z,qemu_arm64,boot-lkft-perf-master-597/qemu-arm,fail
lkft,linux-next-master,next-20190902,2019-09-02T13:13:07.070920Z,juno-r2,boot-lkft-libgpiod-master-597/juno-r2,fail
lkft,linux-next-master,next-20190902,2019-09-02T13:13:07.070920Z,juno-r2,boot-lkft-kvm-unit-tests-master-597/juno-r2,fail
lkft,linux-next-master,next-20190902,2019-09-02T13:13:07.070920Z,juno-r2,boot-lkft-ltp-containers-master-597/juno-r2,fail
lkft,linux-next-master,next-20190902,2019-09-02T13:13:07.070920Z,juno-r2,boot-lkft-libhugetlbfs-master-597/juno-r2,fail
lkft,linux-next-master,next-20190902,2019-09-02T13:13:07.070920Z,juno-r2,boot-lkft-ltp-cve-master-597/juno-r2,fail
lkft,linux-next-master,next-20190902,2019-09-02T13:13:07.070920Z,juno-r2,boot-lkft-ltp-fs-master-597/juno-r2,fail
lkft,linux-next-master,next-20190902,2019-09-02T13:13:07.070920Z,juno-r2,boot-lkft-ltp-hugetlb-mm-master-597/juno-r2,fail
lkft,linux-next-master,next-20190902,2019-09-02T13:13:07.070920Z,juno-r2,boot-lkft-ltp-math-commands-master-597/juno-r2,fail
lkft,linux-next-master,next-20190902,2019-09-02T13:13:07.070920Z,juno-r2,boot-lkft-ltp-io-dio-master-597/juno-r2,fail
lkft,linux-next-master,next-20190902,2019-09-02T13:13:07.070920Z,juno-r2,boot-lkft-ltp-ipc-master-597/juno-r2,fail
lkft,linux-next-master,next-20190902,2019-09-02T13:13:07.070920Z,juno-r2,boot-lkft-ltp-sched-master-597/juno-r2,fail
lkft,linux-next-master,next-20190902,2019-09-02T13:13:07.070920Z,juno-r2,boot-lkft-ltp-open-posix-master-597/juno-r2,fail
lkft,linux-next-master,next-20190902,2019-09-02T13:13:07.070920Z,juno-r2,boot-lkft-ltp-filecaps-fs_bind-fs_perms_simple-fsx-master-597/juno-r2,fail
lkft,linux-next-master,next-20190902,2019-09-02T13:13:07.070920Z,juno-r2,boot-lkft-ltp-nptl-pty-securebits-master-597/juno-r2,fail
lkft,linux-next-master,next-20190902,2019-09-02T13:13:07.070920Z,juno-r2,boot-lkft-ltp-cap_bounds-cpuhotplug-fcntl-locktests-master-597/juno-r2,fail
lkft,linux-next-master,next-20190902,2019-09-02T13:13:07.070920Z,juno-r2,boot-lkft-network-basic-tests-master-597/juno-r2,fail
lkft,linux-next-master,next-20190902,2019-09-02T13:13:07.070920Z,juno-r2,boot-lkft-ltp-syscalls-master-597/juno-r2,fail
lkft,linux-next-master,next-20190902,2019-09-02T13:13:07.070920Z,juno-r2,boot-lkft-ltp-timers-master-597/juno-r2,fail
lkft,linux-next-master,next-20190902,2019-09-02T13:13:07.070920Z,juno-r2,boot-lkft-perf-master-597/juno-r2,fail
lkft,linux-next-master,next-20190902,2019-09-02T13:13:07.070920Z,juno-r2,boot-lkft-v4l2-compliance-master-597/juno-r2,fail
lkft,linux-next-master,next-20190902,2019-09-02T13:13:07.070920Z,hi6220-hikey,boot-lkft-ltp-io-dio-master-597/hi6220-hikey-r2,fail
lkft,linux-next-master,next-20190902,2019-09-02T13:13:07.070920Z,hi6220-hikey,install-android-platform-tools-r2600/install-adb,pass
lkft,linux-next-master,next-20190902,2019-09-02T13:13:07.070920Z,hi6220-hikey,install-android-platform-tools-r2600/install-fastboot,pass
lkft,linux-next-master,next-20190902,2019-09-02T13:13:07.070920Z,hi6220-hikey,install-android-platform-tools-r2600/install-adb,pass
lkft,linux-next-master,next-20190902,2019-09-02T13:13:07.070920Z,hi6220-hikey,boot-lkft-ltp-math-commands-master-597/hi6220-hikey-r2,fail
lkft,linux-next-master,next-20190902,2019-09-02T13:13:07.070920Z,hi6220-hikey,install-android-platform-tools-r2600/install-fastboot,pass
lkft,linux-next-master,next-20190902,2019-09-02T13:13:07.070920Z,hi6220-hikey,install-android-platform-tools-r2600/install-adb,pass
lkft,linux-next-master,next-20190902,2019-09-02T13:13:07.070920Z,hi6220-hikey,install-android-platform-tools-r2600/install-fastboot,pass
lkft,linux-next-master,next-20190902,2019-09-02T13:13:07.070920Z,hi6220-hikey,boot-lkft-ltp-sched-master-597/hi6220-hikey-r2,fail
lkft,linux-next-master,next-20190902,2019-09-02T13:13:07.070920Z,dragonboard-410c,install-android-platform-tools-r2600/install-adb,pass
lkft,linux-next-master,next-20190902,2019-09-02T13:13:07.070920Z,dragonboard-410c,boot-lkft-ltp-syscalls-master-597/dragonboard-410c,fail
lkft,linux-next-master,next-20190902,2019-09-02T13:13:07.070920Z,dragonboard-410c,install-android-platform-tools-r2600/install-fastboot,pass
lkft,linux-next-master,next-20190902,2019-09-02T13:13:07.070920Z,dragonboard-410c,install-android-platform-tools-r2600/install-adb,pass
lkft,linux-next-master,next-20190902,2019-09-02T13:13:07.070920Z,dragonboard-410c,install-android-platform-tools-r2600/install-fastboot,pass
lkft,linux-next-master,next-20190902,2019-09-02T13:13:07.070920Z,dragonboard-410c,boot-lkft-ltp-timers-master-597/dragonboard-410c,fail
lkft,linux-next-master,next-20190902,2019-09-02T13:13:07.070920Z,dragonboard-410c,install-android-platform-tools-r2600/install-adb,pass
lkft,linux-next-master,next-20190902,2019-09-02T13:13:07.070920Z,dragonboard-410c,boot-lkft-ltp-filecaps-fs_bind-fs_perms_simple-fsx-master-597/dragonboard-410c,fail
lkft,linux-next-master,next-20190902,2019-09-02T13:13:07.070920Z,dragonboard-410c,install-android-platform-tools-r2600/install-fastboot,pass
lkft,linux-next-master,next-20190902,2019-09-02T13:13:07.070920Z,dragonboard-410c,install-android-platform-tools-r2600/install-adb,pass
lkft,linux-next-master,next-20190902,2019-09-02T13:13:07.070920Z,dragonboard-410c,boot-lkft-ltp-nptl-pty-securebits-master-597/dragonboard-410c,fail
lkft,linux-next-master,next-20190902,2019-09-02T13:13:07.070920Z,dragonboard-410c,install-android-platform-tools-r2600/install-fastboot,pass
lkft,linux-next-master,next-20190902,2019-09-02T13:13:07.070920Z,dragonboard-410c,boot-lkft-ltp-cap_bounds-cpuhotplug-fcntl-locktests-master-597/dragonboard-410c,fail
lkft,linux-next-master,next-20190902,2019-09-02T13:13:07.070920Z,dragonboard-410c,install-android-platform-tools-r2600/install-adb,pass
lkft,linux-next-master,next-20190902,2019-09-02T13:13:07.070920Z,dragonboard-410c,install-android-platform-tools-r2600/install-fastboot,pass
lkft,linux-next-master,next-20190902,2019-09-02T13:13:07.070920Z,dragonboard-410c,install-android-platform-tools-r2600/install-adb,pass
lkft,linux-next-master,next-20190902,2019-09-02T13:13:07.070920Z,dragonboard-410c,boot-lkft-v4l2-compliance-master-597/dragonboard-410c,fail
lkft,linux-next-master,next-20190902,2019-09-02T13:13:07.070920Z,dragonboard-410c,install-android-platform-tools-r2600/install-fastboot,pass
lkft,linux-next-master,next-20190902,2019-09-02T13:13:07.070920Z,dragonboard-410c,install-android-platform-tools-r2600/install-adb,pass
lkft,linux-next-master,next-20190902,2019-09-02T13:13:07.070920Z,dragonboard-410c,boot-lkft-perf-master-597/dragonboard-410c,fail
lkft,linux-next-master,next-20190902,2019-09-02T13:13:07.070920Z,dragonboard-410c,install-android-platform-tools-r2600/install-fastboot,pass
