group.name,project.name,build.name,build.datetime,environment.name,test.name,test.status
lkft,linux-stable-rc-linux-4.9.y,v4.9.189-93-gcb43723042f9,2019-08-19T05:17:08.499656Z,hi6220-hikey,build/build_process,fail
lkft,linux-stable-rc-linux-4.9.y,v4.9.189-93-gcb43723042f9,2019-08-19T05:17:08.499656Z,x15,build/build_process,fail
lkft,linux-stable-rc-linux-4.9.y,v4.9.189-93-gcb43723042f9,2019-08-19T05:17:08.499656Z,i386,build/build_process,fail
lkft,linux-stable-rc-linux-4.9.y,v4.9.189-93-gcb43723042f9,2019-08-19T05:17:08.499656Z,x86,build/build_process,fail
lkft,linux-stable-rc-linux-4.9.y,v4.9.189-93-gcb43723042f9,2019-08-19T05:17:08.499656Z,juno-r2,build/build_process,fail
lkft,linux-stable-rc-linux-4.9.y,v4.9.189-93-gcb43723042f9,2019-08-19T05:17:08.499656Z,dragonboard-410c,build/build_process,fail
