group.name,project.name,build.name,build.datetime,environment.name,test.name,test.status
lkft,linux-stable-rc-linux-4.14.y,v4.14.39-580-gc8cd674cefa1,2018-05-02T18:29:11.171448Z,qemu_arm64,boot/qemu,fail
lkft,linux-stable-rc-linux-4.14.y,v4.14.39-580-gc8cd674cefa1,2018-05-02T18:29:11.171448Z,qemu_arm64,boot/qemu,fail
lkft,linux-stable-rc-linux-4.14.y,v4.14.39-580-gc8cd674cefa1,2018-05-02T18:29:11.171448Z,qemu_arm64,boot/qemu,fail
lkft,linux-stable-rc-linux-4.14.y,v4.14.39-580-gc8cd674cefa1,2018-05-02T18:29:11.171448Z,qemu_arm64,boot/qemu,fail
lkft,linux-stable-rc-linux-4.14.y,v4.14.39-580-gc8cd674cefa1,2018-05-02T18:29:11.171448Z,qemu_arm64,boot/qemu,fail
lkft,linux-stable-rc-linux-4.14.y,v4.14.39-580-gc8cd674cefa1,2018-05-02T18:29:11.171448Z,qemu_arm64,boot/qemu,fail
lkft,linux-stable-rc-linux-4.14.y,v4.14.39-580-gc8cd674cefa1,2018-05-02T18:29:11.171448Z,qemu_arm64,boot/qemu,fail
lkft,linux-stable-rc-linux-4.14.y,v4.14.39-580-gc8cd674cefa1,2018-05-02T18:29:11.171448Z,qemu_arm64,boot/qemu,fail
lkft,linux-stable-rc-linux-4.14.y,v4.14.39-580-gc8cd674cefa1,2018-05-02T18:29:11.171448Z,x86,boot/x86,fail
lkft,linux-stable-rc-linux-4.14.y,v4.14.39-580-gc8cd674cefa1,2018-05-02T18:29:11.171448Z,x86,boot/x86,fail
lkft,linux-stable-rc-linux-4.14.y,v4.14.39-580-gc8cd674cefa1,2018-05-02T18:29:11.171448Z,qemu_arm64,boot/qemu,fail
lkft,linux-stable-rc-linux-4.14.y,v4.14.39-580-gc8cd674cefa1,2018-05-02T18:29:11.171448Z,qemu_arm64,boot/qemu,fail
lkft,linux-stable-rc-linux-4.14.y,v4.14.39-580-gc8cd674cefa1,2018-05-02T18:29:11.171448Z,qemu_arm64,boot/qemu,fail
lkft,linux-stable-rc-linux-4.14.y,v4.14.39-580-gc8cd674cefa1,2018-05-02T18:29:11.171448Z,qemu_arm64,boot/qemu,fail
lkft,linux-stable-rc-linux-4.14.y,v4.14.39-580-gc8cd674cefa1,2018-05-02T18:29:11.171448Z,qemu_arm64,boot/qemu,fail
lkft,linux-stable-rc-linux-4.14.y,v4.14.39-580-gc8cd674cefa1,2018-05-02T18:29:11.171448Z,qemu_arm64,boot/qemu,fail
lkft,linux-stable-rc-linux-4.14.y,v4.14.39-580-gc8cd674cefa1,2018-05-02T18:29:11.171448Z,qemu_arm64,boot/qemu,fail
lkft,linux-stable-rc-linux-4.14.y,v4.14.39-580-gc8cd674cefa1,2018-05-02T18:29:11.171448Z,qemu_arm64,boot/qemu,fail
lkft,linux-stable-rc-linux-4.14.y,v4.14.39-580-gc8cd674cefa1,2018-05-02T18:29:11.171448Z,qemu_arm64,boot/qemu,fail
lkft,linux-stable-rc-linux-4.14.y,v4.14.39-580-gc8cd674cefa1,2018-05-02T18:29:11.171448Z,x86,boot/x86,fail
lkft,linux-stable-rc-linux-4.14.y,v4.14.39-580-gc8cd674cefa1,2018-05-02T18:29:11.171448Z,qemu_arm64,boot/qemu,fail
lkft,linux-stable-rc-linux-4.14.y,v4.14.39-580-gc8cd674cefa1,2018-05-02T18:29:11.171448Z,x86,boot/x86,fail
lkft,linux-stable-rc-linux-4.14.y,v4.14.39-580-gc8cd674cefa1,2018-05-02T18:29:11.171448Z,x86,boot/x86,fail
lkft,linux-stable-rc-linux-4.14.y,v4.14.39-580-gc8cd674cefa1,2018-05-02T18:29:11.171448Z,qemu_arm64,boot/qemu,fail
lkft,linux-stable-rc-linux-4.14.y,v4.14.39-580-gc8cd674cefa1,2018-05-02T18:29:11.171448Z,qemu_arm64,boot/qemu,fail
lkft,linux-stable-rc-linux-4.14.y,v4.14.39-580-gc8cd674cefa1,2018-05-02T18:29:11.171448Z,qemu_x86_64,boot/qemu,fail
lkft,linux-stable-rc-linux-4.14.y,v4.14.39-580-gc8cd674cefa1,2018-05-02T18:29:11.171448Z,qemu_x86_64,boot/qemu,fail
lkft,linux-stable-rc-linux-4.14.y,v4.14.39-580-gc8cd674cefa1,2018-05-02T18:29:11.171448Z,qemu_x86_64,boot/qemu,fail
lkft,linux-stable-rc-linux-4.14.y,v4.14.39-580-gc8cd674cefa1,2018-05-02T18:29:11.171448Z,qemu_x86_64,boot/qemu,fail
lkft,linux-stable-rc-linux-4.14.y,v4.14.39-580-gc8cd674cefa1,2018-05-02T18:29:11.171448Z,qemu_x86_64,boot/qemu,fail
lkft,linux-stable-rc-linux-4.14.y,v4.14.39-580-gc8cd674cefa1,2018-05-02T18:29:11.171448Z,qemu_x86_64,boot/qemu,fail
lkft,linux-stable-rc-linux-4.14.y,v4.14.39-580-gc8cd674cefa1,2018-05-02T18:29:11.171448Z,qemu_x86_64,boot/qemu,fail
lkft,linux-stable-rc-linux-4.14.y,v4.14.39-580-gc8cd674cefa1,2018-05-02T18:29:11.171448Z,qemu_x86_64,boot/qemu,fail
lkft,linux-stable-rc-linux-4.14.y,v4.14.39-580-gc8cd674cefa1,2018-05-02T18:29:11.171448Z,x86,boot/x86,fail
lkft,linux-stable-rc-linux-4.14.y,v4.14.39-580-gc8cd674cefa1,2018-05-02T18:29:11.171448Z,x86,boot/x86,fail
lkft,linux-stable-rc-linux-4.14.y,v4.14.39-580-gc8cd674cefa1,2018-05-02T18:29:11.171448Z,qemu_x86_64,boot/qemu,fail
lkft,linux-stable-rc-linux-4.14.y,v4.14.39-580-gc8cd674cefa1,2018-05-02T18:29:11.171448Z,x86,boot/x86,fail
lkft,linux-stable-rc-linux-4.14.y,v4.14.39-580-gc8cd674cefa1,2018-05-02T18:29:11.171448Z,qemu_x86_64,boot/qemu,fail
lkft,linux-stable-rc-linux-4.14.y,v4.14.39-580-gc8cd674cefa1,2018-05-02T18:29:11.171448Z,qemu_x86_64,boot/qemu,fail
lkft,linux-stable-rc-linux-4.14.y,v4.14.39-580-gc8cd674cefa1,2018-05-02T18:29:11.171448Z,qemu_x86_64,boot/qemu,fail
lkft,linux-stable-rc-linux-4.14.y,v4.14.39-580-gc8cd674cefa1,2018-05-02T18:29:11.171448Z,qemu_x86_64,boot/qemu,fail
lkft,linux-stable-rc-linux-4.14.y,v4.14.39-580-gc8cd674cefa1,2018-05-02T18:29:11.171448Z,qemu_x86_64,boot/qemu,fail
lkft,linux-stable-rc-linux-4.14.y,v4.14.39-580-gc8cd674cefa1,2018-05-02T18:29:11.171448Z,qemu_x86_64,boot/qemu,fail
lkft,linux-stable-rc-linux-4.14.y,v4.14.39-580-gc8cd674cefa1,2018-05-02T18:29:11.171448Z,x86,boot/x86,fail
lkft,linux-stable-rc-linux-4.14.y,v4.14.39-580-gc8cd674cefa1,2018-05-02T18:29:11.171448Z,qemu_x86_64,boot/qemu,fail
lkft,linux-stable-rc-linux-4.14.y,v4.14.39-580-gc8cd674cefa1,2018-05-02T18:29:11.171448Z,qemu_x86_64,boot/qemu,fail
lkft,linux-stable-rc-linux-4.14.y,v4.14.39-580-gc8cd674cefa1,2018-05-02T18:29:11.171448Z,qemu_x86_64,boot/qemu,fail
lkft,linux-stable-rc-linux-4.14.y,v4.14.39-580-gc8cd674cefa1,2018-05-02T18:29:11.171448Z,qemu_x86_64,boot/qemu,fail
lkft,linux-stable-rc-linux-4.14.y,v4.14.39-580-gc8cd674cefa1,2018-05-02T18:29:11.171448Z,x86,boot/x86,fail
lkft,linux-stable-rc-linux-4.14.y,v4.14.39-580-gc8cd674cefa1,2018-05-02T18:29:11.171448Z,x86,boot/x86,fail
lkft,linux-stable-rc-linux-4.14.y,v4.14.39-580-gc8cd674cefa1,2018-05-02T18:29:11.171448Z,qemu_x86_64,boot/qemu,fail
lkft,linux-stable-rc-linux-4.14.y,v4.14.39-580-gc8cd674cefa1,2018-05-02T18:29:11.171448Z,x86,boot/x86,fail
lkft,linux-stable-rc-linux-4.14.y,v4.14.39-580-gc8cd674cefa1,2018-05-02T18:29:11.171448Z,qemu_x86_64,boot/qemu,fail
lkft,linux-stable-rc-linux-4.14.y,v4.14.39-580-gc8cd674cefa1,2018-05-02T18:29:11.171448Z,qemu_x86_64,boot/qemu,fail
lkft,linux-stable-rc-linux-4.14.y,v4.14.39-580-gc8cd674cefa1,2018-05-02T18:29:11.171448Z,x86,boot/x86,fail
lkft,linux-stable-rc-linux-4.14.y,v4.14.39-580-gc8cd674cefa1,2018-05-02T18:29:11.171448Z,x86,boot/x86,fail
lkft,linux-stable-rc-linux-4.14.y,v4.14.39-580-gc8cd674cefa1,2018-05-02T18:29:11.171448Z,x86,boot/x86,fail
lkft,linux-stable-rc-linux-4.14.y,v4.14.39-580-gc8cd674cefa1,2018-05-02T18:29:11.171448Z,x86,boot/x86,fail
lkft,linux-stable-rc-linux-4.14.y,v4.14.39-580-gc8cd674cefa1,2018-05-02T18:29:11.171448Z,x86,boot/x86,fail
lkft,linux-stable-rc-linux-4.14.y,v4.14.39-580-gc8cd674cefa1,2018-05-02T18:29:11.171448Z,x86,boot/x86,fail
lkft,linux-stable-rc-linux-4.14.y,v4.14.39-580-gc8cd674cefa1,2018-05-02T18:29:11.171448Z,x86,boot/x86,fail
lkft,linux-stable-rc-linux-4.14.y,v4.14.39-580-gc8cd674cefa1,2018-05-02T18:29:11.171448Z,x86,boot/x86,fail
lkft,linux-stable-rc-linux-4.14.y,v4.14.39-580-gc8cd674cefa1,2018-05-02T18:29:11.171448Z,x86,boot/x86,fail
lkft,linux-stable-rc-linux-4.14.y,v4.14.39-580-gc8cd674cefa1,2018-05-02T18:29:11.171448Z,x86,boot/x86,fail
lkft,linux-stable-rc-linux-4.14.y,v4.14.39-580-gc8cd674cefa1,2018-05-02T18:29:11.171448Z,hi6220-hikey,boot/hi6220-hikey-r2,fail
lkft,linux-stable-rc-linux-4.14.y,v4.14.39-580-gc8cd674cefa1,2018-05-02T18:29:11.171448Z,hi6220-hikey,boot/hi6220-hikey-r2,fail
lkft,linux-stable-rc-linux-4.14.y,v4.14.39-580-gc8cd674cefa1,2018-05-02T18:29:11.171448Z,hi6220-hikey,boot/hi6220-hikey-r2,fail
lkft,linux-stable-rc-linux-4.14.y,v4.14.39-580-gc8cd674cefa1,2018-05-02T18:29:11.171448Z,hi6220-hikey,boot/hi6220-hikey-r2,fail
lkft,linux-stable-rc-linux-4.14.y,v4.14.39-580-gc8cd674cefa1,2018-05-02T18:29:11.171448Z,hi6220-hikey,boot/hi6220-hikey-r2,fail
lkft,linux-stable-rc-linux-4.14.y,v4.14.39-580-gc8cd674cefa1,2018-05-02T18:29:11.171448Z,hi6220-hikey,boot/hi6220-hikey-r2,fail
lkft,linux-stable-rc-linux-4.14.y,v4.14.39-580-gc8cd674cefa1,2018-05-02T18:29:11.171448Z,hi6220-hikey,boot/hi6220-hikey-r2,fail
lkft,linux-stable-rc-linux-4.14.y,v4.14.39-580-gc8cd674cefa1,2018-05-02T18:29:11.171448Z,juno-r2,boot/juno-r2,fail
lkft,linux-stable-rc-linux-4.14.y,v4.14.39-580-gc8cd674cefa1,2018-05-02T18:29:11.171448Z,hi6220-hikey,boot/hi6220-hikey-r2,fail
lkft,linux-stable-rc-linux-4.14.y,v4.14.39-580-gc8cd674cefa1,2018-05-02T18:29:11.171448Z,juno-r2,boot/juno-r2,fail
lkft,linux-stable-rc-linux-4.14.y,v4.14.39-580-gc8cd674cefa1,2018-05-02T18:29:11.171448Z,juno-r2,boot/juno-r2,fail
lkft,linux-stable-rc-linux-4.14.y,v4.14.39-580-gc8cd674cefa1,2018-05-02T18:29:11.171448Z,hi6220-hikey,boot/hi6220-hikey-r2,fail
lkft,linux-stable-rc-linux-4.14.y,v4.14.39-580-gc8cd674cefa1,2018-05-02T18:29:11.171448Z,hi6220-hikey,boot/hi6220-hikey-r2,fail
lkft,linux-stable-rc-linux-4.14.y,v4.14.39-580-gc8cd674cefa1,2018-05-02T18:29:11.171448Z,hi6220-hikey,boot/hi6220-hikey-r2,fail
lkft,linux-stable-rc-linux-4.14.y,v4.14.39-580-gc8cd674cefa1,2018-05-02T18:29:11.171448Z,hi6220-hikey,boot/hi6220-hikey-r2,fail
lkft,linux-stable-rc-linux-4.14.y,v4.14.39-580-gc8cd674cefa1,2018-05-02T18:29:11.171448Z,juno-r2,boot/juno-r2,fail
lkft,linux-stable-rc-linux-4.14.y,v4.14.39-580-gc8cd674cefa1,2018-05-02T18:29:11.171448Z,juno-r2,boot/juno-r2,fail
lkft,linux-stable-rc-linux-4.14.y,v4.14.39-580-gc8cd674cefa1,2018-05-02T18:29:11.171448Z,juno-r2,boot/juno-r2,fail
lkft,linux-stable-rc-linux-4.14.y,v4.14.39-580-gc8cd674cefa1,2018-05-02T18:29:11.171448Z,juno-r2,boot/juno-r2,fail
lkft,linux-stable-rc-linux-4.14.y,v4.14.39-580-gc8cd674cefa1,2018-05-02T18:29:11.171448Z,hi6220-hikey,boot/hi6220-hikey-r2,fail
lkft,linux-stable-rc-linux-4.14.y,v4.14.39-580-gc8cd674cefa1,2018-05-02T18:29:11.171448Z,hi6220-hikey,boot/hi6220-hikey-r2,fail
lkft,linux-stable-rc-linux-4.14.y,v4.14.39-580-gc8cd674cefa1,2018-05-02T18:29:11.171448Z,hi6220-hikey,boot/hi6220-hikey-r2,fail
lkft,linux-stable-rc-linux-4.14.y,v4.14.39-580-gc8cd674cefa1,2018-05-02T18:29:11.171448Z,hi6220-hikey,boot/hi6220-hikey-r2,fail
lkft,linux-stable-rc-linux-4.14.y,v4.14.39-580-gc8cd674cefa1,2018-05-02T18:29:11.171448Z,juno-r2,boot/juno-r2,fail
lkft,linux-stable-rc-linux-4.14.y,v4.14.39-580-gc8cd674cefa1,2018-05-02T18:29:11.171448Z,juno-r2,boot/juno-r2,fail
lkft,linux-stable-rc-linux-4.14.y,v4.14.39-580-gc8cd674cefa1,2018-05-02T18:29:11.171448Z,juno-r2,boot/juno-r2,fail
lkft,linux-stable-rc-linux-4.14.y,v4.14.39-580-gc8cd674cefa1,2018-05-02T18:29:11.171448Z,hi6220-hikey,boot/hi6220-hikey-r2,fail
lkft,linux-stable-rc-linux-4.14.y,v4.14.39-580-gc8cd674cefa1,2018-05-02T18:29:11.171448Z,juno-r2,boot/juno-r2,fail
lkft,linux-stable-rc-linux-4.14.y,v4.14.39-580-gc8cd674cefa1,2018-05-02T18:29:11.171448Z,juno-r2,boot/juno-r2,fail
lkft,linux-stable-rc-linux-4.14.y,v4.14.39-580-gc8cd674cefa1,2018-05-02T18:29:11.171448Z,juno-r2,boot/juno-r2,fail
lkft,linux-stable-rc-linux-4.14.y,v4.14.39-580-gc8cd674cefa1,2018-05-02T18:29:11.171448Z,juno-r2,boot/juno-r2,fail
lkft,linux-stable-rc-linux-4.14.y,v4.14.39-580-gc8cd674cefa1,2018-05-02T18:29:11.171448Z,juno-r2,boot/juno-r2,fail
lkft,linux-stable-rc-linux-4.14.y,v4.14.39-580-gc8cd674cefa1,2018-05-02T18:29:11.171448Z,juno-r2,boot/juno-r2,fail
lkft,linux-stable-rc-linux-4.14.y,v4.14.39-580-gc8cd674cefa1,2018-05-02T18:29:11.171448Z,juno-r2,boot/juno-r2,fail
lkft,linux-stable-rc-linux-4.14.y,v4.14.39-580-gc8cd674cefa1,2018-05-02T18:29:11.171448Z,juno-r2,boot/juno-r2,fail
lkft,linux-stable-rc-linux-4.14.y,v4.14.39-580-gc8cd674cefa1,2018-05-02T18:29:11.171448Z,juno-r2,boot/juno-r2,fail
lkft,linux-stable-rc-linux-4.14.y,v4.14.39-580-gc8cd674cefa1,2018-05-02T18:29:11.171448Z,juno-r2,boot/juno-r2,fail
lkft,linux-stable-rc-linux-4.14.y,v4.14.39-580-gc8cd674cefa1,2018-05-02T18:29:11.171448Z,hi6220-hikey,boot/hi6220-hikey-r2,fail
lkft,linux-stable-rc-linux-4.14.y,v4.14.39-580-gc8cd674cefa1,2018-05-02T18:29:11.171448Z,hi6220-hikey,boot/hi6220-hikey-r2,fail
lkft,linux-stable-rc-linux-4.14.y,v4.14.39-580-gc8cd674cefa1,2018-05-02T18:29:11.171448Z,hi6220-hikey,boot/hi6220-hikey-r2,fail
lkft,linux-stable-rc-linux-4.14.y,v4.14.39-580-gc8cd674cefa1,2018-05-02T18:29:11.171448Z,dragonboard-410c,boot/dragonboard-410c,fail
lkft,linux-stable-rc-linux-4.14.y,v4.14.39-580-gc8cd674cefa1,2018-05-02T18:29:11.171448Z,dragonboard-410c,boot/dragonboard-410c,fail
lkft,linux-stable-rc-linux-4.14.y,v4.14.39-580-gc8cd674cefa1,2018-05-02T18:29:11.171448Z,dragonboard-410c,boot/dragonboard-410c,fail
lkft,linux-stable-rc-linux-4.14.y,v4.14.39-580-gc8cd674cefa1,2018-05-02T18:29:11.171448Z,dragonboard-410c,boot/dragonboard-410c,fail
lkft,linux-stable-rc-linux-4.14.y,v4.14.39-580-gc8cd674cefa1,2018-05-02T18:29:11.171448Z,dragonboard-410c,boot/dragonboard-410c,fail
lkft,linux-stable-rc-linux-4.14.y,v4.14.39-580-gc8cd674cefa1,2018-05-02T18:29:11.171448Z,dragonboard-410c,boot/dragonboard-410c,fail
lkft,linux-stable-rc-linux-4.14.y,v4.14.39-580-gc8cd674cefa1,2018-05-02T18:29:11.171448Z,dragonboard-410c,boot/dragonboard-410c,fail
lkft,linux-stable-rc-linux-4.14.y,v4.14.39-580-gc8cd674cefa1,2018-05-02T18:29:11.171448Z,dragonboard-410c,boot/dragonboard-410c,fail
lkft,linux-stable-rc-linux-4.14.y,v4.14.39-580-gc8cd674cefa1,2018-05-02T18:29:11.171448Z,dragonboard-410c,boot/dragonboard-410c,fail
lkft,linux-stable-rc-linux-4.14.y,v4.14.39-580-gc8cd674cefa1,2018-05-02T18:29:11.171448Z,dragonboard-410c,boot/dragonboard-410c,fail
lkft,linux-stable-rc-linux-4.14.y,v4.14.39-580-gc8cd674cefa1,2018-05-02T18:29:11.171448Z,dragonboard-410c,boot/dragonboard-410c,fail
lkft,linux-stable-rc-linux-4.14.y,v4.14.39-580-gc8cd674cefa1,2018-05-02T18:29:11.171448Z,dragonboard-410c,boot/dragonboard-410c,fail
lkft,linux-stable-rc-linux-4.14.y,v4.14.39-580-gc8cd674cefa1,2018-05-02T18:29:11.171448Z,dragonboard-410c,boot/dragonboard-410c,fail
lkft,linux-stable-rc-linux-4.14.y,v4.14.39-580-gc8cd674cefa1,2018-05-02T18:29:11.171448Z,dragonboard-410c,boot/dragonboard-410c,fail
lkft,linux-stable-rc-linux-4.14.y,v4.14.39-580-gc8cd674cefa1,2018-05-02T18:29:11.171448Z,dragonboard-410c,boot/dragonboard-410c,fail
lkft,linux-stable-rc-linux-4.14.y,v4.14.39-580-gc8cd674cefa1,2018-05-02T18:29:11.171448Z,dragonboard-410c,boot/dragonboard-410c,fail
lkft,linux-stable-rc-linux-4.14.y,v4.14.39-580-gc8cd674cefa1,2018-05-02T18:29:11.171448Z,dragonboard-410c,boot/dragonboard-410c,fail
lkft,linux-stable-rc-linux-4.14.y,v4.14.39-580-gc8cd674cefa1,2018-05-02T18:29:11.171448Z,dragonboard-410c,boot/dragonboard-410c,fail
lkft,linux-stable-rc-linux-4.14.y,v4.14.39-580-gc8cd674cefa1,2018-05-02T18:29:11.171448Z,dragonboard-410c,boot/dragonboard-410c,fail
lkft,linux-stable-rc-linux-4.14.y,v4.14.39-580-gc8cd674cefa1,2018-05-02T18:29:11.171448Z,dragonboard-410c,boot/dragonboard-410c,fail
