group.name,project.name,build.name,build.datetime,environment.name,test.name,test.status
lkft,linux-stable-rc-linux-4.9.y,v4.9.225-60-g0caa48a831ad,2020-06-02T10:31:44.540268Z,i386,build/build_process,pass
lkft,linux-stable-rc-linux-4.9.y,v4.9.225-60-g0caa48a831ad,2020-06-02T10:31:44.540268Z,i386,linux-log-parser/check-kernel-exception-i386-910,pass
lkft,linux-stable-rc-linux-4.9.y,v4.9.225-60-g0caa48a831ad,2020-06-02T10:31:44.540268Z,i386,linux-log-parser/check-kernel-trace-i386-910,pass
lkft,linux-stable-rc-linux-4.9.y,v4.9.225-60-g0caa48a831ad,2020-06-02T10:31:44.540268Z,i386,linux-log-parser/check-kernel-oops-i386-910,pass
lkft,linux-stable-rc-linux-4.9.y,v4.9.225-60-g0caa48a831ad,2020-06-02T10:31:44.540268Z,i386,linux-log-parser/check-kernel-fault-i386-910,pass
lkft,linux-stable-rc-linux-4.9.y,v4.9.225-60-g0caa48a831ad,2020-06-02T10:31:44.540268Z,i386,linux-log-parser/check-kernel-warning-i386-910,pass
lkft,linux-stable-rc-linux-4.9.y,v4.9.225-60-g0caa48a831ad,2020-06-02T10:31:44.540268Z,i386,linux-log-parser/check-kernel-bug-i386-910,pass
lkft,linux-stable-rc-linux-4.9.y,v4.9.225-60-g0caa48a831ad,2020-06-02T10:31:44.540268Z,i386,linux-log-parser/check-kernel-invalid-opcode-i386-910,pass
lkft,linux-stable-rc-linux-4.9.y,v4.9.225-60-g0caa48a831ad,2020-06-02T10:31:44.540268Z,i386,linux-log-parser/check-kernel-panic-i386-910,pass
lkft,linux-stable-rc-linux-4.9.y,v4.9.225-60-g0caa48a831ad,2020-06-02T10:31:44.540268Z,juno-r2,build/build_process,pass
lkft,linux-stable-rc-linux-4.9.y,v4.9.225-60-g0caa48a831ad,2020-06-02T10:31:44.540268Z,juno-r2,linux-log-parser/check-kernel-exception-juno-r2-910,pass
lkft,linux-stable-rc-linux-4.9.y,v4.9.225-60-g0caa48a831ad,2020-06-02T10:31:44.540268Z,juno-r2,linux-log-parser/check-kernel-trace-juno-r2-910,pass
lkft,linux-stable-rc-linux-4.9.y,v4.9.225-60-g0caa48a831ad,2020-06-02T10:31:44.540268Z,juno-r2,linux-log-parser/check-kernel-oops-juno-r2-910,pass
lkft,linux-stable-rc-linux-4.9.y,v4.9.225-60-g0caa48a831ad,2020-06-02T10:31:44.540268Z,juno-r2,linux-log-parser/check-kernel-fault-juno-r2-910,pass
lkft,linux-stable-rc-linux-4.9.y,v4.9.225-60-g0caa48a831ad,2020-06-02T10:31:44.540268Z,juno-r2,linux-log-parser/check-kernel-warning-juno-r2-910,pass
lkft,linux-stable-rc-linux-4.9.y,v4.9.225-60-g0caa48a831ad,2020-06-02T10:31:44.540268Z,juno-r2,linux-log-parser/check-kernel-bug-juno-r2-910,pass
lkft,linux-stable-rc-linux-4.9.y,v4.9.225-60-g0caa48a831ad,2020-06-02T10:31:44.540268Z,juno-r2,linux-log-parser/check-kernel-invalid-opcode-juno-r2-910,pass
lkft,linux-stable-rc-linux-4.9.y,v4.9.225-60-g0caa48a831ad,2020-06-02T10:31:44.540268Z,juno-r2,linux-log-parser/check-kernel-panic-juno-r2-910,pass
lkft,linux-stable-rc-linux-4.9.y,v4.9.225-60-g0caa48a831ad,2020-06-02T10:31:44.540268Z,x86,build/build_process,pass
lkft,linux-stable-rc-linux-4.9.y,v4.9.225-60-g0caa48a831ad,2020-06-02T10:31:44.540268Z,x86,linux-log-parser/check-kernel-exception-x86-910,pass
lkft,linux-stable-rc-linux-4.9.y,v4.9.225-60-g0caa48a831ad,2020-06-02T10:31:44.540268Z,x86,linux-log-parser/check-kernel-trace-x86-910,pass
lkft,linux-stable-rc-linux-4.9.y,v4.9.225-60-g0caa48a831ad,2020-06-02T10:31:44.540268Z,x86,linux-log-parser/check-kernel-oops-x86-910,pass
lkft,linux-stable-rc-linux-4.9.y,v4.9.225-60-g0caa48a831ad,2020-06-02T10:31:44.540268Z,x86,linux-log-parser/check-kernel-fault-x86-910,pass
lkft,linux-stable-rc-linux-4.9.y,v4.9.225-60-g0caa48a831ad,2020-06-02T10:31:44.540268Z,x86,linux-log-parser/check-kernel-warning-x86-910,pass
lkft,linux-stable-rc-linux-4.9.y,v4.9.225-60-g0caa48a831ad,2020-06-02T10:31:44.540268Z,x86,linux-log-parser/check-kernel-bug-x86-910,pass
lkft,linux-stable-rc-linux-4.9.y,v4.9.225-60-g0caa48a831ad,2020-06-02T10:31:44.540268Z,x86,linux-log-parser/check-kernel-invalid-opcode-x86-910,pass
lkft,linux-stable-rc-linux-4.9.y,v4.9.225-60-g0caa48a831ad,2020-06-02T10:31:44.540268Z,x86,linux-log-parser/check-kernel-panic-x86-910,pass
lkft,linux-stable-rc-linux-4.9.y,v4.9.225-60-g0caa48a831ad,2020-06-02T10:31:44.540268Z,x15,build/build_process,fail
lkft,linux-stable-rc-linux-4.9.y,v4.9.225-60-g0caa48a831ad,2020-06-02T10:31:44.540268Z,x15,linux-log-parser/check-kernel-exception-x15-910,pass
lkft,linux-stable-rc-linux-4.9.y,v4.9.225-60-g0caa48a831ad,2020-06-02T10:31:44.540268Z,x15,linux-log-parser/check-kernel-trace-x15-910,pass
lkft,linux-stable-rc-linux-4.9.y,v4.9.225-60-g0caa48a831ad,2020-06-02T10:31:44.540268Z,x15,linux-log-parser/check-kernel-oops-x15-910,pass
lkft,linux-stable-rc-linux-4.9.y,v4.9.225-60-g0caa48a831ad,2020-06-02T10:31:44.540268Z,x15,linux-log-parser/check-kernel-fault-x15-910,pass
lkft,linux-stable-rc-linux-4.9.y,v4.9.225-60-g0caa48a831ad,2020-06-02T10:31:44.540268Z,x15,linux-log-parser/check-kernel-warning-x15-910,pass
lkft,linux-stable-rc-linux-4.9.y,v4.9.225-60-g0caa48a831ad,2020-06-02T10:31:44.540268Z,x15,linux-log-parser/check-kernel-bug-x15-910,pass
lkft,linux-stable-rc-linux-4.9.y,v4.9.225-60-g0caa48a831ad,2020-06-02T10:31:44.540268Z,x15,linux-log-parser/check-kernel-invalid-opcode-x15-910,pass
lkft,linux-stable-rc-linux-4.9.y,v4.9.225-60-g0caa48a831ad,2020-06-02T10:31:44.540268Z,x15,linux-log-parser/check-kernel-panic-x15-910,pass
lkft,linux-stable-rc-linux-4.9.y,v4.9.225-60-g0caa48a831ad,2020-06-02T10:31:44.540268Z,dragonboard-410c,build/build_process,pass
lkft,linux-stable-rc-linux-4.9.y,v4.9.225-60-g0caa48a831ad,2020-06-02T10:31:44.540268Z,dragonboard-410c,linux-log-parser/check-kernel-exception-dragonboard-410c-910,pass
lkft,linux-stable-rc-linux-4.9.y,v4.9.225-60-g0caa48a831ad,2020-06-02T10:31:44.540268Z,dragonboard-410c,linux-log-parser/check-kernel-trace-dragonboard-410c-910,pass
lkft,linux-stable-rc-linux-4.9.y,v4.9.225-60-g0caa48a831ad,2020-06-02T10:31:44.540268Z,dragonboard-410c,linux-log-parser/check-kernel-oops-dragonboard-410c-910,pass
lkft,linux-stable-rc-linux-4.9.y,v4.9.225-60-g0caa48a831ad,2020-06-02T10:31:44.540268Z,dragonboard-410c,linux-log-parser/check-kernel-fault-dragonboard-410c-910,pass
lkft,linux-stable-rc-linux-4.9.y,v4.9.225-60-g0caa48a831ad,2020-06-02T10:31:44.540268Z,dragonboard-410c,linux-log-parser/check-kernel-warning-dragonboard-410c-910,pass
lkft,linux-stable-rc-linux-4.9.y,v4.9.225-60-g0caa48a831ad,2020-06-02T10:31:44.540268Z,dragonboard-410c,linux-log-parser/check-kernel-bug-dragonboard-410c-910,pass
lkft,linux-stable-rc-linux-4.9.y,v4.9.225-60-g0caa48a831ad,2020-06-02T10:31:44.540268Z,dragonboard-410c,linux-log-parser/check-kernel-invalid-opcode-dragonboard-410c-910,pass
lkft,linux-stable-rc-linux-4.9.y,v4.9.225-60-g0caa48a831ad,2020-06-02T10:31:44.540268Z,dragonboard-410c,linux-log-parser/check-kernel-panic-dragonboard-410c-910,pass
lkft,linux-stable-rc-linux-4.9.y,v4.9.225-60-g0caa48a831ad,2020-06-02T10:31:44.540268Z,hi6220-hikey,build/build_process,pass
lkft,linux-stable-rc-linux-4.9.y,v4.9.225-60-g0caa48a831ad,2020-06-02T10:31:44.540268Z,hi6220-hikey,linux-log-parser/check-kernel-exception-hi6220-hikey-910,pass
lkft,linux-stable-rc-linux-4.9.y,v4.9.225-60-g0caa48a831ad,2020-06-02T10:31:44.540268Z,hi6220-hikey,linux-log-parser/check-kernel-trace-hi6220-hikey-910,pass
lkft,linux-stable-rc-linux-4.9.y,v4.9.225-60-g0caa48a831ad,2020-06-02T10:31:44.540268Z,hi6220-hikey,linux-log-parser/check-kernel-oops-hi6220-hikey-910,pass
lkft,linux-stable-rc-linux-4.9.y,v4.9.225-60-g0caa48a831ad,2020-06-02T10:31:44.540268Z,hi6220-hikey,linux-log-parser/check-kernel-fault-hi6220-hikey-910,pass
lkft,linux-stable-rc-linux-4.9.y,v4.9.225-60-g0caa48a831ad,2020-06-02T10:31:44.540268Z,hi6220-hikey,linux-log-parser/check-kernel-warning-hi6220-hikey-910,pass
lkft,linux-stable-rc-linux-4.9.y,v4.9.225-60-g0caa48a831ad,2020-06-02T10:31:44.540268Z,hi6220-hikey,linux-log-parser/check-kernel-bug-hi6220-hikey-910,pass
lkft,linux-stable-rc-linux-4.9.y,v4.9.225-60-g0caa48a831ad,2020-06-02T10:31:44.540268Z,hi6220-hikey,linux-log-parser/check-kernel-invalid-opcode-hi6220-hikey-910,pass
lkft,linux-stable-rc-linux-4.9.y,v4.9.225-60-g0caa48a831ad,2020-06-02T10:31:44.540268Z,hi6220-hikey,linux-log-parser/check-kernel-panic-hi6220-hikey-910,pass
lkft,linux-stable-rc-linux-4.9.y,v4.9.225-60-g0caa48a831ad,2020-06-02T10:31:44.540268Z,i386,linux-log-parser/check-kernel-exception-1462488,pass
lkft,linux-stable-rc-linux-4.9.y,v4.9.225-60-g0caa48a831ad,2020-06-02T10:31:44.540268Z,i386,linux-log-parser/check-kernel-trace-1462488,pass
lkft,linux-stable-rc-linux-4.9.y,v4.9.225-60-g0caa48a831ad,2020-06-02T10:31:44.540268Z,i386,linux-log-parser/check-kernel-oops-1462488,pass
lkft,linux-stable-rc-linux-4.9.y,v4.9.225-60-g0caa48a831ad,2020-06-02T10:31:44.540268Z,i386,linux-log-parser/check-kernel-fault-1462488,pass
lkft,linux-stable-rc-linux-4.9.y,v4.9.225-60-g0caa48a831ad,2020-06-02T10:31:44.540268Z,i386,linux-log-parser/check-kernel-warning-1462488,pass
lkft,linux-stable-rc-linux-4.9.y,v4.9.225-60-g0caa48a831ad,2020-06-02T10:31:44.540268Z,i386,linux-log-parser/check-kernel-bug-1462488,pass
lkft,linux-stable-rc-linux-4.9.y,v4.9.225-60-g0caa48a831ad,2020-06-02T10:31:44.540268Z,i386,linux-log-parser/check-kernel-invalid-opcode-1462488,pass
lkft,linux-stable-rc-linux-4.9.y,v4.9.225-60-g0caa48a831ad,2020-06-02T10:31:44.540268Z,i386,linux-log-parser/check-kernel-panic-1462488,pass
lkft,linux-stable-rc-linux-4.9.y,v4.9.225-60-g0caa48a831ad,2020-06-02T10:31:44.540268Z,i386,linux-log-parser/check-kernel-exception-1462489,pass
lkft,linux-stable-rc-linux-4.9.y,v4.9.225-60-g0caa48a831ad,2020-06-02T10:31:44.540268Z,i386,linux-log-parser/check-kernel-trace-1462489,pass
lkft,linux-stable-rc-linux-4.9.y,v4.9.225-60-g0caa48a831ad,2020-06-02T10:31:44.540268Z,i386,linux-log-parser/check-kernel-oops-1462489,pass
lkft,linux-stable-rc-linux-4.9.y,v4.9.225-60-g0caa48a831ad,2020-06-02T10:31:44.540268Z,i386,linux-log-parser/check-kernel-fault-1462489,pass
lkft,linux-stable-rc-linux-4.9.y,v4.9.225-60-g0caa48a831ad,2020-06-02T10:31:44.540268Z,i386,linux-log-parser/check-kernel-warning-1462489,pass
lkft,linux-stable-rc-linux-4.9.y,v4.9.225-60-g0caa48a831ad,2020-06-02T10:31:44.540268Z,i386,linux-log-parser/check-kernel-bug-1462489,pass
lkft,linux-stable-rc-linux-4.9.y,v4.9.225-60-g0caa48a831ad,2020-06-02T10:31:44.540268Z,i386,linux-log-parser/check-kernel-invalid-opcode-1462489,pass
lkft,linux-stable-rc-linux-4.9.y,v4.9.225-60-g0caa48a831ad,2020-06-02T10:31:44.540268Z,i386,linux-log-parser/check-kernel-panic-1462489,pass
lkft,linux-stable-rc-linux-4.9.y,v4.9.225-60-g0caa48a831ad,2020-06-02T10:31:44.540268Z,x86,linux-log-parser/check-kernel-exception-1462505,pass
lkft,linux-stable-rc-linux-4.9.y,v4.9.225-60-g0caa48a831ad,2020-06-02T10:31:44.540268Z,x86,linux-log-parser/check-kernel-trace-1462505,pass
lkft,linux-stable-rc-linux-4.9.y,v4.9.225-60-g0caa48a831ad,2020-06-02T10:31:44.540268Z,x86,linux-log-parser/check-kernel-oops-1462505,pass
lkft,linux-stable-rc-linux-4.9.y,v4.9.225-60-g0caa48a831ad,2020-06-02T10:31:44.540268Z,x86,linux-log-parser/check-kernel-fault-1462505,pass
lkft,linux-stable-rc-linux-4.9.y,v4.9.225-60-g0caa48a831ad,2020-06-02T10:31:44.540268Z,x86,linux-log-parser/check-kernel-warning-1462505,pass
lkft,linux-stable-rc-linux-4.9.y,v4.9.225-60-g0caa48a831ad,2020-06-02T10:31:44.540268Z,x86,linux-log-parser/check-kernel-bug-1462505,pass
lkft,linux-stable-rc-linux-4.9.y,v4.9.225-60-g0caa48a831ad,2020-06-02T10:31:44.540268Z,x86,linux-log-parser/check-kernel-invalid-opcode-1462505,pass
lkft,linux-stable-rc-linux-4.9.y,v4.9.225-60-g0caa48a831ad,2020-06-02T10:31:44.540268Z,x86,linux-log-parser/check-kernel-panic-1462505,pass
lkft,linux-stable-rc-linux-4.9.y,v4.9.225-60-g0caa48a831ad,2020-06-02T10:31:44.540268Z,juno-r2,linux-log-parser/check-kernel-exception-1462496,pass
lkft,linux-stable-rc-linux-4.9.y,v4.9.225-60-g0caa48a831ad,2020-06-02T10:31:44.540268Z,juno-r2,linux-log-parser/check-kernel-trace-1462496,pass
lkft,linux-stable-rc-linux-4.9.y,v4.9.225-60-g0caa48a831ad,2020-06-02T10:31:44.540268Z,juno-r2,linux-log-parser/check-kernel-oops-1462496,pass
lkft,linux-stable-rc-linux-4.9.y,v4.9.225-60-g0caa48a831ad,2020-06-02T10:31:44.540268Z,juno-r2,linux-log-parser/check-kernel-fault-1462496,pass
lkft,linux-stable-rc-linux-4.9.y,v4.9.225-60-g0caa48a831ad,2020-06-02T10:31:44.540268Z,juno-r2,linux-log-parser/check-kernel-warning-1462496,pass
lkft,linux-stable-rc-linux-4.9.y,v4.9.225-60-g0caa48a831ad,2020-06-02T10:31:44.540268Z,juno-r2,linux-log-parser/check-kernel-bug-1462496,pass
lkft,linux-stable-rc-linux-4.9.y,v4.9.225-60-g0caa48a831ad,2020-06-02T10:31:44.540268Z,juno-r2,linux-log-parser/check-kernel-invalid-opcode-1462496,pass
lkft,linux-stable-rc-linux-4.9.y,v4.9.225-60-g0caa48a831ad,2020-06-02T10:31:44.540268Z,juno-r2,linux-log-parser/check-kernel-panic-1462496,pass
lkft,linux-stable-rc-linux-4.9.y,v4.9.225-60-g0caa48a831ad,2020-06-02T10:31:44.540268Z,juno-r2,linux-log-parser/check-kernel-exception-1462497,pass
lkft,linux-stable-rc-linux-4.9.y,v4.9.225-60-g0caa48a831ad,2020-06-02T10:31:44.540268Z,juno-r2,linux-log-parser/check-kernel-trace-1462497,pass
lkft,linux-stable-rc-linux-4.9.y,v4.9.225-60-g0caa48a831ad,2020-06-02T10:31:44.540268Z,juno-r2,linux-log-parser/check-kernel-oops-1462497,pass
lkft,linux-stable-rc-linux-4.9.y,v4.9.225-60-g0caa48a831ad,2020-06-02T10:31:44.540268Z,juno-r2,linux-log-parser/check-kernel-fault-1462497,pass
lkft,linux-stable-rc-linux-4.9.y,v4.9.225-60-g0caa48a831ad,2020-06-02T10:31:44.540268Z,juno-r2,linux-log-parser/check-kernel-warning-1462497,pass
lkft,linux-stable-rc-linux-4.9.y,v4.9.225-60-g0caa48a831ad,2020-06-02T10:31:44.540268Z,juno-r2,linux-log-parser/check-kernel-bug-1462497,pass
lkft,linux-stable-rc-linux-4.9.y,v4.9.225-60-g0caa48a831ad,2020-06-02T10:31:44.540268Z,juno-r2,linux-log-parser/check-kernel-invalid-opcode-1462497,pass
lkft,linux-stable-rc-linux-4.9.y,v4.9.225-60-g0caa48a831ad,2020-06-02T10:31:44.540268Z,juno-r2,linux-log-parser/check-kernel-panic-1462497,pass
lkft,linux-stable-rc-linux-4.9.y,v4.9.225-60-g0caa48a831ad,2020-06-02T10:31:44.540268Z,x86,linux-log-parser/check-kernel-exception-1462500,pass
lkft,linux-stable-rc-linux-4.9.y,v4.9.225-60-g0caa48a831ad,2020-06-02T10:31:44.540268Z,x86,linux-log-parser/check-kernel-trace-1462500,pass
lkft,linux-stable-rc-linux-4.9.y,v4.9.225-60-g0caa48a831ad,2020-06-02T10:31:44.540268Z,x86,linux-log-parser/check-kernel-oops-1462500,pass
lkft,linux-stable-rc-linux-4.9.y,v4.9.225-60-g0caa48a831ad,2020-06-02T10:31:44.540268Z,x86,linux-log-parser/check-kernel-fault-1462500,pass
lkft,linux-stable-rc-linux-4.9.y,v4.9.225-60-g0caa48a831ad,2020-06-02T10:31:44.540268Z,x86,linux-log-parser/check-kernel-warning-1462500,pass
lkft,linux-stable-rc-linux-4.9.y,v4.9.225-60-g0caa48a831ad,2020-06-02T10:31:44.540268Z,x86,linux-log-parser/check-kernel-bug-1462500,pass
lkft,linux-stable-rc-linux-4.9.y,v4.9.225-60-g0caa48a831ad,2020-06-02T10:31:44.540268Z,x86,linux-log-parser/check-kernel-invalid-opcode-1462500,pass
lkft,linux-stable-rc-linux-4.9.y,v4.9.225-60-g0caa48a831ad,2020-06-02T10:31:44.540268Z,x86,linux-log-parser/check-kernel-panic-1462500,pass
lkft,linux-stable-rc-linux-4.9.y,v4.9.225-60-g0caa48a831ad,2020-06-02T10:31:44.540268Z,x86,linux-log-parser/check-kernel-exception-1462501,pass
lkft,linux-stable-rc-linux-4.9.y,v4.9.225-60-g0caa48a831ad,2020-06-02T10:31:44.540268Z,x86,linux-log-parser/check-kernel-trace-1462501,pass
lkft,linux-stable-rc-linux-4.9.y,v4.9.225-60-g0caa48a831ad,2020-06-02T10:31:44.540268Z,x86,linux-log-parser/check-kernel-oops-1462501,pass
lkft,linux-stable-rc-linux-4.9.y,v4.9.225-60-g0caa48a831ad,2020-06-02T10:31:44.540268Z,x86,linux-log-parser/check-kernel-fault-1462501,pass
lkft,linux-stable-rc-linux-4.9.y,v4.9.225-60-g0caa48a831ad,2020-06-02T10:31:44.540268Z,x86,linux-log-parser/check-kernel-warning-1462501,pass
lkft,linux-stable-rc-linux-4.9.y,v4.9.225-60-g0caa48a831ad,2020-06-02T10:31:44.540268Z,x86,linux-log-parser/check-kernel-bug-1462501,pass
lkft,linux-stable-rc-linux-4.9.y,v4.9.225-60-g0caa48a831ad,2020-06-02T10:31:44.540268Z,x86,linux-log-parser/check-kernel-invalid-opcode-1462501,pass
lkft,linux-stable-rc-linux-4.9.y,v4.9.225-60-g0caa48a831ad,2020-06-02T10:31:44.540268Z,x86,linux-log-parser/check-kernel-panic-1462501,pass
lkft,linux-stable-rc-linux-4.9.y,v4.9.225-60-g0caa48a831ad,2020-06-02T10:31:44.540268Z,x86,linux-log-parser/check-kernel-exception-1462503,pass
lkft,linux-stable-rc-linux-4.9.y,v4.9.225-60-g0caa48a831ad,2020-06-02T10:31:44.540268Z,x86,linux-log-parser/check-kernel-trace-1462503,pass
lkft,linux-stable-rc-linux-4.9.y,v4.9.225-60-g0caa48a831ad,2020-06-02T10:31:44.540268Z,x86,linux-log-parser/check-kernel-oops-1462503,pass
lkft,linux-stable-rc-linux-4.9.y,v4.9.225-60-g0caa48a831ad,2020-06-02T10:31:44.540268Z,x86,linux-log-parser/check-kernel-fault-1462503,pass
lkft,linux-stable-rc-linux-4.9.y,v4.9.225-60-g0caa48a831ad,2020-06-02T10:31:44.540268Z,x86,linux-log-parser/check-kernel-warning-1462503,pass
lkft,linux-stable-rc-linux-4.9.y,v4.9.225-60-g0caa48a831ad,2020-06-02T10:31:44.540268Z,x86,linux-log-parser/check-kernel-bug-1462503,pass
lkft,linux-stable-rc-linux-4.9.y,v4.9.225-60-g0caa48a831ad,2020-06-02T10:31:44.540268Z,x86,linux-log-parser/check-kernel-invalid-opcode-1462503,pass
lkft,linux-stable-rc-linux-4.9.y,v4.9.225-60-g0caa48a831ad,2020-06-02T10:31:44.540268Z,x86,linux-log-parser/check-kernel-panic-1462503,pass
lkft,linux-stable-rc-linux-4.9.y,v4.9.225-60-g0caa48a831ad,2020-06-02T10:31:44.540268Z,x86,linux-log-parser/check-kernel-exception-1462502,pass
lkft,linux-stable-rc-linux-4.9.y,v4.9.225-60-g0caa48a831ad,2020-06-02T10:31:44.540268Z,x86,linux-log-parser/check-kernel-trace-1462502,pass
lkft,linux-stable-rc-linux-4.9.y,v4.9.225-60-g0caa48a831ad,2020-06-02T10:31:44.540268Z,x86,linux-log-parser/check-kernel-oops-1462502,pass
lkft,linux-stable-rc-linux-4.9.y,v4.9.225-60-g0caa48a831ad,2020-06-02T10:31:44.540268Z,x86,linux-log-parser/check-kernel-fault-1462502,pass
lkft,linux-stable-rc-linux-4.9.y,v4.9.225-60-g0caa48a831ad,2020-06-02T10:31:44.540268Z,x86,linux-log-parser/check-kernel-warning-1462502,pass
lkft,linux-stable-rc-linux-4.9.y,v4.9.225-60-g0caa48a831ad,2020-06-02T10:31:44.540268Z,x86,linux-log-parser/check-kernel-bug-1462502,pass
lkft,linux-stable-rc-linux-4.9.y,v4.9.225-60-g0caa48a831ad,2020-06-02T10:31:44.540268Z,x86,linux-log-parser/check-kernel-invalid-opcode-1462502,pass
lkft,linux-stable-rc-linux-4.9.y,v4.9.225-60-g0caa48a831ad,2020-06-02T10:31:44.540268Z,x86,linux-log-parser/check-kernel-panic-1462502,pass
lkft,linux-stable-rc-linux-4.9.y,v4.9.225-60-g0caa48a831ad,2020-06-02T10:31:44.540268Z,dragonboard-410c,linux-log-parser/check-kernel-exception-1462618,pass
lkft,linux-stable-rc-linux-4.9.y,v4.9.225-60-g0caa48a831ad,2020-06-02T10:31:44.540268Z,dragonboard-410c,linux-log-parser/check-kernel-trace-1462618,pass
lkft,linux-stable-rc-linux-4.9.y,v4.9.225-60-g0caa48a831ad,2020-06-02T10:31:44.540268Z,dragonboard-410c,linux-log-parser/check-kernel-oops-1462618,pass
lkft,linux-stable-rc-linux-4.9.y,v4.9.225-60-g0caa48a831ad,2020-06-02T10:31:44.540268Z,dragonboard-410c,linux-log-parser/check-kernel-fault-1462618,pass
lkft,linux-stable-rc-linux-4.9.y,v4.9.225-60-g0caa48a831ad,2020-06-02T10:31:44.540268Z,dragonboard-410c,linux-log-parser/check-kernel-warning-1462618,pass
lkft,linux-stable-rc-linux-4.9.y,v4.9.225-60-g0caa48a831ad,2020-06-02T10:31:44.540268Z,dragonboard-410c,linux-log-parser/check-kernel-bug-1462618,pass
lkft,linux-stable-rc-linux-4.9.y,v4.9.225-60-g0caa48a831ad,2020-06-02T10:31:44.540268Z,dragonboard-410c,linux-log-parser/check-kernel-invalid-opcode-1462618,pass
lkft,linux-stable-rc-linux-4.9.y,v4.9.225-60-g0caa48a831ad,2020-06-02T10:31:44.540268Z,dragonboard-410c,linux-log-parser/check-kernel-panic-1462618,pass
lkft,linux-stable-rc-linux-4.9.y,v4.9.225-60-g0caa48a831ad,2020-06-02T10:31:44.540268Z,dragonboard-410c,linux-log-parser/check-kernel-exception-1462619,pass
lkft,linux-stable-rc-linux-4.9.y,v4.9.225-60-g0caa48a831ad,2020-06-02T10:31:44.540268Z,dragonboard-410c,linux-log-parser/check-kernel-trace-1462619,pass
lkft,linux-stable-rc-linux-4.9.y,v4.9.225-60-g0caa48a831ad,2020-06-02T10:31:44.540268Z,dragonboard-410c,linux-log-parser/check-kernel-oops-1462619,pass
lkft,linux-stable-rc-linux-4.9.y,v4.9.225-60-g0caa48a831ad,2020-06-02T10:31:44.540268Z,dragonboard-410c,linux-log-parser/check-kernel-fault-1462619,pass
lkft,linux-stable-rc-linux-4.9.y,v4.9.225-60-g0caa48a831ad,2020-06-02T10:31:44.540268Z,dragonboard-410c,linux-log-parser/check-kernel-warning-1462619,pass
lkft,linux-stable-rc-linux-4.9.y,v4.9.225-60-g0caa48a831ad,2020-06-02T10:31:44.540268Z,dragonboard-410c,linux-log-parser/check-kernel-bug-1462619,pass
lkft,linux-stable-rc-linux-4.9.y,v4.9.225-60-g0caa48a831ad,2020-06-02T10:31:44.540268Z,dragonboard-410c,linux-log-parser/check-kernel-invalid-opcode-1462619,pass
lkft,linux-stable-rc-linux-4.9.y,v4.9.225-60-g0caa48a831ad,2020-06-02T10:31:44.540268Z,dragonboard-410c,linux-log-parser/check-kernel-panic-1462619,pass
lkft,linux-stable-rc-linux-4.9.y,v4.9.225-60-g0caa48a831ad,2020-06-02T10:31:44.540268Z,hi6220-hikey,linux-log-parser/check-kernel-exception-1462667,pass
lkft,linux-stable-rc-linux-4.9.y,v4.9.225-60-g0caa48a831ad,2020-06-02T10:31:44.540268Z,hi6220-hikey,linux-log-parser/check-kernel-trace-1462667,pass
lkft,linux-stable-rc-linux-4.9.y,v4.9.225-60-g0caa48a831ad,2020-06-02T10:31:44.540268Z,hi6220-hikey,linux-log-parser/check-kernel-oops-1462667,pass
lkft,linux-stable-rc-linux-4.9.y,v4.9.225-60-g0caa48a831ad,2020-06-02T10:31:44.540268Z,hi6220-hikey,linux-log-parser/check-kernel-fault-1462667,pass
lkft,linux-stable-rc-linux-4.9.y,v4.9.225-60-g0caa48a831ad,2020-06-02T10:31:44.540268Z,hi6220-hikey,linux-log-parser/check-kernel-warning-1462667,pass
lkft,linux-stable-rc-linux-4.9.y,v4.9.225-60-g0caa48a831ad,2020-06-02T10:31:44.540268Z,hi6220-hikey,linux-log-parser/check-kernel-bug-1462667,pass
lkft,linux-stable-rc-linux-4.9.y,v4.9.225-60-g0caa48a831ad,2020-06-02T10:31:44.540268Z,hi6220-hikey,linux-log-parser/check-kernel-invalid-opcode-1462667,pass
lkft,linux-stable-rc-linux-4.9.y,v4.9.225-60-g0caa48a831ad,2020-06-02T10:31:44.540268Z,hi6220-hikey,linux-log-parser/check-kernel-panic-1462667,pass
lkft,linux-stable-rc-linux-4.9.y,v4.9.225-60-g0caa48a831ad,2020-06-02T10:31:44.540268Z,hi6220-hikey,linux-log-parser/check-kernel-exception-1462668,pass
lkft,linux-stable-rc-linux-4.9.y,v4.9.225-60-g0caa48a831ad,2020-06-02T10:31:44.540268Z,hi6220-hikey,linux-log-parser/check-kernel-trace-1462668,pass
lkft,linux-stable-rc-linux-4.9.y,v4.9.225-60-g0caa48a831ad,2020-06-02T10:31:44.540268Z,hi6220-hikey,linux-log-parser/check-kernel-oops-1462668,pass
lkft,linux-stable-rc-linux-4.9.y,v4.9.225-60-g0caa48a831ad,2020-06-02T10:31:44.540268Z,hi6220-hikey,linux-log-parser/check-kernel-fault-1462668,pass
lkft,linux-stable-rc-linux-4.9.y,v4.9.225-60-g0caa48a831ad,2020-06-02T10:31:44.540268Z,hi6220-hikey,linux-log-parser/check-kernel-warning-1462668,pass
lkft,linux-stable-rc-linux-4.9.y,v4.9.225-60-g0caa48a831ad,2020-06-02T10:31:44.540268Z,hi6220-hikey,linux-log-parser/check-kernel-bug-1462668,pass
lkft,linux-stable-rc-linux-4.9.y,v4.9.225-60-g0caa48a831ad,2020-06-02T10:31:44.540268Z,hi6220-hikey,linux-log-parser/check-kernel-invalid-opcode-1462668,pass
lkft,linux-stable-rc-linux-4.9.y,v4.9.225-60-g0caa48a831ad,2020-06-02T10:31:44.540268Z,hi6220-hikey,linux-log-parser/check-kernel-panic-1462668,pass
lkft,linux-stable-rc-linux-4.9.y,v4.9.225-60-g0caa48a831ad,2020-06-02T10:31:44.540268Z,hi6220-hikey,linux-log-parser/check-kernel-exception-1462669,pass
lkft,linux-stable-rc-linux-4.9.y,v4.9.225-60-g0caa48a831ad,2020-06-02T10:31:44.540268Z,hi6220-hikey,linux-log-parser/check-kernel-trace-1462669,pass
lkft,linux-stable-rc-linux-4.9.y,v4.9.225-60-g0caa48a831ad,2020-06-02T10:31:44.540268Z,hi6220-hikey,linux-log-parser/check-kernel-oops-1462669,pass
lkft,linux-stable-rc-linux-4.9.y,v4.9.225-60-g0caa48a831ad,2020-06-02T10:31:44.540268Z,hi6220-hikey,linux-log-parser/check-kernel-fault-1462669,pass
lkft,linux-stable-rc-linux-4.9.y,v4.9.225-60-g0caa48a831ad,2020-06-02T10:31:44.540268Z,hi6220-hikey,linux-log-parser/check-kernel-warning-1462669,pass
lkft,linux-stable-rc-linux-4.9.y,v4.9.225-60-g0caa48a831ad,2020-06-02T10:31:44.540268Z,hi6220-hikey,linux-log-parser/check-kernel-bug-1462669,pass
lkft,linux-stable-rc-linux-4.9.y,v4.9.225-60-g0caa48a831ad,2020-06-02T10:31:44.540268Z,hi6220-hikey,linux-log-parser/check-kernel-invalid-opcode-1462669,pass
lkft,linux-stable-rc-linux-4.9.y,v4.9.225-60-g0caa48a831ad,2020-06-02T10:31:44.540268Z,hi6220-hikey,linux-log-parser/check-kernel-panic-1462669,pass
lkft,linux-stable-rc-linux-4.9.y,v4.9.225-60-g0caa48a831ad,2020-06-02T10:31:44.540268Z,hi6220-hikey,linux-log-parser/check-kernel-exception-1462670,pass
lkft,linux-stable-rc-linux-4.9.y,v4.9.225-60-g0caa48a831ad,2020-06-02T10:31:44.540268Z,hi6220-hikey,linux-log-parser/check-kernel-trace-1462670,pass
lkft,linux-stable-rc-linux-4.9.y,v4.9.225-60-g0caa48a831ad,2020-06-02T10:31:44.540268Z,hi6220-hikey,linux-log-parser/check-kernel-oops-1462670,pass
lkft,linux-stable-rc-linux-4.9.y,v4.9.225-60-g0caa48a831ad,2020-06-02T10:31:44.540268Z,hi6220-hikey,linux-log-parser/check-kernel-fault-1462670,pass
lkft,linux-stable-rc-linux-4.9.y,v4.9.225-60-g0caa48a831ad,2020-06-02T10:31:44.540268Z,hi6220-hikey,linux-log-parser/check-kernel-warning-1462670,pass
lkft,linux-stable-rc-linux-4.9.y,v4.9.225-60-g0caa48a831ad,2020-06-02T10:31:44.540268Z,hi6220-hikey,linux-log-parser/check-kernel-bug-1462670,pass
lkft,linux-stable-rc-linux-4.9.y,v4.9.225-60-g0caa48a831ad,2020-06-02T10:31:44.540268Z,hi6220-hikey,linux-log-parser/check-kernel-invalid-opcode-1462670,pass
lkft,linux-stable-rc-linux-4.9.y,v4.9.225-60-g0caa48a831ad,2020-06-02T10:31:44.540268Z,hi6220-hikey,linux-log-parser/check-kernel-panic-1462670,pass
lkft,linux-stable-rc-linux-4.9.y,v4.9.225-60-g0caa48a831ad,2020-06-02T10:31:44.540268Z,juno-r2,linux-log-parser/check-kernel-exception-1462499,pass
lkft,linux-stable-rc-linux-4.9.y,v4.9.225-60-g0caa48a831ad,2020-06-02T10:31:44.540268Z,juno-r2,linux-log-parser/check-kernel-trace-1462499,pass
lkft,linux-stable-rc-linux-4.9.y,v4.9.225-60-g0caa48a831ad,2020-06-02T10:31:44.540268Z,juno-r2,linux-log-parser/check-kernel-oops-1462499,pass
lkft,linux-stable-rc-linux-4.9.y,v4.9.225-60-g0caa48a831ad,2020-06-02T10:31:44.540268Z,juno-r2,linux-log-parser/check-kernel-fault-1462499,pass
lkft,linux-stable-rc-linux-4.9.y,v4.9.225-60-g0caa48a831ad,2020-06-02T10:31:44.540268Z,juno-r2,linux-log-parser/check-kernel-warning-1462499,pass
lkft,linux-stable-rc-linux-4.9.y,v4.9.225-60-g0caa48a831ad,2020-06-02T10:31:44.540268Z,juno-r2,linux-log-parser/check-kernel-bug-1462499,pass
lkft,linux-stable-rc-linux-4.9.y,v4.9.225-60-g0caa48a831ad,2020-06-02T10:31:44.540268Z,juno-r2,linux-log-parser/check-kernel-invalid-opcode-1462499,pass
lkft,linux-stable-rc-linux-4.9.y,v4.9.225-60-g0caa48a831ad,2020-06-02T10:31:44.540268Z,juno-r2,linux-log-parser/check-kernel-panic-1462499,pass
lkft,linux-stable-rc-linux-4.9.y,v4.9.225-60-g0caa48a831ad,2020-06-02T10:31:44.540268Z,juno-r2,linux-log-parser/check-kernel-exception-1462498,pass
lkft,linux-stable-rc-linux-4.9.y,v4.9.225-60-g0caa48a831ad,2020-06-02T10:31:44.540268Z,juno-r2,linux-log-parser/check-kernel-trace-1462498,pass
lkft,linux-stable-rc-linux-4.9.y,v4.9.225-60-g0caa48a831ad,2020-06-02T10:31:44.540268Z,juno-r2,linux-log-parser/check-kernel-oops-1462498,pass
lkft,linux-stable-rc-linux-4.9.y,v4.9.225-60-g0caa48a831ad,2020-06-02T10:31:44.540268Z,juno-r2,linux-log-parser/check-kernel-fault-1462498,pass
lkft,linux-stable-rc-linux-4.9.y,v4.9.225-60-g0caa48a831ad,2020-06-02T10:31:44.540268Z,juno-r2,linux-log-parser/check-kernel-warning-1462498,pass
lkft,linux-stable-rc-linux-4.9.y,v4.9.225-60-g0caa48a831ad,2020-06-02T10:31:44.540268Z,juno-r2,linux-log-parser/check-kernel-bug-1462498,pass
lkft,linux-stable-rc-linux-4.9.y,v4.9.225-60-g0caa48a831ad,2020-06-02T10:31:44.540268Z,juno-r2,linux-log-parser/check-kernel-invalid-opcode-1462498,pass
lkft,linux-stable-rc-linux-4.9.y,v4.9.225-60-g0caa48a831ad,2020-06-02T10:31:44.540268Z,juno-r2,linux-log-parser/check-kernel-panic-1462498,pass
lkft,linux-stable-rc-linux-4.9.y,v4.9.225-60-g0caa48a831ad,2020-06-02T10:31:44.540268Z,x86,linux-log-parser/check-kernel-exception-1462504,pass
lkft,linux-stable-rc-linux-4.9.y,v4.9.225-60-g0caa48a831ad,2020-06-02T10:31:44.540268Z,x86,linux-log-parser/check-kernel-trace-1462504,pass
lkft,linux-stable-rc-linux-4.9.y,v4.9.225-60-g0caa48a831ad,2020-06-02T10:31:44.540268Z,x86,linux-log-parser/check-kernel-oops-1462504,pass
lkft,linux-stable-rc-linux-4.9.y,v4.9.225-60-g0caa48a831ad,2020-06-02T10:31:44.540268Z,x86,linux-log-parser/check-kernel-fault-1462504,pass
lkft,linux-stable-rc-linux-4.9.y,v4.9.225-60-g0caa48a831ad,2020-06-02T10:31:44.540268Z,x86,linux-log-parser/check-kernel-warning-1462504,pass
lkft,linux-stable-rc-linux-4.9.y,v4.9.225-60-g0caa48a831ad,2020-06-02T10:31:44.540268Z,x86,linux-log-parser/check-kernel-bug-1462504,pass
lkft,linux-stable-rc-linux-4.9.y,v4.9.225-60-g0caa48a831ad,2020-06-02T10:31:44.540268Z,x86,linux-log-parser/check-kernel-invalid-opcode-1462504,pass
lkft,linux-stable-rc-linux-4.9.y,v4.9.225-60-g0caa48a831ad,2020-06-02T10:31:44.540268Z,x86,linux-log-parser/check-kernel-panic-1462504,pass
lkft,linux-stable-rc-linux-4.9.y,v4.9.225-60-g0caa48a831ad,2020-06-02T10:31:44.540268Z,x86,linux-log-parser/check-kernel-exception-1462506,pass
lkft,linux-stable-rc-linux-4.9.y,v4.9.225-60-g0caa48a831ad,2020-06-02T10:31:44.540268Z,x86,linux-log-parser/check-kernel-trace-1462506,pass
lkft,linux-stable-rc-linux-4.9.y,v4.9.225-60-g0caa48a831ad,2020-06-02T10:31:44.540268Z,x86,linux-log-parser/check-kernel-oops-1462506,pass
lkft,linux-stable-rc-linux-4.9.y,v4.9.225-60-g0caa48a831ad,2020-06-02T10:31:44.540268Z,x86,linux-log-parser/check-kernel-fault-1462506,pass
lkft,linux-stable-rc-linux-4.9.y,v4.9.225-60-g0caa48a831ad,2020-06-02T10:31:44.540268Z,x86,linux-log-parser/check-kernel-warning-1462506,pass
lkft,linux-stable-rc-linux-4.9.y,v4.9.225-60-g0caa48a831ad,2020-06-02T10:31:44.540268Z,x86,linux-log-parser/check-kernel-bug-1462506,pass
lkft,linux-stable-rc-linux-4.9.y,v4.9.225-60-g0caa48a831ad,2020-06-02T10:31:44.540268Z,x86,linux-log-parser/check-kernel-invalid-opcode-1462506,pass
lkft,linux-stable-rc-linux-4.9.y,v4.9.225-60-g0caa48a831ad,2020-06-02T10:31:44.540268Z,x86,linux-log-parser/check-kernel-panic-1462506,pass
lkft,linux-stable-rc-linux-4.9.y,v4.9.225-60-g0caa48a831ad,2020-06-02T10:31:44.540268Z,i386,linux-log-parser/check-kernel-exception-1462482,pass
lkft,linux-stable-rc-linux-4.9.y,v4.9.225-60-g0caa48a831ad,2020-06-02T10:31:44.540268Z,i386,linux-log-parser/check-kernel-trace-1462482,pass
lkft,linux-stable-rc-linux-4.9.y,v4.9.225-60-g0caa48a831ad,2020-06-02T10:31:44.540268Z,i386,linux-log-parser/check-kernel-oops-1462482,pass
lkft,linux-stable-rc-linux-4.9.y,v4.9.225-60-g0caa48a831ad,2020-06-02T10:31:44.540268Z,i386,linux-log-parser/check-kernel-fault-1462482,pass
lkft,linux-stable-rc-linux-4.9.y,v4.9.225-60-g0caa48a831ad,2020-06-02T10:31:44.540268Z,i386,linux-log-parser/check-kernel-warning-1462482,pass
lkft,linux-stable-rc-linux-4.9.y,v4.9.225-60-g0caa48a831ad,2020-06-02T10:31:44.540268Z,i386,linux-log-parser/check-kernel-bug-1462482,pass
lkft,linux-stable-rc-linux-4.9.y,v4.9.225-60-g0caa48a831ad,2020-06-02T10:31:44.540268Z,i386,linux-log-parser/check-kernel-invalid-opcode-1462482,pass
lkft,linux-stable-rc-linux-4.9.y,v4.9.225-60-g0caa48a831ad,2020-06-02T10:31:44.540268Z,i386,linux-log-parser/check-kernel-panic-1462482,pass
lkft,linux-stable-rc-linux-4.9.y,v4.9.225-60-g0caa48a831ad,2020-06-02T10:31:44.540268Z,i386,linux-log-parser/check-kernel-exception-1462487,pass
lkft,linux-stable-rc-linux-4.9.y,v4.9.225-60-g0caa48a831ad,2020-06-02T10:31:44.540268Z,i386,linux-log-parser/check-kernel-trace-1462487,pass
lkft,linux-stable-rc-linux-4.9.y,v4.9.225-60-g0caa48a831ad,2020-06-02T10:31:44.540268Z,i386,linux-log-parser/check-kernel-oops-1462487,pass
lkft,linux-stable-rc-linux-4.9.y,v4.9.225-60-g0caa48a831ad,2020-06-02T10:31:44.540268Z,i386,linux-log-parser/check-kernel-fault-1462487,pass
lkft,linux-stable-rc-linux-4.9.y,v4.9.225-60-g0caa48a831ad,2020-06-02T10:31:44.540268Z,i386,linux-log-parser/check-kernel-warning-1462487,pass
lkft,linux-stable-rc-linux-4.9.y,v4.9.225-60-g0caa48a831ad,2020-06-02T10:31:44.540268Z,i386,linux-log-parser/check-kernel-bug-1462487,pass
lkft,linux-stable-rc-linux-4.9.y,v4.9.225-60-g0caa48a831ad,2020-06-02T10:31:44.540268Z,i386,linux-log-parser/check-kernel-invalid-opcode-1462487,pass
lkft,linux-stable-rc-linux-4.9.y,v4.9.225-60-g0caa48a831ad,2020-06-02T10:31:44.540268Z,i386,linux-log-parser/check-kernel-panic-1462487,pass
lkft,linux-stable-rc-linux-4.9.y,v4.9.225-60-g0caa48a831ad,2020-06-02T10:31:44.540268Z,dragonboard-410c,linux-log-parser/check-kernel-exception-1462620,pass
lkft,linux-stable-rc-linux-4.9.y,v4.9.225-60-g0caa48a831ad,2020-06-02T10:31:44.540268Z,dragonboard-410c,linux-log-parser/check-kernel-trace-1462620,pass
lkft,linux-stable-rc-linux-4.9.y,v4.9.225-60-g0caa48a831ad,2020-06-02T10:31:44.540268Z,dragonboard-410c,linux-log-parser/check-kernel-oops-1462620,pass
lkft,linux-stable-rc-linux-4.9.y,v4.9.225-60-g0caa48a831ad,2020-06-02T10:31:44.540268Z,dragonboard-410c,linux-log-parser/check-kernel-fault-1462620,pass
lkft,linux-stable-rc-linux-4.9.y,v4.9.225-60-g0caa48a831ad,2020-06-02T10:31:44.540268Z,dragonboard-410c,linux-log-parser/check-kernel-warning-1462620,pass
lkft,linux-stable-rc-linux-4.9.y,v4.9.225-60-g0caa48a831ad,2020-06-02T10:31:44.540268Z,dragonboard-410c,linux-log-parser/check-kernel-bug-1462620,pass
lkft,linux-stable-rc-linux-4.9.y,v4.9.225-60-g0caa48a831ad,2020-06-02T10:31:44.540268Z,dragonboard-410c,linux-log-parser/check-kernel-invalid-opcode-1462620,pass
lkft,linux-stable-rc-linux-4.9.y,v4.9.225-60-g0caa48a831ad,2020-06-02T10:31:44.540268Z,dragonboard-410c,linux-log-parser/check-kernel-panic-1462620,pass
