group.name,project.name,build.name,build.datetime,environment.name,test.name,test.status
lkft,linux-stable-rc-linux-4.9.y,v4.9.186-130-g1aa60168a02b,2019-07-26T14:47:14.575947Z,i386,build/build_process,fail
lkft,linux-stable-rc-linux-4.9.y,v4.9.186-130-g1aa60168a02b,2019-07-26T14:47:14.575947Z,x86,build/build_process,fail
lkft,linux-stable-rc-linux-4.9.y,v4.9.186-130-g1aa60168a02b,2019-07-26T14:47:14.575947Z,x15,build/build_process,fail
lkft,linux-stable-rc-linux-4.9.y,v4.9.186-130-g1aa60168a02b,2019-07-26T14:47:14.575947Z,dragonboard-410c,build/build_process,fail
lkft,linux-stable-rc-linux-4.9.y,v4.9.186-130-g1aa60168a02b,2019-07-26T14:47:14.575947Z,juno-r2,build/build_process,fail
lkft,linux-stable-rc-linux-4.9.y,v4.9.186-130-g1aa60168a02b,2019-07-26T14:47:14.575947Z,hi6220-hikey,build/build_process,fail
