group.name,project.name,build.name,build.datetime,environment.name,test.name,test.status
lkft,linux-next-master,next-20190924,2019-09-24T20:21:20.550039Z,x15,build/build_process,fail
lkft,linux-next-master,next-20190924,2019-09-24T20:21:20.550039Z,x15,linux-log-parser/check-oops,pass
lkft,linux-next-master,next-20190924,2019-09-24T20:21:20.550039Z,x15,linux-log-parser/check-kernel-panic,pass
lkft,linux-next-master,next-20190924,2019-09-24T20:21:20.550039Z,i386,build/build_process,fail
lkft,linux-next-master,next-20190924,2019-09-24T20:21:20.550039Z,i386,linux-log-parser/check-oops,pass
lkft,linux-next-master,next-20190924,2019-09-24T20:21:20.550039Z,i386,linux-log-parser/check-kernel-panic,pass
lkft,linux-next-master,next-20190924,2019-09-24T20:21:20.550039Z,x86,build/build_process,fail
lkft,linux-next-master,next-20190924,2019-09-24T20:21:20.550039Z,x86,linux-log-parser/check-oops,pass
lkft,linux-next-master,next-20190924,2019-09-24T20:21:20.550039Z,x86,linux-log-parser/check-kernel-panic,pass
lkft,linux-next-master,next-20190924,2019-09-24T20:21:20.550039Z,juno-r2,build/build_process,fail
lkft,linux-next-master,next-20190924,2019-09-24T20:21:20.550039Z,juno-r2,linux-log-parser/check-oops,pass
lkft,linux-next-master,next-20190924,2019-09-24T20:21:20.550039Z,juno-r2,linux-log-parser/check-kernel-panic,pass
lkft,linux-next-master,next-20190924,2019-09-24T20:21:20.550039Z,dragonboard-410c,build/build_process,fail
lkft,linux-next-master,next-20190924,2019-09-24T20:21:20.550039Z,dragonboard-410c,linux-log-parser/check-oops,pass
lkft,linux-next-master,next-20190924,2019-09-24T20:21:20.550039Z,dragonboard-410c,linux-log-parser/check-kernel-panic,pass
lkft,linux-next-master,next-20190924,2019-09-24T20:21:20.550039Z,hi6220-hikey,build/build_process,fail
lkft,linux-next-master,next-20190924,2019-09-24T20:21:20.550039Z,hi6220-hikey,linux-log-parser/check-oops,pass
lkft,linux-next-master,next-20190924,2019-09-24T20:21:20.550039Z,hi6220-hikey,linux-log-parser/check-kernel-panic,pass
