group.name,project.name,build.name,build.datetime,environment.name,test.name,test.status
lkft,linux-next-master,next-20191024,2019-10-24T06:14:24.610974Z,i386,build/build_process,fail
lkft,linux-next-master,next-20191024,2019-10-24T06:14:24.610974Z,i386,linux-log-parser/check-oops,pass
lkft,linux-next-master,next-20191024,2019-10-24T06:14:24.610974Z,i386,linux-log-parser/check-kernel-panic,pass
lkft,linux-next-master,next-20191024,2019-10-24T06:14:24.610974Z,x86,build/build_process,fail
lkft,linux-next-master,next-20191024,2019-10-24T06:14:24.610974Z,x86,linux-log-parser/check-oops,pass
lkft,linux-next-master,next-20191024,2019-10-24T06:14:24.610974Z,x86,linux-log-parser/check-kernel-panic,pass
lkft,linux-next-master,next-20191024,2019-10-24T06:14:24.610974Z,x15,build/build_process,fail
lkft,linux-next-master,next-20191024,2019-10-24T06:14:24.610974Z,x15,linux-log-parser/check-oops,pass
lkft,linux-next-master,next-20191024,2019-10-24T06:14:24.610974Z,x15,linux-log-parser/check-kernel-panic,pass
lkft,linux-next-master,next-20191024,2019-10-24T06:14:24.610974Z,juno-r2,build/build_process,fail
lkft,linux-next-master,next-20191024,2019-10-24T06:14:24.610974Z,juno-r2,linux-log-parser/check-oops,pass
lkft,linux-next-master,next-20191024,2019-10-24T06:14:24.610974Z,juno-r2,linux-log-parser/check-kernel-panic,pass
lkft,linux-next-master,next-20191024,2019-10-24T06:14:24.610974Z,dragonboard-410c,build/build_process,fail
lkft,linux-next-master,next-20191024,2019-10-24T06:14:24.610974Z,dragonboard-410c,linux-log-parser/check-oops,pass
lkft,linux-next-master,next-20191024,2019-10-24T06:14:24.610974Z,dragonboard-410c,linux-log-parser/check-kernel-panic,pass
lkft,linux-next-master,next-20191024,2019-10-24T06:14:24.610974Z,hi6220-hikey,build/build_process,fail
lkft,linux-next-master,next-20191024,2019-10-24T06:14:24.610974Z,hi6220-hikey,linux-log-parser/check-oops,pass
lkft,linux-next-master,next-20191024,2019-10-24T06:14:24.610974Z,hi6220-hikey,linux-log-parser/check-kernel-panic,pass
