group.name,project.name,build.name,build.datetime,environment.name,test.name,test.status
lkft,linux-stable-rc-linux-4.19.y,v4.19.81-145-g7d816e1d91b0,2019-11-04T11:41:57.416476Z,juno-r2,build/build_process,fail
lkft,linux-stable-rc-linux-4.19.y,v4.19.81-145-g7d816e1d91b0,2019-11-04T11:41:57.416476Z,hi6220-hikey,build/build_process,fail
lkft,linux-stable-rc-linux-4.19.y,v4.19.81-145-g7d816e1d91b0,2019-11-04T11:41:57.416476Z,dragonboard-410c,build/build_process,fail
lkft,linux-stable-rc-linux-4.19.y,v4.19.81-145-g7d816e1d91b0,2019-11-04T11:41:57.416476Z,i386,build/build_process,fail
lkft,linux-stable-rc-linux-4.19.y,v4.19.81-145-g7d816e1d91b0,2019-11-04T11:41:57.416476Z,x15,build/build_process,fail
lkft,linux-stable-rc-linux-4.19.y,v4.19.81-145-g7d816e1d91b0,2019-11-04T11:41:57.416476Z,x86,build/build_process,fail
