group.name,project.name,build.name,build.datetime,environment.name,test.name,test.status
lkft,linux-stable-rc-linux-4.19.y,v4.19.84-422-gaf1bb7db3102,2019-11-19T12:39:20.593590Z,i386,build/build_process,fail
lkft,linux-stable-rc-linux-4.19.y,v4.19.84-422-gaf1bb7db3102,2019-11-19T12:39:20.593590Z,juno-r2,build/build_process,fail
lkft,linux-stable-rc-linux-4.19.y,v4.19.84-422-gaf1bb7db3102,2019-11-19T12:39:20.593590Z,dragonboard-410c,build/build_process,fail
lkft,linux-stable-rc-linux-4.19.y,v4.19.84-422-gaf1bb7db3102,2019-11-19T12:39:20.593590Z,hi6220-hikey,build/build_process,fail
lkft,linux-stable-rc-linux-4.19.y,v4.19.84-422-gaf1bb7db3102,2019-11-19T12:39:20.593590Z,x15,build/build_process,fail
lkft,linux-stable-rc-linux-4.19.y,v4.19.84-422-gaf1bb7db3102,2019-11-19T12:39:20.593590Z,x86,build/build_process,fail
lkft,linux-stable-rc-linux-4.19.y,v4.19.84-422-gaf1bb7db3102,2019-11-19T12:39:20.593590Z,x86,build/build_process,fail
lkft,linux-stable-rc-linux-4.19.y,v4.19.84-422-gaf1bb7db3102,2019-11-19T12:39:20.593590Z,i386,build/build_process,fail
lkft,linux-stable-rc-linux-4.19.y,v4.19.84-422-gaf1bb7db3102,2019-11-19T12:39:20.593590Z,x15,build/build_process,fail
lkft,linux-stable-rc-linux-4.19.y,v4.19.84-422-gaf1bb7db3102,2019-11-19T12:39:20.593590Z,juno-r2,build/build_process,fail
lkft,linux-stable-rc-linux-4.19.y,v4.19.84-422-gaf1bb7db3102,2019-11-19T12:39:20.593590Z,hi6220-hikey,build/build_process,fail
lkft,linux-stable-rc-linux-4.19.y,v4.19.84-422-gaf1bb7db3102,2019-11-19T12:39:20.593590Z,dragonboard-410c,build/build_process,fail
