group.name,project.name,build.name,build.datetime,environment.name,test.name,test.status
lkft,linux-stable-rc-linux-4.19.y,v4.19.86-299-g44d856203b74,2019-11-29T11:50:00.823983Z,hi6220-hikey,build/build_process,fail
lkft,linux-stable-rc-linux-4.19.y,v4.19.86-299-g44d856203b74,2019-11-29T11:50:00.823983Z,hi6220-hikey,linux-log-parser/check-oops,pass
lkft,linux-stable-rc-linux-4.19.y,v4.19.86-299-g44d856203b74,2019-11-29T11:50:00.823983Z,hi6220-hikey,linux-log-parser/check-kernel-panic,pass
