group.name,project.name,build.name,build.datetime,environment.name,test.name,test.status
lkft,linux-stable-rc-linux-4.4.y,v4.4.223-79-g57a59daaeb7b,2020-05-18T14:56:44.956314Z,x86,build/build_process,pass
lkft,linux-stable-rc-linux-4.4.y,v4.4.223-79-g57a59daaeb7b,2020-05-18T14:56:44.956314Z,x86,linux-log-parser/check-kernel-exception-x86-826,pass
lkft,linux-stable-rc-linux-4.4.y,v4.4.223-79-g57a59daaeb7b,2020-05-18T14:56:44.956314Z,x86,linux-log-parser/check-kernel-trace-x86-826,pass
lkft,linux-stable-rc-linux-4.4.y,v4.4.223-79-g57a59daaeb7b,2020-05-18T14:56:44.956314Z,x86,linux-log-parser/check-kernel-oops-x86-826,pass
lkft,linux-stable-rc-linux-4.4.y,v4.4.223-79-g57a59daaeb7b,2020-05-18T14:56:44.956314Z,x86,linux-log-parser/check-kernel-fault-x86-826,pass
lkft,linux-stable-rc-linux-4.4.y,v4.4.223-79-g57a59daaeb7b,2020-05-18T14:56:44.956314Z,x86,linux-log-parser/check-kernel-warning-x86-826,pass
lkft,linux-stable-rc-linux-4.4.y,v4.4.223-79-g57a59daaeb7b,2020-05-18T14:56:44.956314Z,x86,linux-log-parser/check-kernel-bug-x86-826,pass
lkft,linux-stable-rc-linux-4.4.y,v4.4.223-79-g57a59daaeb7b,2020-05-18T14:56:44.956314Z,x86,linux-log-parser/check-kernel-panic-x86-826,pass
lkft,linux-stable-rc-linux-4.4.y,v4.4.223-79-g57a59daaeb7b,2020-05-18T14:56:44.956314Z,x15,build/build_process,pass
lkft,linux-stable-rc-linux-4.4.y,v4.4.223-79-g57a59daaeb7b,2020-05-18T14:56:44.956314Z,x15,linux-log-parser/check-kernel-exception-x15-826,pass
lkft,linux-stable-rc-linux-4.4.y,v4.4.223-79-g57a59daaeb7b,2020-05-18T14:56:44.956314Z,x15,linux-log-parser/check-kernel-trace-x15-826,pass
lkft,linux-stable-rc-linux-4.4.y,v4.4.223-79-g57a59daaeb7b,2020-05-18T14:56:44.956314Z,x15,linux-log-parser/check-kernel-oops-x15-826,pass
lkft,linux-stable-rc-linux-4.4.y,v4.4.223-79-g57a59daaeb7b,2020-05-18T14:56:44.956314Z,x15,linux-log-parser/check-kernel-fault-x15-826,pass
lkft,linux-stable-rc-linux-4.4.y,v4.4.223-79-g57a59daaeb7b,2020-05-18T14:56:44.956314Z,x15,linux-log-parser/check-kernel-warning-x15-826,pass
lkft,linux-stable-rc-linux-4.4.y,v4.4.223-79-g57a59daaeb7b,2020-05-18T14:56:44.956314Z,x15,linux-log-parser/check-kernel-bug-x15-826,pass
lkft,linux-stable-rc-linux-4.4.y,v4.4.223-79-g57a59daaeb7b,2020-05-18T14:56:44.956314Z,x15,linux-log-parser/check-kernel-panic-x15-826,pass
lkft,linux-stable-rc-linux-4.4.y,v4.4.223-79-g57a59daaeb7b,2020-05-18T14:56:44.956314Z,i386,build/build_process,pass
lkft,linux-stable-rc-linux-4.4.y,v4.4.223-79-g57a59daaeb7b,2020-05-18T14:56:44.956314Z,i386,linux-log-parser/check-kernel-exception-i386-826,pass
lkft,linux-stable-rc-linux-4.4.y,v4.4.223-79-g57a59daaeb7b,2020-05-18T14:56:44.956314Z,i386,linux-log-parser/check-kernel-trace-i386-826,pass
lkft,linux-stable-rc-linux-4.4.y,v4.4.223-79-g57a59daaeb7b,2020-05-18T14:56:44.956314Z,i386,linux-log-parser/check-kernel-oops-i386-826,pass
lkft,linux-stable-rc-linux-4.4.y,v4.4.223-79-g57a59daaeb7b,2020-05-18T14:56:44.956314Z,i386,linux-log-parser/check-kernel-fault-i386-826,pass
lkft,linux-stable-rc-linux-4.4.y,v4.4.223-79-g57a59daaeb7b,2020-05-18T14:56:44.956314Z,i386,linux-log-parser/check-kernel-warning-i386-826,pass
lkft,linux-stable-rc-linux-4.4.y,v4.4.223-79-g57a59daaeb7b,2020-05-18T14:56:44.956314Z,i386,linux-log-parser/check-kernel-bug-i386-826,pass
lkft,linux-stable-rc-linux-4.4.y,v4.4.223-79-g57a59daaeb7b,2020-05-18T14:56:44.956314Z,i386,linux-log-parser/check-kernel-panic-i386-826,pass
lkft,linux-stable-rc-linux-4.4.y,v4.4.223-79-g57a59daaeb7b,2020-05-18T14:56:44.956314Z,juno-r2,build/build_process,pass
lkft,linux-stable-rc-linux-4.4.y,v4.4.223-79-g57a59daaeb7b,2020-05-18T14:56:44.956314Z,juno-r2,linux-log-parser/check-kernel-exception-juno-r2-826,pass
lkft,linux-stable-rc-linux-4.4.y,v4.4.223-79-g57a59daaeb7b,2020-05-18T14:56:44.956314Z,juno-r2,linux-log-parser/check-kernel-trace-juno-r2-826,pass
lkft,linux-stable-rc-linux-4.4.y,v4.4.223-79-g57a59daaeb7b,2020-05-18T14:56:44.956314Z,juno-r2,linux-log-parser/check-kernel-oops-juno-r2-826,pass
lkft,linux-stable-rc-linux-4.4.y,v4.4.223-79-g57a59daaeb7b,2020-05-18T14:56:44.956314Z,juno-r2,linux-log-parser/check-kernel-fault-juno-r2-826,pass
lkft,linux-stable-rc-linux-4.4.y,v4.4.223-79-g57a59daaeb7b,2020-05-18T14:56:44.956314Z,juno-r2,linux-log-parser/check-kernel-warning-juno-r2-826,pass
lkft,linux-stable-rc-linux-4.4.y,v4.4.223-79-g57a59daaeb7b,2020-05-18T14:56:44.956314Z,juno-r2,linux-log-parser/check-kernel-bug-juno-r2-826,pass
lkft,linux-stable-rc-linux-4.4.y,v4.4.223-79-g57a59daaeb7b,2020-05-18T14:56:44.956314Z,juno-r2,linux-log-parser/check-kernel-panic-juno-r2-826,pass
lkft,linux-stable-rc-linux-4.4.y,v4.4.223-79-g57a59daaeb7b,2020-05-18T14:56:44.956314Z,x86,linux-log-parser/check-kernel-exception-1437447,pass
lkft,linux-stable-rc-linux-4.4.y,v4.4.223-79-g57a59daaeb7b,2020-05-18T14:56:44.956314Z,x86,linux-log-parser/check-kernel-trace-1437447,pass
lkft,linux-stable-rc-linux-4.4.y,v4.4.223-79-g57a59daaeb7b,2020-05-18T14:56:44.956314Z,x86,linux-log-parser/check-kernel-oops-1437447,pass
lkft,linux-stable-rc-linux-4.4.y,v4.4.223-79-g57a59daaeb7b,2020-05-18T14:56:44.956314Z,x86,linux-log-parser/check-kernel-fault-1437447,pass
lkft,linux-stable-rc-linux-4.4.y,v4.4.223-79-g57a59daaeb7b,2020-05-18T14:56:44.956314Z,x86,linux-log-parser/check-kernel-warning-1437447,pass
lkft,linux-stable-rc-linux-4.4.y,v4.4.223-79-g57a59daaeb7b,2020-05-18T14:56:44.956314Z,x86,linux-log-parser/check-kernel-bug-1437447,pass
lkft,linux-stable-rc-linux-4.4.y,v4.4.223-79-g57a59daaeb7b,2020-05-18T14:56:44.956314Z,x86,linux-log-parser/check-kernel-panic-1437447,pass
lkft,linux-stable-rc-linux-4.4.y,v4.4.223-79-g57a59daaeb7b,2020-05-18T14:56:44.956314Z,x86,linux-log-parser/check-kernel-exception-1437448,pass
lkft,linux-stable-rc-linux-4.4.y,v4.4.223-79-g57a59daaeb7b,2020-05-18T14:56:44.956314Z,x86,linux-log-parser/check-kernel-trace-1437448,pass
lkft,linux-stable-rc-linux-4.4.y,v4.4.223-79-g57a59daaeb7b,2020-05-18T14:56:44.956314Z,x86,linux-log-parser/check-kernel-oops-1437448,pass
lkft,linux-stable-rc-linux-4.4.y,v4.4.223-79-g57a59daaeb7b,2020-05-18T14:56:44.956314Z,x86,linux-log-parser/check-kernel-fault-1437448,pass
lkft,linux-stable-rc-linux-4.4.y,v4.4.223-79-g57a59daaeb7b,2020-05-18T14:56:44.956314Z,x86,linux-log-parser/check-kernel-warning-1437448,pass
lkft,linux-stable-rc-linux-4.4.y,v4.4.223-79-g57a59daaeb7b,2020-05-18T14:56:44.956314Z,x86,linux-log-parser/check-kernel-bug-1437448,pass
lkft,linux-stable-rc-linux-4.4.y,v4.4.223-79-g57a59daaeb7b,2020-05-18T14:56:44.956314Z,x86,linux-log-parser/check-kernel-panic-1437448,pass
lkft,linux-stable-rc-linux-4.4.y,v4.4.223-79-g57a59daaeb7b,2020-05-18T14:56:44.956314Z,x86,linux-log-parser/check-kernel-exception-1437452,pass
lkft,linux-stable-rc-linux-4.4.y,v4.4.223-79-g57a59daaeb7b,2020-05-18T14:56:44.956314Z,x86,linux-log-parser/check-kernel-trace-1437452,pass
lkft,linux-stable-rc-linux-4.4.y,v4.4.223-79-g57a59daaeb7b,2020-05-18T14:56:44.956314Z,x86,linux-log-parser/check-kernel-oops-1437452,pass
lkft,linux-stable-rc-linux-4.4.y,v4.4.223-79-g57a59daaeb7b,2020-05-18T14:56:44.956314Z,x86,linux-log-parser/check-kernel-fault-1437452,pass
lkft,linux-stable-rc-linux-4.4.y,v4.4.223-79-g57a59daaeb7b,2020-05-18T14:56:44.956314Z,x86,linux-log-parser/check-kernel-warning-1437452,pass
lkft,linux-stable-rc-linux-4.4.y,v4.4.223-79-g57a59daaeb7b,2020-05-18T14:56:44.956314Z,x86,linux-log-parser/check-kernel-bug-1437452,pass
lkft,linux-stable-rc-linux-4.4.y,v4.4.223-79-g57a59daaeb7b,2020-05-18T14:56:44.956314Z,x86,linux-log-parser/check-kernel-panic-1437452,pass
lkft,linux-stable-rc-linux-4.4.y,v4.4.223-79-g57a59daaeb7b,2020-05-18T14:56:44.956314Z,x15,linux-log-parser/check-kernel-exception-1437493,pass
lkft,linux-stable-rc-linux-4.4.y,v4.4.223-79-g57a59daaeb7b,2020-05-18T14:56:44.956314Z,x15,linux-log-parser/check-kernel-trace-1437493,pass
lkft,linux-stable-rc-linux-4.4.y,v4.4.223-79-g57a59daaeb7b,2020-05-18T14:56:44.956314Z,x15,linux-log-parser/check-kernel-oops-1437493,pass
lkft,linux-stable-rc-linux-4.4.y,v4.4.223-79-g57a59daaeb7b,2020-05-18T14:56:44.956314Z,x15,linux-log-parser/check-kernel-fault-1437493,pass
lkft,linux-stable-rc-linux-4.4.y,v4.4.223-79-g57a59daaeb7b,2020-05-18T14:56:44.956314Z,x15,linux-log-parser/check-kernel-warning-1437493,pass
lkft,linux-stable-rc-linux-4.4.y,v4.4.223-79-g57a59daaeb7b,2020-05-18T14:56:44.956314Z,x15,linux-log-parser/check-kernel-bug-1437493,pass
lkft,linux-stable-rc-linux-4.4.y,v4.4.223-79-g57a59daaeb7b,2020-05-18T14:56:44.956314Z,x15,linux-log-parser/check-kernel-panic-1437493,pass
lkft,linux-stable-rc-linux-4.4.y,v4.4.223-79-g57a59daaeb7b,2020-05-18T14:56:44.956314Z,x15,linux-log-parser/check-kernel-exception-1437494,pass
lkft,linux-stable-rc-linux-4.4.y,v4.4.223-79-g57a59daaeb7b,2020-05-18T14:56:44.956314Z,x15,linux-log-parser/check-kernel-trace-1437494,pass
lkft,linux-stable-rc-linux-4.4.y,v4.4.223-79-g57a59daaeb7b,2020-05-18T14:56:44.956314Z,x15,linux-log-parser/check-kernel-oops-1437494,pass
lkft,linux-stable-rc-linux-4.4.y,v4.4.223-79-g57a59daaeb7b,2020-05-18T14:56:44.956314Z,x15,linux-log-parser/check-kernel-fault-1437494,pass
lkft,linux-stable-rc-linux-4.4.y,v4.4.223-79-g57a59daaeb7b,2020-05-18T14:56:44.956314Z,x15,linux-log-parser/check-kernel-warning-1437494,pass
lkft,linux-stable-rc-linux-4.4.y,v4.4.223-79-g57a59daaeb7b,2020-05-18T14:56:44.956314Z,x15,linux-log-parser/check-kernel-bug-1437494,pass
lkft,linux-stable-rc-linux-4.4.y,v4.4.223-79-g57a59daaeb7b,2020-05-18T14:56:44.956314Z,x15,linux-log-parser/check-kernel-panic-1437494,pass
lkft,linux-stable-rc-linux-4.4.y,v4.4.223-79-g57a59daaeb7b,2020-05-18T14:56:44.956314Z,x15,linux-log-parser/check-kernel-exception-1437495,pass
lkft,linux-stable-rc-linux-4.4.y,v4.4.223-79-g57a59daaeb7b,2020-05-18T14:56:44.956314Z,x15,linux-log-parser/check-kernel-trace-1437495,pass
lkft,linux-stable-rc-linux-4.4.y,v4.4.223-79-g57a59daaeb7b,2020-05-18T14:56:44.956314Z,x15,linux-log-parser/check-kernel-oops-1437495,pass
lkft,linux-stable-rc-linux-4.4.y,v4.4.223-79-g57a59daaeb7b,2020-05-18T14:56:44.956314Z,x15,linux-log-parser/check-kernel-fault-1437495,pass
lkft,linux-stable-rc-linux-4.4.y,v4.4.223-79-g57a59daaeb7b,2020-05-18T14:56:44.956314Z,x15,linux-log-parser/check-kernel-warning-1437495,pass
lkft,linux-stable-rc-linux-4.4.y,v4.4.223-79-g57a59daaeb7b,2020-05-18T14:56:44.956314Z,x15,linux-log-parser/check-kernel-bug-1437495,pass
lkft,linux-stable-rc-linux-4.4.y,v4.4.223-79-g57a59daaeb7b,2020-05-18T14:56:44.956314Z,x15,linux-log-parser/check-kernel-panic-1437495,pass
lkft,linux-stable-rc-linux-4.4.y,v4.4.223-79-g57a59daaeb7b,2020-05-18T14:56:44.956314Z,i386,linux-log-parser/check-kernel-exception-1437512,pass
lkft,linux-stable-rc-linux-4.4.y,v4.4.223-79-g57a59daaeb7b,2020-05-18T14:56:44.956314Z,i386,linux-log-parser/check-kernel-trace-1437512,pass
lkft,linux-stable-rc-linux-4.4.y,v4.4.223-79-g57a59daaeb7b,2020-05-18T14:56:44.956314Z,i386,linux-log-parser/check-kernel-oops-1437512,pass
lkft,linux-stable-rc-linux-4.4.y,v4.4.223-79-g57a59daaeb7b,2020-05-18T14:56:44.956314Z,i386,linux-log-parser/check-kernel-fault-1437512,pass
lkft,linux-stable-rc-linux-4.4.y,v4.4.223-79-g57a59daaeb7b,2020-05-18T14:56:44.956314Z,i386,linux-log-parser/check-kernel-warning-1437512,pass
lkft,linux-stable-rc-linux-4.4.y,v4.4.223-79-g57a59daaeb7b,2020-05-18T14:56:44.956314Z,i386,linux-log-parser/check-kernel-bug-1437512,pass
lkft,linux-stable-rc-linux-4.4.y,v4.4.223-79-g57a59daaeb7b,2020-05-18T14:56:44.956314Z,i386,linux-log-parser/check-kernel-panic-1437512,pass
lkft,linux-stable-rc-linux-4.4.y,v4.4.223-79-g57a59daaeb7b,2020-05-18T14:56:44.956314Z,i386,linux-log-parser/check-kernel-exception-1437510,pass
lkft,linux-stable-rc-linux-4.4.y,v4.4.223-79-g57a59daaeb7b,2020-05-18T14:56:44.956314Z,i386,linux-log-parser/check-kernel-trace-1437510,pass
lkft,linux-stable-rc-linux-4.4.y,v4.4.223-79-g57a59daaeb7b,2020-05-18T14:56:44.956314Z,i386,linux-log-parser/check-kernel-oops-1437510,pass
lkft,linux-stable-rc-linux-4.4.y,v4.4.223-79-g57a59daaeb7b,2020-05-18T14:56:44.956314Z,i386,linux-log-parser/check-kernel-fault-1437510,pass
lkft,linux-stable-rc-linux-4.4.y,v4.4.223-79-g57a59daaeb7b,2020-05-18T14:56:44.956314Z,i386,linux-log-parser/check-kernel-warning-1437510,pass
lkft,linux-stable-rc-linux-4.4.y,v4.4.223-79-g57a59daaeb7b,2020-05-18T14:56:44.956314Z,i386,linux-log-parser/check-kernel-bug-1437510,pass
lkft,linux-stable-rc-linux-4.4.y,v4.4.223-79-g57a59daaeb7b,2020-05-18T14:56:44.956314Z,i386,linux-log-parser/check-kernel-panic-1437510,pass
lkft,linux-stable-rc-linux-4.4.y,v4.4.223-79-g57a59daaeb7b,2020-05-18T14:56:44.956314Z,x86,linux-log-parser/check-kernel-exception-1437449,pass
lkft,linux-stable-rc-linux-4.4.y,v4.4.223-79-g57a59daaeb7b,2020-05-18T14:56:44.956314Z,x86,linux-log-parser/check-kernel-trace-1437449,pass
lkft,linux-stable-rc-linux-4.4.y,v4.4.223-79-g57a59daaeb7b,2020-05-18T14:56:44.956314Z,x86,linux-log-parser/check-kernel-oops-1437449,pass
lkft,linux-stable-rc-linux-4.4.y,v4.4.223-79-g57a59daaeb7b,2020-05-18T14:56:44.956314Z,x86,linux-log-parser/check-kernel-fault-1437449,pass
lkft,linux-stable-rc-linux-4.4.y,v4.4.223-79-g57a59daaeb7b,2020-05-18T14:56:44.956314Z,x86,linux-log-parser/check-kernel-warning-1437449,pass
lkft,linux-stable-rc-linux-4.4.y,v4.4.223-79-g57a59daaeb7b,2020-05-18T14:56:44.956314Z,x86,linux-log-parser/check-kernel-bug-1437449,pass
lkft,linux-stable-rc-linux-4.4.y,v4.4.223-79-g57a59daaeb7b,2020-05-18T14:56:44.956314Z,x86,linux-log-parser/check-kernel-panic-1437449,pass
lkft,linux-stable-rc-linux-4.4.y,v4.4.223-79-g57a59daaeb7b,2020-05-18T14:56:44.956314Z,x86,linux-log-parser/check-kernel-exception-1437450,pass
lkft,linux-stable-rc-linux-4.4.y,v4.4.223-79-g57a59daaeb7b,2020-05-18T14:56:44.956314Z,x86,linux-log-parser/check-kernel-trace-1437450,pass
lkft,linux-stable-rc-linux-4.4.y,v4.4.223-79-g57a59daaeb7b,2020-05-18T14:56:44.956314Z,x86,linux-log-parser/check-kernel-oops-1437450,pass
lkft,linux-stable-rc-linux-4.4.y,v4.4.223-79-g57a59daaeb7b,2020-05-18T14:56:44.956314Z,x86,linux-log-parser/check-kernel-fault-1437450,pass
lkft,linux-stable-rc-linux-4.4.y,v4.4.223-79-g57a59daaeb7b,2020-05-18T14:56:44.956314Z,x86,linux-log-parser/check-kernel-warning-1437450,pass
lkft,linux-stable-rc-linux-4.4.y,v4.4.223-79-g57a59daaeb7b,2020-05-18T14:56:44.956314Z,x86,linux-log-parser/check-kernel-bug-1437450,pass
lkft,linux-stable-rc-linux-4.4.y,v4.4.223-79-g57a59daaeb7b,2020-05-18T14:56:44.956314Z,x86,linux-log-parser/check-kernel-panic-1437450,pass
lkft,linux-stable-rc-linux-4.4.y,v4.4.223-79-g57a59daaeb7b,2020-05-18T14:56:44.956314Z,x86,linux-log-parser/check-kernel-exception-1437453,pass
lkft,linux-stable-rc-linux-4.4.y,v4.4.223-79-g57a59daaeb7b,2020-05-18T14:56:44.956314Z,x86,linux-log-parser/check-kernel-trace-1437453,pass
lkft,linux-stable-rc-linux-4.4.y,v4.4.223-79-g57a59daaeb7b,2020-05-18T14:56:44.956314Z,x86,linux-log-parser/check-kernel-oops-1437453,pass
lkft,linux-stable-rc-linux-4.4.y,v4.4.223-79-g57a59daaeb7b,2020-05-18T14:56:44.956314Z,x86,linux-log-parser/check-kernel-fault-1437453,pass
lkft,linux-stable-rc-linux-4.4.y,v4.4.223-79-g57a59daaeb7b,2020-05-18T14:56:44.956314Z,x86,linux-log-parser/check-kernel-warning-1437453,pass
lkft,linux-stable-rc-linux-4.4.y,v4.4.223-79-g57a59daaeb7b,2020-05-18T14:56:44.956314Z,x86,linux-log-parser/check-kernel-bug-1437453,pass
lkft,linux-stable-rc-linux-4.4.y,v4.4.223-79-g57a59daaeb7b,2020-05-18T14:56:44.956314Z,x86,linux-log-parser/check-kernel-panic-1437453,pass
lkft,linux-stable-rc-linux-4.4.y,v4.4.223-79-g57a59daaeb7b,2020-05-18T14:56:44.956314Z,x86,linux-log-parser/check-kernel-exception-1437451,pass
lkft,linux-stable-rc-linux-4.4.y,v4.4.223-79-g57a59daaeb7b,2020-05-18T14:56:44.956314Z,x86,linux-log-parser/check-kernel-trace-1437451,pass
lkft,linux-stable-rc-linux-4.4.y,v4.4.223-79-g57a59daaeb7b,2020-05-18T14:56:44.956314Z,x86,linux-log-parser/check-kernel-oops-1437451,pass
lkft,linux-stable-rc-linux-4.4.y,v4.4.223-79-g57a59daaeb7b,2020-05-18T14:56:44.956314Z,x86,linux-log-parser/check-kernel-fault-1437451,pass
lkft,linux-stable-rc-linux-4.4.y,v4.4.223-79-g57a59daaeb7b,2020-05-18T14:56:44.956314Z,x86,linux-log-parser/check-kernel-warning-1437451,pass
lkft,linux-stable-rc-linux-4.4.y,v4.4.223-79-g57a59daaeb7b,2020-05-18T14:56:44.956314Z,x86,linux-log-parser/check-kernel-bug-1437451,pass
lkft,linux-stable-rc-linux-4.4.y,v4.4.223-79-g57a59daaeb7b,2020-05-18T14:56:44.956314Z,x86,linux-log-parser/check-kernel-panic-1437451,pass
lkft,linux-stable-rc-linux-4.4.y,v4.4.223-79-g57a59daaeb7b,2020-05-18T14:56:44.956314Z,x15,linux-log-parser/check-kernel-exception-1437496,pass
lkft,linux-stable-rc-linux-4.4.y,v4.4.223-79-g57a59daaeb7b,2020-05-18T14:56:44.956314Z,x15,linux-log-parser/check-kernel-trace-1437496,pass
lkft,linux-stable-rc-linux-4.4.y,v4.4.223-79-g57a59daaeb7b,2020-05-18T14:56:44.956314Z,x15,linux-log-parser/check-kernel-oops-1437496,pass
lkft,linux-stable-rc-linux-4.4.y,v4.4.223-79-g57a59daaeb7b,2020-05-18T14:56:44.956314Z,x15,linux-log-parser/check-kernel-fault-1437496,pass
lkft,linux-stable-rc-linux-4.4.y,v4.4.223-79-g57a59daaeb7b,2020-05-18T14:56:44.956314Z,x15,linux-log-parser/check-kernel-warning-1437496,pass
lkft,linux-stable-rc-linux-4.4.y,v4.4.223-79-g57a59daaeb7b,2020-05-18T14:56:44.956314Z,x15,linux-log-parser/check-kernel-bug-1437496,pass
lkft,linux-stable-rc-linux-4.4.y,v4.4.223-79-g57a59daaeb7b,2020-05-18T14:56:44.956314Z,x15,linux-log-parser/check-kernel-panic-1437496,pass
lkft,linux-stable-rc-linux-4.4.y,v4.4.223-79-g57a59daaeb7b,2020-05-18T14:56:44.956314Z,i386,linux-log-parser/check-kernel-exception-1437513,pass
lkft,linux-stable-rc-linux-4.4.y,v4.4.223-79-g57a59daaeb7b,2020-05-18T14:56:44.956314Z,i386,linux-log-parser/check-kernel-trace-1437513,pass
lkft,linux-stable-rc-linux-4.4.y,v4.4.223-79-g57a59daaeb7b,2020-05-18T14:56:44.956314Z,i386,linux-log-parser/check-kernel-oops-1437513,pass
lkft,linux-stable-rc-linux-4.4.y,v4.4.223-79-g57a59daaeb7b,2020-05-18T14:56:44.956314Z,i386,linux-log-parser/check-kernel-fault-1437513,pass
lkft,linux-stable-rc-linux-4.4.y,v4.4.223-79-g57a59daaeb7b,2020-05-18T14:56:44.956314Z,i386,linux-log-parser/check-kernel-warning-1437513,pass
lkft,linux-stable-rc-linux-4.4.y,v4.4.223-79-g57a59daaeb7b,2020-05-18T14:56:44.956314Z,i386,linux-log-parser/check-kernel-bug-1437513,pass
lkft,linux-stable-rc-linux-4.4.y,v4.4.223-79-g57a59daaeb7b,2020-05-18T14:56:44.956314Z,i386,linux-log-parser/check-kernel-panic-1437513,pass
lkft,linux-stable-rc-linux-4.4.y,v4.4.223-79-g57a59daaeb7b,2020-05-18T14:56:44.956314Z,i386,linux-log-parser/check-kernel-exception-1437511,pass
lkft,linux-stable-rc-linux-4.4.y,v4.4.223-79-g57a59daaeb7b,2020-05-18T14:56:44.956314Z,i386,linux-log-parser/check-kernel-trace-1437511,pass
lkft,linux-stable-rc-linux-4.4.y,v4.4.223-79-g57a59daaeb7b,2020-05-18T14:56:44.956314Z,i386,linux-log-parser/check-kernel-oops-1437511,pass
lkft,linux-stable-rc-linux-4.4.y,v4.4.223-79-g57a59daaeb7b,2020-05-18T14:56:44.956314Z,i386,linux-log-parser/check-kernel-fault-1437511,pass
lkft,linux-stable-rc-linux-4.4.y,v4.4.223-79-g57a59daaeb7b,2020-05-18T14:56:44.956314Z,i386,linux-log-parser/check-kernel-warning-1437511,pass
lkft,linux-stable-rc-linux-4.4.y,v4.4.223-79-g57a59daaeb7b,2020-05-18T14:56:44.956314Z,i386,linux-log-parser/check-kernel-bug-1437511,pass
lkft,linux-stable-rc-linux-4.4.y,v4.4.223-79-g57a59daaeb7b,2020-05-18T14:56:44.956314Z,i386,linux-log-parser/check-kernel-panic-1437511,pass
lkft,linux-stable-rc-linux-4.4.y,v4.4.223-79-g57a59daaeb7b,2020-05-18T14:56:44.956314Z,x86,linux-log-parser/check-kernel-exception-1437797,pass
lkft,linux-stable-rc-linux-4.4.y,v4.4.223-79-g57a59daaeb7b,2020-05-18T14:56:44.956314Z,x86,linux-log-parser/check-kernel-trace-1437797,pass
lkft,linux-stable-rc-linux-4.4.y,v4.4.223-79-g57a59daaeb7b,2020-05-18T14:56:44.956314Z,x86,linux-log-parser/check-kernel-oops-1437797,pass
lkft,linux-stable-rc-linux-4.4.y,v4.4.223-79-g57a59daaeb7b,2020-05-18T14:56:44.956314Z,x86,linux-log-parser/check-kernel-fault-1437797,pass
lkft,linux-stable-rc-linux-4.4.y,v4.4.223-79-g57a59daaeb7b,2020-05-18T14:56:44.956314Z,x86,linux-log-parser/check-kernel-warning-1437797,pass
lkft,linux-stable-rc-linux-4.4.y,v4.4.223-79-g57a59daaeb7b,2020-05-18T14:56:44.956314Z,x86,linux-log-parser/check-kernel-bug-1437797,pass
lkft,linux-stable-rc-linux-4.4.y,v4.4.223-79-g57a59daaeb7b,2020-05-18T14:56:44.956314Z,x86,linux-log-parser/check-kernel-panic-1437797,pass
lkft,linux-stable-rc-linux-4.4.y,v4.4.223-79-g57a59daaeb7b,2020-05-18T14:56:44.956314Z,x86,linux-log-parser/check-kernel-exception-1437811,pass
lkft,linux-stable-rc-linux-4.4.y,v4.4.223-79-g57a59daaeb7b,2020-05-18T14:56:44.956314Z,x86,linux-log-parser/check-kernel-trace-1437811,pass
lkft,linux-stable-rc-linux-4.4.y,v4.4.223-79-g57a59daaeb7b,2020-05-18T14:56:44.956314Z,x86,linux-log-parser/check-kernel-oops-1437811,pass
lkft,linux-stable-rc-linux-4.4.y,v4.4.223-79-g57a59daaeb7b,2020-05-18T14:56:44.956314Z,x86,linux-log-parser/check-kernel-fault-1437811,pass
lkft,linux-stable-rc-linux-4.4.y,v4.4.223-79-g57a59daaeb7b,2020-05-18T14:56:44.956314Z,x86,linux-log-parser/check-kernel-warning-1437811,pass
lkft,linux-stable-rc-linux-4.4.y,v4.4.223-79-g57a59daaeb7b,2020-05-18T14:56:44.956314Z,x86,linux-log-parser/check-kernel-bug-1437811,pass
lkft,linux-stable-rc-linux-4.4.y,v4.4.223-79-g57a59daaeb7b,2020-05-18T14:56:44.956314Z,x86,linux-log-parser/check-kernel-panic-1437811,pass
lkft,linux-stable-rc-linux-4.4.y,v4.4.223-79-g57a59daaeb7b,2020-05-18T14:56:44.956314Z,x86,linux-log-parser/check-kernel-exception-1437812,pass
lkft,linux-stable-rc-linux-4.4.y,v4.4.223-79-g57a59daaeb7b,2020-05-18T14:56:44.956314Z,x86,linux-log-parser/check-kernel-trace-1437812,pass
lkft,linux-stable-rc-linux-4.4.y,v4.4.223-79-g57a59daaeb7b,2020-05-18T14:56:44.956314Z,x86,linux-log-parser/check-kernel-oops-1437812,pass
lkft,linux-stable-rc-linux-4.4.y,v4.4.223-79-g57a59daaeb7b,2020-05-18T14:56:44.956314Z,x86,linux-log-parser/check-kernel-fault-1437812,pass
lkft,linux-stable-rc-linux-4.4.y,v4.4.223-79-g57a59daaeb7b,2020-05-18T14:56:44.956314Z,x86,linux-log-parser/check-kernel-warning-1437812,pass
lkft,linux-stable-rc-linux-4.4.y,v4.4.223-79-g57a59daaeb7b,2020-05-18T14:56:44.956314Z,x86,linux-log-parser/check-kernel-bug-1437812,pass
lkft,linux-stable-rc-linux-4.4.y,v4.4.223-79-g57a59daaeb7b,2020-05-18T14:56:44.956314Z,x86,linux-log-parser/check-kernel-panic-1437812,pass
lkft,linux-stable-rc-linux-4.4.y,v4.4.223-79-g57a59daaeb7b,2020-05-18T14:56:44.956314Z,x86,linux-log-parser/check-kernel-exception-1437815,pass
lkft,linux-stable-rc-linux-4.4.y,v4.4.223-79-g57a59daaeb7b,2020-05-18T14:56:44.956314Z,x86,linux-log-parser/check-kernel-trace-1437815,pass
lkft,linux-stable-rc-linux-4.4.y,v4.4.223-79-g57a59daaeb7b,2020-05-18T14:56:44.956314Z,x86,linux-log-parser/check-kernel-oops-1437815,pass
lkft,linux-stable-rc-linux-4.4.y,v4.4.223-79-g57a59daaeb7b,2020-05-18T14:56:44.956314Z,x86,linux-log-parser/check-kernel-fault-1437815,pass
lkft,linux-stable-rc-linux-4.4.y,v4.4.223-79-g57a59daaeb7b,2020-05-18T14:56:44.956314Z,x86,linux-log-parser/check-kernel-warning-1437815,pass
lkft,linux-stable-rc-linux-4.4.y,v4.4.223-79-g57a59daaeb7b,2020-05-18T14:56:44.956314Z,x86,linux-log-parser/check-kernel-bug-1437815,pass
lkft,linux-stable-rc-linux-4.4.y,v4.4.223-79-g57a59daaeb7b,2020-05-18T14:56:44.956314Z,x86,linux-log-parser/check-kernel-panic-1437815,pass
lkft,linux-stable-rc-linux-4.4.y,v4.4.223-79-g57a59daaeb7b,2020-05-18T14:56:44.956314Z,x86,linux-log-parser/check-kernel-exception-1437805,pass
lkft,linux-stable-rc-linux-4.4.y,v4.4.223-79-g57a59daaeb7b,2020-05-18T14:56:44.956314Z,x86,linux-log-parser/check-kernel-trace-1437805,pass
lkft,linux-stable-rc-linux-4.4.y,v4.4.223-79-g57a59daaeb7b,2020-05-18T14:56:44.956314Z,x86,linux-log-parser/check-kernel-oops-1437805,pass
lkft,linux-stable-rc-linux-4.4.y,v4.4.223-79-g57a59daaeb7b,2020-05-18T14:56:44.956314Z,x86,linux-log-parser/check-kernel-fault-1437805,pass
lkft,linux-stable-rc-linux-4.4.y,v4.4.223-79-g57a59daaeb7b,2020-05-18T14:56:44.956314Z,x86,linux-log-parser/check-kernel-warning-1437805,pass
lkft,linux-stable-rc-linux-4.4.y,v4.4.223-79-g57a59daaeb7b,2020-05-18T14:56:44.956314Z,x86,linux-log-parser/check-kernel-bug-1437805,pass
lkft,linux-stable-rc-linux-4.4.y,v4.4.223-79-g57a59daaeb7b,2020-05-18T14:56:44.956314Z,x86,linux-log-parser/check-kernel-panic-1437805,pass
lkft,linux-stable-rc-linux-4.4.y,v4.4.223-79-g57a59daaeb7b,2020-05-18T14:56:44.956314Z,i386,linux-log-parser/check-kernel-exception-1437831,pass
lkft,linux-stable-rc-linux-4.4.y,v4.4.223-79-g57a59daaeb7b,2020-05-18T14:56:44.956314Z,i386,linux-log-parser/check-kernel-trace-1437831,pass
lkft,linux-stable-rc-linux-4.4.y,v4.4.223-79-g57a59daaeb7b,2020-05-18T14:56:44.956314Z,i386,linux-log-parser/check-kernel-oops-1437831,pass
lkft,linux-stable-rc-linux-4.4.y,v4.4.223-79-g57a59daaeb7b,2020-05-18T14:56:44.956314Z,i386,linux-log-parser/check-kernel-fault-1437831,pass
lkft,linux-stable-rc-linux-4.4.y,v4.4.223-79-g57a59daaeb7b,2020-05-18T14:56:44.956314Z,i386,linux-log-parser/check-kernel-warning-1437831,pass
lkft,linux-stable-rc-linux-4.4.y,v4.4.223-79-g57a59daaeb7b,2020-05-18T14:56:44.956314Z,i386,linux-log-parser/check-kernel-bug-1437831,pass
lkft,linux-stable-rc-linux-4.4.y,v4.4.223-79-g57a59daaeb7b,2020-05-18T14:56:44.956314Z,i386,linux-log-parser/check-kernel-panic-1437831,pass
lkft,linux-stable-rc-linux-4.4.y,v4.4.223-79-g57a59daaeb7b,2020-05-18T14:56:44.956314Z,i386,linux-log-parser/check-kernel-exception-1437835,pass
lkft,linux-stable-rc-linux-4.4.y,v4.4.223-79-g57a59daaeb7b,2020-05-18T14:56:44.956314Z,i386,linux-log-parser/check-kernel-trace-1437835,pass
lkft,linux-stable-rc-linux-4.4.y,v4.4.223-79-g57a59daaeb7b,2020-05-18T14:56:44.956314Z,i386,linux-log-parser/check-kernel-oops-1437835,pass
lkft,linux-stable-rc-linux-4.4.y,v4.4.223-79-g57a59daaeb7b,2020-05-18T14:56:44.956314Z,i386,linux-log-parser/check-kernel-fault-1437835,pass
lkft,linux-stable-rc-linux-4.4.y,v4.4.223-79-g57a59daaeb7b,2020-05-18T14:56:44.956314Z,i386,linux-log-parser/check-kernel-warning-1437835,pass
lkft,linux-stable-rc-linux-4.4.y,v4.4.223-79-g57a59daaeb7b,2020-05-18T14:56:44.956314Z,i386,linux-log-parser/check-kernel-bug-1437835,pass
lkft,linux-stable-rc-linux-4.4.y,v4.4.223-79-g57a59daaeb7b,2020-05-18T14:56:44.956314Z,i386,linux-log-parser/check-kernel-panic-1437835,pass
lkft,linux-stable-rc-linux-4.4.y,v4.4.223-79-g57a59daaeb7b,2020-05-18T14:56:44.956314Z,x86,linux-log-parser/check-kernel-exception-1437795,pass
lkft,linux-stable-rc-linux-4.4.y,v4.4.223-79-g57a59daaeb7b,2020-05-18T14:56:44.956314Z,x86,linux-log-parser/check-kernel-trace-1437795,pass
lkft,linux-stable-rc-linux-4.4.y,v4.4.223-79-g57a59daaeb7b,2020-05-18T14:56:44.956314Z,x86,linux-log-parser/check-kernel-oops-1437795,pass
lkft,linux-stable-rc-linux-4.4.y,v4.4.223-79-g57a59daaeb7b,2020-05-18T14:56:44.956314Z,x86,linux-log-parser/check-kernel-fault-1437795,pass
lkft,linux-stable-rc-linux-4.4.y,v4.4.223-79-g57a59daaeb7b,2020-05-18T14:56:44.956314Z,x86,linux-log-parser/check-kernel-warning-1437795,pass
lkft,linux-stable-rc-linux-4.4.y,v4.4.223-79-g57a59daaeb7b,2020-05-18T14:56:44.956314Z,x86,linux-log-parser/check-kernel-bug-1437795,pass
lkft,linux-stable-rc-linux-4.4.y,v4.4.223-79-g57a59daaeb7b,2020-05-18T14:56:44.956314Z,x86,linux-log-parser/check-kernel-panic-1437795,pass
lkft,linux-stable-rc-linux-4.4.y,v4.4.223-79-g57a59daaeb7b,2020-05-18T14:56:44.956314Z,x86,linux-log-parser/check-kernel-exception-1437796,pass
lkft,linux-stable-rc-linux-4.4.y,v4.4.223-79-g57a59daaeb7b,2020-05-18T14:56:44.956314Z,x86,linux-log-parser/check-kernel-trace-1437796,pass
lkft,linux-stable-rc-linux-4.4.y,v4.4.223-79-g57a59daaeb7b,2020-05-18T14:56:44.956314Z,x86,linux-log-parser/check-kernel-oops-1437796,pass
lkft,linux-stable-rc-linux-4.4.y,v4.4.223-79-g57a59daaeb7b,2020-05-18T14:56:44.956314Z,x86,linux-log-parser/check-kernel-fault-1437796,pass
lkft,linux-stable-rc-linux-4.4.y,v4.4.223-79-g57a59daaeb7b,2020-05-18T14:56:44.956314Z,x86,linux-log-parser/check-kernel-warning-1437796,pass
lkft,linux-stable-rc-linux-4.4.y,v4.4.223-79-g57a59daaeb7b,2020-05-18T14:56:44.956314Z,x86,linux-log-parser/check-kernel-bug-1437796,pass
lkft,linux-stable-rc-linux-4.4.y,v4.4.223-79-g57a59daaeb7b,2020-05-18T14:56:44.956314Z,x86,linux-log-parser/check-kernel-panic-1437796,pass
lkft,linux-stable-rc-linux-4.4.y,v4.4.223-79-g57a59daaeb7b,2020-05-18T14:56:44.956314Z,x86,linux-log-parser/check-kernel-exception-1437802,pass
lkft,linux-stable-rc-linux-4.4.y,v4.4.223-79-g57a59daaeb7b,2020-05-18T14:56:44.956314Z,x86,linux-log-parser/check-kernel-trace-1437802,pass
lkft,linux-stable-rc-linux-4.4.y,v4.4.223-79-g57a59daaeb7b,2020-05-18T14:56:44.956314Z,x86,linux-log-parser/check-kernel-oops-1437802,pass
lkft,linux-stable-rc-linux-4.4.y,v4.4.223-79-g57a59daaeb7b,2020-05-18T14:56:44.956314Z,x86,linux-log-parser/check-kernel-fault-1437802,pass
lkft,linux-stable-rc-linux-4.4.y,v4.4.223-79-g57a59daaeb7b,2020-05-18T14:56:44.956314Z,x86,linux-log-parser/check-kernel-warning-1437802,pass
lkft,linux-stable-rc-linux-4.4.y,v4.4.223-79-g57a59daaeb7b,2020-05-18T14:56:44.956314Z,x86,linux-log-parser/check-kernel-bug-1437802,pass
lkft,linux-stable-rc-linux-4.4.y,v4.4.223-79-g57a59daaeb7b,2020-05-18T14:56:44.956314Z,x86,linux-log-parser/check-kernel-panic-1437802,pass
lkft,linux-stable-rc-linux-4.4.y,v4.4.223-79-g57a59daaeb7b,2020-05-18T14:56:44.956314Z,x86,linux-log-parser/check-kernel-exception-1437801,pass
lkft,linux-stable-rc-linux-4.4.y,v4.4.223-79-g57a59daaeb7b,2020-05-18T14:56:44.956314Z,x86,linux-log-parser/check-kernel-trace-1437801,pass
lkft,linux-stable-rc-linux-4.4.y,v4.4.223-79-g57a59daaeb7b,2020-05-18T14:56:44.956314Z,x86,linux-log-parser/check-kernel-oops-1437801,pass
lkft,linux-stable-rc-linux-4.4.y,v4.4.223-79-g57a59daaeb7b,2020-05-18T14:56:44.956314Z,x86,linux-log-parser/check-kernel-fault-1437801,pass
lkft,linux-stable-rc-linux-4.4.y,v4.4.223-79-g57a59daaeb7b,2020-05-18T14:56:44.956314Z,x86,linux-log-parser/check-kernel-warning-1437801,pass
lkft,linux-stable-rc-linux-4.4.y,v4.4.223-79-g57a59daaeb7b,2020-05-18T14:56:44.956314Z,x86,linux-log-parser/check-kernel-bug-1437801,pass
lkft,linux-stable-rc-linux-4.4.y,v4.4.223-79-g57a59daaeb7b,2020-05-18T14:56:44.956314Z,x86,linux-log-parser/check-kernel-panic-1437801,pass
lkft,linux-stable-rc-linux-4.4.y,v4.4.223-79-g57a59daaeb7b,2020-05-18T14:56:44.956314Z,x86,linux-log-parser/check-kernel-exception-1437806,pass
lkft,linux-stable-rc-linux-4.4.y,v4.4.223-79-g57a59daaeb7b,2020-05-18T14:56:44.956314Z,x86,linux-log-parser/check-kernel-trace-1437806,pass
lkft,linux-stable-rc-linux-4.4.y,v4.4.223-79-g57a59daaeb7b,2020-05-18T14:56:44.956314Z,x86,linux-log-parser/check-kernel-oops-1437806,pass
lkft,linux-stable-rc-linux-4.4.y,v4.4.223-79-g57a59daaeb7b,2020-05-18T14:56:44.956314Z,x86,linux-log-parser/check-kernel-fault-1437806,pass
lkft,linux-stable-rc-linux-4.4.y,v4.4.223-79-g57a59daaeb7b,2020-05-18T14:56:44.956314Z,x86,linux-log-parser/check-kernel-warning-1437806,pass
lkft,linux-stable-rc-linux-4.4.y,v4.4.223-79-g57a59daaeb7b,2020-05-18T14:56:44.956314Z,x86,linux-log-parser/check-kernel-bug-1437806,pass
lkft,linux-stable-rc-linux-4.4.y,v4.4.223-79-g57a59daaeb7b,2020-05-18T14:56:44.956314Z,x86,linux-log-parser/check-kernel-panic-1437806,pass
lkft,linux-stable-rc-linux-4.4.y,v4.4.223-79-g57a59daaeb7b,2020-05-18T14:56:44.956314Z,x86,linux-log-parser/check-kernel-exception-1437807,pass
lkft,linux-stable-rc-linux-4.4.y,v4.4.223-79-g57a59daaeb7b,2020-05-18T14:56:44.956314Z,x86,linux-log-parser/check-kernel-trace-1437807,pass
lkft,linux-stable-rc-linux-4.4.y,v4.4.223-79-g57a59daaeb7b,2020-05-18T14:56:44.956314Z,x86,linux-log-parser/check-kernel-oops-1437807,pass
lkft,linux-stable-rc-linux-4.4.y,v4.4.223-79-g57a59daaeb7b,2020-05-18T14:56:44.956314Z,x86,linux-log-parser/check-kernel-fault-1437807,pass
lkft,linux-stable-rc-linux-4.4.y,v4.4.223-79-g57a59daaeb7b,2020-05-18T14:56:44.956314Z,x86,linux-log-parser/check-kernel-warning-1437807,pass
lkft,linux-stable-rc-linux-4.4.y,v4.4.223-79-g57a59daaeb7b,2020-05-18T14:56:44.956314Z,x86,linux-log-parser/check-kernel-bug-1437807,pass
lkft,linux-stable-rc-linux-4.4.y,v4.4.223-79-g57a59daaeb7b,2020-05-18T14:56:44.956314Z,x86,linux-log-parser/check-kernel-panic-1437807,pass
lkft,linux-stable-rc-linux-4.4.y,v4.4.223-79-g57a59daaeb7b,2020-05-18T14:56:44.956314Z,i386,linux-log-parser/check-kernel-exception-1437828,pass
lkft,linux-stable-rc-linux-4.4.y,v4.4.223-79-g57a59daaeb7b,2020-05-18T14:56:44.956314Z,i386,linux-log-parser/check-kernel-trace-1437828,pass
lkft,linux-stable-rc-linux-4.4.y,v4.4.223-79-g57a59daaeb7b,2020-05-18T14:56:44.956314Z,i386,linux-log-parser/check-kernel-oops-1437828,pass
lkft,linux-stable-rc-linux-4.4.y,v4.4.223-79-g57a59daaeb7b,2020-05-18T14:56:44.956314Z,i386,linux-log-parser/check-kernel-fault-1437828,pass
lkft,linux-stable-rc-linux-4.4.y,v4.4.223-79-g57a59daaeb7b,2020-05-18T14:56:44.956314Z,i386,linux-log-parser/check-kernel-warning-1437828,pass
lkft,linux-stable-rc-linux-4.4.y,v4.4.223-79-g57a59daaeb7b,2020-05-18T14:56:44.956314Z,i386,linux-log-parser/check-kernel-bug-1437828,pass
lkft,linux-stable-rc-linux-4.4.y,v4.4.223-79-g57a59daaeb7b,2020-05-18T14:56:44.956314Z,i386,linux-log-parser/check-kernel-panic-1437828,pass
lkft,linux-stable-rc-linux-4.4.y,v4.4.223-79-g57a59daaeb7b,2020-05-18T14:56:44.956314Z,i386,linux-log-parser/check-kernel-exception-1437829,pass
lkft,linux-stable-rc-linux-4.4.y,v4.4.223-79-g57a59daaeb7b,2020-05-18T14:56:44.956314Z,i386,linux-log-parser/check-kernel-trace-1437829,pass
lkft,linux-stable-rc-linux-4.4.y,v4.4.223-79-g57a59daaeb7b,2020-05-18T14:56:44.956314Z,i386,linux-log-parser/check-kernel-oops-1437829,pass
lkft,linux-stable-rc-linux-4.4.y,v4.4.223-79-g57a59daaeb7b,2020-05-18T14:56:44.956314Z,i386,linux-log-parser/check-kernel-fault-1437829,pass
lkft,linux-stable-rc-linux-4.4.y,v4.4.223-79-g57a59daaeb7b,2020-05-18T14:56:44.956314Z,i386,linux-log-parser/check-kernel-warning-1437829,pass
lkft,linux-stable-rc-linux-4.4.y,v4.4.223-79-g57a59daaeb7b,2020-05-18T14:56:44.956314Z,i386,linux-log-parser/check-kernel-bug-1437829,pass
lkft,linux-stable-rc-linux-4.4.y,v4.4.223-79-g57a59daaeb7b,2020-05-18T14:56:44.956314Z,i386,linux-log-parser/check-kernel-panic-1437829,pass
lkft,linux-stable-rc-linux-4.4.y,v4.4.223-79-g57a59daaeb7b,2020-05-18T14:56:44.956314Z,i386,linux-log-parser/check-kernel-exception-1437834,pass
lkft,linux-stable-rc-linux-4.4.y,v4.4.223-79-g57a59daaeb7b,2020-05-18T14:56:44.956314Z,i386,linux-log-parser/check-kernel-trace-1437834,pass
lkft,linux-stable-rc-linux-4.4.y,v4.4.223-79-g57a59daaeb7b,2020-05-18T14:56:44.956314Z,i386,linux-log-parser/check-kernel-oops-1437834,pass
lkft,linux-stable-rc-linux-4.4.y,v4.4.223-79-g57a59daaeb7b,2020-05-18T14:56:44.956314Z,i386,linux-log-parser/check-kernel-fault-1437834,pass
lkft,linux-stable-rc-linux-4.4.y,v4.4.223-79-g57a59daaeb7b,2020-05-18T14:56:44.956314Z,i386,linux-log-parser/check-kernel-warning-1437834,pass
lkft,linux-stable-rc-linux-4.4.y,v4.4.223-79-g57a59daaeb7b,2020-05-18T14:56:44.956314Z,i386,linux-log-parser/check-kernel-bug-1437834,pass
lkft,linux-stable-rc-linux-4.4.y,v4.4.223-79-g57a59daaeb7b,2020-05-18T14:56:44.956314Z,i386,linux-log-parser/check-kernel-panic-1437834,pass
lkft,linux-stable-rc-linux-4.4.y,v4.4.223-79-g57a59daaeb7b,2020-05-18T14:56:44.956314Z,i386,linux-log-parser/check-kernel-exception-1437837,pass
lkft,linux-stable-rc-linux-4.4.y,v4.4.223-79-g57a59daaeb7b,2020-05-18T14:56:44.956314Z,i386,linux-log-parser/check-kernel-trace-1437837,pass
lkft,linux-stable-rc-linux-4.4.y,v4.4.223-79-g57a59daaeb7b,2020-05-18T14:56:44.956314Z,i386,linux-log-parser/check-kernel-oops-1437837,pass
lkft,linux-stable-rc-linux-4.4.y,v4.4.223-79-g57a59daaeb7b,2020-05-18T14:56:44.956314Z,i386,linux-log-parser/check-kernel-fault-1437837,pass
lkft,linux-stable-rc-linux-4.4.y,v4.4.223-79-g57a59daaeb7b,2020-05-18T14:56:44.956314Z,i386,linux-log-parser/check-kernel-warning-1437837,pass
lkft,linux-stable-rc-linux-4.4.y,v4.4.223-79-g57a59daaeb7b,2020-05-18T14:56:44.956314Z,i386,linux-log-parser/check-kernel-bug-1437837,pass
lkft,linux-stable-rc-linux-4.4.y,v4.4.223-79-g57a59daaeb7b,2020-05-18T14:56:44.956314Z,i386,linux-log-parser/check-kernel-panic-1437837,pass
lkft,linux-stable-rc-linux-4.4.y,v4.4.223-79-g57a59daaeb7b,2020-05-18T14:56:44.956314Z,x86,linux-log-parser/check-kernel-exception-1437800,pass
lkft,linux-stable-rc-linux-4.4.y,v4.4.223-79-g57a59daaeb7b,2020-05-18T14:56:44.956314Z,x86,linux-log-parser/check-kernel-trace-1437800,pass
lkft,linux-stable-rc-linux-4.4.y,v4.4.223-79-g57a59daaeb7b,2020-05-18T14:56:44.956314Z,x86,linux-log-parser/check-kernel-oops-1437800,pass
lkft,linux-stable-rc-linux-4.4.y,v4.4.223-79-g57a59daaeb7b,2020-05-18T14:56:44.956314Z,x86,linux-log-parser/check-kernel-fault-1437800,pass
lkft,linux-stable-rc-linux-4.4.y,v4.4.223-79-g57a59daaeb7b,2020-05-18T14:56:44.956314Z,x86,linux-log-parser/check-kernel-warning-1437800,pass
lkft,linux-stable-rc-linux-4.4.y,v4.4.223-79-g57a59daaeb7b,2020-05-18T14:56:44.956314Z,x86,linux-log-parser/check-kernel-bug-1437800,pass
lkft,linux-stable-rc-linux-4.4.y,v4.4.223-79-g57a59daaeb7b,2020-05-18T14:56:44.956314Z,x86,linux-log-parser/check-kernel-panic-1437800,pass
lkft,linux-stable-rc-linux-4.4.y,v4.4.223-79-g57a59daaeb7b,2020-05-18T14:56:44.956314Z,x86,linux-log-parser/check-kernel-exception-1437803,pass
lkft,linux-stable-rc-linux-4.4.y,v4.4.223-79-g57a59daaeb7b,2020-05-18T14:56:44.956314Z,x86,linux-log-parser/check-kernel-trace-1437803,pass
lkft,linux-stable-rc-linux-4.4.y,v4.4.223-79-g57a59daaeb7b,2020-05-18T14:56:44.956314Z,x86,linux-log-parser/check-kernel-oops-1437803,pass
lkft,linux-stable-rc-linux-4.4.y,v4.4.223-79-g57a59daaeb7b,2020-05-18T14:56:44.956314Z,x86,linux-log-parser/check-kernel-fault-1437803,pass
lkft,linux-stable-rc-linux-4.4.y,v4.4.223-79-g57a59daaeb7b,2020-05-18T14:56:44.956314Z,x86,linux-log-parser/check-kernel-warning-1437803,pass
lkft,linux-stable-rc-linux-4.4.y,v4.4.223-79-g57a59daaeb7b,2020-05-18T14:56:44.956314Z,x86,linux-log-parser/check-kernel-bug-1437803,pass
lkft,linux-stable-rc-linux-4.4.y,v4.4.223-79-g57a59daaeb7b,2020-05-18T14:56:44.956314Z,x86,linux-log-parser/check-kernel-panic-1437803,pass
lkft,linux-stable-rc-linux-4.4.y,v4.4.223-79-g57a59daaeb7b,2020-05-18T14:56:44.956314Z,i386,linux-log-parser/check-kernel-exception-1437838,pass
lkft,linux-stable-rc-linux-4.4.y,v4.4.223-79-g57a59daaeb7b,2020-05-18T14:56:44.956314Z,i386,linux-log-parser/check-kernel-trace-1437838,pass
lkft,linux-stable-rc-linux-4.4.y,v4.4.223-79-g57a59daaeb7b,2020-05-18T14:56:44.956314Z,i386,linux-log-parser/check-kernel-oops-1437838,pass
lkft,linux-stable-rc-linux-4.4.y,v4.4.223-79-g57a59daaeb7b,2020-05-18T14:56:44.956314Z,i386,linux-log-parser/check-kernel-fault-1437838,pass
lkft,linux-stable-rc-linux-4.4.y,v4.4.223-79-g57a59daaeb7b,2020-05-18T14:56:44.956314Z,i386,linux-log-parser/check-kernel-warning-1437838,pass
lkft,linux-stable-rc-linux-4.4.y,v4.4.223-79-g57a59daaeb7b,2020-05-18T14:56:44.956314Z,i386,linux-log-parser/check-kernel-bug-1437838,pass
lkft,linux-stable-rc-linux-4.4.y,v4.4.223-79-g57a59daaeb7b,2020-05-18T14:56:44.956314Z,i386,linux-log-parser/check-kernel-panic-1437838,pass
lkft,linux-stable-rc-linux-4.4.y,v4.4.223-79-g57a59daaeb7b,2020-05-18T14:56:44.956314Z,i386,linux-log-parser/check-kernel-exception-1437836,pass
lkft,linux-stable-rc-linux-4.4.y,v4.4.223-79-g57a59daaeb7b,2020-05-18T14:56:44.956314Z,i386,linux-log-parser/check-kernel-trace-1437836,pass
lkft,linux-stable-rc-linux-4.4.y,v4.4.223-79-g57a59daaeb7b,2020-05-18T14:56:44.956314Z,i386,linux-log-parser/check-kernel-oops-1437836,pass
lkft,linux-stable-rc-linux-4.4.y,v4.4.223-79-g57a59daaeb7b,2020-05-18T14:56:44.956314Z,i386,linux-log-parser/check-kernel-fault-1437836,pass
lkft,linux-stable-rc-linux-4.4.y,v4.4.223-79-g57a59daaeb7b,2020-05-18T14:56:44.956314Z,i386,linux-log-parser/check-kernel-warning-1437836,pass
lkft,linux-stable-rc-linux-4.4.y,v4.4.223-79-g57a59daaeb7b,2020-05-18T14:56:44.956314Z,i386,linux-log-parser/check-kernel-bug-1437836,pass
lkft,linux-stable-rc-linux-4.4.y,v4.4.223-79-g57a59daaeb7b,2020-05-18T14:56:44.956314Z,i386,linux-log-parser/check-kernel-panic-1437836,pass
lkft,linux-stable-rc-linux-4.4.y,v4.4.223-79-g57a59daaeb7b,2020-05-18T14:56:44.956314Z,i386,linux-log-parser/check-kernel-exception-1437844,pass
lkft,linux-stable-rc-linux-4.4.y,v4.4.223-79-g57a59daaeb7b,2020-05-18T14:56:44.956314Z,i386,linux-log-parser/check-kernel-trace-1437844,pass
lkft,linux-stable-rc-linux-4.4.y,v4.4.223-79-g57a59daaeb7b,2020-05-18T14:56:44.956314Z,i386,linux-log-parser/check-kernel-oops-1437844,pass
lkft,linux-stable-rc-linux-4.4.y,v4.4.223-79-g57a59daaeb7b,2020-05-18T14:56:44.956314Z,i386,linux-log-parser/check-kernel-fault-1437844,pass
lkft,linux-stable-rc-linux-4.4.y,v4.4.223-79-g57a59daaeb7b,2020-05-18T14:56:44.956314Z,i386,linux-log-parser/check-kernel-warning-1437844,pass
lkft,linux-stable-rc-linux-4.4.y,v4.4.223-79-g57a59daaeb7b,2020-05-18T14:56:44.956314Z,i386,linux-log-parser/check-kernel-bug-1437844,pass
lkft,linux-stable-rc-linux-4.4.y,v4.4.223-79-g57a59daaeb7b,2020-05-18T14:56:44.956314Z,i386,linux-log-parser/check-kernel-panic-1437844,pass
lkft,linux-stable-rc-linux-4.4.y,v4.4.223-79-g57a59daaeb7b,2020-05-18T14:56:44.956314Z,i386,linux-log-parser/check-kernel-exception-1437839,pass
lkft,linux-stable-rc-linux-4.4.y,v4.4.223-79-g57a59daaeb7b,2020-05-18T14:56:44.956314Z,i386,linux-log-parser/check-kernel-trace-1437839,pass
lkft,linux-stable-rc-linux-4.4.y,v4.4.223-79-g57a59daaeb7b,2020-05-18T14:56:44.956314Z,i386,linux-log-parser/check-kernel-oops-1437839,pass
lkft,linux-stable-rc-linux-4.4.y,v4.4.223-79-g57a59daaeb7b,2020-05-18T14:56:44.956314Z,i386,linux-log-parser/check-kernel-fault-1437839,pass
lkft,linux-stable-rc-linux-4.4.y,v4.4.223-79-g57a59daaeb7b,2020-05-18T14:56:44.956314Z,i386,linux-log-parser/check-kernel-warning-1437839,pass
lkft,linux-stable-rc-linux-4.4.y,v4.4.223-79-g57a59daaeb7b,2020-05-18T14:56:44.956314Z,i386,linux-log-parser/check-kernel-bug-1437839,pass
lkft,linux-stable-rc-linux-4.4.y,v4.4.223-79-g57a59daaeb7b,2020-05-18T14:56:44.956314Z,i386,linux-log-parser/check-kernel-panic-1437839,pass
lkft,linux-stable-rc-linux-4.4.y,v4.4.223-79-g57a59daaeb7b,2020-05-18T14:56:44.956314Z,i386,linux-log-parser/check-kernel-exception-1437830,pass
lkft,linux-stable-rc-linux-4.4.y,v4.4.223-79-g57a59daaeb7b,2020-05-18T14:56:44.956314Z,i386,linux-log-parser/check-kernel-trace-1437830,pass
lkft,linux-stable-rc-linux-4.4.y,v4.4.223-79-g57a59daaeb7b,2020-05-18T14:56:44.956314Z,i386,linux-log-parser/check-kernel-oops-1437830,pass
lkft,linux-stable-rc-linux-4.4.y,v4.4.223-79-g57a59daaeb7b,2020-05-18T14:56:44.956314Z,i386,linux-log-parser/check-kernel-fault-1437830,pass
lkft,linux-stable-rc-linux-4.4.y,v4.4.223-79-g57a59daaeb7b,2020-05-18T14:56:44.956314Z,i386,linux-log-parser/check-kernel-warning-1437830,pass
lkft,linux-stable-rc-linux-4.4.y,v4.4.223-79-g57a59daaeb7b,2020-05-18T14:56:44.956314Z,i386,linux-log-parser/check-kernel-bug-1437830,pass
lkft,linux-stable-rc-linux-4.4.y,v4.4.223-79-g57a59daaeb7b,2020-05-18T14:56:44.956314Z,i386,linux-log-parser/check-kernel-panic-1437830,pass
lkft,linux-stable-rc-linux-4.4.y,v4.4.223-79-g57a59daaeb7b,2020-05-18T14:56:44.956314Z,i386,linux-log-parser/check-kernel-exception-1437840,pass
lkft,linux-stable-rc-linux-4.4.y,v4.4.223-79-g57a59daaeb7b,2020-05-18T14:56:44.956314Z,i386,linux-log-parser/check-kernel-trace-1437840,pass
lkft,linux-stable-rc-linux-4.4.y,v4.4.223-79-g57a59daaeb7b,2020-05-18T14:56:44.956314Z,i386,linux-log-parser/check-kernel-oops-1437840,pass
lkft,linux-stable-rc-linux-4.4.y,v4.4.223-79-g57a59daaeb7b,2020-05-18T14:56:44.956314Z,i386,linux-log-parser/check-kernel-fault-1437840,pass
lkft,linux-stable-rc-linux-4.4.y,v4.4.223-79-g57a59daaeb7b,2020-05-18T14:56:44.956314Z,i386,linux-log-parser/check-kernel-warning-1437840,pass
lkft,linux-stable-rc-linux-4.4.y,v4.4.223-79-g57a59daaeb7b,2020-05-18T14:56:44.956314Z,i386,linux-log-parser/check-kernel-bug-1437840,pass
lkft,linux-stable-rc-linux-4.4.y,v4.4.223-79-g57a59daaeb7b,2020-05-18T14:56:44.956314Z,i386,linux-log-parser/check-kernel-panic-1437840,pass
lkft,linux-stable-rc-linux-4.4.y,v4.4.223-79-g57a59daaeb7b,2020-05-18T14:56:44.956314Z,i386,linux-log-parser/check-kernel-exception-1437833,pass
lkft,linux-stable-rc-linux-4.4.y,v4.4.223-79-g57a59daaeb7b,2020-05-18T14:56:44.956314Z,i386,linux-log-parser/check-kernel-trace-1437833,pass
lkft,linux-stable-rc-linux-4.4.y,v4.4.223-79-g57a59daaeb7b,2020-05-18T14:56:44.956314Z,i386,linux-log-parser/check-kernel-oops-1437833,pass
lkft,linux-stable-rc-linux-4.4.y,v4.4.223-79-g57a59daaeb7b,2020-05-18T14:56:44.956314Z,i386,linux-log-parser/check-kernel-fault-1437833,pass
lkft,linux-stable-rc-linux-4.4.y,v4.4.223-79-g57a59daaeb7b,2020-05-18T14:56:44.956314Z,i386,linux-log-parser/check-kernel-warning-1437833,pass
lkft,linux-stable-rc-linux-4.4.y,v4.4.223-79-g57a59daaeb7b,2020-05-18T14:56:44.956314Z,i386,linux-log-parser/check-kernel-bug-1437833,pass
lkft,linux-stable-rc-linux-4.4.y,v4.4.223-79-g57a59daaeb7b,2020-05-18T14:56:44.956314Z,i386,linux-log-parser/check-kernel-panic-1437833,pass
lkft,linux-stable-rc-linux-4.4.y,v4.4.223-79-g57a59daaeb7b,2020-05-18T14:56:44.956314Z,i386,linux-log-parser/check-kernel-exception-1437842,pass
lkft,linux-stable-rc-linux-4.4.y,v4.4.223-79-g57a59daaeb7b,2020-05-18T14:56:44.956314Z,i386,linux-log-parser/check-kernel-trace-1437842,pass
lkft,linux-stable-rc-linux-4.4.y,v4.4.223-79-g57a59daaeb7b,2020-05-18T14:56:44.956314Z,i386,linux-log-parser/check-kernel-oops-1437842,pass
lkft,linux-stable-rc-linux-4.4.y,v4.4.223-79-g57a59daaeb7b,2020-05-18T14:56:44.956314Z,i386,linux-log-parser/check-kernel-fault-1437842,pass
lkft,linux-stable-rc-linux-4.4.y,v4.4.223-79-g57a59daaeb7b,2020-05-18T14:56:44.956314Z,i386,linux-log-parser/check-kernel-warning-1437842,pass
lkft,linux-stable-rc-linux-4.4.y,v4.4.223-79-g57a59daaeb7b,2020-05-18T14:56:44.956314Z,i386,linux-log-parser/check-kernel-bug-1437842,pass
lkft,linux-stable-rc-linux-4.4.y,v4.4.223-79-g57a59daaeb7b,2020-05-18T14:56:44.956314Z,i386,linux-log-parser/check-kernel-panic-1437842,pass
lkft,linux-stable-rc-linux-4.4.y,v4.4.223-79-g57a59daaeb7b,2020-05-18T14:56:44.956314Z,i386,linux-log-parser/check-kernel-exception-1437832,pass
lkft,linux-stable-rc-linux-4.4.y,v4.4.223-79-g57a59daaeb7b,2020-05-18T14:56:44.956314Z,i386,linux-log-parser/check-kernel-trace-1437832,pass
lkft,linux-stable-rc-linux-4.4.y,v4.4.223-79-g57a59daaeb7b,2020-05-18T14:56:44.956314Z,i386,linux-log-parser/check-kernel-oops-1437832,pass
lkft,linux-stable-rc-linux-4.4.y,v4.4.223-79-g57a59daaeb7b,2020-05-18T14:56:44.956314Z,i386,linux-log-parser/check-kernel-fault-1437832,pass
lkft,linux-stable-rc-linux-4.4.y,v4.4.223-79-g57a59daaeb7b,2020-05-18T14:56:44.956314Z,i386,linux-log-parser/check-kernel-warning-1437832,pass
lkft,linux-stable-rc-linux-4.4.y,v4.4.223-79-g57a59daaeb7b,2020-05-18T14:56:44.956314Z,i386,linux-log-parser/check-kernel-bug-1437832,pass
lkft,linux-stable-rc-linux-4.4.y,v4.4.223-79-g57a59daaeb7b,2020-05-18T14:56:44.956314Z,i386,linux-log-parser/check-kernel-panic-1437832,pass
lkft,linux-stable-rc-linux-4.4.y,v4.4.223-79-g57a59daaeb7b,2020-05-18T14:56:44.956314Z,x86,linux-log-parser/check-kernel-exception-1437798,pass
lkft,linux-stable-rc-linux-4.4.y,v4.4.223-79-g57a59daaeb7b,2020-05-18T14:56:44.956314Z,x86,linux-log-parser/check-kernel-trace-1437798,pass
lkft,linux-stable-rc-linux-4.4.y,v4.4.223-79-g57a59daaeb7b,2020-05-18T14:56:44.956314Z,x86,linux-log-parser/check-kernel-oops-1437798,pass
lkft,linux-stable-rc-linux-4.4.y,v4.4.223-79-g57a59daaeb7b,2020-05-18T14:56:44.956314Z,x86,linux-log-parser/check-kernel-fault-1437798,pass
lkft,linux-stable-rc-linux-4.4.y,v4.4.223-79-g57a59daaeb7b,2020-05-18T14:56:44.956314Z,x86,linux-log-parser/check-kernel-warning-1437798,pass
lkft,linux-stable-rc-linux-4.4.y,v4.4.223-79-g57a59daaeb7b,2020-05-18T14:56:44.956314Z,x86,linux-log-parser/check-kernel-bug-1437798,pass
lkft,linux-stable-rc-linux-4.4.y,v4.4.223-79-g57a59daaeb7b,2020-05-18T14:56:44.956314Z,x86,linux-log-parser/check-kernel-panic-1437798,pass
lkft,linux-stable-rc-linux-4.4.y,v4.4.223-79-g57a59daaeb7b,2020-05-18T14:56:44.956314Z,juno-r2,linux-log-parser/check-kernel-exception-1437945,pass
lkft,linux-stable-rc-linux-4.4.y,v4.4.223-79-g57a59daaeb7b,2020-05-18T14:56:44.956314Z,juno-r2,linux-log-parser/check-kernel-trace-1437945,pass
lkft,linux-stable-rc-linux-4.4.y,v4.4.223-79-g57a59daaeb7b,2020-05-18T14:56:44.956314Z,juno-r2,linux-log-parser/check-kernel-oops-1437945,pass
lkft,linux-stable-rc-linux-4.4.y,v4.4.223-79-g57a59daaeb7b,2020-05-18T14:56:44.956314Z,juno-r2,linux-log-parser/check-kernel-fault-1437945,pass
lkft,linux-stable-rc-linux-4.4.y,v4.4.223-79-g57a59daaeb7b,2020-05-18T14:56:44.956314Z,juno-r2,linux-log-parser/check-kernel-warning-1437945,pass
lkft,linux-stable-rc-linux-4.4.y,v4.4.223-79-g57a59daaeb7b,2020-05-18T14:56:44.956314Z,juno-r2,linux-log-parser/check-kernel-bug-1437945,pass
lkft,linux-stable-rc-linux-4.4.y,v4.4.223-79-g57a59daaeb7b,2020-05-18T14:56:44.956314Z,juno-r2,linux-log-parser/check-kernel-panic-1437945,pass
lkft,linux-stable-rc-linux-4.4.y,v4.4.223-79-g57a59daaeb7b,2020-05-18T14:56:44.956314Z,juno-r2,linux-log-parser/check-kernel-exception-1437944,pass
lkft,linux-stable-rc-linux-4.4.y,v4.4.223-79-g57a59daaeb7b,2020-05-18T14:56:44.956314Z,juno-r2,linux-log-parser/check-kernel-trace-1437944,pass
lkft,linux-stable-rc-linux-4.4.y,v4.4.223-79-g57a59daaeb7b,2020-05-18T14:56:44.956314Z,juno-r2,linux-log-parser/check-kernel-oops-1437944,pass
lkft,linux-stable-rc-linux-4.4.y,v4.4.223-79-g57a59daaeb7b,2020-05-18T14:56:44.956314Z,juno-r2,linux-log-parser/check-kernel-fault-1437944,pass
lkft,linux-stable-rc-linux-4.4.y,v4.4.223-79-g57a59daaeb7b,2020-05-18T14:56:44.956314Z,juno-r2,linux-log-parser/check-kernel-warning-1437944,pass
lkft,linux-stable-rc-linux-4.4.y,v4.4.223-79-g57a59daaeb7b,2020-05-18T14:56:44.956314Z,juno-r2,linux-log-parser/check-kernel-bug-1437944,pass
lkft,linux-stable-rc-linux-4.4.y,v4.4.223-79-g57a59daaeb7b,2020-05-18T14:56:44.956314Z,juno-r2,linux-log-parser/check-kernel-panic-1437944,pass
lkft,linux-stable-rc-linux-4.4.y,v4.4.223-79-g57a59daaeb7b,2020-05-18T14:56:44.956314Z,juno-r2,linux-log-parser/check-kernel-exception-1437947,pass
lkft,linux-stable-rc-linux-4.4.y,v4.4.223-79-g57a59daaeb7b,2020-05-18T14:56:44.956314Z,juno-r2,linux-log-parser/check-kernel-trace-1437947,pass
lkft,linux-stable-rc-linux-4.4.y,v4.4.223-79-g57a59daaeb7b,2020-05-18T14:56:44.956314Z,juno-r2,linux-log-parser/check-kernel-oops-1437947,pass
lkft,linux-stable-rc-linux-4.4.y,v4.4.223-79-g57a59daaeb7b,2020-05-18T14:56:44.956314Z,juno-r2,linux-log-parser/check-kernel-fault-1437947,pass
lkft,linux-stable-rc-linux-4.4.y,v4.4.223-79-g57a59daaeb7b,2020-05-18T14:56:44.956314Z,juno-r2,linux-log-parser/check-kernel-warning-1437947,pass
lkft,linux-stable-rc-linux-4.4.y,v4.4.223-79-g57a59daaeb7b,2020-05-18T14:56:44.956314Z,juno-r2,linux-log-parser/check-kernel-bug-1437947,pass
lkft,linux-stable-rc-linux-4.4.y,v4.4.223-79-g57a59daaeb7b,2020-05-18T14:56:44.956314Z,juno-r2,linux-log-parser/check-kernel-panic-1437947,pass
lkft,linux-stable-rc-linux-4.4.y,v4.4.223-79-g57a59daaeb7b,2020-05-18T14:56:44.956314Z,juno-r2,linux-log-parser/check-kernel-exception-1437946,pass
lkft,linux-stable-rc-linux-4.4.y,v4.4.223-79-g57a59daaeb7b,2020-05-18T14:56:44.956314Z,juno-r2,linux-log-parser/check-kernel-trace-1437946,pass
lkft,linux-stable-rc-linux-4.4.y,v4.4.223-79-g57a59daaeb7b,2020-05-18T14:56:44.956314Z,juno-r2,linux-log-parser/check-kernel-oops-1437946,pass
lkft,linux-stable-rc-linux-4.4.y,v4.4.223-79-g57a59daaeb7b,2020-05-18T14:56:44.956314Z,juno-r2,linux-log-parser/check-kernel-fault-1437946,pass
lkft,linux-stable-rc-linux-4.4.y,v4.4.223-79-g57a59daaeb7b,2020-05-18T14:56:44.956314Z,juno-r2,linux-log-parser/check-kernel-warning-1437946,pass
lkft,linux-stable-rc-linux-4.4.y,v4.4.223-79-g57a59daaeb7b,2020-05-18T14:56:44.956314Z,juno-r2,linux-log-parser/check-kernel-bug-1437946,pass
lkft,linux-stable-rc-linux-4.4.y,v4.4.223-79-g57a59daaeb7b,2020-05-18T14:56:44.956314Z,juno-r2,linux-log-parser/check-kernel-panic-1437946,pass
lkft,linux-stable-rc-linux-4.4.y,v4.4.223-79-g57a59daaeb7b,2020-05-18T14:56:44.956314Z,x86,linux-log-parser/check-kernel-exception-1437799,pass
lkft,linux-stable-rc-linux-4.4.y,v4.4.223-79-g57a59daaeb7b,2020-05-18T14:56:44.956314Z,x86,linux-log-parser/check-kernel-trace-1437799,pass
lkft,linux-stable-rc-linux-4.4.y,v4.4.223-79-g57a59daaeb7b,2020-05-18T14:56:44.956314Z,x86,linux-log-parser/check-kernel-oops-1437799,pass
lkft,linux-stable-rc-linux-4.4.y,v4.4.223-79-g57a59daaeb7b,2020-05-18T14:56:44.956314Z,x86,linux-log-parser/check-kernel-fault-1437799,pass
lkft,linux-stable-rc-linux-4.4.y,v4.4.223-79-g57a59daaeb7b,2020-05-18T14:56:44.956314Z,x86,linux-log-parser/check-kernel-warning-1437799,pass
lkft,linux-stable-rc-linux-4.4.y,v4.4.223-79-g57a59daaeb7b,2020-05-18T14:56:44.956314Z,x86,linux-log-parser/check-kernel-bug-1437799,pass
lkft,linux-stable-rc-linux-4.4.y,v4.4.223-79-g57a59daaeb7b,2020-05-18T14:56:44.956314Z,x86,linux-log-parser/check-kernel-panic-1437799,pass
lkft,linux-stable-rc-linux-4.4.y,v4.4.223-79-g57a59daaeb7b,2020-05-18T14:56:44.956314Z,x86,linux-log-parser/check-kernel-exception-1437804,pass
lkft,linux-stable-rc-linux-4.4.y,v4.4.223-79-g57a59daaeb7b,2020-05-18T14:56:44.956314Z,x86,linux-log-parser/check-kernel-trace-1437804,pass
lkft,linux-stable-rc-linux-4.4.y,v4.4.223-79-g57a59daaeb7b,2020-05-18T14:56:44.956314Z,x86,linux-log-parser/check-kernel-oops-1437804,pass
lkft,linux-stable-rc-linux-4.4.y,v4.4.223-79-g57a59daaeb7b,2020-05-18T14:56:44.956314Z,x86,linux-log-parser/check-kernel-fault-1437804,pass
lkft,linux-stable-rc-linux-4.4.y,v4.4.223-79-g57a59daaeb7b,2020-05-18T14:56:44.956314Z,x86,linux-log-parser/check-kernel-warning-1437804,pass
lkft,linux-stable-rc-linux-4.4.y,v4.4.223-79-g57a59daaeb7b,2020-05-18T14:56:44.956314Z,x86,linux-log-parser/check-kernel-bug-1437804,pass
lkft,linux-stable-rc-linux-4.4.y,v4.4.223-79-g57a59daaeb7b,2020-05-18T14:56:44.956314Z,x86,linux-log-parser/check-kernel-panic-1437804,pass
lkft,linux-stable-rc-linux-4.4.y,v4.4.223-79-g57a59daaeb7b,2020-05-18T14:56:44.956314Z,x86,linux-log-parser/check-kernel-exception-1437813,pass
lkft,linux-stable-rc-linux-4.4.y,v4.4.223-79-g57a59daaeb7b,2020-05-18T14:56:44.956314Z,x86,linux-log-parser/check-kernel-trace-1437813,pass
lkft,linux-stable-rc-linux-4.4.y,v4.4.223-79-g57a59daaeb7b,2020-05-18T14:56:44.956314Z,x86,linux-log-parser/check-kernel-oops-1437813,pass
lkft,linux-stable-rc-linux-4.4.y,v4.4.223-79-g57a59daaeb7b,2020-05-18T14:56:44.956314Z,x86,linux-log-parser/check-kernel-fault-1437813,pass
lkft,linux-stable-rc-linux-4.4.y,v4.4.223-79-g57a59daaeb7b,2020-05-18T14:56:44.956314Z,x86,linux-log-parser/check-kernel-warning-1437813,pass
lkft,linux-stable-rc-linux-4.4.y,v4.4.223-79-g57a59daaeb7b,2020-05-18T14:56:44.956314Z,x86,linux-log-parser/check-kernel-bug-1437813,pass
lkft,linux-stable-rc-linux-4.4.y,v4.4.223-79-g57a59daaeb7b,2020-05-18T14:56:44.956314Z,x86,linux-log-parser/check-kernel-panic-1437813,pass
lkft,linux-stable-rc-linux-4.4.y,v4.4.223-79-g57a59daaeb7b,2020-05-18T14:56:44.956314Z,x86,linux-log-parser/check-kernel-exception-1437808,pass
lkft,linux-stable-rc-linux-4.4.y,v4.4.223-79-g57a59daaeb7b,2020-05-18T14:56:44.956314Z,x86,linux-log-parser/check-kernel-trace-1437808,pass
lkft,linux-stable-rc-linux-4.4.y,v4.4.223-79-g57a59daaeb7b,2020-05-18T14:56:44.956314Z,x86,linux-log-parser/check-kernel-oops-1437808,pass
lkft,linux-stable-rc-linux-4.4.y,v4.4.223-79-g57a59daaeb7b,2020-05-18T14:56:44.956314Z,x86,linux-log-parser/check-kernel-fault-1437808,pass
lkft,linux-stable-rc-linux-4.4.y,v4.4.223-79-g57a59daaeb7b,2020-05-18T14:56:44.956314Z,x86,linux-log-parser/check-kernel-warning-1437808,pass
lkft,linux-stable-rc-linux-4.4.y,v4.4.223-79-g57a59daaeb7b,2020-05-18T14:56:44.956314Z,x86,linux-log-parser/check-kernel-bug-1437808,pass
lkft,linux-stable-rc-linux-4.4.y,v4.4.223-79-g57a59daaeb7b,2020-05-18T14:56:44.956314Z,x86,linux-log-parser/check-kernel-panic-1437808,pass
lkft,linux-stable-rc-linux-4.4.y,v4.4.223-79-g57a59daaeb7b,2020-05-18T14:56:44.956314Z,i386,linux-log-parser/check-kernel-exception-1437841,pass
lkft,linux-stable-rc-linux-4.4.y,v4.4.223-79-g57a59daaeb7b,2020-05-18T14:56:44.956314Z,i386,linux-log-parser/check-kernel-trace-1437841,pass
lkft,linux-stable-rc-linux-4.4.y,v4.4.223-79-g57a59daaeb7b,2020-05-18T14:56:44.956314Z,i386,linux-log-parser/check-kernel-oops-1437841,pass
lkft,linux-stable-rc-linux-4.4.y,v4.4.223-79-g57a59daaeb7b,2020-05-18T14:56:44.956314Z,i386,linux-log-parser/check-kernel-fault-1437841,pass
lkft,linux-stable-rc-linux-4.4.y,v4.4.223-79-g57a59daaeb7b,2020-05-18T14:56:44.956314Z,i386,linux-log-parser/check-kernel-warning-1437841,pass
lkft,linux-stable-rc-linux-4.4.y,v4.4.223-79-g57a59daaeb7b,2020-05-18T14:56:44.956314Z,i386,linux-log-parser/check-kernel-bug-1437841,pass
lkft,linux-stable-rc-linux-4.4.y,v4.4.223-79-g57a59daaeb7b,2020-05-18T14:56:44.956314Z,i386,linux-log-parser/check-kernel-panic-1437841,pass
lkft,linux-stable-rc-linux-4.4.y,v4.4.223-79-g57a59daaeb7b,2020-05-18T14:56:44.956314Z,i386,linux-log-parser/check-kernel-exception-1437843,pass
lkft,linux-stable-rc-linux-4.4.y,v4.4.223-79-g57a59daaeb7b,2020-05-18T14:56:44.956314Z,i386,linux-log-parser/check-kernel-trace-1437843,pass
lkft,linux-stable-rc-linux-4.4.y,v4.4.223-79-g57a59daaeb7b,2020-05-18T14:56:44.956314Z,i386,linux-log-parser/check-kernel-oops-1437843,pass
lkft,linux-stable-rc-linux-4.4.y,v4.4.223-79-g57a59daaeb7b,2020-05-18T14:56:44.956314Z,i386,linux-log-parser/check-kernel-fault-1437843,pass
lkft,linux-stable-rc-linux-4.4.y,v4.4.223-79-g57a59daaeb7b,2020-05-18T14:56:44.956314Z,i386,linux-log-parser/check-kernel-warning-1437843,pass
lkft,linux-stable-rc-linux-4.4.y,v4.4.223-79-g57a59daaeb7b,2020-05-18T14:56:44.956314Z,i386,linux-log-parser/check-kernel-bug-1437843,pass
lkft,linux-stable-rc-linux-4.4.y,v4.4.223-79-g57a59daaeb7b,2020-05-18T14:56:44.956314Z,i386,linux-log-parser/check-kernel-panic-1437843,pass
