group.name,project.name,build.name,build.datetime,environment.name,test.name,test.status
lkft,linux-stable-rc-linux-4.9.y,v4.9.207-164-g7d6b084587b1,2020-01-01T18:19:22.120102Z,juno-r2,build/build_process,fail
lkft,linux-stable-rc-linux-4.9.y,v4.9.207-164-g7d6b084587b1,2020-01-01T18:19:22.120102Z,juno-r2,linux-log-parser/check-kernel-exception-juno-r2-766,pass
lkft,linux-stable-rc-linux-4.9.y,v4.9.207-164-g7d6b084587b1,2020-01-01T18:19:22.120102Z,juno-r2,linux-log-parser/check-kernel-trace-juno-r2-766,pass
lkft,linux-stable-rc-linux-4.9.y,v4.9.207-164-g7d6b084587b1,2020-01-01T18:19:22.120102Z,juno-r2,linux-log-parser/check-kernel-oops-juno-r2-766,pass
lkft,linux-stable-rc-linux-4.9.y,v4.9.207-164-g7d6b084587b1,2020-01-01T18:19:22.120102Z,juno-r2,linux-log-parser/check-kernel-fault-juno-r2-766,pass
lkft,linux-stable-rc-linux-4.9.y,v4.9.207-164-g7d6b084587b1,2020-01-01T18:19:22.120102Z,juno-r2,linux-log-parser/check-kernel-warning-juno-r2-766,pass
lkft,linux-stable-rc-linux-4.9.y,v4.9.207-164-g7d6b084587b1,2020-01-01T18:19:22.120102Z,juno-r2,linux-log-parser/check-kernel-bug-juno-r2-766,pass
lkft,linux-stable-rc-linux-4.9.y,v4.9.207-164-g7d6b084587b1,2020-01-01T18:19:22.120102Z,juno-r2,linux-log-parser/check-kernel-panic-juno-r2-766,pass
lkft,linux-stable-rc-linux-4.9.y,v4.9.207-164-g7d6b084587b1,2020-01-01T18:19:22.120102Z,x86,build/build_process,fail
lkft,linux-stable-rc-linux-4.9.y,v4.9.207-164-g7d6b084587b1,2020-01-01T18:19:22.120102Z,x86,linux-log-parser/check-kernel-exception-x86-766,pass
lkft,linux-stable-rc-linux-4.9.y,v4.9.207-164-g7d6b084587b1,2020-01-01T18:19:22.120102Z,x86,linux-log-parser/check-kernel-trace-x86-766,pass
lkft,linux-stable-rc-linux-4.9.y,v4.9.207-164-g7d6b084587b1,2020-01-01T18:19:22.120102Z,x86,linux-log-parser/check-kernel-oops-x86-766,pass
lkft,linux-stable-rc-linux-4.9.y,v4.9.207-164-g7d6b084587b1,2020-01-01T18:19:22.120102Z,x86,linux-log-parser/check-kernel-fault-x86-766,pass
lkft,linux-stable-rc-linux-4.9.y,v4.9.207-164-g7d6b084587b1,2020-01-01T18:19:22.120102Z,x86,linux-log-parser/check-kernel-warning-x86-766,pass
lkft,linux-stable-rc-linux-4.9.y,v4.9.207-164-g7d6b084587b1,2020-01-01T18:19:22.120102Z,x86,linux-log-parser/check-kernel-bug-x86-766,pass
lkft,linux-stable-rc-linux-4.9.y,v4.9.207-164-g7d6b084587b1,2020-01-01T18:19:22.120102Z,x86,linux-log-parser/check-kernel-panic-x86-766,pass
lkft,linux-stable-rc-linux-4.9.y,v4.9.207-164-g7d6b084587b1,2020-01-01T18:19:22.120102Z,x15,build/build_process,fail
lkft,linux-stable-rc-linux-4.9.y,v4.9.207-164-g7d6b084587b1,2020-01-01T18:19:22.120102Z,x15,linux-log-parser/check-kernel-exception-x15-766,pass
lkft,linux-stable-rc-linux-4.9.y,v4.9.207-164-g7d6b084587b1,2020-01-01T18:19:22.120102Z,x15,linux-log-parser/check-kernel-trace-x15-766,pass
lkft,linux-stable-rc-linux-4.9.y,v4.9.207-164-g7d6b084587b1,2020-01-01T18:19:22.120102Z,x15,linux-log-parser/check-kernel-oops-x15-766,pass
lkft,linux-stable-rc-linux-4.9.y,v4.9.207-164-g7d6b084587b1,2020-01-01T18:19:22.120102Z,x15,linux-log-parser/check-kernel-fault-x15-766,pass
lkft,linux-stable-rc-linux-4.9.y,v4.9.207-164-g7d6b084587b1,2020-01-01T18:19:22.120102Z,x15,linux-log-parser/check-kernel-warning-x15-766,pass
lkft,linux-stable-rc-linux-4.9.y,v4.9.207-164-g7d6b084587b1,2020-01-01T18:19:22.120102Z,x15,linux-log-parser/check-kernel-bug-x15-766,pass
lkft,linux-stable-rc-linux-4.9.y,v4.9.207-164-g7d6b084587b1,2020-01-01T18:19:22.120102Z,x15,linux-log-parser/check-kernel-panic-x15-766,pass
lkft,linux-stable-rc-linux-4.9.y,v4.9.207-164-g7d6b084587b1,2020-01-01T18:19:22.120102Z,hi6220-hikey,build/build_process,fail
lkft,linux-stable-rc-linux-4.9.y,v4.9.207-164-g7d6b084587b1,2020-01-01T18:19:22.120102Z,hi6220-hikey,linux-log-parser/check-kernel-exception-hi6220-hikey-766,pass
lkft,linux-stable-rc-linux-4.9.y,v4.9.207-164-g7d6b084587b1,2020-01-01T18:19:22.120102Z,hi6220-hikey,linux-log-parser/check-kernel-trace-hi6220-hikey-766,pass
lkft,linux-stable-rc-linux-4.9.y,v4.9.207-164-g7d6b084587b1,2020-01-01T18:19:22.120102Z,hi6220-hikey,linux-log-parser/check-kernel-oops-hi6220-hikey-766,pass
lkft,linux-stable-rc-linux-4.9.y,v4.9.207-164-g7d6b084587b1,2020-01-01T18:19:22.120102Z,hi6220-hikey,linux-log-parser/check-kernel-fault-hi6220-hikey-766,pass
lkft,linux-stable-rc-linux-4.9.y,v4.9.207-164-g7d6b084587b1,2020-01-01T18:19:22.120102Z,hi6220-hikey,linux-log-parser/check-kernel-warning-hi6220-hikey-766,pass
lkft,linux-stable-rc-linux-4.9.y,v4.9.207-164-g7d6b084587b1,2020-01-01T18:19:22.120102Z,hi6220-hikey,linux-log-parser/check-kernel-bug-hi6220-hikey-766,pass
lkft,linux-stable-rc-linux-4.9.y,v4.9.207-164-g7d6b084587b1,2020-01-01T18:19:22.120102Z,hi6220-hikey,linux-log-parser/check-kernel-panic-hi6220-hikey-766,pass
lkft,linux-stable-rc-linux-4.9.y,v4.9.207-164-g7d6b084587b1,2020-01-01T18:19:22.120102Z,i386,build/build_process,fail
lkft,linux-stable-rc-linux-4.9.y,v4.9.207-164-g7d6b084587b1,2020-01-01T18:19:22.120102Z,i386,linux-log-parser/check-kernel-exception-i386-766,pass
lkft,linux-stable-rc-linux-4.9.y,v4.9.207-164-g7d6b084587b1,2020-01-01T18:19:22.120102Z,i386,linux-log-parser/check-kernel-trace-i386-766,pass
lkft,linux-stable-rc-linux-4.9.y,v4.9.207-164-g7d6b084587b1,2020-01-01T18:19:22.120102Z,i386,linux-log-parser/check-kernel-oops-i386-766,pass
lkft,linux-stable-rc-linux-4.9.y,v4.9.207-164-g7d6b084587b1,2020-01-01T18:19:22.120102Z,i386,linux-log-parser/check-kernel-fault-i386-766,pass
lkft,linux-stable-rc-linux-4.9.y,v4.9.207-164-g7d6b084587b1,2020-01-01T18:19:22.120102Z,i386,linux-log-parser/check-kernel-warning-i386-766,pass
lkft,linux-stable-rc-linux-4.9.y,v4.9.207-164-g7d6b084587b1,2020-01-01T18:19:22.120102Z,i386,linux-log-parser/check-kernel-bug-i386-766,pass
lkft,linux-stable-rc-linux-4.9.y,v4.9.207-164-g7d6b084587b1,2020-01-01T18:19:22.120102Z,i386,linux-log-parser/check-kernel-panic-i386-766,pass
lkft,linux-stable-rc-linux-4.9.y,v4.9.207-164-g7d6b084587b1,2020-01-01T18:19:22.120102Z,dragonboard-410c,build/build_process,fail
lkft,linux-stable-rc-linux-4.9.y,v4.9.207-164-g7d6b084587b1,2020-01-01T18:19:22.120102Z,dragonboard-410c,linux-log-parser/check-kernel-exception-dragonboard-410c-766,pass
lkft,linux-stable-rc-linux-4.9.y,v4.9.207-164-g7d6b084587b1,2020-01-01T18:19:22.120102Z,dragonboard-410c,linux-log-parser/check-kernel-trace-dragonboard-410c-766,pass
lkft,linux-stable-rc-linux-4.9.y,v4.9.207-164-g7d6b084587b1,2020-01-01T18:19:22.120102Z,dragonboard-410c,linux-log-parser/check-kernel-oops-dragonboard-410c-766,pass
lkft,linux-stable-rc-linux-4.9.y,v4.9.207-164-g7d6b084587b1,2020-01-01T18:19:22.120102Z,dragonboard-410c,linux-log-parser/check-kernel-fault-dragonboard-410c-766,pass
lkft,linux-stable-rc-linux-4.9.y,v4.9.207-164-g7d6b084587b1,2020-01-01T18:19:22.120102Z,dragonboard-410c,linux-log-parser/check-kernel-warning-dragonboard-410c-766,pass
lkft,linux-stable-rc-linux-4.9.y,v4.9.207-164-g7d6b084587b1,2020-01-01T18:19:22.120102Z,dragonboard-410c,linux-log-parser/check-kernel-bug-dragonboard-410c-766,pass
lkft,linux-stable-rc-linux-4.9.y,v4.9.207-164-g7d6b084587b1,2020-01-01T18:19:22.120102Z,dragonboard-410c,linux-log-parser/check-kernel-panic-dragonboard-410c-766,pass
