group.name,project.name,build.name,environment.name,test.name,test.status
lkft,linux-stable-rc-linux-4.4.y,v4.4.245,x15,build/build_process,pass
lkft,linux-stable-rc-linux-4.4.y,v4.4.245,x15,linux-log-parser/check-kernel-exception-x15-965,pass
lkft,linux-stable-rc-linux-4.4.y,v4.4.245,x15,linux-log-parser/check-kernel-trace-x15-965,pass
lkft,linux-stable-rc-linux-4.4.y,v4.4.245,x15,linux-log-parser/check-kernel-oops-x15-965,pass
lkft,linux-stable-rc-linux-4.4.y,v4.4.245,x15,linux-log-parser/check-kernel-fault-x15-965,pass
lkft,linux-stable-rc-linux-4.4.y,v4.4.245,x15,linux-log-parser/check-kernel-warning-x15-965,pass
lkft,linux-stable-rc-linux-4.4.y,v4.4.245,x15,linux-log-parser/check-kernel-bug-x15-965,pass
lkft,linux-stable-rc-linux-4.4.y,v4.4.245,x15,linux-log-parser/check-kernel-invalid-opcode-x15-965,pass
lkft,linux-stable-rc-linux-4.4.y,v4.4.245,x15,linux-log-parser/check-kernel-panic-x15-965,pass
lkft,linux-stable-rc-linux-4.4.y,v4.4.245,juno-r2,build/build_process,pass
lkft,linux-stable-rc-linux-4.4.y,v4.4.245,juno-r2,linux-log-parser/check-kernel-exception-juno-r2-965,pass
lkft,linux-stable-rc-linux-4.4.y,v4.4.245,juno-r2,linux-log-parser/check-kernel-trace-juno-r2-965,pass
lkft,linux-stable-rc-linux-4.4.y,v4.4.245,juno-r2,linux-log-parser/check-kernel-oops-juno-r2-965,pass
lkft,linux-stable-rc-linux-4.4.y,v4.4.245,juno-r2,linux-log-parser/check-kernel-fault-juno-r2-965,pass
lkft,linux-stable-rc-linux-4.4.y,v4.4.245,juno-r2,linux-log-parser/check-kernel-warning-juno-r2-965,pass
lkft,linux-stable-rc-linux-4.4.y,v4.4.245,juno-r2,linux-log-parser/check-kernel-bug-juno-r2-965,pass
lkft,linux-stable-rc-linux-4.4.y,v4.4.245,juno-r2,linux-log-parser/check-kernel-invalid-opcode-juno-r2-965,pass
lkft,linux-stable-rc-linux-4.4.y,v4.4.245,juno-r2,linux-log-parser/check-kernel-panic-juno-r2-965,pass
lkft,linux-stable-rc-linux-4.4.y,v4.4.245,x86,build/build_process,pass
lkft,linux-stable-rc-linux-4.4.y,v4.4.245,x86,linux-log-parser/check-kernel-exception-x86-965,pass
lkft,linux-stable-rc-linux-4.4.y,v4.4.245,x86,linux-log-parser/check-kernel-trace-x86-965,pass
lkft,linux-stable-rc-linux-4.4.y,v4.4.245,x86,linux-log-parser/check-kernel-oops-x86-965,pass
lkft,linux-stable-rc-linux-4.4.y,v4.4.245,x86,linux-log-parser/check-kernel-fault-x86-965,pass
lkft,linux-stable-rc-linux-4.4.y,v4.4.245,x86,linux-log-parser/check-kernel-warning-x86-965,pass
lkft,linux-stable-rc-linux-4.4.y,v4.4.245,x86,linux-log-parser/check-kernel-bug-x86-965,pass
lkft,linux-stable-rc-linux-4.4.y,v4.4.245,x86,linux-log-parser/check-kernel-invalid-opcode-x86-965,pass
lkft,linux-stable-rc-linux-4.4.y,v4.4.245,x86,linux-log-parser/check-kernel-panic-x86-965,pass
lkft,linux-stable-rc-linux-4.4.y,v4.4.245,i386,build/build_process,pass
lkft,linux-stable-rc-linux-4.4.y,v4.4.245,i386,linux-log-parser/check-kernel-exception-i386-965,pass
lkft,linux-stable-rc-linux-4.4.y,v4.4.245,i386,linux-log-parser/check-kernel-trace-i386-965,pass
lkft,linux-stable-rc-linux-4.4.y,v4.4.245,i386,linux-log-parser/check-kernel-oops-i386-965,pass
lkft,linux-stable-rc-linux-4.4.y,v4.4.245,i386,linux-log-parser/check-kernel-fault-i386-965,pass
lkft,linux-stable-rc-linux-4.4.y,v4.4.245,i386,linux-log-parser/check-kernel-warning-i386-965,pass
lkft,linux-stable-rc-linux-4.4.y,v4.4.245,i386,linux-log-parser/check-kernel-bug-i386-965,pass
lkft,linux-stable-rc-linux-4.4.y,v4.4.245,i386,linux-log-parser/check-kernel-invalid-opcode-i386-965,pass
lkft,linux-stable-rc-linux-4.4.y,v4.4.245,i386,linux-log-parser/check-kernel-panic-i386-965,pass
lkft,linux-stable-rc-linux-4.4.y,v4.4.245,x15,install-android-platform-tools-r2600/install-fastboot,pass
lkft,linux-stable-rc-linux-4.4.y,v4.4.245,x15,install-android-platform-tools-r2600/install-adb,pass
lkft,linux-stable-rc-linux-4.4.y,v4.4.245,x15,linux-log-parser/check-kernel-exception-1965810,pass
lkft,linux-stable-rc-linux-4.4.y,v4.4.245,x15,linux-log-parser/check-kernel-trace-1965810,pass
lkft,linux-stable-rc-linux-4.4.y,v4.4.245,x15,linux-log-parser/check-kernel-oops-1965810,pass
lkft,linux-stable-rc-linux-4.4.y,v4.4.245,x15,linux-log-parser/check-kernel-fault-1965810,pass
lkft,linux-stable-rc-linux-4.4.y,v4.4.245,x15,linux-log-parser/check-kernel-warning-1965810,pass
lkft,linux-stable-rc-linux-4.4.y,v4.4.245,x15,linux-log-parser/check-kernel-bug-1965810,pass
lkft,linux-stable-rc-linux-4.4.y,v4.4.245,x15,linux-log-parser/check-kernel-invalid-opcode-1965810,pass
lkft,linux-stable-rc-linux-4.4.y,v4.4.245,x15,linux-log-parser/check-kernel-panic-1965810,pass
lkft,linux-stable-rc-linux-4.4.y,v4.4.245,x15,network-basic-tests/print-network-statistics,pass
lkft,linux-stable-rc-linux-4.4.y,v4.4.245,x15,network-basic-tests/list-all-network-interfaces,pass
lkft,linux-stable-rc-linux-4.4.y,v4.4.245,x15,network-basic-tests/print-routing-tables,pass
lkft,linux-stable-rc-linux-4.4.y,v4.4.245,x15,network-basic-tests/ip-link-loopback-up,pass
lkft,linux-stable-rc-linux-4.4.y,v4.4.245,x15,network-basic-tests/route-dump-after-ip-link-loopback-up,pass
lkft,linux-stable-rc-linux-4.4.y,v4.4.245,x15,network-basic-tests/ip-link-interface-up,pass
lkft,linux-stable-rc-linux-4.4.y,v4.4.245,x15,network-basic-tests/ip-link-interface-down,skip
lkft,linux-stable-rc-linux-4.4.y,v4.4.245,x15,network-basic-tests/Dynamic-Host-Configuration-Protocol-Client-dhclient-v,pass
lkft,linux-stable-rc-linux-4.4.y,v4.4.245,x15,network-basic-tests/print-routing-tables-after-dhclient-request,pass
lkft,linux-stable-rc-linux-4.4.y,v4.4.245,x15,network-basic-tests/ping-gateway,pass
lkft,linux-stable-rc-linux-4.4.y,v4.4.245,x15,network-basic-tests/download-a-file,pass
lkft,linux-stable-rc-linux-4.4.y,v4.4.245,x15,install-android-platform-tools-r2600/install-fastboot,pass
lkft,linux-stable-rc-linux-4.4.y,v4.4.245,x15,install-android-platform-tools-r2600/install-adb,pass
lkft,linux-stable-rc-linux-4.4.y,v4.4.245,x15,linux-log-parser/check-kernel-exception-1965811,pass
lkft,linux-stable-rc-linux-4.4.y,v4.4.245,x15,linux-log-parser/check-kernel-trace-1965811,pass
lkft,linux-stable-rc-linux-4.4.y,v4.4.245,x15,linux-log-parser/check-kernel-oops-1965811,pass
lkft,linux-stable-rc-linux-4.4.y,v4.4.245,x15,linux-log-parser/check-kernel-fault-1965811,pass
lkft,linux-stable-rc-linux-4.4.y,v4.4.245,x15,linux-log-parser/check-kernel-warning-1965811,pass
lkft,linux-stable-rc-linux-4.4.y,v4.4.245,x15,linux-log-parser/check-kernel-bug-1965811,pass
lkft,linux-stable-rc-linux-4.4.y,v4.4.245,x15,linux-log-parser/check-kernel-invalid-opcode-1965811,pass
lkft,linux-stable-rc-linux-4.4.y,v4.4.245,x15,linux-log-parser/check-kernel-panic-1965811,pass
lkft,linux-stable-rc-linux-4.4.y,v4.4.245,x15,install-android-platform-tools-r2600/install-fastboot,pass
lkft,linux-stable-rc-linux-4.4.y,v4.4.245,x15,install-android-platform-tools-r2600/install-adb,pass
lkft,linux-stable-rc-linux-4.4.y,v4.4.245,x15,linux-log-parser/check-kernel-exception-1965809,pass
lkft,linux-stable-rc-linux-4.4.y,v4.4.245,x15,linux-log-parser/check-kernel-trace-1965809,pass
lkft,linux-stable-rc-linux-4.4.y,v4.4.245,x15,linux-log-parser/check-kernel-oops-1965809,pass
lkft,linux-stable-rc-linux-4.4.y,v4.4.245,x15,linux-log-parser/check-kernel-fault-1965809,pass
lkft,linux-stable-rc-linux-4.4.y,v4.4.245,x15,linux-log-parser/check-kernel-warning-1965809,pass
lkft,linux-stable-rc-linux-4.4.y,v4.4.245,x15,linux-log-parser/check-kernel-bug-1965809,pass
lkft,linux-stable-rc-linux-4.4.y,v4.4.245,x15,linux-log-parser/check-kernel-invalid-opcode-1965809,pass
lkft,linux-stable-rc-linux-4.4.y,v4.4.245,x15,linux-log-parser/check-kernel-panic-1965809,pass
lkft,linux-stable-rc-linux-4.4.y,v4.4.245,x15,perf/perf-existence-check,pass
lkft,linux-stable-rc-linux-4.4.y,v4.4.245,x15,perf/perf_record_test,pass
lkft,linux-stable-rc-linux-4.4.y,v4.4.245,x15,perf/perf_report_test,pass
lkft,linux-stable-rc-linux-4.4.y,v4.4.245,x15,perf/perf_stat_test,pass
lkft,linux-stable-rc-linux-4.4.y,v4.4.245,x15,perf/perf_test,pass
lkft,linux-stable-rc-linux-4.4.y,v4.4.245,x15,perf/Test-perf-pmu-format-parsing,pass
lkft,linux-stable-rc-linux-4.4.y,v4.4.245,x15,perf/Test-dso-data-read,pass
lkft,linux-stable-rc-linux-4.4.y,v4.4.245,x15,perf/Test-dso-data-cache,pass
lkft,linux-stable-rc-linux-4.4.y,v4.4.245,x15,perf/Test-dso-data-reopen,pass
lkft,linux-stable-rc-linux-4.4.y,v4.4.245,x15,perf/Check-parsing-of-sched-tracepoints-fields,pass
lkft,linux-stable-rc-linux-4.4.y,v4.4.245,x15,perf/Test-matching-and-linking-multiple-hists,pass
lkft,linux-stable-rc-linux-4.4.y,v4.4.245,x15,perf/Test-number-of-exit-event-of-a-simple-workload,pass
lkft,linux-stable-rc-linux-4.4.y,v4.4.245,x15,perf/Test-software-clock-events-have-valid-period-values,pass
lkft,linux-stable-rc-linux-4.4.y,v4.4.245,x15,perf/Test-sample-parsing,pass
lkft,linux-stable-rc-linux-4.4.y,v4.4.245,x15,perf/Test-using-a-dummy-software-event-to-keep-tracking,pass
lkft,linux-stable-rc-linux-4.4.y,v4.4.245,x15,perf/Test-parsing-with-no-sample_id_all-bit-set,pass
lkft,linux-stable-rc-linux-4.4.y,v4.4.245,x15,perf/Test-filtering-hist-entries,pass
lkft,linux-stable-rc-linux-4.4.y,v4.4.245,x15,perf/Test-mmap-thread-lookup,pass
lkft,linux-stable-rc-linux-4.4.y,v4.4.245,x15,perf/Test-thread-mg-sharing,pass
lkft,linux-stable-rc-linux-4.4.y,v4.4.245,x15,perf/Test-output-sorting-of-hist-entries,pass
lkft,linux-stable-rc-linux-4.4.y,v4.4.245,x15,perf/Test-cumulation-of-child-hist-entries,pass
lkft,linux-stable-rc-linux-4.4.y,v4.4.245,x15,perf/Test-tracking-with-sched_switch,pass
lkft,linux-stable-rc-linux-4.4.y,v4.4.245,x15,perf/Filter-fds-with-revents-mask-in-a-fdarray,pass
lkft,linux-stable-rc-linux-4.4.y,v4.4.245,x15,"perf/Add-fd-to-a-fdarray,-making-it-autogrow",pass
lkft,linux-stable-rc-linux-4.4.y,v4.4.245,x15,perf/Test-kmod_path__parse-function,pass
lkft,linux-stable-rc-linux-4.4.y,v4.4.245,x15,perf/Test-thread-map,pass
lkft,linux-stable-rc-linux-4.4.y,v4.4.245,x15,perf/Test-topology-in-session,pass
lkft,linux-stable-rc-linux-4.4.y,v4.4.245,x15,perf/detect-openat-syscall-event,fail
lkft,linux-stable-rc-linux-4.4.y,v4.4.245,x15,perf/detect-openat-syscall-event-on-all-cpus,fail
lkft,linux-stable-rc-linux-4.4.y,v4.4.245,x15,perf/read-samples-using-the-mmap-interface,fail
lkft,linux-stable-rc-linux-4.4.y,v4.4.245,x15,perf/parse-events-tests,fail
lkft,linux-stable-rc-linux-4.4.y,v4.4.245,x15,perf/Validate-PERF_RECORD_*-events-&-perf_sample-fields,fail
lkft,linux-stable-rc-linux-4.4.y,v4.4.245,x15,"perf/Try-'import-perf'-in-python,-checking-link-problems",fail
lkft,linux-stable-rc-linux-4.4.y,v4.4.245,x15,perf/Test-breakpoint-overflow-signal-handler,fail
lkft,linux-stable-rc-linux-4.4.y,v4.4.245,x15,perf/Test-breakpoint-overflow-sampling,fail
lkft,linux-stable-rc-linux-4.4.y,v4.4.245,x15,perf/Test-object-code-reading,xfail
lkft,linux-stable-rc-linux-4.4.y,v4.4.245,x15,perf/Test-LLVM-searching-and-compiling,fail
lkft,linux-stable-rc-linux-4.4.y,v4.4.245,x15,perf/vmlinux-symtab-matches-kallsyms,skip
lkft,linux-stable-rc-linux-4.4.y,v4.4.245,x15,perf/struct-perf_event_attr-setup,skip
lkft,linux-stable-rc-linux-4.4.y,v4.4.245,x15,perf/Test-BPF-filter,skip
lkft,linux-stable-rc-linux-4.4.y,v4.4.245,x15,install-android-platform-tools-r2600/install-fastboot,pass
lkft,linux-stable-rc-linux-4.4.y,v4.4.245,x15,install-android-platform-tools-r2600/install-adb,pass
lkft,linux-stable-rc-linux-4.4.y,v4.4.245,x15,linux-log-parser/check-kernel-exception-1965812,pass
lkft,linux-stable-rc-linux-4.4.y,v4.4.245,x15,linux-log-parser/check-kernel-trace-1965812,pass
lkft,linux-stable-rc-linux-4.4.y,v4.4.245,x15,linux-log-parser/check-kernel-oops-1965812,pass
lkft,linux-stable-rc-linux-4.4.y,v4.4.245,x15,linux-log-parser/check-kernel-fault-1965812,pass
lkft,linux-stable-rc-linux-4.4.y,v4.4.245,x15,linux-log-parser/check-kernel-warning-1965812,pass
lkft,linux-stable-rc-linux-4.4.y,v4.4.245,x15,linux-log-parser/check-kernel-bug-1965812,pass
lkft,linux-stable-rc-linux-4.4.y,v4.4.245,x15,linux-log-parser/check-kernel-invalid-opcode-1965812,pass
lkft,linux-stable-rc-linux-4.4.y,v4.4.245,x15,linux-log-parser/check-kernel-panic-1965812,pass
lkft,linux-stable-rc-linux-4.4.y,v4.4.245,x86,linux-log-parser/check-kernel-exception-1965900,pass
lkft,linux-stable-rc-linux-4.4.y,v4.4.245,x86,linux-log-parser/check-kernel-trace-1965900,pass
lkft,linux-stable-rc-linux-4.4.y,v4.4.245,x86,linux-log-parser/check-kernel-oops-1965900,pass
lkft,linux-stable-rc-linux-4.4.y,v4.4.245,x86,linux-log-parser/check-kernel-fault-1965900,pass
lkft,linux-stable-rc-linux-4.4.y,v4.4.245,x86,linux-log-parser/check-kernel-warning-1965900,pass
lkft,linux-stable-rc-linux-4.4.y,v4.4.245,x86,linux-log-parser/check-kernel-bug-1965900,pass
lkft,linux-stable-rc-linux-4.4.y,v4.4.245,x86,linux-log-parser/check-kernel-invalid-opcode-1965900,pass
lkft,linux-stable-rc-linux-4.4.y,v4.4.245,x86,linux-log-parser/check-kernel-panic-1965900,pass
lkft,linux-stable-rc-linux-4.4.y,v4.4.245,x86,linux-log-parser/check-kernel-exception-1965897,pass
lkft,linux-stable-rc-linux-4.4.y,v4.4.245,x86,linux-log-parser/check-kernel-trace-1965897,pass
lkft,linux-stable-rc-linux-4.4.y,v4.4.245,x86,linux-log-parser/check-kernel-oops-1965897,pass
lkft,linux-stable-rc-linux-4.4.y,v4.4.245,x86,linux-log-parser/check-kernel-fault-1965897,pass
lkft,linux-stable-rc-linux-4.4.y,v4.4.245,x86,linux-log-parser/check-kernel-warning-1965897,pass
lkft,linux-stable-rc-linux-4.4.y,v4.4.245,x86,linux-log-parser/check-kernel-bug-1965897,pass
lkft,linux-stable-rc-linux-4.4.y,v4.4.245,x86,linux-log-parser/check-kernel-invalid-opcode-1965897,pass
lkft,linux-stable-rc-linux-4.4.y,v4.4.245,x86,linux-log-parser/check-kernel-panic-1965897,pass
lkft,linux-stable-rc-linux-4.4.y,v4.4.245,i386,network-basic-tests/print-network-statistics,pass
lkft,linux-stable-rc-linux-4.4.y,v4.4.245,i386,network-basic-tests/list-all-network-interfaces,pass
lkft,linux-stable-rc-linux-4.4.y,v4.4.245,i386,network-basic-tests/print-routing-tables,pass
lkft,linux-stable-rc-linux-4.4.y,v4.4.245,i386,network-basic-tests/ip-link-loopback-up,pass
lkft,linux-stable-rc-linux-4.4.y,v4.4.245,i386,network-basic-tests/route-dump-after-ip-link-loopback-up,pass
lkft,linux-stable-rc-linux-4.4.y,v4.4.245,i386,network-basic-tests/ip-link-interface-up,pass
lkft,linux-stable-rc-linux-4.4.y,v4.4.245,i386,network-basic-tests/ip-link-interface-down,skip
lkft,linux-stable-rc-linux-4.4.y,v4.4.245,i386,network-basic-tests/Dynamic-Host-Configuration-Protocol-Client-dhclient-v,pass
lkft,linux-stable-rc-linux-4.4.y,v4.4.245,i386,network-basic-tests/print-routing-tables-after-dhclient-request,pass
lkft,linux-stable-rc-linux-4.4.y,v4.4.245,i386,network-basic-tests/ping-gateway,pass
lkft,linux-stable-rc-linux-4.4.y,v4.4.245,i386,network-basic-tests/download-a-file,pass
lkft,linux-stable-rc-linux-4.4.y,v4.4.245,i386,linux-log-parser/check-kernel-exception-1966295,pass
lkft,linux-stable-rc-linux-4.4.y,v4.4.245,i386,linux-log-parser/check-kernel-trace-1966295,pass
lkft,linux-stable-rc-linux-4.4.y,v4.4.245,i386,linux-log-parser/check-kernel-oops-1966295,pass
lkft,linux-stable-rc-linux-4.4.y,v4.4.245,i386,linux-log-parser/check-kernel-fault-1966295,pass
lkft,linux-stable-rc-linux-4.4.y,v4.4.245,i386,linux-log-parser/check-kernel-warning-1966295,pass
lkft,linux-stable-rc-linux-4.4.y,v4.4.245,i386,linux-log-parser/check-kernel-bug-1966295,pass
lkft,linux-stable-rc-linux-4.4.y,v4.4.245,i386,linux-log-parser/check-kernel-invalid-opcode-1966295,pass
lkft,linux-stable-rc-linux-4.4.y,v4.4.245,i386,linux-log-parser/check-kernel-panic-1966295,pass
lkft,linux-stable-rc-linux-4.4.y,v4.4.245,i386,linux-log-parser/check-kernel-exception-1966294,pass
lkft,linux-stable-rc-linux-4.4.y,v4.4.245,i386,linux-log-parser/check-kernel-trace-1966294,pass
lkft,linux-stable-rc-linux-4.4.y,v4.4.245,i386,linux-log-parser/check-kernel-oops-1966294,pass
lkft,linux-stable-rc-linux-4.4.y,v4.4.245,i386,linux-log-parser/check-kernel-fault-1966294,pass
lkft,linux-stable-rc-linux-4.4.y,v4.4.245,i386,linux-log-parser/check-kernel-warning-1966294,pass
lkft,linux-stable-rc-linux-4.4.y,v4.4.245,i386,linux-log-parser/check-kernel-bug-1966294,pass
lkft,linux-stable-rc-linux-4.4.y,v4.4.245,i386,linux-log-parser/check-kernel-invalid-opcode-1966294,pass
lkft,linux-stable-rc-linux-4.4.y,v4.4.245,i386,linux-log-parser/check-kernel-panic-1966294,pass
lkft,linux-stable-rc-linux-4.4.y,v4.4.245,x86,network-basic-tests/print-network-statistics,pass
lkft,linux-stable-rc-linux-4.4.y,v4.4.245,x86,network-basic-tests/list-all-network-interfaces,pass
lkft,linux-stable-rc-linux-4.4.y,v4.4.245,x86,network-basic-tests/print-routing-tables,pass
lkft,linux-stable-rc-linux-4.4.y,v4.4.245,x86,network-basic-tests/ip-link-loopback-up,pass
lkft,linux-stable-rc-linux-4.4.y,v4.4.245,x86,network-basic-tests/route-dump-after-ip-link-loopback-up,pass
lkft,linux-stable-rc-linux-4.4.y,v4.4.245,x86,network-basic-tests/ip-link-interface-up,pass
lkft,linux-stable-rc-linux-4.4.y,v4.4.245,x86,network-basic-tests/ip-link-interface-down,skip
lkft,linux-stable-rc-linux-4.4.y,v4.4.245,x86,network-basic-tests/Dynamic-Host-Configuration-Protocol-Client-dhclient-v,pass
lkft,linux-stable-rc-linux-4.4.y,v4.4.245,x86,network-basic-tests/print-routing-tables-after-dhclient-request,pass
lkft,linux-stable-rc-linux-4.4.y,v4.4.245,x86,network-basic-tests/ping-gateway,pass
lkft,linux-stable-rc-linux-4.4.y,v4.4.245,x86,network-basic-tests/download-a-file,pass
lkft,linux-stable-rc-linux-4.4.y,v4.4.245,x86,linux-log-parser/check-kernel-exception-1965898,pass
lkft,linux-stable-rc-linux-4.4.y,v4.4.245,x86,linux-log-parser/check-kernel-trace-1965898,pass
lkft,linux-stable-rc-linux-4.4.y,v4.4.245,x86,linux-log-parser/check-kernel-oops-1965898,pass
lkft,linux-stable-rc-linux-4.4.y,v4.4.245,x86,linux-log-parser/check-kernel-fault-1965898,pass
lkft,linux-stable-rc-linux-4.4.y,v4.4.245,x86,linux-log-parser/check-kernel-warning-1965898,pass
lkft,linux-stable-rc-linux-4.4.y,v4.4.245,x86,linux-log-parser/check-kernel-bug-1965898,pass
lkft,linux-stable-rc-linux-4.4.y,v4.4.245,x86,linux-log-parser/check-kernel-invalid-opcode-1965898,pass
lkft,linux-stable-rc-linux-4.4.y,v4.4.245,x86,linux-log-parser/check-kernel-panic-1965898,pass
lkft,linux-stable-rc-linux-4.4.y,v4.4.245,x86,perf/perf-existence-check,pass
lkft,linux-stable-rc-linux-4.4.y,v4.4.245,x86,perf/perf_record_test,pass
lkft,linux-stable-rc-linux-4.4.y,v4.4.245,x86,perf/perf_report_test,pass
lkft,linux-stable-rc-linux-4.4.y,v4.4.245,x86,perf/perf_stat_test,pass
lkft,linux-stable-rc-linux-4.4.y,v4.4.245,x86,perf/perf_test,pass
lkft,linux-stable-rc-linux-4.4.y,v4.4.245,x86,perf/Test-perf-pmu-format-parsing,pass
lkft,linux-stable-rc-linux-4.4.y,v4.4.245,x86,perf/Test-dso-data-read,pass
lkft,linux-stable-rc-linux-4.4.y,v4.4.245,x86,perf/Test-dso-data-cache,pass
lkft,linux-stable-rc-linux-4.4.y,v4.4.245,x86,perf/Test-dso-data-reopen,pass
lkft,linux-stable-rc-linux-4.4.y,v4.4.245,x86,perf/Check-parsing-of-sched-tracepoints-fields,pass
lkft,linux-stable-rc-linux-4.4.y,v4.4.245,x86,perf/Test-matching-and-linking-multiple-hists,pass
lkft,linux-stable-rc-linux-4.4.y,v4.4.245,x86,perf/Test-breakpoint-overflow-signal-handler,pass
lkft,linux-stable-rc-linux-4.4.y,v4.4.245,x86,perf/Test-breakpoint-overflow-sampling,pass
lkft,linux-stable-rc-linux-4.4.y,v4.4.245,x86,perf/Test-number-of-exit-event-of-a-simple-workload,pass
lkft,linux-stable-rc-linux-4.4.y,v4.4.245,x86,perf/Test-software-clock-events-have-valid-period-values,pass
lkft,linux-stable-rc-linux-4.4.y,v4.4.245,x86,perf/Test-object-code-reading,pass
lkft,linux-stable-rc-linux-4.4.y,v4.4.245,x86,perf/Test-sample-parsing,pass
lkft,linux-stable-rc-linux-4.4.y,v4.4.245,x86,perf/Test-using-a-dummy-software-event-to-keep-tracking,pass
lkft,linux-stable-rc-linux-4.4.y,v4.4.245,x86,perf/Test-parsing-with-no-sample_id_all-bit-set,pass
lkft,linux-stable-rc-linux-4.4.y,v4.4.245,x86,perf/Test-filtering-hist-entries,pass
lkft,linux-stable-rc-linux-4.4.y,v4.4.245,x86,perf/Test-mmap-thread-lookup,pass
lkft,linux-stable-rc-linux-4.4.y,v4.4.245,x86,perf/Test-thread-mg-sharing,pass
lkft,linux-stable-rc-linux-4.4.y,v4.4.245,x86,perf/Test-output-sorting-of-hist-entries,pass
lkft,linux-stable-rc-linux-4.4.y,v4.4.245,x86,perf/Test-cumulation-of-child-hist-entries,pass
lkft,linux-stable-rc-linux-4.4.y,v4.4.245,x86,perf/Test-tracking-with-sched_switch,pass
lkft,linux-stable-rc-linux-4.4.y,v4.4.245,x86,perf/Filter-fds-with-revents-mask-in-a-fdarray,pass
lkft,linux-stable-rc-linux-4.4.y,v4.4.245,x86,"perf/Add-fd-to-a-fdarray,-making-it-autogrow",pass
lkft,linux-stable-rc-linux-4.4.y,v4.4.245,x86,perf/Test-kmod_path__parse-function,pass
lkft,linux-stable-rc-linux-4.4.y,v4.4.245,x86,perf/Test-thread-map,pass
lkft,linux-stable-rc-linux-4.4.y,v4.4.245,x86,perf/Test-topology-in-session,pass
lkft,linux-stable-rc-linux-4.4.y,v4.4.245,x86,perf/x86-rdpmc-test,pass
lkft,linux-stable-rc-linux-4.4.y,v4.4.245,x86,perf/Test-converting-perf-time-to-TSC,pass
lkft,linux-stable-rc-linux-4.4.y,v4.4.245,x86,perf/detect-openat-syscall-event,fail
lkft,linux-stable-rc-linux-4.4.y,v4.4.245,x86,perf/detect-openat-syscall-event-on-all-cpus,fail
lkft,linux-stable-rc-linux-4.4.y,v4.4.245,x86,perf/read-samples-using-the-mmap-interface,fail
lkft,linux-stable-rc-linux-4.4.y,v4.4.245,x86,perf/parse-events-tests,fail
lkft,linux-stable-rc-linux-4.4.y,v4.4.245,x86,perf/Validate-PERF_RECORD_*-events-&-perf_sample-fields,fail
lkft,linux-stable-rc-linux-4.4.y,v4.4.245,x86,"perf/Try-'import-perf'-in-python,-checking-link-problems",fail
lkft,linux-stable-rc-linux-4.4.y,v4.4.245,x86,perf/Test-LLVM-searching-and-compiling,fail
lkft,linux-stable-rc-linux-4.4.y,v4.4.245,x86,perf/Test-dwarf-unwind,fail
lkft,linux-stable-rc-linux-4.4.y,v4.4.245,x86,perf/Test-x86-instruction-decoder---new-instructions,fail
lkft,linux-stable-rc-linux-4.4.y,v4.4.245,x86,perf/vmlinux-symtab-matches-kallsyms,skip
lkft,linux-stable-rc-linux-4.4.y,v4.4.245,x86,perf/struct-perf_event_attr-setup,skip
lkft,linux-stable-rc-linux-4.4.y,v4.4.245,x86,perf/Test-BPF-filter,skip
lkft,linux-stable-rc-linux-4.4.y,v4.4.245,x86,perf/Test-intel-cqm-nmi-context-read,skip
lkft,linux-stable-rc-linux-4.4.y,v4.4.245,x86,linux-log-parser/check-kernel-exception-1965899,pass
lkft,linux-stable-rc-linux-4.4.y,v4.4.245,x86,linux-log-parser/check-kernel-trace-1965899,pass
lkft,linux-stable-rc-linux-4.4.y,v4.4.245,x86,linux-log-parser/check-kernel-oops-1965899,pass
lkft,linux-stable-rc-linux-4.4.y,v4.4.245,x86,linux-log-parser/check-kernel-fault-1965899,pass
lkft,linux-stable-rc-linux-4.4.y,v4.4.245,x86,linux-log-parser/check-kernel-warning-1965899,pass
lkft,linux-stable-rc-linux-4.4.y,v4.4.245,x86,linux-log-parser/check-kernel-bug-1965899,pass
lkft,linux-stable-rc-linux-4.4.y,v4.4.245,x86,linux-log-parser/check-kernel-invalid-opcode-1965899,pass
lkft,linux-stable-rc-linux-4.4.y,v4.4.245,x86,linux-log-parser/check-kernel-panic-1965899,pass
lkft,linux-stable-rc-linux-4.4.y,v4.4.245,i386,perf/perf-existence-check,pass
lkft,linux-stable-rc-linux-4.4.y,v4.4.245,i386,perf/perf_record_test,pass
lkft,linux-stable-rc-linux-4.4.y,v4.4.245,i386,perf/perf_report_test,pass
lkft,linux-stable-rc-linux-4.4.y,v4.4.245,i386,perf/perf_stat_test,pass
lkft,linux-stable-rc-linux-4.4.y,v4.4.245,i386,perf/perf_test,pass
lkft,linux-stable-rc-linux-4.4.y,v4.4.245,i386,perf/Test-perf-pmu-format-parsing,pass
lkft,linux-stable-rc-linux-4.4.y,v4.4.245,i386,perf/Test-dso-data-read,pass
lkft,linux-stable-rc-linux-4.4.y,v4.4.245,i386,perf/Test-dso-data-cache,pass
lkft,linux-stable-rc-linux-4.4.y,v4.4.245,i386,perf/Test-dso-data-reopen,pass
lkft,linux-stable-rc-linux-4.4.y,v4.4.245,i386,perf/Check-parsing-of-sched-tracepoints-fields,pass
lkft,linux-stable-rc-linux-4.4.y,v4.4.245,i386,perf/Test-matching-and-linking-multiple-hists,pass
lkft,linux-stable-rc-linux-4.4.y,v4.4.245,i386,perf/Test-breakpoint-overflow-signal-handler,pass
lkft,linux-stable-rc-linux-4.4.y,v4.4.245,i386,perf/Test-breakpoint-overflow-sampling,pass
lkft,linux-stable-rc-linux-4.4.y,v4.4.245,i386,perf/Test-number-of-exit-event-of-a-simple-workload,pass
lkft,linux-stable-rc-linux-4.4.y,v4.4.245,i386,perf/Test-software-clock-events-have-valid-period-values,pass
lkft,linux-stable-rc-linux-4.4.y,v4.4.245,i386,perf/Test-object-code-reading,pass
lkft,linux-stable-rc-linux-4.4.y,v4.4.245,i386,perf/Test-sample-parsing,pass
lkft,linux-stable-rc-linux-4.4.y,v4.4.245,i386,perf/Test-using-a-dummy-software-event-to-keep-tracking,pass
lkft,linux-stable-rc-linux-4.4.y,v4.4.245,i386,perf/Test-parsing-with-no-sample_id_all-bit-set,pass
lkft,linux-stable-rc-linux-4.4.y,v4.4.245,i386,perf/Test-filtering-hist-entries,pass
lkft,linux-stable-rc-linux-4.4.y,v4.4.245,i386,perf/Test-mmap-thread-lookup,pass
lkft,linux-stable-rc-linux-4.4.y,v4.4.245,i386,perf/Test-thread-mg-sharing,pass
lkft,linux-stable-rc-linux-4.4.y,v4.4.245,i386,perf/Test-output-sorting-of-hist-entries,pass
lkft,linux-stable-rc-linux-4.4.y,v4.4.245,i386,perf/Test-cumulation-of-child-hist-entries,pass
lkft,linux-stable-rc-linux-4.4.y,v4.4.245,i386,perf/Test-tracking-with-sched_switch,pass
lkft,linux-stable-rc-linux-4.4.y,v4.4.245,i386,perf/Filter-fds-with-revents-mask-in-a-fdarray,pass
lkft,linux-stable-rc-linux-4.4.y,v4.4.245,i386,"perf/Add-fd-to-a-fdarray,-making-it-autogrow",pass
lkft,linux-stable-rc-linux-4.4.y,v4.4.245,i386,perf/Test-kmod_path__parse-function,pass
lkft,linux-stable-rc-linux-4.4.y,v4.4.245,i386,perf/Test-thread-map,pass
lkft,linux-stable-rc-linux-4.4.y,v4.4.245,i386,perf/Test-topology-in-session,pass
lkft,linux-stable-rc-linux-4.4.y,v4.4.245,i386,perf/x86-rdpmc-test,pass
lkft,linux-stable-rc-linux-4.4.y,v4.4.245,i386,perf/Test-converting-perf-time-to-TSC,pass
lkft,linux-stable-rc-linux-4.4.y,v4.4.245,i386,perf/detect-openat-syscall-event,fail
lkft,linux-stable-rc-linux-4.4.y,v4.4.245,i386,perf/detect-openat-syscall-event-on-all-cpus,fail
lkft,linux-stable-rc-linux-4.4.y,v4.4.245,i386,perf/read-samples-using-the-mmap-interface,fail
lkft,linux-stable-rc-linux-4.4.y,v4.4.245,i386,perf/parse-events-tests,fail
lkft,linux-stable-rc-linux-4.4.y,v4.4.245,i386,perf/Validate-PERF_RECORD_*-events-&-perf_sample-fields,fail
lkft,linux-stable-rc-linux-4.4.y,v4.4.245,i386,"perf/Try-'import-perf'-in-python,-checking-link-problems",fail
lkft,linux-stable-rc-linux-4.4.y,v4.4.245,i386,perf/Test-LLVM-searching-and-compiling,fail
lkft,linux-stable-rc-linux-4.4.y,v4.4.245,i386,perf/Test-dwarf-unwind,fail
lkft,linux-stable-rc-linux-4.4.y,v4.4.245,i386,perf/Test-x86-instruction-decoder---new-instructions,fail
lkft,linux-stable-rc-linux-4.4.y,v4.4.245,i386,perf/vmlinux-symtab-matches-kallsyms,skip
lkft,linux-stable-rc-linux-4.4.y,v4.4.245,i386,perf/struct-perf_event_attr-setup,skip
lkft,linux-stable-rc-linux-4.4.y,v4.4.245,i386,perf/Test-BPF-filter,skip
lkft,linux-stable-rc-linux-4.4.y,v4.4.245,i386,perf/Test-intel-cqm-nmi-context-read,skip
lkft,linux-stable-rc-linux-4.4.y,v4.4.245,i386,linux-log-parser/check-kernel-exception-1966296,pass
lkft,linux-stable-rc-linux-4.4.y,v4.4.245,i386,linux-log-parser/check-kernel-trace-1966296,pass
lkft,linux-stable-rc-linux-4.4.y,v4.4.245,i386,linux-log-parser/check-kernel-oops-1966296,pass
lkft,linux-stable-rc-linux-4.4.y,v4.4.245,i386,linux-log-parser/check-kernel-fault-1966296,pass
lkft,linux-stable-rc-linux-4.4.y,v4.4.245,i386,linux-log-parser/check-kernel-warning-1966296,pass
lkft,linux-stable-rc-linux-4.4.y,v4.4.245,i386,linux-log-parser/check-kernel-bug-1966296,pass
lkft,linux-stable-rc-linux-4.4.y,v4.4.245,i386,linux-log-parser/check-kernel-invalid-opcode-1966296,pass
lkft,linux-stable-rc-linux-4.4.y,v4.4.245,i386,linux-log-parser/check-kernel-panic-1966296,pass
lkft,linux-stable-rc-linux-4.4.y,v4.4.245,x86,linux-log-parser/check-kernel-exception-1965894,pass
lkft,linux-stable-rc-linux-4.4.y,v4.4.245,x86,linux-log-parser/check-kernel-trace-1965894,pass
lkft,linux-stable-rc-linux-4.4.y,v4.4.245,x86,linux-log-parser/check-kernel-oops-1965894,pass
lkft,linux-stable-rc-linux-4.4.y,v4.4.245,x86,linux-log-parser/check-kernel-fault-1965894,pass
lkft,linux-stable-rc-linux-4.4.y,v4.4.245,x86,linux-log-parser/check-kernel-warning-1965894,pass
lkft,linux-stable-rc-linux-4.4.y,v4.4.245,x86,linux-log-parser/check-kernel-bug-1965894,pass
lkft,linux-stable-rc-linux-4.4.y,v4.4.245,x86,linux-log-parser/check-kernel-invalid-opcode-1965894,pass
lkft,linux-stable-rc-linux-4.4.y,v4.4.245,x86,linux-log-parser/check-kernel-panic-1965894,pass
lkft,linux-stable-rc-linux-4.4.y,v4.4.245,x86,linux-log-parser/check-kernel-exception-1965891,pass
lkft,linux-stable-rc-linux-4.4.y,v4.4.245,x86,linux-log-parser/check-kernel-trace-1965891,pass
lkft,linux-stable-rc-linux-4.4.y,v4.4.245,x86,linux-log-parser/check-kernel-oops-1965891,pass
lkft,linux-stable-rc-linux-4.4.y,v4.4.245,x86,linux-log-parser/check-kernel-fault-1965891,pass
lkft,linux-stable-rc-linux-4.4.y,v4.4.245,x86,linux-log-parser/check-kernel-warning-1965891,pass
lkft,linux-stable-rc-linux-4.4.y,v4.4.245,x86,linux-log-parser/check-kernel-bug-1965891,pass
lkft,linux-stable-rc-linux-4.4.y,v4.4.245,x86,linux-log-parser/check-kernel-invalid-opcode-1965891,pass
lkft,linux-stable-rc-linux-4.4.y,v4.4.245,x86,linux-log-parser/check-kernel-panic-1965891,pass
lkft,linux-stable-rc-linux-4.4.y,v4.4.245,x86,linux-log-parser/check-kernel-exception-1965896,pass
lkft,linux-stable-rc-linux-4.4.y,v4.4.245,x86,linux-log-parser/check-kernel-trace-1965896,pass
lkft,linux-stable-rc-linux-4.4.y,v4.4.245,x86,linux-log-parser/check-kernel-oops-1965896,pass
lkft,linux-stable-rc-linux-4.4.y,v4.4.245,x86,linux-log-parser/check-kernel-fault-1965896,pass
lkft,linux-stable-rc-linux-4.4.y,v4.4.245,x86,linux-log-parser/check-kernel-warning-1965896,pass
lkft,linux-stable-rc-linux-4.4.y,v4.4.245,x86,linux-log-parser/check-kernel-bug-1965896,pass
lkft,linux-stable-rc-linux-4.4.y,v4.4.245,x86,linux-log-parser/check-kernel-invalid-opcode-1965896,pass
lkft,linux-stable-rc-linux-4.4.y,v4.4.245,x86,linux-log-parser/check-kernel-panic-1965896,pass
lkft,linux-stable-rc-linux-4.4.y,v4.4.245,i386,linux-log-parser/check-kernel-exception-1966293,pass
lkft,linux-stable-rc-linux-4.4.y,v4.4.245,i386,linux-log-parser/check-kernel-trace-1966293,pass
lkft,linux-stable-rc-linux-4.4.y,v4.4.245,i386,linux-log-parser/check-kernel-oops-1966293,pass
lkft,linux-stable-rc-linux-4.4.y,v4.4.245,i386,linux-log-parser/check-kernel-fault-1966293,pass
lkft,linux-stable-rc-linux-4.4.y,v4.4.245,i386,linux-log-parser/check-kernel-warning-1966293,pass
lkft,linux-stable-rc-linux-4.4.y,v4.4.245,i386,linux-log-parser/check-kernel-bug-1966293,pass
lkft,linux-stable-rc-linux-4.4.y,v4.4.245,i386,linux-log-parser/check-kernel-invalid-opcode-1966293,pass
lkft,linux-stable-rc-linux-4.4.y,v4.4.245,i386,linux-log-parser/check-kernel-panic-1966293,pass
lkft,linux-stable-rc-linux-4.4.y,v4.4.245,juno-r2,linux-log-parser/check-kernel-exception-1965814,pass
lkft,linux-stable-rc-linux-4.4.y,v4.4.245,juno-r2,linux-log-parser/check-kernel-trace-1965814,pass
lkft,linux-stable-rc-linux-4.4.y,v4.4.245,juno-r2,linux-log-parser/check-kernel-oops-1965814,pass
lkft,linux-stable-rc-linux-4.4.y,v4.4.245,juno-r2,linux-log-parser/check-kernel-fault-1965814,pass
lkft,linux-stable-rc-linux-4.4.y,v4.4.245,juno-r2,linux-log-parser/check-kernel-warning-1965814,pass
lkft,linux-stable-rc-linux-4.4.y,v4.4.245,juno-r2,linux-log-parser/check-kernel-bug-1965814,pass
lkft,linux-stable-rc-linux-4.4.y,v4.4.245,juno-r2,linux-log-parser/check-kernel-invalid-opcode-1965814,pass
lkft,linux-stable-rc-linux-4.4.y,v4.4.245,juno-r2,linux-log-parser/check-kernel-panic-1965814,pass
lkft,linux-stable-rc-linux-4.4.y,v4.4.245,juno-r2,perf/perf-existence-check,pass
lkft,linux-stable-rc-linux-4.4.y,v4.4.245,juno-r2,perf/perf_record_test,pass
lkft,linux-stable-rc-linux-4.4.y,v4.4.245,juno-r2,perf/perf_report_test,pass
lkft,linux-stable-rc-linux-4.4.y,v4.4.245,juno-r2,perf/perf_stat_test,skip
lkft,linux-stable-rc-linux-4.4.y,v4.4.245,juno-r2,perf/perf_test,pass
lkft,linux-stable-rc-linux-4.4.y,v4.4.245,juno-r2,perf/Test-perf-pmu-format-parsing,pass
lkft,linux-stable-rc-linux-4.4.y,v4.4.245,juno-r2,perf/Test-dso-data-read,pass
lkft,linux-stable-rc-linux-4.4.y,v4.4.245,juno-r2,perf/Test-dso-data-cache,pass
lkft,linux-stable-rc-linux-4.4.y,v4.4.245,juno-r2,perf/Test-dso-data-reopen,pass
lkft,linux-stable-rc-linux-4.4.y,v4.4.245,juno-r2,perf/Check-parsing-of-sched-tracepoints-fields,pass
lkft,linux-stable-rc-linux-4.4.y,v4.4.245,juno-r2,perf/Test-matching-and-linking-multiple-hists,pass
lkft,linux-stable-rc-linux-4.4.y,v4.4.245,juno-r2,perf/Test-number-of-exit-event-of-a-simple-workload,pass
lkft,linux-stable-rc-linux-4.4.y,v4.4.245,juno-r2,perf/Test-software-clock-events-have-valid-period-values,pass
lkft,linux-stable-rc-linux-4.4.y,v4.4.245,juno-r2,perf/Test-sample-parsing,pass
lkft,linux-stable-rc-linux-4.4.y,v4.4.245,juno-r2,perf/Test-using-a-dummy-software-event-to-keep-tracking,pass
lkft,linux-stable-rc-linux-4.4.y,v4.4.245,juno-r2,perf/Test-parsing-with-no-sample_id_all-bit-set,pass
lkft,linux-stable-rc-linux-4.4.y,v4.4.245,juno-r2,perf/Test-filtering-hist-entries,pass
lkft,linux-stable-rc-linux-4.4.y,v4.4.245,juno-r2,perf/Test-mmap-thread-lookup,pass
lkft,linux-stable-rc-linux-4.4.y,v4.4.245,juno-r2,perf/Test-thread-mg-sharing,pass
lkft,linux-stable-rc-linux-4.4.y,v4.4.245,juno-r2,perf/Test-output-sorting-of-hist-entries,pass
lkft,linux-stable-rc-linux-4.4.y,v4.4.245,juno-r2,perf/Test-cumulation-of-child-hist-entries,pass
lkft,linux-stable-rc-linux-4.4.y,v4.4.245,juno-r2,perf/Test-tracking-with-sched_switch,pass
lkft,linux-stable-rc-linux-4.4.y,v4.4.245,juno-r2,perf/Filter-fds-with-revents-mask-in-a-fdarray,pass
lkft,linux-stable-rc-linux-4.4.y,v4.4.245,juno-r2,"perf/Add-fd-to-a-fdarray,-making-it-autogrow",pass
lkft,linux-stable-rc-linux-4.4.y,v4.4.245,juno-r2,perf/Test-kmod_path__parse-function,pass
lkft,linux-stable-rc-linux-4.4.y,v4.4.245,juno-r2,perf/Test-thread-map,pass
lkft,linux-stable-rc-linux-4.4.y,v4.4.245,juno-r2,perf/Test-topology-in-session,pass
lkft,linux-stable-rc-linux-4.4.y,v4.4.245,juno-r2,perf/detect-openat-syscall-event,fail
lkft,linux-stable-rc-linux-4.4.y,v4.4.245,juno-r2,perf/detect-openat-syscall-event-on-all-cpus,fail
lkft,linux-stable-rc-linux-4.4.y,v4.4.245,juno-r2,perf/read-samples-using-the-mmap-interface,fail
lkft,linux-stable-rc-linux-4.4.y,v4.4.245,juno-r2,perf/parse-events-tests,fail
lkft,linux-stable-rc-linux-4.4.y,v4.4.245,juno-r2,perf/Validate-PERF_RECORD_*-events-&-perf_sample-fields,fail
lkft,linux-stable-rc-linux-4.4.y,v4.4.245,juno-r2,"perf/Try-'import-perf'-in-python,-checking-link-problems",fail
lkft,linux-stable-rc-linux-4.4.y,v4.4.245,juno-r2,perf/Test-breakpoint-overflow-signal-handler,fail
lkft,linux-stable-rc-linux-4.4.y,v4.4.245,juno-r2,perf/Test-breakpoint-overflow-sampling,fail
lkft,linux-stable-rc-linux-4.4.y,v4.4.245,juno-r2,perf/Test-object-code-reading,xfail
lkft,linux-stable-rc-linux-4.4.y,v4.4.245,juno-r2,perf/Test-LLVM-searching-and-compiling,fail
lkft,linux-stable-rc-linux-4.4.y,v4.4.245,juno-r2,perf/vmlinux-symtab-matches-kallsyms,skip
lkft,linux-stable-rc-linux-4.4.y,v4.4.245,juno-r2,perf/struct-perf_event_attr-setup,skip
lkft,linux-stable-rc-linux-4.4.y,v4.4.245,juno-r2,perf/Test-BPF-filter,skip
lkft,linux-stable-rc-linux-4.4.y,v4.4.245,juno-r2,linux-log-parser/check-kernel-exception-1965816,pass
lkft,linux-stable-rc-linux-4.4.y,v4.4.245,juno-r2,linux-log-parser/check-kernel-trace-1965816,pass
lkft,linux-stable-rc-linux-4.4.y,v4.4.245,juno-r2,linux-log-parser/check-kernel-oops-1965816,pass
lkft,linux-stable-rc-linux-4.4.y,v4.4.245,juno-r2,linux-log-parser/check-kernel-fault-1965816,pass
lkft,linux-stable-rc-linux-4.4.y,v4.4.245,juno-r2,linux-log-parser/check-kernel-warning-1965816,pass
lkft,linux-stable-rc-linux-4.4.y,v4.4.245,juno-r2,linux-log-parser/check-kernel-bug-1965816,pass
lkft,linux-stable-rc-linux-4.4.y,v4.4.245,juno-r2,linux-log-parser/check-kernel-invalid-opcode-1965816,pass
lkft,linux-stable-rc-linux-4.4.y,v4.4.245,juno-r2,linux-log-parser/check-kernel-panic-1965816,pass
lkft,linux-stable-rc-linux-4.4.y,v4.4.245,juno-r2,network-basic-tests/print-network-statistics,pass
lkft,linux-stable-rc-linux-4.4.y,v4.4.245,juno-r2,network-basic-tests/list-all-network-interfaces,pass
lkft,linux-stable-rc-linux-4.4.y,v4.4.245,juno-r2,network-basic-tests/print-routing-tables,pass
lkft,linux-stable-rc-linux-4.4.y,v4.4.245,juno-r2,network-basic-tests/ip-link-loopback-up,pass
lkft,linux-stable-rc-linux-4.4.y,v4.4.245,juno-r2,network-basic-tests/route-dump-after-ip-link-loopback-up,pass
lkft,linux-stable-rc-linux-4.4.y,v4.4.245,juno-r2,network-basic-tests/ip-link-interface-up,pass
lkft,linux-stable-rc-linux-4.4.y,v4.4.245,juno-r2,network-basic-tests/ip-link-interface-down,skip
lkft,linux-stable-rc-linux-4.4.y,v4.4.245,juno-r2,network-basic-tests/Dynamic-Host-Configuration-Protocol-Client-dhclient-v,pass
lkft,linux-stable-rc-linux-4.4.y,v4.4.245,juno-r2,network-basic-tests/print-routing-tables-after-dhclient-request,pass
lkft,linux-stable-rc-linux-4.4.y,v4.4.245,juno-r2,network-basic-tests/ping-gateway,pass
lkft,linux-stable-rc-linux-4.4.y,v4.4.245,juno-r2,network-basic-tests/download-a-file,pass
lkft,linux-stable-rc-linux-4.4.y,v4.4.245,juno-r2,linux-log-parser/check-kernel-exception-1965815,pass
lkft,linux-stable-rc-linux-4.4.y,v4.4.245,juno-r2,linux-log-parser/check-kernel-trace-1965815,pass
lkft,linux-stable-rc-linux-4.4.y,v4.4.245,juno-r2,linux-log-parser/check-kernel-oops-1965815,pass
lkft,linux-stable-rc-linux-4.4.y,v4.4.245,juno-r2,linux-log-parser/check-kernel-fault-1965815,pass
lkft,linux-stable-rc-linux-4.4.y,v4.4.245,juno-r2,linux-log-parser/check-kernel-warning-1965815,pass
lkft,linux-stable-rc-linux-4.4.y,v4.4.245,juno-r2,linux-log-parser/check-kernel-bug-1965815,pass
lkft,linux-stable-rc-linux-4.4.y,v4.4.245,juno-r2,linux-log-parser/check-kernel-invalid-opcode-1965815,pass
lkft,linux-stable-rc-linux-4.4.y,v4.4.245,juno-r2,linux-log-parser/check-kernel-panic-1965815,pass
lkft,linux-stable-rc-linux-4.4.y,v4.4.245,juno-r2,linux-log-parser/check-kernel-exception-1965813,pass
lkft,linux-stable-rc-linux-4.4.y,v4.4.245,juno-r2,linux-log-parser/check-kernel-trace-1965813,pass
lkft,linux-stable-rc-linux-4.4.y,v4.4.245,juno-r2,linux-log-parser/check-kernel-oops-1965813,pass
lkft,linux-stable-rc-linux-4.4.y,v4.4.245,juno-r2,linux-log-parser/check-kernel-fault-1965813,pass
lkft,linux-stable-rc-linux-4.4.y,v4.4.245,juno-r2,linux-log-parser/check-kernel-warning-1965813,pass
lkft,linux-stable-rc-linux-4.4.y,v4.4.245,juno-r2,linux-log-parser/check-kernel-bug-1965813,pass
lkft,linux-stable-rc-linux-4.4.y,v4.4.245,juno-r2,linux-log-parser/check-kernel-invalid-opcode-1965813,pass
lkft,linux-stable-rc-linux-4.4.y,v4.4.245,juno-r2,linux-log-parser/check-kernel-panic-1965813,pass
