group.name,project.name,build.name,build.datetime,environment.name,test.name,test.status
lkft,linux-stable-rc-linux-5.7.y,v5.7.5-477-gdc1d013af42f,2020-06-23T21:00:55.918104Z,x86,build/build_process,fail
lkft,linux-stable-rc-linux-5.7.y,v5.7.5-477-gdc1d013af42f,2020-06-23T21:00:55.918104Z,x86,linux-log-parser/check-kernel-exception-x86-20,pass
lkft,linux-stable-rc-linux-5.7.y,v5.7.5-477-gdc1d013af42f,2020-06-23T21:00:55.918104Z,x86,linux-log-parser/check-kernel-trace-x86-20,pass
lkft,linux-stable-rc-linux-5.7.y,v5.7.5-477-gdc1d013af42f,2020-06-23T21:00:55.918104Z,x86,linux-log-parser/check-kernel-oops-x86-20,pass
lkft,linux-stable-rc-linux-5.7.y,v5.7.5-477-gdc1d013af42f,2020-06-23T21:00:55.918104Z,x86,linux-log-parser/check-kernel-fault-x86-20,pass
lkft,linux-stable-rc-linux-5.7.y,v5.7.5-477-gdc1d013af42f,2020-06-23T21:00:55.918104Z,x86,linux-log-parser/check-kernel-warning-x86-20,pass
lkft,linux-stable-rc-linux-5.7.y,v5.7.5-477-gdc1d013af42f,2020-06-23T21:00:55.918104Z,x86,linux-log-parser/check-kernel-bug-x86-20,pass
lkft,linux-stable-rc-linux-5.7.y,v5.7.5-477-gdc1d013af42f,2020-06-23T21:00:55.918104Z,x86,linux-log-parser/check-kernel-invalid-opcode-x86-20,pass
lkft,linux-stable-rc-linux-5.7.y,v5.7.5-477-gdc1d013af42f,2020-06-23T21:00:55.918104Z,x86,linux-log-parser/check-kernel-panic-x86-20,pass
