group.name,project.name,build.name,build.datetime,environment.name,test.name,test.status
lkft,linux-stable-rc-linux-4.14.y,v4.14.138-126-g1c96c405da48,2019-08-18T20:11:57.631344Z,x15,build/build_process,fail
lkft,linux-stable-rc-linux-4.14.y,v4.14.138-126-g1c96c405da48,2019-08-18T20:11:57.631344Z,hi6220-hikey,build/build_process,fail
lkft,linux-stable-rc-linux-4.14.y,v4.14.138-126-g1c96c405da48,2019-08-18T20:11:57.631344Z,juno-r2,build/build_process,fail
lkft,linux-stable-rc-linux-4.14.y,v4.14.138-126-g1c96c405da48,2019-08-18T20:11:57.631344Z,dragonboard-410c,build/build_process,fail
lkft,linux-stable-rc-linux-4.14.y,v4.14.138-126-g1c96c405da48,2019-08-18T20:11:57.631344Z,i386,build/build_process,fail
lkft,linux-stable-rc-linux-4.14.y,v4.14.138-126-g1c96c405da48,2019-08-18T20:11:57.631344Z,x86,build/build_process,fail
