group.name,project.name,build.name,build.datetime,environment.name,test.name,test.status
lkft,linux-stable-rc-linux-5.4.y,v5.4.48-315-gdbc007d110b0,2020-06-23T21:02:10.813411Z,dragonboard-410c,build/build_process,fail
lkft,linux-stable-rc-linux-5.4.y,v5.4.48-315-gdbc007d110b0,2020-06-23T21:02:10.813411Z,dragonboard-410c,linux-log-parser/check-kernel-exception-dragonboard-410c-217,pass
lkft,linux-stable-rc-linux-5.4.y,v5.4.48-315-gdbc007d110b0,2020-06-23T21:02:10.813411Z,dragonboard-410c,linux-log-parser/check-kernel-trace-dragonboard-410c-217,pass
lkft,linux-stable-rc-linux-5.4.y,v5.4.48-315-gdbc007d110b0,2020-06-23T21:02:10.813411Z,dragonboard-410c,linux-log-parser/check-kernel-oops-dragonboard-410c-217,pass
lkft,linux-stable-rc-linux-5.4.y,v5.4.48-315-gdbc007d110b0,2020-06-23T21:02:10.813411Z,dragonboard-410c,linux-log-parser/check-kernel-fault-dragonboard-410c-217,pass
lkft,linux-stable-rc-linux-5.4.y,v5.4.48-315-gdbc007d110b0,2020-06-23T21:02:10.813411Z,dragonboard-410c,linux-log-parser/check-kernel-warning-dragonboard-410c-217,pass
lkft,linux-stable-rc-linux-5.4.y,v5.4.48-315-gdbc007d110b0,2020-06-23T21:02:10.813411Z,dragonboard-410c,linux-log-parser/check-kernel-bug-dragonboard-410c-217,pass
lkft,linux-stable-rc-linux-5.4.y,v5.4.48-315-gdbc007d110b0,2020-06-23T21:02:10.813411Z,dragonboard-410c,linux-log-parser/check-kernel-invalid-opcode-dragonboard-410c-217,pass
lkft,linux-stable-rc-linux-5.4.y,v5.4.48-315-gdbc007d110b0,2020-06-23T21:02:10.813411Z,dragonboard-410c,linux-log-parser/check-kernel-panic-dragonboard-410c-217,pass
lkft,linux-stable-rc-linux-5.4.y,v5.4.48-315-gdbc007d110b0,2020-06-23T21:02:10.813411Z,hi6220-hikey,build/build_process,fail
lkft,linux-stable-rc-linux-5.4.y,v5.4.48-315-gdbc007d110b0,2020-06-23T21:02:10.813411Z,hi6220-hikey,linux-log-parser/check-kernel-exception-hi6220-hikey-217,pass
lkft,linux-stable-rc-linux-5.4.y,v5.4.48-315-gdbc007d110b0,2020-06-23T21:02:10.813411Z,hi6220-hikey,linux-log-parser/check-kernel-trace-hi6220-hikey-217,pass
lkft,linux-stable-rc-linux-5.4.y,v5.4.48-315-gdbc007d110b0,2020-06-23T21:02:10.813411Z,hi6220-hikey,linux-log-parser/check-kernel-oops-hi6220-hikey-217,pass
lkft,linux-stable-rc-linux-5.4.y,v5.4.48-315-gdbc007d110b0,2020-06-23T21:02:10.813411Z,hi6220-hikey,linux-log-parser/check-kernel-fault-hi6220-hikey-217,pass
lkft,linux-stable-rc-linux-5.4.y,v5.4.48-315-gdbc007d110b0,2020-06-23T21:02:10.813411Z,hi6220-hikey,linux-log-parser/check-kernel-warning-hi6220-hikey-217,pass
lkft,linux-stable-rc-linux-5.4.y,v5.4.48-315-gdbc007d110b0,2020-06-23T21:02:10.813411Z,hi6220-hikey,linux-log-parser/check-kernel-bug-hi6220-hikey-217,pass
lkft,linux-stable-rc-linux-5.4.y,v5.4.48-315-gdbc007d110b0,2020-06-23T21:02:10.813411Z,hi6220-hikey,linux-log-parser/check-kernel-invalid-opcode-hi6220-hikey-217,pass
lkft,linux-stable-rc-linux-5.4.y,v5.4.48-315-gdbc007d110b0,2020-06-23T21:02:10.813411Z,hi6220-hikey,linux-log-parser/check-kernel-panic-hi6220-hikey-217,pass
lkft,linux-stable-rc-linux-5.4.y,v5.4.48-315-gdbc007d110b0,2020-06-23T21:02:10.813411Z,i386,build/build_process,fail
lkft,linux-stable-rc-linux-5.4.y,v5.4.48-315-gdbc007d110b0,2020-06-23T21:02:10.813411Z,i386,linux-log-parser/check-kernel-exception-i386-217,pass
lkft,linux-stable-rc-linux-5.4.y,v5.4.48-315-gdbc007d110b0,2020-06-23T21:02:10.813411Z,i386,linux-log-parser/check-kernel-trace-i386-217,pass
lkft,linux-stable-rc-linux-5.4.y,v5.4.48-315-gdbc007d110b0,2020-06-23T21:02:10.813411Z,i386,linux-log-parser/check-kernel-oops-i386-217,pass
lkft,linux-stable-rc-linux-5.4.y,v5.4.48-315-gdbc007d110b0,2020-06-23T21:02:10.813411Z,i386,linux-log-parser/check-kernel-fault-i386-217,pass
lkft,linux-stable-rc-linux-5.4.y,v5.4.48-315-gdbc007d110b0,2020-06-23T21:02:10.813411Z,i386,linux-log-parser/check-kernel-warning-i386-217,pass
lkft,linux-stable-rc-linux-5.4.y,v5.4.48-315-gdbc007d110b0,2020-06-23T21:02:10.813411Z,i386,linux-log-parser/check-kernel-bug-i386-217,pass
lkft,linux-stable-rc-linux-5.4.y,v5.4.48-315-gdbc007d110b0,2020-06-23T21:02:10.813411Z,i386,linux-log-parser/check-kernel-invalid-opcode-i386-217,pass
lkft,linux-stable-rc-linux-5.4.y,v5.4.48-315-gdbc007d110b0,2020-06-23T21:02:10.813411Z,i386,linux-log-parser/check-kernel-panic-i386-217,pass
lkft,linux-stable-rc-linux-5.4.y,v5.4.48-315-gdbc007d110b0,2020-06-23T21:02:10.813411Z,juno-r2,build/build_process,fail
lkft,linux-stable-rc-linux-5.4.y,v5.4.48-315-gdbc007d110b0,2020-06-23T21:02:10.813411Z,juno-r2,linux-log-parser/check-kernel-exception-juno-r2-217,pass
lkft,linux-stable-rc-linux-5.4.y,v5.4.48-315-gdbc007d110b0,2020-06-23T21:02:10.813411Z,juno-r2,linux-log-parser/check-kernel-trace-juno-r2-217,pass
lkft,linux-stable-rc-linux-5.4.y,v5.4.48-315-gdbc007d110b0,2020-06-23T21:02:10.813411Z,juno-r2,linux-log-parser/check-kernel-oops-juno-r2-217,pass
lkft,linux-stable-rc-linux-5.4.y,v5.4.48-315-gdbc007d110b0,2020-06-23T21:02:10.813411Z,juno-r2,linux-log-parser/check-kernel-fault-juno-r2-217,pass
lkft,linux-stable-rc-linux-5.4.y,v5.4.48-315-gdbc007d110b0,2020-06-23T21:02:10.813411Z,juno-r2,linux-log-parser/check-kernel-warning-juno-r2-217,pass
lkft,linux-stable-rc-linux-5.4.y,v5.4.48-315-gdbc007d110b0,2020-06-23T21:02:10.813411Z,juno-r2,linux-log-parser/check-kernel-bug-juno-r2-217,pass
lkft,linux-stable-rc-linux-5.4.y,v5.4.48-315-gdbc007d110b0,2020-06-23T21:02:10.813411Z,juno-r2,linux-log-parser/check-kernel-invalid-opcode-juno-r2-217,pass
lkft,linux-stable-rc-linux-5.4.y,v5.4.48-315-gdbc007d110b0,2020-06-23T21:02:10.813411Z,juno-r2,linux-log-parser/check-kernel-panic-juno-r2-217,pass
lkft,linux-stable-rc-linux-5.4.y,v5.4.48-315-gdbc007d110b0,2020-06-23T21:02:10.813411Z,x86,build/build_process,fail
lkft,linux-stable-rc-linux-5.4.y,v5.4.48-315-gdbc007d110b0,2020-06-23T21:02:10.813411Z,x86,linux-log-parser/check-kernel-exception-x86-217,pass
lkft,linux-stable-rc-linux-5.4.y,v5.4.48-315-gdbc007d110b0,2020-06-23T21:02:10.813411Z,x86,linux-log-parser/check-kernel-trace-x86-217,pass
lkft,linux-stable-rc-linux-5.4.y,v5.4.48-315-gdbc007d110b0,2020-06-23T21:02:10.813411Z,x86,linux-log-parser/check-kernel-oops-x86-217,pass
lkft,linux-stable-rc-linux-5.4.y,v5.4.48-315-gdbc007d110b0,2020-06-23T21:02:10.813411Z,x86,linux-log-parser/check-kernel-fault-x86-217,pass
lkft,linux-stable-rc-linux-5.4.y,v5.4.48-315-gdbc007d110b0,2020-06-23T21:02:10.813411Z,x86,linux-log-parser/check-kernel-warning-x86-217,pass
lkft,linux-stable-rc-linux-5.4.y,v5.4.48-315-gdbc007d110b0,2020-06-23T21:02:10.813411Z,x86,linux-log-parser/check-kernel-bug-x86-217,pass
lkft,linux-stable-rc-linux-5.4.y,v5.4.48-315-gdbc007d110b0,2020-06-23T21:02:10.813411Z,x86,linux-log-parser/check-kernel-invalid-opcode-x86-217,pass
lkft,linux-stable-rc-linux-5.4.y,v5.4.48-315-gdbc007d110b0,2020-06-23T21:02:10.813411Z,x86,linux-log-parser/check-kernel-panic-x86-217,pass
