group.name,project.name,build.name,build.datetime,environment.name,test.name,test.status
lkft,linux-stable-rc-linux-4.14.y,v4.14.134-179-gad2564e89372,2019-07-24T19:20:28.841286Z,x86,build/build_process,fail
lkft,linux-stable-rc-linux-4.14.y,v4.14.134-179-gad2564e89372,2019-07-24T19:20:28.841286Z,juno-r2,build/build_process,fail
lkft,linux-stable-rc-linux-4.14.y,v4.14.134-179-gad2564e89372,2019-07-24T19:20:28.841286Z,x15,build/build_process,fail
lkft,linux-stable-rc-linux-4.14.y,v4.14.134-179-gad2564e89372,2019-07-24T19:20:28.841286Z,dragonboard-410c,build/build_process,fail
lkft,linux-stable-rc-linux-4.14.y,v4.14.134-179-gad2564e89372,2019-07-24T19:20:28.841286Z,i386,build/build_process,fail
lkft,linux-stable-rc-linux-4.14.y,v4.14.134-179-gad2564e89372,2019-07-24T19:20:28.841286Z,hi6220-hikey,build/build_process,fail
