group.name,project.name,build.name,build.datetime,environment.name,test.name,test.status
lkft,linux-stable-rc-linux-4.14.y,v4.14.134-319-gafdefcd60732,2019-08-02T16:05:46.014440Z,i386,build/build_process,fail
lkft,linux-stable-rc-linux-4.14.y,v4.14.134-319-gafdefcd60732,2019-08-02T16:05:46.014440Z,hi6220-hikey,build/build_process,fail
lkft,linux-stable-rc-linux-4.14.y,v4.14.134-319-gafdefcd60732,2019-08-02T16:05:46.014440Z,x86,build/build_process,fail
lkft,linux-stable-rc-linux-4.14.y,v4.14.134-319-gafdefcd60732,2019-08-02T16:05:46.014440Z,juno-r2,build/build_process,fail
lkft,linux-stable-rc-linux-4.14.y,v4.14.134-319-gafdefcd60732,2019-08-02T16:05:46.014440Z,dragonboard-410c,build/build_process,fail
lkft,linux-stable-rc-linux-4.14.y,v4.14.134-319-gafdefcd60732,2019-08-02T16:05:46.014440Z,x15,build/build_process,fail
