group.name,project.name,build.name,build.datetime,environment.name,test.name,test.status
lkft,linux-stable-rc-linux-4.19.y,v4.19.57-91-g7b63e70b83fc,2019-07-08T14:17:17.483256Z,juno-r2,build/build_process,fail
lkft,linux-stable-rc-linux-4.19.y,v4.19.57-91-g7b63e70b83fc,2019-07-08T14:17:17.483256Z,i386,build/build_process,fail
lkft,linux-stable-rc-linux-4.19.y,v4.19.57-91-g7b63e70b83fc,2019-07-08T14:17:17.483256Z,hi6220-hikey,build/build_process,fail
lkft,linux-stable-rc-linux-4.19.y,v4.19.57-91-g7b63e70b83fc,2019-07-08T14:17:17.483256Z,dragonboard-410c,build/build_process,fail
lkft,linux-stable-rc-linux-4.19.y,v4.19.57-91-g7b63e70b83fc,2019-07-08T14:17:17.483256Z,x15,build/build_process,fail
lkft,linux-stable-rc-linux-4.19.y,v4.19.57-91-g7b63e70b83fc,2019-07-08T14:17:17.483256Z,x86,build/build_process,fail
