group.name,project.name,build.name,build.datetime,environment.name,test.name,test.status
lkft,linux-stable-rc-linux-4.14.y,v4.14.146-14-g070435ea791f,2019-09-24T22:14:20.447141Z,i386,build/build_process,fail
lkft,linux-stable-rc-linux-4.14.y,v4.14.146-14-g070435ea791f,2019-09-24T22:14:20.447141Z,juno-r2,build/build_process,fail
lkft,linux-stable-rc-linux-4.14.y,v4.14.146-14-g070435ea791f,2019-09-24T22:14:20.447141Z,x15,build/build_process,fail
lkft,linux-stable-rc-linux-4.14.y,v4.14.146-14-g070435ea791f,2019-09-24T22:14:20.447141Z,x86,build/build_process,fail
lkft,linux-stable-rc-linux-4.14.y,v4.14.146-14-g070435ea791f,2019-09-24T22:14:20.447141Z,dragonboard-410c,build/build_process,fail
lkft,linux-stable-rc-linux-4.14.y,v4.14.146-14-g070435ea791f,2019-09-24T22:14:20.447141Z,hi6220-hikey,build/build_process,fail
