group.name,project.name,build.name,build.datetime,environment.name,test.name,test.status
lkft,linux-stable-rc-linux-4.4.y,v4.4.229-20-g033f1cedf291,2020-07-07T15:02:42.190505Z,i386,build/build_process,pass
lkft,linux-stable-rc-linux-4.4.y,v4.4.229-20-g033f1cedf291,2020-07-07T15:02:42.190505Z,i386,linux-log-parser/check-kernel-exception-i386-863,pass
lkft,linux-stable-rc-linux-4.4.y,v4.4.229-20-g033f1cedf291,2020-07-07T15:02:42.190505Z,i386,linux-log-parser/check-kernel-trace-i386-863,pass
lkft,linux-stable-rc-linux-4.4.y,v4.4.229-20-g033f1cedf291,2020-07-07T15:02:42.190505Z,i386,linux-log-parser/check-kernel-oops-i386-863,pass
lkft,linux-stable-rc-linux-4.4.y,v4.4.229-20-g033f1cedf291,2020-07-07T15:02:42.190505Z,i386,linux-log-parser/check-kernel-fault-i386-863,pass
lkft,linux-stable-rc-linux-4.4.y,v4.4.229-20-g033f1cedf291,2020-07-07T15:02:42.190505Z,i386,linux-log-parser/check-kernel-warning-i386-863,pass
lkft,linux-stable-rc-linux-4.4.y,v4.4.229-20-g033f1cedf291,2020-07-07T15:02:42.190505Z,i386,linux-log-parser/check-kernel-bug-i386-863,pass
lkft,linux-stable-rc-linux-4.4.y,v4.4.229-20-g033f1cedf291,2020-07-07T15:02:42.190505Z,i386,linux-log-parser/check-kernel-invalid-opcode-i386-863,pass
lkft,linux-stable-rc-linux-4.4.y,v4.4.229-20-g033f1cedf291,2020-07-07T15:02:42.190505Z,i386,linux-log-parser/check-kernel-panic-i386-863,pass
lkft,linux-stable-rc-linux-4.4.y,v4.4.229-20-g033f1cedf291,2020-07-07T15:02:42.190505Z,x15,build/build_process,pass
lkft,linux-stable-rc-linux-4.4.y,v4.4.229-20-g033f1cedf291,2020-07-07T15:02:42.190505Z,x15,linux-log-parser/check-kernel-exception-x15-863,pass
lkft,linux-stable-rc-linux-4.4.y,v4.4.229-20-g033f1cedf291,2020-07-07T15:02:42.190505Z,x15,linux-log-parser/check-kernel-trace-x15-863,pass
lkft,linux-stable-rc-linux-4.4.y,v4.4.229-20-g033f1cedf291,2020-07-07T15:02:42.190505Z,x15,linux-log-parser/check-kernel-oops-x15-863,pass
lkft,linux-stable-rc-linux-4.4.y,v4.4.229-20-g033f1cedf291,2020-07-07T15:02:42.190505Z,x15,linux-log-parser/check-kernel-fault-x15-863,pass
lkft,linux-stable-rc-linux-4.4.y,v4.4.229-20-g033f1cedf291,2020-07-07T15:02:42.190505Z,x15,linux-log-parser/check-kernel-warning-x15-863,pass
lkft,linux-stable-rc-linux-4.4.y,v4.4.229-20-g033f1cedf291,2020-07-07T15:02:42.190505Z,x15,linux-log-parser/check-kernel-bug-x15-863,pass
lkft,linux-stable-rc-linux-4.4.y,v4.4.229-20-g033f1cedf291,2020-07-07T15:02:42.190505Z,x15,linux-log-parser/check-kernel-invalid-opcode-x15-863,pass
lkft,linux-stable-rc-linux-4.4.y,v4.4.229-20-g033f1cedf291,2020-07-07T15:02:42.190505Z,x15,linux-log-parser/check-kernel-panic-x15-863,pass
lkft,linux-stable-rc-linux-4.4.y,v4.4.229-20-g033f1cedf291,2020-07-07T15:02:42.190505Z,i386,linux-log-parser/check-kernel-exception-1544943,pass
lkft,linux-stable-rc-linux-4.4.y,v4.4.229-20-g033f1cedf291,2020-07-07T15:02:42.190505Z,i386,linux-log-parser/check-kernel-trace-1544943,pass
lkft,linux-stable-rc-linux-4.4.y,v4.4.229-20-g033f1cedf291,2020-07-07T15:02:42.190505Z,i386,linux-log-parser/check-kernel-oops-1544943,pass
lkft,linux-stable-rc-linux-4.4.y,v4.4.229-20-g033f1cedf291,2020-07-07T15:02:42.190505Z,i386,linux-log-parser/check-kernel-fault-1544943,pass
lkft,linux-stable-rc-linux-4.4.y,v4.4.229-20-g033f1cedf291,2020-07-07T15:02:42.190505Z,i386,linux-log-parser/check-kernel-warning-1544943,pass
lkft,linux-stable-rc-linux-4.4.y,v4.4.229-20-g033f1cedf291,2020-07-07T15:02:42.190505Z,i386,linux-log-parser/check-kernel-bug-1544943,pass
lkft,linux-stable-rc-linux-4.4.y,v4.4.229-20-g033f1cedf291,2020-07-07T15:02:42.190505Z,i386,linux-log-parser/check-kernel-invalid-opcode-1544943,pass
lkft,linux-stable-rc-linux-4.4.y,v4.4.229-20-g033f1cedf291,2020-07-07T15:02:42.190505Z,i386,linux-log-parser/check-kernel-panic-1544943,pass
lkft,linux-stable-rc-linux-4.4.y,v4.4.229-20-g033f1cedf291,2020-07-07T15:02:42.190505Z,i386,linux-log-parser/check-kernel-exception-1544942,pass
lkft,linux-stable-rc-linux-4.4.y,v4.4.229-20-g033f1cedf291,2020-07-07T15:02:42.190505Z,i386,linux-log-parser/check-kernel-trace-1544942,pass
lkft,linux-stable-rc-linux-4.4.y,v4.4.229-20-g033f1cedf291,2020-07-07T15:02:42.190505Z,i386,linux-log-parser/check-kernel-oops-1544942,pass
lkft,linux-stable-rc-linux-4.4.y,v4.4.229-20-g033f1cedf291,2020-07-07T15:02:42.190505Z,i386,linux-log-parser/check-kernel-fault-1544942,pass
lkft,linux-stable-rc-linux-4.4.y,v4.4.229-20-g033f1cedf291,2020-07-07T15:02:42.190505Z,i386,linux-log-parser/check-kernel-warning-1544942,pass
lkft,linux-stable-rc-linux-4.4.y,v4.4.229-20-g033f1cedf291,2020-07-07T15:02:42.190505Z,i386,linux-log-parser/check-kernel-bug-1544942,pass
lkft,linux-stable-rc-linux-4.4.y,v4.4.229-20-g033f1cedf291,2020-07-07T15:02:42.190505Z,i386,linux-log-parser/check-kernel-invalid-opcode-1544942,pass
lkft,linux-stable-rc-linux-4.4.y,v4.4.229-20-g033f1cedf291,2020-07-07T15:02:42.190505Z,i386,linux-log-parser/check-kernel-panic-1544942,pass
lkft,linux-stable-rc-linux-4.4.y,v4.4.229-20-g033f1cedf291,2020-07-07T15:02:42.190505Z,i386,linux-log-parser/check-kernel-exception-1544944,pass
lkft,linux-stable-rc-linux-4.4.y,v4.4.229-20-g033f1cedf291,2020-07-07T15:02:42.190505Z,i386,linux-log-parser/check-kernel-trace-1544944,pass
lkft,linux-stable-rc-linux-4.4.y,v4.4.229-20-g033f1cedf291,2020-07-07T15:02:42.190505Z,i386,linux-log-parser/check-kernel-oops-1544944,pass
lkft,linux-stable-rc-linux-4.4.y,v4.4.229-20-g033f1cedf291,2020-07-07T15:02:42.190505Z,i386,linux-log-parser/check-kernel-fault-1544944,pass
lkft,linux-stable-rc-linux-4.4.y,v4.4.229-20-g033f1cedf291,2020-07-07T15:02:42.190505Z,i386,linux-log-parser/check-kernel-warning-1544944,pass
lkft,linux-stable-rc-linux-4.4.y,v4.4.229-20-g033f1cedf291,2020-07-07T15:02:42.190505Z,i386,linux-log-parser/check-kernel-bug-1544944,pass
lkft,linux-stable-rc-linux-4.4.y,v4.4.229-20-g033f1cedf291,2020-07-07T15:02:42.190505Z,i386,linux-log-parser/check-kernel-invalid-opcode-1544944,pass
lkft,linux-stable-rc-linux-4.4.y,v4.4.229-20-g033f1cedf291,2020-07-07T15:02:42.190505Z,i386,linux-log-parser/check-kernel-panic-1544944,pass
lkft,linux-stable-rc-linux-4.4.y,v4.4.229-20-g033f1cedf291,2020-07-07T15:02:42.190505Z,i386,linux-log-parser/check-kernel-exception-1544945,pass
lkft,linux-stable-rc-linux-4.4.y,v4.4.229-20-g033f1cedf291,2020-07-07T15:02:42.190505Z,i386,linux-log-parser/check-kernel-trace-1544945,pass
lkft,linux-stable-rc-linux-4.4.y,v4.4.229-20-g033f1cedf291,2020-07-07T15:02:42.190505Z,i386,linux-log-parser/check-kernel-oops-1544945,pass
lkft,linux-stable-rc-linux-4.4.y,v4.4.229-20-g033f1cedf291,2020-07-07T15:02:42.190505Z,i386,linux-log-parser/check-kernel-fault-1544945,pass
lkft,linux-stable-rc-linux-4.4.y,v4.4.229-20-g033f1cedf291,2020-07-07T15:02:42.190505Z,i386,linux-log-parser/check-kernel-warning-1544945,pass
lkft,linux-stable-rc-linux-4.4.y,v4.4.229-20-g033f1cedf291,2020-07-07T15:02:42.190505Z,i386,linux-log-parser/check-kernel-bug-1544945,pass
lkft,linux-stable-rc-linux-4.4.y,v4.4.229-20-g033f1cedf291,2020-07-07T15:02:42.190505Z,i386,linux-log-parser/check-kernel-invalid-opcode-1544945,pass
lkft,linux-stable-rc-linux-4.4.y,v4.4.229-20-g033f1cedf291,2020-07-07T15:02:42.190505Z,i386,linux-log-parser/check-kernel-panic-1544945,pass
lkft,linux-stable-rc-linux-4.4.y,v4.4.229-20-g033f1cedf291,2020-07-07T15:02:42.190505Z,x15,linux-log-parser/check-kernel-exception-1544948,pass
lkft,linux-stable-rc-linux-4.4.y,v4.4.229-20-g033f1cedf291,2020-07-07T15:02:42.190505Z,x15,linux-log-parser/check-kernel-trace-1544948,pass
lkft,linux-stable-rc-linux-4.4.y,v4.4.229-20-g033f1cedf291,2020-07-07T15:02:42.190505Z,x15,linux-log-parser/check-kernel-oops-1544948,pass
lkft,linux-stable-rc-linux-4.4.y,v4.4.229-20-g033f1cedf291,2020-07-07T15:02:42.190505Z,x15,linux-log-parser/check-kernel-fault-1544948,pass
lkft,linux-stable-rc-linux-4.4.y,v4.4.229-20-g033f1cedf291,2020-07-07T15:02:42.190505Z,x15,linux-log-parser/check-kernel-warning-1544948,pass
lkft,linux-stable-rc-linux-4.4.y,v4.4.229-20-g033f1cedf291,2020-07-07T15:02:42.190505Z,x15,linux-log-parser/check-kernel-bug-1544948,pass
lkft,linux-stable-rc-linux-4.4.y,v4.4.229-20-g033f1cedf291,2020-07-07T15:02:42.190505Z,x15,linux-log-parser/check-kernel-invalid-opcode-1544948,pass
lkft,linux-stable-rc-linux-4.4.y,v4.4.229-20-g033f1cedf291,2020-07-07T15:02:42.190505Z,x15,linux-log-parser/check-kernel-panic-1544948,pass
lkft,linux-stable-rc-linux-4.4.y,v4.4.229-20-g033f1cedf291,2020-07-07T15:02:42.190505Z,x15,linux-log-parser/check-kernel-exception-1544946,pass
lkft,linux-stable-rc-linux-4.4.y,v4.4.229-20-g033f1cedf291,2020-07-07T15:02:42.190505Z,x15,linux-log-parser/check-kernel-trace-1544946,pass
lkft,linux-stable-rc-linux-4.4.y,v4.4.229-20-g033f1cedf291,2020-07-07T15:02:42.190505Z,x15,linux-log-parser/check-kernel-oops-1544946,pass
lkft,linux-stable-rc-linux-4.4.y,v4.4.229-20-g033f1cedf291,2020-07-07T15:02:42.190505Z,x15,linux-log-parser/check-kernel-fault-1544946,pass
lkft,linux-stable-rc-linux-4.4.y,v4.4.229-20-g033f1cedf291,2020-07-07T15:02:42.190505Z,x15,linux-log-parser/check-kernel-warning-1544946,pass
lkft,linux-stable-rc-linux-4.4.y,v4.4.229-20-g033f1cedf291,2020-07-07T15:02:42.190505Z,x15,linux-log-parser/check-kernel-bug-1544946,pass
lkft,linux-stable-rc-linux-4.4.y,v4.4.229-20-g033f1cedf291,2020-07-07T15:02:42.190505Z,x15,linux-log-parser/check-kernel-invalid-opcode-1544946,pass
lkft,linux-stable-rc-linux-4.4.y,v4.4.229-20-g033f1cedf291,2020-07-07T15:02:42.190505Z,x15,linux-log-parser/check-kernel-panic-1544946,pass
lkft,linux-stable-rc-linux-4.4.y,v4.4.229-20-g033f1cedf291,2020-07-07T15:02:42.190505Z,x15,linux-log-parser/check-kernel-exception-1544947,pass
lkft,linux-stable-rc-linux-4.4.y,v4.4.229-20-g033f1cedf291,2020-07-07T15:02:42.190505Z,x15,linux-log-parser/check-kernel-trace-1544947,pass
lkft,linux-stable-rc-linux-4.4.y,v4.4.229-20-g033f1cedf291,2020-07-07T15:02:42.190505Z,x15,linux-log-parser/check-kernel-oops-1544947,pass
lkft,linux-stable-rc-linux-4.4.y,v4.4.229-20-g033f1cedf291,2020-07-07T15:02:42.190505Z,x15,linux-log-parser/check-kernel-fault-1544947,pass
lkft,linux-stable-rc-linux-4.4.y,v4.4.229-20-g033f1cedf291,2020-07-07T15:02:42.190505Z,x15,linux-log-parser/check-kernel-warning-1544947,pass
lkft,linux-stable-rc-linux-4.4.y,v4.4.229-20-g033f1cedf291,2020-07-07T15:02:42.190505Z,x15,linux-log-parser/check-kernel-bug-1544947,pass
lkft,linux-stable-rc-linux-4.4.y,v4.4.229-20-g033f1cedf291,2020-07-07T15:02:42.190505Z,x15,linux-log-parser/check-kernel-invalid-opcode-1544947,pass
lkft,linux-stable-rc-linux-4.4.y,v4.4.229-20-g033f1cedf291,2020-07-07T15:02:42.190505Z,x15,linux-log-parser/check-kernel-panic-1544947,pass
lkft,linux-stable-rc-linux-4.4.y,v4.4.229-20-g033f1cedf291,2020-07-07T15:02:42.190505Z,x15,linux-log-parser/check-kernel-exception-1544949,pass
lkft,linux-stable-rc-linux-4.4.y,v4.4.229-20-g033f1cedf291,2020-07-07T15:02:42.190505Z,x15,linux-log-parser/check-kernel-trace-1544949,pass
lkft,linux-stable-rc-linux-4.4.y,v4.4.229-20-g033f1cedf291,2020-07-07T15:02:42.190505Z,x15,linux-log-parser/check-kernel-oops-1544949,pass
lkft,linux-stable-rc-linux-4.4.y,v4.4.229-20-g033f1cedf291,2020-07-07T15:02:42.190505Z,x15,linux-log-parser/check-kernel-fault-1544949,pass
lkft,linux-stable-rc-linux-4.4.y,v4.4.229-20-g033f1cedf291,2020-07-07T15:02:42.190505Z,x15,linux-log-parser/check-kernel-warning-1544949,pass
lkft,linux-stable-rc-linux-4.4.y,v4.4.229-20-g033f1cedf291,2020-07-07T15:02:42.190505Z,x15,linux-log-parser/check-kernel-bug-1544949,pass
lkft,linux-stable-rc-linux-4.4.y,v4.4.229-20-g033f1cedf291,2020-07-07T15:02:42.190505Z,x15,linux-log-parser/check-kernel-invalid-opcode-1544949,pass
lkft,linux-stable-rc-linux-4.4.y,v4.4.229-20-g033f1cedf291,2020-07-07T15:02:42.190505Z,x15,linux-log-parser/check-kernel-panic-1544949,pass
lkft,linux-stable-rc-linux-4.4.y,v4.4.229-20-g033f1cedf291,2020-07-07T15:02:42.190505Z,x86,build/build_process,fail
lkft,linux-stable-rc-linux-4.4.y,v4.4.229-20-g033f1cedf291,2020-07-07T15:02:42.190505Z,x86,linux-log-parser/check-kernel-exception-x86-863,pass
lkft,linux-stable-rc-linux-4.4.y,v4.4.229-20-g033f1cedf291,2020-07-07T15:02:42.190505Z,x86,linux-log-parser/check-kernel-trace-x86-863,pass
lkft,linux-stable-rc-linux-4.4.y,v4.4.229-20-g033f1cedf291,2020-07-07T15:02:42.190505Z,x86,linux-log-parser/check-kernel-oops-x86-863,pass
lkft,linux-stable-rc-linux-4.4.y,v4.4.229-20-g033f1cedf291,2020-07-07T15:02:42.190505Z,x86,linux-log-parser/check-kernel-fault-x86-863,pass
lkft,linux-stable-rc-linux-4.4.y,v4.4.229-20-g033f1cedf291,2020-07-07T15:02:42.190505Z,x86,linux-log-parser/check-kernel-warning-x86-863,pass
lkft,linux-stable-rc-linux-4.4.y,v4.4.229-20-g033f1cedf291,2020-07-07T15:02:42.190505Z,x86,linux-log-parser/check-kernel-bug-x86-863,pass
lkft,linux-stable-rc-linux-4.4.y,v4.4.229-20-g033f1cedf291,2020-07-07T15:02:42.190505Z,x86,linux-log-parser/check-kernel-invalid-opcode-x86-863,pass
lkft,linux-stable-rc-linux-4.4.y,v4.4.229-20-g033f1cedf291,2020-07-07T15:02:42.190505Z,x86,linux-log-parser/check-kernel-panic-x86-863,pass
