group.name,project.name,build.name,build.datetime,environment.name,test.name,test.status
lkft,linux-stable-rc-linux-4.9.y,v4.9.189-41-ge000f8795868,2019-08-14T17:49:19.207720Z,x15,build/build_process,fail
lkft,linux-stable-rc-linux-4.9.y,v4.9.189-41-ge000f8795868,2019-08-14T17:49:19.207720Z,hi6220-hikey,build/build_process,fail
lkft,linux-stable-rc-linux-4.9.y,v4.9.189-41-ge000f8795868,2019-08-14T17:49:19.207720Z,i386,build/build_process,fail
lkft,linux-stable-rc-linux-4.9.y,v4.9.189-41-ge000f8795868,2019-08-14T17:49:19.207720Z,dragonboard-410c,build/build_process,fail
lkft,linux-stable-rc-linux-4.9.y,v4.9.189-41-ge000f8795868,2019-08-14T17:49:19.207720Z,i386,build/build_process,fail
lkft,linux-stable-rc-linux-4.9.y,v4.9.189-41-ge000f8795868,2019-08-14T17:49:19.207720Z,hi6220-hikey,build/build_process,fail
lkft,linux-stable-rc-linux-4.9.y,v4.9.189-41-ge000f8795868,2019-08-14T17:49:19.207720Z,x15,build/build_process,fail
lkft,linux-stable-rc-linux-4.9.y,v4.9.189-41-ge000f8795868,2019-08-14T17:49:19.207720Z,x86,build/build_process,fail
lkft,linux-stable-rc-linux-4.9.y,v4.9.189-41-ge000f8795868,2019-08-14T17:49:19.207720Z,juno-r2,build/build_process,fail
