group.name,project.name,build.name,build.datetime,environment.name,test.name,test.status
lkft,linux-stable-rc-linux-4.9.y,v4.9.224-65-g8430888b29d8,2020-05-25T16:10:01.694182Z,qemu_x86_64,linux-log-parser/check-kernel-exception-1450044,pass
lkft,linux-stable-rc-linux-4.9.y,v4.9.224-65-g8430888b29d8,2020-05-25T16:10:01.694182Z,qemu_x86_64,linux-log-parser/check-kernel-trace-1450044,pass
lkft,linux-stable-rc-linux-4.9.y,v4.9.224-65-g8430888b29d8,2020-05-25T16:10:01.694182Z,qemu_x86_64,linux-log-parser/check-kernel-oops-1450044,pass
lkft,linux-stable-rc-linux-4.9.y,v4.9.224-65-g8430888b29d8,2020-05-25T16:10:01.694182Z,qemu_x86_64,linux-log-parser/check-kernel-fault-1450044,pass
lkft,linux-stable-rc-linux-4.9.y,v4.9.224-65-g8430888b29d8,2020-05-25T16:10:01.694182Z,qemu_x86_64,linux-log-parser/check-kernel-warning-1450044,pass
lkft,linux-stable-rc-linux-4.9.y,v4.9.224-65-g8430888b29d8,2020-05-25T16:10:01.694182Z,qemu_x86_64,linux-log-parser/check-kernel-bug-1450044,pass
lkft,linux-stable-rc-linux-4.9.y,v4.9.224-65-g8430888b29d8,2020-05-25T16:10:01.694182Z,qemu_x86_64,linux-log-parser/check-kernel-panic-1450044,pass
lkft,linux-stable-rc-linux-4.9.y,v4.9.224-65-g8430888b29d8,2020-05-25T16:10:01.694182Z,qemu_x86_64,linux-log-parser/check-kernel-exception-1450050,pass
lkft,linux-stable-rc-linux-4.9.y,v4.9.224-65-g8430888b29d8,2020-05-25T16:10:01.694182Z,qemu_x86_64,linux-log-parser/check-kernel-trace-1450050,pass
lkft,linux-stable-rc-linux-4.9.y,v4.9.224-65-g8430888b29d8,2020-05-25T16:10:01.694182Z,qemu_x86_64,linux-log-parser/check-kernel-oops-1450050,pass
lkft,linux-stable-rc-linux-4.9.y,v4.9.224-65-g8430888b29d8,2020-05-25T16:10:01.694182Z,qemu_x86_64,linux-log-parser/check-kernel-fault-1450050,pass
lkft,linux-stable-rc-linux-4.9.y,v4.9.224-65-g8430888b29d8,2020-05-25T16:10:01.694182Z,qemu_x86_64,linux-log-parser/check-kernel-warning-1450050,pass
lkft,linux-stable-rc-linux-4.9.y,v4.9.224-65-g8430888b29d8,2020-05-25T16:10:01.694182Z,qemu_x86_64,linux-log-parser/check-kernel-bug-1450050,pass
lkft,linux-stable-rc-linux-4.9.y,v4.9.224-65-g8430888b29d8,2020-05-25T16:10:01.694182Z,qemu_x86_64,linux-log-parser/check-kernel-panic-1450050,pass
lkft,linux-stable-rc-linux-4.9.y,v4.9.224-65-g8430888b29d8,2020-05-25T16:10:01.694182Z,qemu_x86_64,libhugetlbfs/linkhuge-2M-64,pass
lkft,linux-stable-rc-linux-4.9.y,v4.9.224-65-g8430888b29d8,2020-05-25T16:10:01.694182Z,qemu_x86_64,libhugetlbfs/huge_below_4GB_normal_above_static-2M-64,pass
lkft,linux-stable-rc-linux-4.9.y,v4.9.224-65-g8430888b29d8,2020-05-25T16:10:01.694182Z,qemu_x86_64,libhugetlbfs/mmap-cow-199-200-2M-64,pass
lkft,linux-stable-rc-linux-4.9.y,v4.9.224-65-g8430888b29d8,2020-05-25T16:10:01.694182Z,qemu_x86_64,libhugetlbfs/GLIBC_TUNABLES_glibc.malloc.tcache_count_0-HUGETLB_MORECORE_yes-HUGETLB_MORECORE_SHRINK_yes-LD_PRELOAD_libheapshrink.so-heapshrink-2M-64,pass
lkft,linux-stable-rc-linux-4.9.y,v4.9.224-65-g8430888b29d8,2020-05-25T16:10:01.694182Z,qemu_x86_64,libhugetlbfs/HUGETLB_VERBOSE_1-large_mounts-2M-64,pass
lkft,linux-stable-rc-linux-4.9.y,v4.9.224-65-g8430888b29d8,2020-05-25T16:10:01.694182Z,qemu_x86_64,libhugetlbfs/readahead_reserve.sh-2M-64,pass
lkft,linux-stable-rc-linux-4.9.y,v4.9.224-65-g8430888b29d8,2020-05-25T16:10:01.694182Z,qemu_x86_64,libhugetlbfs/HUGETLB_RESTRICT_EXE_unknownnone-HUGETLB_MORECORE_yes-LD_PRELOAD_libhugetlbfs.so-malloc-2M-64,pass
lkft,linux-stable-rc-linux-4.9.y,v4.9.224-65-g8430888b29d8,2020-05-25T16:10:01.694182Z,qemu_x86_64,libhugetlbfs/HUGETLB_VERBOSE_1-HUGETLB_MORECORE_yes-heap-overflow-2M-64,pass
lkft,linux-stable-rc-linux-4.9.y,v4.9.224-65-g8430888b29d8,2020-05-25T16:10:01.694182Z,qemu_x86_64,libhugetlbfs/shm-getraw-200--dev-full-2M-64,pass
lkft,linux-stable-rc-linux-4.9.y,v4.9.224-65-g8430888b29d8,2020-05-25T16:10:01.694182Z,qemu_x86_64,libhugetlbfs/GLIBC_TUNABLES_glibc.malloc.tcache_count_0-HUGETLB_MORECORE_yes-LD_PRELOAD_libhugetlbfs.so-heapshrink-2M-64,pass
lkft,linux-stable-rc-linux-4.9.y,v4.9.224-65-g8430888b29d8,2020-05-25T16:10:01.694182Z,qemu_x86_64,libhugetlbfs/private-2M-64,pass
lkft,linux-stable-rc-linux-4.9.y,v4.9.224-65-g8430888b29d8,2020-05-25T16:10:01.694182Z,qemu_x86_64,libhugetlbfs/fallocate_stress.sh-2M-64,pass
lkft,linux-stable-rc-linux-4.9.y,v4.9.224-65-g8430888b29d8,2020-05-25T16:10:01.694182Z,qemu_x86_64,libhugetlbfs/HUGETLB_ELFMAP_R-linkhuge_rw-2M-64,pass
lkft,linux-stable-rc-linux-4.9.y,v4.9.224-65-g8430888b29d8,2020-05-25T16:10:01.694182Z,qemu_x86_64,libhugetlbfs/mremap-fixed-huge-near-normal.sh-2M-64,pass
lkft,linux-stable-rc-linux-4.9.y,v4.9.224-65-g8430888b29d8,2020-05-25T16:10:01.694182Z,qemu_x86_64,libhugetlbfs/misaligned_offset-2M-64,pass
lkft,linux-stable-rc-linux-4.9.y,v4.9.224-65-g8430888b29d8,2020-05-25T16:10:01.694182Z,qemu_x86_64,libhugetlbfs/truncate_sigbus_versus_oom-2M-64,pass
lkft,linux-stable-rc-linux-4.9.y,v4.9.224-65-g8430888b29d8,2020-05-25T16:10:01.694182Z,qemu_x86_64,libhugetlbfs/test_root-2M-64,pass
lkft,linux-stable-rc-linux-4.9.y,v4.9.224-65-g8430888b29d8,2020-05-25T16:10:01.694182Z,qemu_x86_64,libhugetlbfs/fallocate_basic.sh-2M-64,pass
lkft,linux-stable-rc-linux-4.9.y,v4.9.224-65-g8430888b29d8,2020-05-25T16:10:01.694182Z,qemu_x86_64,libhugetlbfs/HUGETLB_SHARE_1-HUGETLB_ELFMAP_R-linkhuge_rw-2M-64,pass
lkft,linux-stable-rc-linux-4.9.y,v4.9.224-65-g8430888b29d8,2020-05-25T16:10:01.694182Z,qemu_x86_64,libhugetlbfs/HUGETLB_SHARE_1-HUGETLB_ELFMAP_W-linkhuge_rw-2M-64,pass
lkft,linux-stable-rc-linux-4.9.y,v4.9.224-65-g8430888b29d8,2020-05-25T16:10:01.694182Z,qemu_x86_64,libhugetlbfs/straddle_4GB_static-2M-64,pass
lkft,linux-stable-rc-linux-4.9.y,v4.9.224-65-g8430888b29d8,2020-05-25T16:10:01.694182Z,qemu_x86_64,libhugetlbfs/mprotect-2M-64,pass
lkft,linux-stable-rc-linux-4.9.y,v4.9.224-65-g8430888b29d8,2020-05-25T16:10:01.694182Z,qemu_x86_64,libhugetlbfs/GLIBC_TUNABLES_glibc.malloc.tcache_count_0-heapshrink-2M-64,pass
lkft,linux-stable-rc-linux-4.9.y,v4.9.224-65-g8430888b29d8,2020-05-25T16:10:01.694182Z,qemu_x86_64,libhugetlbfs/mremap-expand-slice-collision.sh-2M-64,pass
lkft,linux-stable-rc-linux-4.9.y,v4.9.224-65-g8430888b29d8,2020-05-25T16:10:01.694182Z,qemu_x86_64,libhugetlbfs/noresv-preserve-resv-page-2M-64,pass
lkft,linux-stable-rc-linux-4.9.y,v4.9.224-65-g8430888b29d8,2020-05-25T16:10:01.694182Z,qemu_x86_64,libhugetlbfs/HUGETLB_MINIMAL_COPY_no-HUGETLB_ELFMAP_RW-linkhuge_rw-2M-64,pass
lkft,linux-stable-rc-linux-4.9.y,v4.9.224-65-g8430888b29d8,2020-05-25T16:10:01.694182Z,qemu_x86_64,libhugetlbfs/shm-fork-10-100-2M-64,pass
lkft,linux-stable-rc-linux-4.9.y,v4.9.224-65-g8430888b29d8,2020-05-25T16:10:01.694182Z,qemu_x86_64,libhugetlbfs/truncate_reserve_wraparound-2M-64,pass
lkft,linux-stable-rc-linux-4.9.y,v4.9.224-65-g8430888b29d8,2020-05-25T16:10:01.694182Z,qemu_x86_64,libhugetlbfs/chunk-overcommit-2M-64,pass
lkft,linux-stable-rc-linux-4.9.y,v4.9.224-65-g8430888b29d8,2020-05-25T16:10:01.694182Z,qemu_x86_64,libhugetlbfs/mmap-gettest-10-200-2M-64,pass
lkft,linux-stable-rc-linux-4.9.y,v4.9.224-65-g8430888b29d8,2020-05-25T16:10:01.694182Z,qemu_x86_64,libhugetlbfs/fallocate_align.sh-2M-64,pass
lkft,linux-stable-rc-linux-4.9.y,v4.9.224-65-g8430888b29d8,2020-05-25T16:10:01.694182Z,qemu_x86_64,libhugetlbfs/HUGETLB_SHM_yes-shmoverride_linked-2M-64,pass
lkft,linux-stable-rc-linux-4.9.y,v4.9.224-65-g8430888b29d8,2020-05-25T16:10:01.694182Z,qemu_x86_64,libhugetlbfs/HUGETLB_MINIMAL_COPY_no-HUGETLB_ELFMAP_R-linkhuge_rw-2M-64,pass
lkft,linux-stable-rc-linux-4.9.y,v4.9.224-65-g8430888b29d8,2020-05-25T16:10:01.694182Z,qemu_x86_64,libhugetlbfs/GLIBC_TUNABLES_glibc.malloc.tcache_count_0-LD_PRELOAD_libheapshrink.so-heapshrink-2M-64,pass
lkft,linux-stable-rc-linux-4.9.y,v4.9.224-65-g8430888b29d8,2020-05-25T16:10:01.694182Z,qemu_x86_64,libhugetlbfs/HUGETLB_SHARE_0-HUGETLB_ELFMAP_R-linkhuge_rw-2M-64,pass
lkft,linux-stable-rc-linux-4.9.y,v4.9.224-65-g8430888b29d8,2020-05-25T16:10:01.694182Z,qemu_x86_64,libhugetlbfs/HUGETLB_SHM_yes-LD_PRELOAD_libhugetlbfs.so-shmoverride_unlinked-2M-64,pass
lkft,linux-stable-rc-linux-4.9.y,v4.9.224-65-g8430888b29d8,2020-05-25T16:10:01.694182Z,qemu_x86_64,libhugetlbfs/HUGETLB_VERBOSE_0-LD_PRELOAD_libhugetlbfs.so-linkhuge_nofd-2M-64,pass
lkft,linux-stable-rc-linux-4.9.y,v4.9.224-65-g8430888b29d8,2020-05-25T16:10:01.694182Z,qemu_x86_64,libhugetlbfs/get_huge_pages-2M-64,pass
lkft,linux-stable-rc-linux-4.9.y,v4.9.224-65-g8430888b29d8,2020-05-25T16:10:01.694182Z,qemu_x86_64,libhugetlbfs/shm-perms-2M-64,pass
lkft,linux-stable-rc-linux-4.9.y,v4.9.224-65-g8430888b29d8,2020-05-25T16:10:01.694182Z,qemu_x86_64,libhugetlbfs/zero_filesize_segment-2M-64,pass
lkft,linux-stable-rc-linux-4.9.y,v4.9.224-65-g8430888b29d8,2020-05-25T16:10:01.694182Z,qemu_x86_64,libhugetlbfs/stack_grow_into_huge-2M-64,pass
lkft,linux-stable-rc-linux-4.9.y,v4.9.224-65-g8430888b29d8,2020-05-25T16:10:01.694182Z,qemu_x86_64,libhugetlbfs/HUGETLB_SHARE_1-HUGETLB_ELFMAP_RW-linkhuge_rw-2M-64,pass
lkft,linux-stable-rc-linux-4.9.y,v4.9.224-65-g8430888b29d8,2020-05-25T16:10:01.694182Z,qemu_x86_64,libhugetlbfs/direct-2M-64,skip
lkft,linux-stable-rc-linux-4.9.y,v4.9.224-65-g8430888b29d8,2020-05-25T16:10:01.694182Z,qemu_x86_64,libhugetlbfs/misalign-2M-64,pass
lkft,linux-stable-rc-linux-4.9.y,v4.9.224-65-g8430888b29d8,2020-05-25T16:10:01.694182Z,qemu_x86_64,libhugetlbfs/HUGETLB_MORECORE_yes-LD_PRELOAD_libhugetlbfs.so-malloc_manysmall-2M-64,pass
lkft,linux-stable-rc-linux-4.9.y,v4.9.224-65-g8430888b29d8,2020-05-25T16:10:01.694182Z,qemu_x86_64,libhugetlbfs/quota.sh-2M-64,pass
lkft,linux-stable-rc-linux-4.9.y,v4.9.224-65-g8430888b29d8,2020-05-25T16:10:01.694182Z,qemu_x86_64,libhugetlbfs/slbpacaflush-2M-64,pass
lkft,linux-stable-rc-linux-4.9.y,v4.9.224-65-g8430888b29d8,2020-05-25T16:10:01.694182Z,qemu_x86_64,libhugetlbfs/madvise_reserve.sh-2M-64,pass
lkft,linux-stable-rc-linux-4.9.y,v4.9.224-65-g8430888b29d8,2020-05-25T16:10:01.694182Z,qemu_x86_64,libhugetlbfs/HUGETLB_VERBOSE_1-empty_mounts-2M-64,pass
lkft,linux-stable-rc-linux-4.9.y,v4.9.224-65-g8430888b29d8,2020-05-25T16:10:01.694182Z,qemu_x86_64,libhugetlbfs/corrupt-by-cow-opt-2M-64,pass
lkft,linux-stable-rc-linux-4.9.y,v4.9.224-65-g8430888b29d8,2020-05-25T16:10:01.694182Z,qemu_x86_64,libhugetlbfs/shm-fork-10-200-2M-64,pass
lkft,linux-stable-rc-linux-4.9.y,v4.9.224-65-g8430888b29d8,2020-05-25T16:10:01.694182Z,qemu_x86_64,libhugetlbfs/fadvise_reserve.sh-2M-64,pass
lkft,linux-stable-rc-linux-4.9.y,v4.9.224-65-g8430888b29d8,2020-05-25T16:10:01.694182Z,qemu_x86_64,libhugetlbfs/noresv-regarded-as-resv-2M-64,pass
lkft,linux-stable-rc-linux-4.9.y,v4.9.224-65-g8430888b29d8,2020-05-25T16:10:01.694182Z,qemu_x86_64,libhugetlbfs/linkhuge_rw-2M-64,pass
lkft,linux-stable-rc-linux-4.9.y,v4.9.224-65-g8430888b29d8,2020-05-25T16:10:01.694182Z,qemu_x86_64,libhugetlbfs/HUGETLB_ELFMAP_W-linkhuge_rw-2M-64,pass
lkft,linux-stable-rc-linux-4.9.y,v4.9.224-65-g8430888b29d8,2020-05-25T16:10:01.694182Z,qemu_x86_64,libhugetlbfs/malloc-2M-64,pass
lkft,linux-stable-rc-linux-4.9.y,v4.9.224-65-g8430888b29d8,2020-05-25T16:10:01.694182Z,qemu_x86_64,libhugetlbfs/HUGETLB_RESTRICT_EXE_unknownmalloc-HUGETLB_MORECORE_yes-LD_PRELOAD_libhugetlbfs.so-malloc-2M-64,pass
lkft,linux-stable-rc-linux-4.9.y,v4.9.224-65-g8430888b29d8,2020-05-25T16:10:01.694182Z,qemu_x86_64,libhugetlbfs/shared-2M-64,pass
lkft,linux-stable-rc-linux-4.9.y,v4.9.224-65-g8430888b29d8,2020-05-25T16:10:01.694182Z,qemu_x86_64,libhugetlbfs/libhugetlb-pre-requirements,pass
lkft,linux-stable-rc-linux-4.9.y,v4.9.224-65-g8430888b29d8,2020-05-25T16:10:01.694182Z,qemu_x86_64,libhugetlbfs/icache-hygiene-2M-64,pass
lkft,linux-stable-rc-linux-4.9.y,v4.9.224-65-g8430888b29d8,2020-05-25T16:10:01.694182Z,qemu_x86_64,libhugetlbfs/GLIBC_TUNABLES_glibc.malloc.tcache_count_0-HUGETLB_MORECORE_yes-LD_PRELOAD_libhugetlbfs.so-libheapshrink.so-heapshrink-2M-64,pass
lkft,linux-stable-rc-linux-4.9.y,v4.9.224-65-g8430888b29d8,2020-05-25T16:10:01.694182Z,qemu_x86_64,libhugetlbfs/counters.sh-2M-64,pass
lkft,linux-stable-rc-linux-4.9.y,v4.9.224-65-g8430888b29d8,2020-05-25T16:10:01.694182Z,qemu_x86_64,libhugetlbfs/GLIBC_TUNABLES_glibc.malloc.tcache_count_0-HUGETLB_MORECORE_yes-HUGETLB_MORECORE_SHRINK_yes-LD_PRELOAD_libhugetlbfs.so-libheapshrink.so-heapshrink-2M-64,pass
lkft,linux-stable-rc-linux-4.9.y,v4.9.224-65-g8430888b29d8,2020-05-25T16:10:01.694182Z,qemu_x86_64,libhugetlbfs/truncate-2M-64,pass
lkft,linux-stable-rc-linux-4.9.y,v4.9.224-65-g8430888b29d8,2020-05-25T16:10:01.694182Z,qemu_x86_64,libhugetlbfs/ptrace-write-hugepage-2M-64,pass
lkft,linux-stable-rc-linux-4.9.y,v4.9.224-65-g8430888b29d8,2020-05-25T16:10:01.694182Z,qemu_x86_64,libhugetlbfs/gethugepagesizes-2M-64,pass
lkft,linux-stable-rc-linux-4.9.y,v4.9.224-65-g8430888b29d8,2020-05-25T16:10:01.694182Z,qemu_x86_64,libhugetlbfs/gethugepagesize-2M-64,pass
lkft,linux-stable-rc-linux-4.9.y,v4.9.224-65-g8430888b29d8,2020-05-25T16:10:01.694182Z,qemu_x86_64,libhugetlbfs/HUGETLB_MINIMAL_COPY_no-HUGETLB_ELFMAP_W-linkhuge_rw-2M-64,pass
lkft,linux-stable-rc-linux-4.9.y,v4.9.224-65-g8430888b29d8,2020-05-25T16:10:01.694182Z,qemu_x86_64,libhugetlbfs/task-size-overrun-2M-64,pass
lkft,linux-stable-rc-linux-4.9.y,v4.9.224-65-g8430888b29d8,2020-05-25T16:10:01.694182Z,qemu_x86_64,libhugetlbfs/unlinked_fd-2M-64,pass
lkft,linux-stable-rc-linux-4.9.y,v4.9.224-65-g8430888b29d8,2020-05-25T16:10:01.694182Z,qemu_x86_64,libhugetlbfs/mremap-fixed-normal-near-huge.sh-2M-64,pass
lkft,linux-stable-rc-linux-4.9.y,v4.9.224-65-g8430888b29d8,2020-05-25T16:10:01.694182Z,qemu_x86_64,libhugetlbfs/alloc-instantiate-race-private-2M-64,pass
lkft,linux-stable-rc-linux-4.9.y,v4.9.224-65-g8430888b29d8,2020-05-25T16:10:01.694182Z,qemu_x86_64,libhugetlbfs/meminfo_nohuge-2M-64,pass
lkft,linux-stable-rc-linux-4.9.y,v4.9.224-65-g8430888b29d8,2020-05-25T16:10:01.694182Z,qemu_x86_64,libhugetlbfs/find_path-2M-64,pass
lkft,linux-stable-rc-linux-4.9.y,v4.9.224-65-g8430888b29d8,2020-05-25T16:10:01.694182Z,qemu_x86_64,libhugetlbfs/HUGETLB_MORECORE_yes-LD_PRELOAD_libhugetlbfs.so-malloc-2M-64,pass
lkft,linux-stable-rc-linux-4.9.y,v4.9.224-65-g8430888b29d8,2020-05-25T16:10:01.694182Z,qemu_x86_64,libhugetlbfs/LD_PRELOAD_libhugetlbfs.so-linkhuge-2M-64,pass
lkft,linux-stable-rc-linux-4.9.y,v4.9.224-65-g8430888b29d8,2020-05-25T16:10:01.694182Z,qemu_x86_64,libhugetlbfs/readback-2M-64,pass
lkft,linux-stable-rc-linux-4.9.y,v4.9.224-65-g8430888b29d8,2020-05-25T16:10:01.694182Z,qemu_x86_64,libhugetlbfs/HUGETLB_SHARE_0-HUGETLB_ELFMAP_W-linkhuge_rw-2M-64,pass
lkft,linux-stable-rc-linux-4.9.y,v4.9.224-65-g8430888b29d8,2020-05-25T16:10:01.694182Z,qemu_x86_64,libhugetlbfs/shmoverride_linked-2M-64,pass
lkft,linux-stable-rc-linux-4.9.y,v4.9.224-65-g8430888b29d8,2020-05-25T16:10:01.694182Z,qemu_x86_64,libhugetlbfs/HUGETLB_ELFMAP_RW-linkhuge_rw-2M-64,pass
lkft,linux-stable-rc-linux-4.9.y,v4.9.224-65-g8430888b29d8,2020-05-25T16:10:01.694182Z,qemu_x86_64,libhugetlbfs/HUGETLB_VERBOSE_0-linkhuge_nofd-2M-64,pass
lkft,linux-stable-rc-linux-4.9.y,v4.9.224-65-g8430888b29d8,2020-05-25T16:10:01.694182Z,qemu_x86_64,libhugetlbfs/alloc-instantiate-race-shared-2M-64,pass
lkft,linux-stable-rc-linux-4.9.y,v4.9.224-65-g8430888b29d8,2020-05-25T16:10:01.694182Z,qemu_x86_64,libhugetlbfs/truncate_above_4GB-2M-64,pass
lkft,linux-stable-rc-linux-4.9.y,v4.9.224-65-g8430888b29d8,2020-05-25T16:10:01.694182Z,qemu_x86_64,libhugetlbfs/malloc_manysmall-2M-64,pass
lkft,linux-stable-rc-linux-4.9.y,v4.9.224-65-g8430888b29d8,2020-05-25T16:10:01.694182Z,qemu_x86_64,libhugetlbfs/HUGETLB_SHARE_0-HUGETLB_ELFMAP_RW-linkhuge_rw-2M-64,pass
lkft,linux-stable-rc-linux-4.9.y,v4.9.224-65-g8430888b29d8,2020-05-25T16:10:01.694182Z,qemu_x86_64,libhugetlbfs/mlock-2M-64,pass
lkft,linux-stable-rc-linux-4.9.y,v4.9.224-65-g8430888b29d8,2020-05-25T16:10:01.694182Z,qemu_x86_64,libhugetlbfs/map_high_truncate_2-2M-64,pass
lkft,linux-stable-rc-linux-4.9.y,v4.9.224-65-g8430888b29d8,2020-05-25T16:10:01.694182Z,qemu_x86_64,libhugetlbfs/huge_at_4GB_normal_below_static-2M-64,pass
lkft,linux-stable-rc-linux-4.9.y,v4.9.224-65-g8430888b29d8,2020-05-25T16:10:01.694182Z,qemu_x86_64,libhugetlbfs/fork-cow-2M-64,pass
lkft,linux-stable-rc-linux-4.9.y,v4.9.224-65-g8430888b29d8,2020-05-25T16:10:01.694182Z,qemu_x86_64,libhugetlbfs/HUGETLB_ELFMAP_no-linkhuge_rw-2M-64,pass
lkft,linux-stable-rc-linux-4.9.y,v4.9.224-65-g8430888b29d8,2020-05-25T16:10:01.694182Z,qemu_x86_64,libhugetlbfs/LD_PRELOAD_libhugetlbfs.so-shmoverride_unlinked-2M-64,pass
lkft,linux-stable-rc-linux-4.9.y,v4.9.224-65-g8430888b29d8,2020-05-25T16:10:01.694182Z,qemu_x86_64,linux-log-parser/check-kernel-exception-1450052,pass
lkft,linux-stable-rc-linux-4.9.y,v4.9.224-65-g8430888b29d8,2020-05-25T16:10:01.694182Z,qemu_x86_64,linux-log-parser/check-kernel-trace-1450052,pass
lkft,linux-stable-rc-linux-4.9.y,v4.9.224-65-g8430888b29d8,2020-05-25T16:10:01.694182Z,qemu_x86_64,linux-log-parser/check-kernel-oops-1450052,pass
lkft,linux-stable-rc-linux-4.9.y,v4.9.224-65-g8430888b29d8,2020-05-25T16:10:01.694182Z,qemu_x86_64,linux-log-parser/check-kernel-fault-1450052,pass
lkft,linux-stable-rc-linux-4.9.y,v4.9.224-65-g8430888b29d8,2020-05-25T16:10:01.694182Z,qemu_x86_64,linux-log-parser/check-kernel-warning-1450052,pass
lkft,linux-stable-rc-linux-4.9.y,v4.9.224-65-g8430888b29d8,2020-05-25T16:10:01.694182Z,qemu_x86_64,linux-log-parser/check-kernel-bug-1450052,pass
lkft,linux-stable-rc-linux-4.9.y,v4.9.224-65-g8430888b29d8,2020-05-25T16:10:01.694182Z,qemu_x86_64,linux-log-parser/check-kernel-panic-1450052,pass
lkft,linux-stable-rc-linux-4.9.y,v4.9.224-65-g8430888b29d8,2020-05-25T16:10:01.694182Z,qemu_x86_64,linux-log-parser/check-kernel-exception-1450055,pass
lkft,linux-stable-rc-linux-4.9.y,v4.9.224-65-g8430888b29d8,2020-05-25T16:10:01.694182Z,qemu_x86_64,linux-log-parser/check-kernel-trace-1450055,pass
lkft,linux-stable-rc-linux-4.9.y,v4.9.224-65-g8430888b29d8,2020-05-25T16:10:01.694182Z,qemu_x86_64,linux-log-parser/check-kernel-oops-1450055,pass
lkft,linux-stable-rc-linux-4.9.y,v4.9.224-65-g8430888b29d8,2020-05-25T16:10:01.694182Z,qemu_x86_64,linux-log-parser/check-kernel-fault-1450055,pass
lkft,linux-stable-rc-linux-4.9.y,v4.9.224-65-g8430888b29d8,2020-05-25T16:10:01.694182Z,qemu_x86_64,linux-log-parser/check-kernel-warning-1450055,pass
lkft,linux-stable-rc-linux-4.9.y,v4.9.224-65-g8430888b29d8,2020-05-25T16:10:01.694182Z,qemu_x86_64,linux-log-parser/check-kernel-bug-1450055,pass
lkft,linux-stable-rc-linux-4.9.y,v4.9.224-65-g8430888b29d8,2020-05-25T16:10:01.694182Z,qemu_x86_64,linux-log-parser/check-kernel-panic-1450055,pass
lkft,linux-stable-rc-linux-4.9.y,v4.9.224-65-g8430888b29d8,2020-05-25T16:10:01.694182Z,qemu_x86_64,linux-log-parser/check-kernel-exception-1450056,pass
lkft,linux-stable-rc-linux-4.9.y,v4.9.224-65-g8430888b29d8,2020-05-25T16:10:01.694182Z,qemu_x86_64,linux-log-parser/check-kernel-trace-1450056,pass
lkft,linux-stable-rc-linux-4.9.y,v4.9.224-65-g8430888b29d8,2020-05-25T16:10:01.694182Z,qemu_x86_64,linux-log-parser/check-kernel-oops-1450056,pass
lkft,linux-stable-rc-linux-4.9.y,v4.9.224-65-g8430888b29d8,2020-05-25T16:10:01.694182Z,qemu_x86_64,linux-log-parser/check-kernel-fault-1450056,pass
lkft,linux-stable-rc-linux-4.9.y,v4.9.224-65-g8430888b29d8,2020-05-25T16:10:01.694182Z,qemu_x86_64,linux-log-parser/check-kernel-warning-1450056,pass
lkft,linux-stable-rc-linux-4.9.y,v4.9.224-65-g8430888b29d8,2020-05-25T16:10:01.694182Z,qemu_x86_64,linux-log-parser/check-kernel-bug-1450056,pass
lkft,linux-stable-rc-linux-4.9.y,v4.9.224-65-g8430888b29d8,2020-05-25T16:10:01.694182Z,qemu_x86_64,linux-log-parser/check-kernel-panic-1450056,pass
lkft,linux-stable-rc-linux-4.9.y,v4.9.224-65-g8430888b29d8,2020-05-25T16:10:01.694182Z,qemu_x86_64,ltp-sched-tests/sched_stress,pass
lkft,linux-stable-rc-linux-4.9.y,v4.9.224-65-g8430888b29d8,2020-05-25T16:10:01.694182Z,qemu_x86_64,ltp-sched-tests/pth_str02,pass
lkft,linux-stable-rc-linux-4.9.y,v4.9.224-65-g8430888b29d8,2020-05-25T16:10:01.694182Z,qemu_x86_64,ltp-sched-tests/trace_sched01,pass
lkft,linux-stable-rc-linux-4.9.y,v4.9.224-65-g8430888b29d8,2020-05-25T16:10:01.694182Z,qemu_x86_64,ltp-sched-tests/time-schedule01,pass
lkft,linux-stable-rc-linux-4.9.y,v4.9.224-65-g8430888b29d8,2020-05-25T16:10:01.694182Z,qemu_x86_64,ltp-sched-tests/pth_str03,pass
lkft,linux-stable-rc-linux-4.9.y,v4.9.224-65-g8430888b29d8,2020-05-25T16:10:01.694182Z,qemu_x86_64,ltp-sched-tests/hackbench02,pass
lkft,linux-stable-rc-linux-4.9.y,v4.9.224-65-g8430888b29d8,2020-05-25T16:10:01.694182Z,qemu_x86_64,ltp-sched-tests/hackbench01,pass
lkft,linux-stable-rc-linux-4.9.y,v4.9.224-65-g8430888b29d8,2020-05-25T16:10:01.694182Z,qemu_x86_64,ltp-sched-tests/sched_cli_serv,pass
lkft,linux-stable-rc-linux-4.9.y,v4.9.224-65-g8430888b29d8,2020-05-25T16:10:01.694182Z,qemu_x86_64,ltp-sched-tests/pth_str01,pass
lkft,linux-stable-rc-linux-4.9.y,v4.9.224-65-g8430888b29d8,2020-05-25T16:10:01.694182Z,qemu_x86_64,ltp-sched-tests/autogroup01,pass
lkft,linux-stable-rc-linux-4.9.y,v4.9.224-65-g8430888b29d8,2020-05-25T16:10:01.694182Z,qemu_x86_64,linux-log-parser/check-kernel-exception-1450060,pass
lkft,linux-stable-rc-linux-4.9.y,v4.9.224-65-g8430888b29d8,2020-05-25T16:10:01.694182Z,qemu_x86_64,linux-log-parser/check-kernel-trace-1450060,pass
lkft,linux-stable-rc-linux-4.9.y,v4.9.224-65-g8430888b29d8,2020-05-25T16:10:01.694182Z,qemu_x86_64,linux-log-parser/check-kernel-oops-1450060,pass
lkft,linux-stable-rc-linux-4.9.y,v4.9.224-65-g8430888b29d8,2020-05-25T16:10:01.694182Z,qemu_x86_64,linux-log-parser/check-kernel-fault-1450060,pass
lkft,linux-stable-rc-linux-4.9.y,v4.9.224-65-g8430888b29d8,2020-05-25T16:10:01.694182Z,qemu_x86_64,linux-log-parser/check-kernel-warning-1450060,pass
lkft,linux-stable-rc-linux-4.9.y,v4.9.224-65-g8430888b29d8,2020-05-25T16:10:01.694182Z,qemu_x86_64,linux-log-parser/check-kernel-bug-1450060,pass
lkft,linux-stable-rc-linux-4.9.y,v4.9.224-65-g8430888b29d8,2020-05-25T16:10:01.694182Z,qemu_x86_64,linux-log-parser/check-kernel-panic-1450060,pass
lkft,linux-stable-rc-linux-4.9.y,v4.9.224-65-g8430888b29d8,2020-05-25T16:10:01.694182Z,qemu_x86_64,linux-log-parser/check-kernel-exception-1450064,pass
lkft,linux-stable-rc-linux-4.9.y,v4.9.224-65-g8430888b29d8,2020-05-25T16:10:01.694182Z,qemu_x86_64,linux-log-parser/check-kernel-trace-1450064,pass
lkft,linux-stable-rc-linux-4.9.y,v4.9.224-65-g8430888b29d8,2020-05-25T16:10:01.694182Z,qemu_x86_64,linux-log-parser/check-kernel-oops-1450064,pass
lkft,linux-stable-rc-linux-4.9.y,v4.9.224-65-g8430888b29d8,2020-05-25T16:10:01.694182Z,qemu_x86_64,linux-log-parser/check-kernel-fault-1450064,pass
lkft,linux-stable-rc-linux-4.9.y,v4.9.224-65-g8430888b29d8,2020-05-25T16:10:01.694182Z,qemu_x86_64,linux-log-parser/check-kernel-warning-1450064,pass
lkft,linux-stable-rc-linux-4.9.y,v4.9.224-65-g8430888b29d8,2020-05-25T16:10:01.694182Z,qemu_x86_64,linux-log-parser/check-kernel-bug-1450064,pass
lkft,linux-stable-rc-linux-4.9.y,v4.9.224-65-g8430888b29d8,2020-05-25T16:10:01.694182Z,qemu_x86_64,linux-log-parser/check-kernel-panic-1450064,pass
lkft,linux-stable-rc-linux-4.9.y,v4.9.224-65-g8430888b29d8,2020-05-25T16:10:01.694182Z,qemu_x86_64,linux-log-parser/check-kernel-exception-1450066,pass
lkft,linux-stable-rc-linux-4.9.y,v4.9.224-65-g8430888b29d8,2020-05-25T16:10:01.694182Z,qemu_x86_64,linux-log-parser/check-kernel-trace-1450066,pass
lkft,linux-stable-rc-linux-4.9.y,v4.9.224-65-g8430888b29d8,2020-05-25T16:10:01.694182Z,qemu_x86_64,linux-log-parser/check-kernel-oops-1450066,pass
lkft,linux-stable-rc-linux-4.9.y,v4.9.224-65-g8430888b29d8,2020-05-25T16:10:01.694182Z,qemu_x86_64,linux-log-parser/check-kernel-fault-1450066,pass
lkft,linux-stable-rc-linux-4.9.y,v4.9.224-65-g8430888b29d8,2020-05-25T16:10:01.694182Z,qemu_x86_64,linux-log-parser/check-kernel-warning-1450066,pass
lkft,linux-stable-rc-linux-4.9.y,v4.9.224-65-g8430888b29d8,2020-05-25T16:10:01.694182Z,qemu_x86_64,linux-log-parser/check-kernel-bug-1450066,pass
lkft,linux-stable-rc-linux-4.9.y,v4.9.224-65-g8430888b29d8,2020-05-25T16:10:01.694182Z,qemu_x86_64,linux-log-parser/check-kernel-panic-1450066,pass
lkft,linux-stable-rc-linux-4.9.y,v4.9.224-65-g8430888b29d8,2020-05-25T16:10:01.694182Z,qemu_x86_64,ltp-securebits-tests/check_keepcaps03,pass
lkft,linux-stable-rc-linux-4.9.y,v4.9.224-65-g8430888b29d8,2020-05-25T16:10:01.694182Z,qemu_x86_64,ltp-pty-tests/pty02,pass
lkft,linux-stable-rc-linux-4.9.y,v4.9.224-65-g8430888b29d8,2020-05-25T16:10:01.694182Z,qemu_x86_64,ltp-pty-tests/pty01,pass
lkft,linux-stable-rc-linux-4.9.y,v4.9.224-65-g8430888b29d8,2020-05-25T16:10:01.694182Z,qemu_x86_64,ltp-pty-tests/pty04,skip
lkft,linux-stable-rc-linux-4.9.y,v4.9.224-65-g8430888b29d8,2020-05-25T16:10:01.694182Z,qemu_x86_64,ltp-pty-tests/hangup01,pass
lkft,linux-stable-rc-linux-4.9.y,v4.9.224-65-g8430888b29d8,2020-05-25T16:10:01.694182Z,qemu_x86_64,ltp-securebits-tests/check_keepcaps02,pass
lkft,linux-stable-rc-linux-4.9.y,v4.9.224-65-g8430888b29d8,2020-05-25T16:10:01.694182Z,qemu_x86_64,ltp-pty-tests/ptem01,pass
lkft,linux-stable-rc-linux-4.9.y,v4.9.224-65-g8430888b29d8,2020-05-25T16:10:01.694182Z,qemu_x86_64,ltp-pty-tests/pty03,skip
lkft,linux-stable-rc-linux-4.9.y,v4.9.224-65-g8430888b29d8,2020-05-25T16:10:01.694182Z,qemu_x86_64,ltp-nptl-tests/nptl01,pass
lkft,linux-stable-rc-linux-4.9.y,v4.9.224-65-g8430888b29d8,2020-05-25T16:10:01.694182Z,qemu_x86_64,ltp-securebits-tests/check_keepcaps01,pass
lkft,linux-stable-rc-linux-4.9.y,v4.9.224-65-g8430888b29d8,2020-05-25T16:10:01.694182Z,qemu_x86_64,linux-log-parser/check-kernel-exception-1450065,pass
lkft,linux-stable-rc-linux-4.9.y,v4.9.224-65-g8430888b29d8,2020-05-25T16:10:01.694182Z,qemu_x86_64,linux-log-parser/check-kernel-trace-1450065,pass
lkft,linux-stable-rc-linux-4.9.y,v4.9.224-65-g8430888b29d8,2020-05-25T16:10:01.694182Z,qemu_x86_64,linux-log-parser/check-kernel-oops-1450065,pass
lkft,linux-stable-rc-linux-4.9.y,v4.9.224-65-g8430888b29d8,2020-05-25T16:10:01.694182Z,qemu_x86_64,linux-log-parser/check-kernel-fault-1450065,pass
lkft,linux-stable-rc-linux-4.9.y,v4.9.224-65-g8430888b29d8,2020-05-25T16:10:01.694182Z,qemu_x86_64,linux-log-parser/check-kernel-warning-1450065,pass
lkft,linux-stable-rc-linux-4.9.y,v4.9.224-65-g8430888b29d8,2020-05-25T16:10:01.694182Z,qemu_x86_64,linux-log-parser/check-kernel-bug-1450065,pass
lkft,linux-stable-rc-linux-4.9.y,v4.9.224-65-g8430888b29d8,2020-05-25T16:10:01.694182Z,qemu_x86_64,linux-log-parser/check-kernel-panic-1450065,pass
lkft,linux-stable-rc-linux-4.9.y,v4.9.224-65-g8430888b29d8,2020-05-25T16:10:01.694182Z,qemu_x86_64,linux-log-parser/check-kernel-exception-1450068,pass
lkft,linux-stable-rc-linux-4.9.y,v4.9.224-65-g8430888b29d8,2020-05-25T16:10:01.694182Z,qemu_x86_64,linux-log-parser/check-kernel-trace-1450068,pass
lkft,linux-stable-rc-linux-4.9.y,v4.9.224-65-g8430888b29d8,2020-05-25T16:10:01.694182Z,qemu_x86_64,linux-log-parser/check-kernel-oops-1450068,pass
lkft,linux-stable-rc-linux-4.9.y,v4.9.224-65-g8430888b29d8,2020-05-25T16:10:01.694182Z,qemu_x86_64,linux-log-parser/check-kernel-fault-1450068,pass
lkft,linux-stable-rc-linux-4.9.y,v4.9.224-65-g8430888b29d8,2020-05-25T16:10:01.694182Z,qemu_x86_64,linux-log-parser/check-kernel-warning-1450068,pass
lkft,linux-stable-rc-linux-4.9.y,v4.9.224-65-g8430888b29d8,2020-05-25T16:10:01.694182Z,qemu_x86_64,linux-log-parser/check-kernel-bug-1450068,pass
lkft,linux-stable-rc-linux-4.9.y,v4.9.224-65-g8430888b29d8,2020-05-25T16:10:01.694182Z,qemu_x86_64,linux-log-parser/check-kernel-panic-1450068,pass
lkft,linux-stable-rc-linux-4.9.y,v4.9.224-65-g8430888b29d8,2020-05-25T16:10:01.694182Z,qemu_x86_64,linux-log-parser/check-kernel-exception-1450067,pass
lkft,linux-stable-rc-linux-4.9.y,v4.9.224-65-g8430888b29d8,2020-05-25T16:10:01.694182Z,qemu_x86_64,linux-log-parser/check-kernel-trace-1450067,pass
lkft,linux-stable-rc-linux-4.9.y,v4.9.224-65-g8430888b29d8,2020-05-25T16:10:01.694182Z,qemu_x86_64,linux-log-parser/check-kernel-oops-1450067,pass
lkft,linux-stable-rc-linux-4.9.y,v4.9.224-65-g8430888b29d8,2020-05-25T16:10:01.694182Z,qemu_x86_64,linux-log-parser/check-kernel-fault-1450067,pass
lkft,linux-stable-rc-linux-4.9.y,v4.9.224-65-g8430888b29d8,2020-05-25T16:10:01.694182Z,qemu_x86_64,linux-log-parser/check-kernel-warning-1450067,pass
lkft,linux-stable-rc-linux-4.9.y,v4.9.224-65-g8430888b29d8,2020-05-25T16:10:01.694182Z,qemu_x86_64,linux-log-parser/check-kernel-bug-1450067,pass
lkft,linux-stable-rc-linux-4.9.y,v4.9.224-65-g8430888b29d8,2020-05-25T16:10:01.694182Z,qemu_x86_64,linux-log-parser/check-kernel-panic-1450067,pass
lkft,linux-stable-rc-linux-4.9.y,v4.9.224-65-g8430888b29d8,2020-05-25T16:10:01.694182Z,qemu_x86_64,linux-log-parser/check-kernel-exception-1450046,pass
lkft,linux-stable-rc-linux-4.9.y,v4.9.224-65-g8430888b29d8,2020-05-25T16:10:01.694182Z,qemu_x86_64,linux-log-parser/check-kernel-trace-1450046,pass
lkft,linux-stable-rc-linux-4.9.y,v4.9.224-65-g8430888b29d8,2020-05-25T16:10:01.694182Z,qemu_x86_64,linux-log-parser/check-kernel-oops-1450046,pass
lkft,linux-stable-rc-linux-4.9.y,v4.9.224-65-g8430888b29d8,2020-05-25T16:10:01.694182Z,qemu_x86_64,linux-log-parser/check-kernel-fault-1450046,pass
lkft,linux-stable-rc-linux-4.9.y,v4.9.224-65-g8430888b29d8,2020-05-25T16:10:01.694182Z,qemu_x86_64,linux-log-parser/check-kernel-warning-1450046,pass
lkft,linux-stable-rc-linux-4.9.y,v4.9.224-65-g8430888b29d8,2020-05-25T16:10:01.694182Z,qemu_x86_64,linux-log-parser/check-kernel-bug-1450046,pass
lkft,linux-stable-rc-linux-4.9.y,v4.9.224-65-g8430888b29d8,2020-05-25T16:10:01.694182Z,qemu_x86_64,linux-log-parser/check-kernel-panic-1450046,pass
lkft,linux-stable-rc-linux-4.9.y,v4.9.224-65-g8430888b29d8,2020-05-25T16:10:01.694182Z,qemu_x86_64,linux-log-parser/check-kernel-exception-1450042,pass
lkft,linux-stable-rc-linux-4.9.y,v4.9.224-65-g8430888b29d8,2020-05-25T16:10:01.694182Z,qemu_x86_64,linux-log-parser/check-kernel-trace-1450042,pass
lkft,linux-stable-rc-linux-4.9.y,v4.9.224-65-g8430888b29d8,2020-05-25T16:10:01.694182Z,qemu_x86_64,linux-log-parser/check-kernel-oops-1450042,pass
lkft,linux-stable-rc-linux-4.9.y,v4.9.224-65-g8430888b29d8,2020-05-25T16:10:01.694182Z,qemu_x86_64,linux-log-parser/check-kernel-fault-1450042,pass
lkft,linux-stable-rc-linux-4.9.y,v4.9.224-65-g8430888b29d8,2020-05-25T16:10:01.694182Z,qemu_x86_64,linux-log-parser/check-kernel-warning-1450042,pass
lkft,linux-stable-rc-linux-4.9.y,v4.9.224-65-g8430888b29d8,2020-05-25T16:10:01.694182Z,qemu_x86_64,linux-log-parser/check-kernel-bug-1450042,pass
lkft,linux-stable-rc-linux-4.9.y,v4.9.224-65-g8430888b29d8,2020-05-25T16:10:01.694182Z,qemu_x86_64,linux-log-parser/check-kernel-panic-1450042,pass
lkft,linux-stable-rc-linux-4.9.y,v4.9.224-65-g8430888b29d8,2020-05-25T16:10:01.694182Z,qemu_x86_64,linux-log-parser/check-kernel-exception-1450057,pass
lkft,linux-stable-rc-linux-4.9.y,v4.9.224-65-g8430888b29d8,2020-05-25T16:10:01.694182Z,qemu_x86_64,linux-log-parser/check-kernel-trace-1450057,pass
lkft,linux-stable-rc-linux-4.9.y,v4.9.224-65-g8430888b29d8,2020-05-25T16:10:01.694182Z,qemu_x86_64,linux-log-parser/check-kernel-oops-1450057,pass
lkft,linux-stable-rc-linux-4.9.y,v4.9.224-65-g8430888b29d8,2020-05-25T16:10:01.694182Z,qemu_x86_64,linux-log-parser/check-kernel-fault-1450057,pass
lkft,linux-stable-rc-linux-4.9.y,v4.9.224-65-g8430888b29d8,2020-05-25T16:10:01.694182Z,qemu_x86_64,linux-log-parser/check-kernel-warning-1450057,pass
lkft,linux-stable-rc-linux-4.9.y,v4.9.224-65-g8430888b29d8,2020-05-25T16:10:01.694182Z,qemu_x86_64,linux-log-parser/check-kernel-bug-1450057,pass
lkft,linux-stable-rc-linux-4.9.y,v4.9.224-65-g8430888b29d8,2020-05-25T16:10:01.694182Z,qemu_x86_64,linux-log-parser/check-kernel-panic-1450057,pass
lkft,linux-stable-rc-linux-4.9.y,v4.9.224-65-g8430888b29d8,2020-05-25T16:10:01.694182Z,x86,linux-log-parser/check-kernel-exception-1450043,pass
lkft,linux-stable-rc-linux-4.9.y,v4.9.224-65-g8430888b29d8,2020-05-25T16:10:01.694182Z,x86,linux-log-parser/check-kernel-trace-1450043,pass
lkft,linux-stable-rc-linux-4.9.y,v4.9.224-65-g8430888b29d8,2020-05-25T16:10:01.694182Z,x86,linux-log-parser/check-kernel-oops-1450043,pass
lkft,linux-stable-rc-linux-4.9.y,v4.9.224-65-g8430888b29d8,2020-05-25T16:10:01.694182Z,x86,linux-log-parser/check-kernel-fault-1450043,pass
lkft,linux-stable-rc-linux-4.9.y,v4.9.224-65-g8430888b29d8,2020-05-25T16:10:01.694182Z,x86,linux-log-parser/check-kernel-warning-1450043,pass
lkft,linux-stable-rc-linux-4.9.y,v4.9.224-65-g8430888b29d8,2020-05-25T16:10:01.694182Z,x86,linux-log-parser/check-kernel-bug-1450043,pass
lkft,linux-stable-rc-linux-4.9.y,v4.9.224-65-g8430888b29d8,2020-05-25T16:10:01.694182Z,x86,linux-log-parser/check-kernel-panic-1450043,pass
lkft,linux-stable-rc-linux-4.9.y,v4.9.224-65-g8430888b29d8,2020-05-25T16:10:01.694182Z,x86,linux-log-parser/check-kernel-exception-1450058,pass
lkft,linux-stable-rc-linux-4.9.y,v4.9.224-65-g8430888b29d8,2020-05-25T16:10:01.694182Z,x86,linux-log-parser/check-kernel-trace-1450058,pass
lkft,linux-stable-rc-linux-4.9.y,v4.9.224-65-g8430888b29d8,2020-05-25T16:10:01.694182Z,x86,linux-log-parser/check-kernel-oops-1450058,pass
lkft,linux-stable-rc-linux-4.9.y,v4.9.224-65-g8430888b29d8,2020-05-25T16:10:01.694182Z,x86,linux-log-parser/check-kernel-fault-1450058,pass
lkft,linux-stable-rc-linux-4.9.y,v4.9.224-65-g8430888b29d8,2020-05-25T16:10:01.694182Z,x86,linux-log-parser/check-kernel-warning-1450058,pass
lkft,linux-stable-rc-linux-4.9.y,v4.9.224-65-g8430888b29d8,2020-05-25T16:10:01.694182Z,x86,linux-log-parser/check-kernel-bug-1450058,pass
lkft,linux-stable-rc-linux-4.9.y,v4.9.224-65-g8430888b29d8,2020-05-25T16:10:01.694182Z,x86,linux-log-parser/check-kernel-panic-1450058,pass
lkft,linux-stable-rc-linux-4.9.y,v4.9.224-65-g8430888b29d8,2020-05-25T16:10:01.694182Z,x86,linux-log-parser/check-kernel-exception-1450054,pass
lkft,linux-stable-rc-linux-4.9.y,v4.9.224-65-g8430888b29d8,2020-05-25T16:10:01.694182Z,x86,linux-log-parser/check-kernel-trace-1450054,pass
lkft,linux-stable-rc-linux-4.9.y,v4.9.224-65-g8430888b29d8,2020-05-25T16:10:01.694182Z,x86,linux-log-parser/check-kernel-oops-1450054,pass
lkft,linux-stable-rc-linux-4.9.y,v4.9.224-65-g8430888b29d8,2020-05-25T16:10:01.694182Z,x86,linux-log-parser/check-kernel-fault-1450054,pass
lkft,linux-stable-rc-linux-4.9.y,v4.9.224-65-g8430888b29d8,2020-05-25T16:10:01.694182Z,x86,linux-log-parser/check-kernel-warning-1450054,pass
lkft,linux-stable-rc-linux-4.9.y,v4.9.224-65-g8430888b29d8,2020-05-25T16:10:01.694182Z,x86,linux-log-parser/check-kernel-bug-1450054,pass
lkft,linux-stable-rc-linux-4.9.y,v4.9.224-65-g8430888b29d8,2020-05-25T16:10:01.694182Z,x86,linux-log-parser/check-kernel-panic-1450054,pass
lkft,linux-stable-rc-linux-4.9.y,v4.9.224-65-g8430888b29d8,2020-05-25T16:10:01.694182Z,x86,linux-log-parser/check-kernel-exception-1450063,pass
lkft,linux-stable-rc-linux-4.9.y,v4.9.224-65-g8430888b29d8,2020-05-25T16:10:01.694182Z,x86,linux-log-parser/check-kernel-trace-1450063,pass
lkft,linux-stable-rc-linux-4.9.y,v4.9.224-65-g8430888b29d8,2020-05-25T16:10:01.694182Z,x86,linux-log-parser/check-kernel-oops-1450063,pass
lkft,linux-stable-rc-linux-4.9.y,v4.9.224-65-g8430888b29d8,2020-05-25T16:10:01.694182Z,x86,linux-log-parser/check-kernel-fault-1450063,pass
lkft,linux-stable-rc-linux-4.9.y,v4.9.224-65-g8430888b29d8,2020-05-25T16:10:01.694182Z,x86,linux-log-parser/check-kernel-warning-1450063,pass
lkft,linux-stable-rc-linux-4.9.y,v4.9.224-65-g8430888b29d8,2020-05-25T16:10:01.694182Z,x86,linux-log-parser/check-kernel-bug-1450063,pass
lkft,linux-stable-rc-linux-4.9.y,v4.9.224-65-g8430888b29d8,2020-05-25T16:10:01.694182Z,x86,linux-log-parser/check-kernel-panic-1450063,pass
lkft,linux-stable-rc-linux-4.9.y,v4.9.224-65-g8430888b29d8,2020-05-25T16:10:01.694182Z,x86,linux-log-parser/check-kernel-exception-1450059,pass
lkft,linux-stable-rc-linux-4.9.y,v4.9.224-65-g8430888b29d8,2020-05-25T16:10:01.694182Z,x86,linux-log-parser/check-kernel-trace-1450059,pass
lkft,linux-stable-rc-linux-4.9.y,v4.9.224-65-g8430888b29d8,2020-05-25T16:10:01.694182Z,x86,linux-log-parser/check-kernel-oops-1450059,pass
lkft,linux-stable-rc-linux-4.9.y,v4.9.224-65-g8430888b29d8,2020-05-25T16:10:01.694182Z,x86,linux-log-parser/check-kernel-fault-1450059,pass
lkft,linux-stable-rc-linux-4.9.y,v4.9.224-65-g8430888b29d8,2020-05-25T16:10:01.694182Z,x86,linux-log-parser/check-kernel-warning-1450059,pass
lkft,linux-stable-rc-linux-4.9.y,v4.9.224-65-g8430888b29d8,2020-05-25T16:10:01.694182Z,x86,linux-log-parser/check-kernel-bug-1450059,pass
lkft,linux-stable-rc-linux-4.9.y,v4.9.224-65-g8430888b29d8,2020-05-25T16:10:01.694182Z,x86,linux-log-parser/check-kernel-panic-1450059,pass
lkft,linux-stable-rc-linux-4.9.y,v4.9.224-65-g8430888b29d8,2020-05-25T16:10:01.694182Z,x86,linux-log-parser/check-kernel-exception-1450061,pass
lkft,linux-stable-rc-linux-4.9.y,v4.9.224-65-g8430888b29d8,2020-05-25T16:10:01.694182Z,x86,linux-log-parser/check-kernel-trace-1450061,pass
lkft,linux-stable-rc-linux-4.9.y,v4.9.224-65-g8430888b29d8,2020-05-25T16:10:01.694182Z,x86,linux-log-parser/check-kernel-oops-1450061,pass
lkft,linux-stable-rc-linux-4.9.y,v4.9.224-65-g8430888b29d8,2020-05-25T16:10:01.694182Z,x86,linux-log-parser/check-kernel-fault-1450061,pass
lkft,linux-stable-rc-linux-4.9.y,v4.9.224-65-g8430888b29d8,2020-05-25T16:10:01.694182Z,x86,linux-log-parser/check-kernel-warning-1450061,pass
lkft,linux-stable-rc-linux-4.9.y,v4.9.224-65-g8430888b29d8,2020-05-25T16:10:01.694182Z,x86,linux-log-parser/check-kernel-bug-1450061,pass
lkft,linux-stable-rc-linux-4.9.y,v4.9.224-65-g8430888b29d8,2020-05-25T16:10:01.694182Z,x86,linux-log-parser/check-kernel-panic-1450061,pass
lkft,linux-stable-rc-linux-4.9.y,v4.9.224-65-g8430888b29d8,2020-05-25T16:10:01.694182Z,x86,linux-log-parser/check-kernel-exception-1450062,pass
lkft,linux-stable-rc-linux-4.9.y,v4.9.224-65-g8430888b29d8,2020-05-25T16:10:01.694182Z,x86,linux-log-parser/check-kernel-trace-1450062,pass
lkft,linux-stable-rc-linux-4.9.y,v4.9.224-65-g8430888b29d8,2020-05-25T16:10:01.694182Z,x86,linux-log-parser/check-kernel-oops-1450062,pass
lkft,linux-stable-rc-linux-4.9.y,v4.9.224-65-g8430888b29d8,2020-05-25T16:10:01.694182Z,x86,linux-log-parser/check-kernel-fault-1450062,pass
lkft,linux-stable-rc-linux-4.9.y,v4.9.224-65-g8430888b29d8,2020-05-25T16:10:01.694182Z,x86,linux-log-parser/check-kernel-warning-1450062,pass
lkft,linux-stable-rc-linux-4.9.y,v4.9.224-65-g8430888b29d8,2020-05-25T16:10:01.694182Z,x86,linux-log-parser/check-kernel-bug-1450062,pass
lkft,linux-stable-rc-linux-4.9.y,v4.9.224-65-g8430888b29d8,2020-05-25T16:10:01.694182Z,x86,linux-log-parser/check-kernel-panic-1450062,pass
lkft,linux-stable-rc-linux-4.9.y,v4.9.224-65-g8430888b29d8,2020-05-25T16:10:01.694182Z,x86,linux-log-parser/check-kernel-exception-1450041,pass
lkft,linux-stable-rc-linux-4.9.y,v4.9.224-65-g8430888b29d8,2020-05-25T16:10:01.694182Z,x86,linux-log-parser/check-kernel-trace-1450041,pass
lkft,linux-stable-rc-linux-4.9.y,v4.9.224-65-g8430888b29d8,2020-05-25T16:10:01.694182Z,x86,linux-log-parser/check-kernel-oops-1450041,pass
lkft,linux-stable-rc-linux-4.9.y,v4.9.224-65-g8430888b29d8,2020-05-25T16:10:01.694182Z,x86,linux-log-parser/check-kernel-fault-1450041,pass
lkft,linux-stable-rc-linux-4.9.y,v4.9.224-65-g8430888b29d8,2020-05-25T16:10:01.694182Z,x86,linux-log-parser/check-kernel-warning-1450041,pass
lkft,linux-stable-rc-linux-4.9.y,v4.9.224-65-g8430888b29d8,2020-05-25T16:10:01.694182Z,x86,linux-log-parser/check-kernel-bug-1450041,pass
lkft,linux-stable-rc-linux-4.9.y,v4.9.224-65-g8430888b29d8,2020-05-25T16:10:01.694182Z,x86,linux-log-parser/check-kernel-panic-1450041,pass
lkft,linux-stable-rc-linux-4.9.y,v4.9.224-65-g8430888b29d8,2020-05-25T16:10:01.694182Z,x86,linux-log-parser/check-kernel-exception-1450036,pass
lkft,linux-stable-rc-linux-4.9.y,v4.9.224-65-g8430888b29d8,2020-05-25T16:10:01.694182Z,x86,linux-log-parser/check-kernel-trace-1450036,pass
lkft,linux-stable-rc-linux-4.9.y,v4.9.224-65-g8430888b29d8,2020-05-25T16:10:01.694182Z,x86,linux-log-parser/check-kernel-oops-1450036,pass
lkft,linux-stable-rc-linux-4.9.y,v4.9.224-65-g8430888b29d8,2020-05-25T16:10:01.694182Z,x86,linux-log-parser/check-kernel-fault-1450036,pass
lkft,linux-stable-rc-linux-4.9.y,v4.9.224-65-g8430888b29d8,2020-05-25T16:10:01.694182Z,x86,linux-log-parser/check-kernel-warning-1450036,pass
lkft,linux-stable-rc-linux-4.9.y,v4.9.224-65-g8430888b29d8,2020-05-25T16:10:01.694182Z,x86,linux-log-parser/check-kernel-bug-1450036,pass
lkft,linux-stable-rc-linux-4.9.y,v4.9.224-65-g8430888b29d8,2020-05-25T16:10:01.694182Z,x86,linux-log-parser/check-kernel-panic-1450036,pass
lkft,linux-stable-rc-linux-4.9.y,v4.9.224-65-g8430888b29d8,2020-05-25T16:10:01.694182Z,x86,linux-log-parser/check-kernel-exception-1450037,pass
lkft,linux-stable-rc-linux-4.9.y,v4.9.224-65-g8430888b29d8,2020-05-25T16:10:01.694182Z,x86,linux-log-parser/check-kernel-trace-1450037,pass
lkft,linux-stable-rc-linux-4.9.y,v4.9.224-65-g8430888b29d8,2020-05-25T16:10:01.694182Z,x86,linux-log-parser/check-kernel-oops-1450037,pass
lkft,linux-stable-rc-linux-4.9.y,v4.9.224-65-g8430888b29d8,2020-05-25T16:10:01.694182Z,x86,linux-log-parser/check-kernel-fault-1450037,pass
lkft,linux-stable-rc-linux-4.9.y,v4.9.224-65-g8430888b29d8,2020-05-25T16:10:01.694182Z,x86,linux-log-parser/check-kernel-warning-1450037,pass
lkft,linux-stable-rc-linux-4.9.y,v4.9.224-65-g8430888b29d8,2020-05-25T16:10:01.694182Z,x86,linux-log-parser/check-kernel-bug-1450037,pass
lkft,linux-stable-rc-linux-4.9.y,v4.9.224-65-g8430888b29d8,2020-05-25T16:10:01.694182Z,x86,linux-log-parser/check-kernel-panic-1450037,pass
lkft,linux-stable-rc-linux-4.9.y,v4.9.224-65-g8430888b29d8,2020-05-25T16:10:01.694182Z,x86,linux-log-parser/check-kernel-exception-1450038,pass
lkft,linux-stable-rc-linux-4.9.y,v4.9.224-65-g8430888b29d8,2020-05-25T16:10:01.694182Z,x86,linux-log-parser/check-kernel-trace-1450038,pass
lkft,linux-stable-rc-linux-4.9.y,v4.9.224-65-g8430888b29d8,2020-05-25T16:10:01.694182Z,x86,linux-log-parser/check-kernel-oops-1450038,pass
lkft,linux-stable-rc-linux-4.9.y,v4.9.224-65-g8430888b29d8,2020-05-25T16:10:01.694182Z,x86,linux-log-parser/check-kernel-fault-1450038,pass
lkft,linux-stable-rc-linux-4.9.y,v4.9.224-65-g8430888b29d8,2020-05-25T16:10:01.694182Z,x86,linux-log-parser/check-kernel-warning-1450038,pass
lkft,linux-stable-rc-linux-4.9.y,v4.9.224-65-g8430888b29d8,2020-05-25T16:10:01.694182Z,x86,linux-log-parser/check-kernel-bug-1450038,pass
lkft,linux-stable-rc-linux-4.9.y,v4.9.224-65-g8430888b29d8,2020-05-25T16:10:01.694182Z,x86,linux-log-parser/check-kernel-panic-1450038,pass
lkft,linux-stable-rc-linux-4.9.y,v4.9.224-65-g8430888b29d8,2020-05-25T16:10:01.694182Z,x86,linux-log-parser/check-kernel-exception-1450039,pass
lkft,linux-stable-rc-linux-4.9.y,v4.9.224-65-g8430888b29d8,2020-05-25T16:10:01.694182Z,x86,linux-log-parser/check-kernel-trace-1450039,pass
lkft,linux-stable-rc-linux-4.9.y,v4.9.224-65-g8430888b29d8,2020-05-25T16:10:01.694182Z,x86,linux-log-parser/check-kernel-oops-1450039,pass
lkft,linux-stable-rc-linux-4.9.y,v4.9.224-65-g8430888b29d8,2020-05-25T16:10:01.694182Z,x86,linux-log-parser/check-kernel-fault-1450039,pass
lkft,linux-stable-rc-linux-4.9.y,v4.9.224-65-g8430888b29d8,2020-05-25T16:10:01.694182Z,x86,linux-log-parser/check-kernel-warning-1450039,pass
lkft,linux-stable-rc-linux-4.9.y,v4.9.224-65-g8430888b29d8,2020-05-25T16:10:01.694182Z,x86,linux-log-parser/check-kernel-bug-1450039,pass
lkft,linux-stable-rc-linux-4.9.y,v4.9.224-65-g8430888b29d8,2020-05-25T16:10:01.694182Z,x86,linux-log-parser/check-kernel-panic-1450039,pass
lkft,linux-stable-rc-linux-4.9.y,v4.9.224-65-g8430888b29d8,2020-05-25T16:10:01.694182Z,x86,linux-log-parser/check-kernel-exception-1450040,pass
lkft,linux-stable-rc-linux-4.9.y,v4.9.224-65-g8430888b29d8,2020-05-25T16:10:01.694182Z,x86,linux-log-parser/check-kernel-trace-1450040,pass
lkft,linux-stable-rc-linux-4.9.y,v4.9.224-65-g8430888b29d8,2020-05-25T16:10:01.694182Z,x86,linux-log-parser/check-kernel-oops-1450040,pass
lkft,linux-stable-rc-linux-4.9.y,v4.9.224-65-g8430888b29d8,2020-05-25T16:10:01.694182Z,x86,linux-log-parser/check-kernel-fault-1450040,pass
lkft,linux-stable-rc-linux-4.9.y,v4.9.224-65-g8430888b29d8,2020-05-25T16:10:01.694182Z,x86,linux-log-parser/check-kernel-warning-1450040,pass
lkft,linux-stable-rc-linux-4.9.y,v4.9.224-65-g8430888b29d8,2020-05-25T16:10:01.694182Z,x86,linux-log-parser/check-kernel-bug-1450040,pass
lkft,linux-stable-rc-linux-4.9.y,v4.9.224-65-g8430888b29d8,2020-05-25T16:10:01.694182Z,x86,linux-log-parser/check-kernel-panic-1450040,pass
lkft,linux-stable-rc-linux-4.9.y,v4.9.224-65-g8430888b29d8,2020-05-25T16:10:01.694182Z,x86,linux-log-parser/check-kernel-exception-1450051,pass
lkft,linux-stable-rc-linux-4.9.y,v4.9.224-65-g8430888b29d8,2020-05-25T16:10:01.694182Z,x86,linux-log-parser/check-kernel-trace-1450051,pass
lkft,linux-stable-rc-linux-4.9.y,v4.9.224-65-g8430888b29d8,2020-05-25T16:10:01.694182Z,x86,linux-log-parser/check-kernel-oops-1450051,pass
lkft,linux-stable-rc-linux-4.9.y,v4.9.224-65-g8430888b29d8,2020-05-25T16:10:01.694182Z,x86,linux-log-parser/check-kernel-fault-1450051,pass
lkft,linux-stable-rc-linux-4.9.y,v4.9.224-65-g8430888b29d8,2020-05-25T16:10:01.694182Z,x86,linux-log-parser/check-kernel-warning-1450051,pass
lkft,linux-stable-rc-linux-4.9.y,v4.9.224-65-g8430888b29d8,2020-05-25T16:10:01.694182Z,x86,linux-log-parser/check-kernel-bug-1450051,pass
lkft,linux-stable-rc-linux-4.9.y,v4.9.224-65-g8430888b29d8,2020-05-25T16:10:01.694182Z,x86,linux-log-parser/check-kernel-panic-1450051,pass
lkft,linux-stable-rc-linux-4.9.y,v4.9.224-65-g8430888b29d8,2020-05-25T16:10:01.694182Z,x86,linux-log-parser/check-kernel-exception-1450048,pass
lkft,linux-stable-rc-linux-4.9.y,v4.9.224-65-g8430888b29d8,2020-05-25T16:10:01.694182Z,x86,linux-log-parser/check-kernel-trace-1450048,pass
lkft,linux-stable-rc-linux-4.9.y,v4.9.224-65-g8430888b29d8,2020-05-25T16:10:01.694182Z,x86,linux-log-parser/check-kernel-oops-1450048,pass
lkft,linux-stable-rc-linux-4.9.y,v4.9.224-65-g8430888b29d8,2020-05-25T16:10:01.694182Z,x86,linux-log-parser/check-kernel-fault-1450048,pass
lkft,linux-stable-rc-linux-4.9.y,v4.9.224-65-g8430888b29d8,2020-05-25T16:10:01.694182Z,x86,linux-log-parser/check-kernel-warning-1450048,pass
lkft,linux-stable-rc-linux-4.9.y,v4.9.224-65-g8430888b29d8,2020-05-25T16:10:01.694182Z,x86,linux-log-parser/check-kernel-bug-1450048,pass
lkft,linux-stable-rc-linux-4.9.y,v4.9.224-65-g8430888b29d8,2020-05-25T16:10:01.694182Z,x86,linux-log-parser/check-kernel-panic-1450048,pass
lkft,linux-stable-rc-linux-4.9.y,v4.9.224-65-g8430888b29d8,2020-05-25T16:10:01.694182Z,x86,linux-log-parser/check-kernel-exception-1450045,pass
lkft,linux-stable-rc-linux-4.9.y,v4.9.224-65-g8430888b29d8,2020-05-25T16:10:01.694182Z,x86,linux-log-parser/check-kernel-trace-1450045,pass
lkft,linux-stable-rc-linux-4.9.y,v4.9.224-65-g8430888b29d8,2020-05-25T16:10:01.694182Z,x86,linux-log-parser/check-kernel-oops-1450045,pass
lkft,linux-stable-rc-linux-4.9.y,v4.9.224-65-g8430888b29d8,2020-05-25T16:10:01.694182Z,x86,linux-log-parser/check-kernel-fault-1450045,pass
lkft,linux-stable-rc-linux-4.9.y,v4.9.224-65-g8430888b29d8,2020-05-25T16:10:01.694182Z,x86,linux-log-parser/check-kernel-warning-1450045,pass
lkft,linux-stable-rc-linux-4.9.y,v4.9.224-65-g8430888b29d8,2020-05-25T16:10:01.694182Z,x86,linux-log-parser/check-kernel-bug-1450045,pass
lkft,linux-stable-rc-linux-4.9.y,v4.9.224-65-g8430888b29d8,2020-05-25T16:10:01.694182Z,x86,linux-log-parser/check-kernel-panic-1450045,pass
lkft,linux-stable-rc-linux-4.9.y,v4.9.224-65-g8430888b29d8,2020-05-25T16:10:01.694182Z,qemu_x86_64,ltp-mm-tests/data_space,pass
lkft,linux-stable-rc-linux-4.9.y,v4.9.224-65-g8430888b29d8,2020-05-25T16:10:01.694182Z,qemu_x86_64,ltp-mm-tests/ksm02,skip
lkft,linux-stable-rc-linux-4.9.y,v4.9.224-65-g8430888b29d8,2020-05-25T16:10:01.694182Z,qemu_x86_64,ltp-mm-tests/ksm06_1,skip
lkft,linux-stable-rc-linux-4.9.y,v4.9.224-65-g8430888b29d8,2020-05-25T16:10:01.694182Z,qemu_x86_64,ltp-mm-tests/shmt04,pass
lkft,linux-stable-rc-linux-4.9.y,v4.9.224-65-g8430888b29d8,2020-05-25T16:10:01.694182Z,qemu_x86_64,ltp-mm-tests/shmt07,pass
lkft,linux-stable-rc-linux-4.9.y,v4.9.224-65-g8430888b29d8,2020-05-25T16:10:01.694182Z,qemu_x86_64,ltp-mm-tests/mm02,pass
lkft,linux-stable-rc-linux-4.9.y,v4.9.224-65-g8430888b29d8,2020-05-25T16:10:01.694182Z,qemu_x86_64,ltp-mm-tests/mtest01w,pass
lkft,linux-stable-rc-linux-4.9.y,v4.9.224-65-g8430888b29d8,2020-05-25T16:10:01.694182Z,qemu_x86_64,ltp-mm-tests/thp03,skip
lkft,linux-stable-rc-linux-4.9.y,v4.9.224-65-g8430888b29d8,2020-05-25T16:10:01.694182Z,qemu_x86_64,ltp-mm-tests/mmapstress01,pass
lkft,linux-stable-rc-linux-4.9.y,v4.9.224-65-g8430888b29d8,2020-05-25T16:10:01.694182Z,qemu_x86_64,ltp-mm-tests/oom01,pass
lkft,linux-stable-rc-linux-4.9.y,v4.9.224-65-g8430888b29d8,2020-05-25T16:10:01.694182Z,qemu_x86_64,ltp-mm-tests/shmt03,pass
lkft,linux-stable-rc-linux-4.9.y,v4.9.224-65-g8430888b29d8,2020-05-25T16:10:01.694182Z,qemu_x86_64,ltp-mm-tests/ksm03_1,pass
lkft,linux-stable-rc-linux-4.9.y,v4.9.224-65-g8430888b29d8,2020-05-25T16:10:01.694182Z,qemu_x86_64,ltp-hugetlb-tests/hugeshmget03,pass
lkft,linux-stable-rc-linux-4.9.y,v4.9.224-65-g8430888b29d8,2020-05-25T16:10:01.694182Z,qemu_x86_64,ltp-mm-tests/mtest01,pass
lkft,linux-stable-rc-linux-4.9.y,v4.9.224-65-g8430888b29d8,2020-05-25T16:10:01.694182Z,qemu_x86_64,ltp-mm-tests/mmap10_3,pass
lkft,linux-stable-rc-linux-4.9.y,v4.9.224-65-g8430888b29d8,2020-05-25T16:10:01.694182Z,qemu_x86_64,ltp-mm-tests/mem03,pass
lkft,linux-stable-rc-linux-4.9.y,v4.9.224-65-g8430888b29d8,2020-05-25T16:10:01.694182Z,qemu_x86_64,ltp-mm-tests/vma02,skip
lkft,linux-stable-rc-linux-4.9.y,v4.9.224-65-g8430888b29d8,2020-05-25T16:10:01.694182Z,qemu_x86_64,ltp-hugetlb-tests/hugemmap06,pass
lkft,linux-stable-rc-linux-4.9.y,v4.9.224-65-g8430888b29d8,2020-05-25T16:10:01.694182Z,qemu_x86_64,ltp-hugetlb-tests/hugeshmat02,pass
lkft,linux-stable-rc-linux-4.9.y,v4.9.224-65-g8430888b29d8,2020-05-25T16:10:01.694182Z,qemu_x86_64,ltp-mm-tests/vma04,skip
lkft,linux-stable-rc-linux-4.9.y,v4.9.224-65-g8430888b29d8,2020-05-25T16:10:01.694182Z,qemu_x86_64,ltp-mm-tests/mmapstress02,pass
lkft,linux-stable-rc-linux-4.9.y,v4.9.224-65-g8430888b29d8,2020-05-25T16:10:01.694182Z,qemu_x86_64,ltp-hugetlb-tests/hugeshmctl02,pass
lkft,linux-stable-rc-linux-4.9.y,v4.9.224-65-g8430888b29d8,2020-05-25T16:10:01.694182Z,qemu_x86_64,ltp-mm-tests/mtest05,pass
lkft,linux-stable-rc-linux-4.9.y,v4.9.224-65-g8430888b29d8,2020-05-25T16:10:01.694182Z,qemu_x86_64,ltp-mm-tests/overcommit_memory06,pass
lkft,linux-stable-rc-linux-4.9.y,v4.9.224-65-g8430888b29d8,2020-05-25T16:10:01.694182Z,qemu_x86_64,ltp-mm-tests/mmapstress08,pass
lkft,linux-stable-rc-linux-4.9.y,v4.9.224-65-g8430888b29d8,2020-05-25T16:10:01.694182Z,qemu_x86_64,ltp-mm-tests/mmapstress04,pass
lkft,linux-stable-rc-linux-4.9.y,v4.9.224-65-g8430888b29d8,2020-05-25T16:10:01.694182Z,qemu_x86_64,ltp-mm-tests/mmapstress03,pass
lkft,linux-stable-rc-linux-4.9.y,v4.9.224-65-g8430888b29d8,2020-05-25T16:10:01.694182Z,qemu_x86_64,ltp-hugetlb-tests/hugeshmctl01,pass
lkft,linux-stable-rc-linux-4.9.y,v4.9.224-65-g8430888b29d8,2020-05-25T16:10:01.694182Z,qemu_x86_64,ltp-mm-tests/mmapstress09,pass
lkft,linux-stable-rc-linux-4.9.y,v4.9.224-65-g8430888b29d8,2020-05-25T16:10:01.694182Z,qemu_x86_64,ltp-hugetlb-tests/hugeshmget02,pass
lkft,linux-stable-rc-linux-4.9.y,v4.9.224-65-g8430888b29d8,2020-05-25T16:10:01.694182Z,qemu_x86_64,ltp-hugetlb-tests/hugemmap05,pass
lkft,linux-stable-rc-linux-4.9.y,v4.9.224-65-g8430888b29d8,2020-05-25T16:10:01.694182Z,qemu_x86_64,ltp-hugetlb-tests/hugeshmctl03,pass
lkft,linux-stable-rc-linux-4.9.y,v4.9.224-65-g8430888b29d8,2020-05-25T16:10:01.694182Z,qemu_x86_64,ltp-mm-tests/shmt02,pass
lkft,linux-stable-rc-linux-4.9.y,v4.9.224-65-g8430888b29d8,2020-05-25T16:10:01.694182Z,qemu_x86_64,ltp-mm-tests/mmapstress06,pass
lkft,linux-stable-rc-linux-4.9.y,v4.9.224-65-g8430888b29d8,2020-05-25T16:10:01.694182Z,qemu_x86_64,ltp-mm-tests/ksm02_1,skip
lkft,linux-stable-rc-linux-4.9.y,v4.9.224-65-g8430888b29d8,2020-05-25T16:10:01.694182Z,qemu_x86_64,ltp-mm-tests/shm_test01,pass
lkft,linux-stable-rc-linux-4.9.y,v4.9.224-65-g8430888b29d8,2020-05-25T16:10:01.694182Z,qemu_x86_64,ltp-mm-tests/min_free_kbytes,pass
lkft,linux-stable-rc-linux-4.9.y,v4.9.224-65-g8430888b29d8,2020-05-25T16:10:01.694182Z,qemu_x86_64,ltp-mm-tests/mm01,pass
lkft,linux-stable-rc-linux-4.9.y,v4.9.224-65-g8430888b29d8,2020-05-25T16:10:01.694182Z,qemu_x86_64,ltp-hugetlb-tests/hugeshmat05,pass
lkft,linux-stable-rc-linux-4.9.y,v4.9.224-65-g8430888b29d8,2020-05-25T16:10:01.694182Z,qemu_x86_64,ltp-mm-tests/mmap10_4,pass
lkft,linux-stable-rc-linux-4.9.y,v4.9.224-65-g8430888b29d8,2020-05-25T16:10:01.694182Z,qemu_x86_64,ltp-mm-tests/vma01,pass
lkft,linux-stable-rc-linux-4.9.y,v4.9.224-65-g8430888b29d8,2020-05-25T16:10:01.694182Z,qemu_x86_64,ltp-mm-tests/overcommit_memory03,pass
lkft,linux-stable-rc-linux-4.9.y,v4.9.224-65-g8430888b29d8,2020-05-25T16:10:01.694182Z,qemu_x86_64,ltp-hugetlb-tests/hugeshmget05,pass
lkft,linux-stable-rc-linux-4.9.y,v4.9.224-65-g8430888b29d8,2020-05-25T16:10:01.694182Z,qemu_x86_64,ltp-mm-tests/overcommit_memory05,pass
lkft,linux-stable-rc-linux-4.9.y,v4.9.224-65-g8430888b29d8,2020-05-25T16:10:01.694182Z,qemu_x86_64,ltp-hugetlb-tests/hugeshmat01,pass
lkft,linux-stable-rc-linux-4.9.y,v4.9.224-65-g8430888b29d8,2020-05-25T16:10:01.694182Z,qemu_x86_64,ltp-mm-tests/shmt10,pass
lkft,linux-stable-rc-linux-4.9.y,v4.9.224-65-g8430888b29d8,2020-05-25T16:10:01.694182Z,qemu_x86_64,ltp-mm-tests/mmapstress05,pass
lkft,linux-stable-rc-linux-4.9.y,v4.9.224-65-g8430888b29d8,2020-05-25T16:10:01.694182Z,qemu_x86_64,ltp-mm-tests/ksm06_2,skip
lkft,linux-stable-rc-linux-4.9.y,v4.9.224-65-g8430888b29d8,2020-05-25T16:10:01.694182Z,qemu_x86_64,ltp-mm-tests/shmt09,pass
lkft,linux-stable-rc-linux-4.9.y,v4.9.224-65-g8430888b29d8,2020-05-25T16:10:01.694182Z,qemu_x86_64,ltp-mm-tests/mem01,pass
lkft,linux-stable-rc-linux-4.9.y,v4.9.224-65-g8430888b29d8,2020-05-25T16:10:01.694182Z,qemu_x86_64,ltp-mm-tests/ksm05,pass
lkft,linux-stable-rc-linux-4.9.y,v4.9.224-65-g8430888b29d8,2020-05-25T16:10:01.694182Z,qemu_x86_64,ltp-mm-tests/thp02,skip
lkft,linux-stable-rc-linux-4.9.y,v4.9.224-65-g8430888b29d8,2020-05-25T16:10:01.694182Z,qemu_x86_64,ltp-mm-tests/mmap10_1,pass
lkft,linux-stable-rc-linux-4.9.y,v4.9.224-65-g8430888b29d8,2020-05-25T16:10:01.694182Z,qemu_x86_64,ltp-mm-tests/overcommit_memory02,skip
lkft,linux-stable-rc-linux-4.9.y,v4.9.224-65-g8430888b29d8,2020-05-25T16:10:01.694182Z,qemu_x86_64,ltp-mm-tests/mmapstress10,pass
lkft,linux-stable-rc-linux-4.9.y,v4.9.224-65-g8430888b29d8,2020-05-25T16:10:01.694182Z,qemu_x86_64,ltp-mm-tests/mmap10,pass
lkft,linux-stable-rc-linux-4.9.y,v4.9.224-65-g8430888b29d8,2020-05-25T16:10:01.694182Z,qemu_x86_64,ltp-mm-tests/ksm06,skip
lkft,linux-stable-rc-linux-4.9.y,v4.9.224-65-g8430888b29d8,2020-05-25T16:10:01.694182Z,qemu_x86_64,ltp-mm-tests/thp01,pass
lkft,linux-stable-rc-linux-4.9.y,v4.9.224-65-g8430888b29d8,2020-05-25T16:10:01.694182Z,qemu_x86_64,ltp-mm-tests/shmt06,pass
lkft,linux-stable-rc-linux-4.9.y,v4.9.224-65-g8430888b29d8,2020-05-25T16:10:01.694182Z,qemu_x86_64,ltp-mm-tests/oom02,skip
lkft,linux-stable-rc-linux-4.9.y,v4.9.224-65-g8430888b29d8,2020-05-25T16:10:01.694182Z,qemu_x86_64,ltp-mm-tests/vma05,xfail
lkft,linux-stable-rc-linux-4.9.y,v4.9.224-65-g8430888b29d8,2020-05-25T16:10:01.694182Z,qemu_x86_64,ltp-mm-tests/stack_space,pass
lkft,linux-stable-rc-linux-4.9.y,v4.9.224-65-g8430888b29d8,2020-05-25T16:10:01.694182Z,qemu_x86_64,ltp-hugetlb-tests/hugemmap05_2,pass
lkft,linux-stable-rc-linux-4.9.y,v4.9.224-65-g8430888b29d8,2020-05-25T16:10:01.694182Z,qemu_x86_64,ltp-mm-tests/ksm01,pass
lkft,linux-stable-rc-linux-4.9.y,v4.9.224-65-g8430888b29d8,2020-05-25T16:10:01.694182Z,qemu_x86_64,ltp-mm-tests/shmt05,pass
lkft,linux-stable-rc-linux-4.9.y,v4.9.224-65-g8430888b29d8,2020-05-25T16:10:01.694182Z,qemu_x86_64,ltp-mm-tests/page02,pass
lkft,linux-stable-rc-linux-4.9.y,v4.9.224-65-g8430888b29d8,2020-05-25T16:10:01.694182Z,qemu_x86_64,ltp-mm-tests/oom04,skip
lkft,linux-stable-rc-linux-4.9.y,v4.9.224-65-g8430888b29d8,2020-05-25T16:10:01.694182Z,qemu_x86_64,ltp-mm-tests/shmt08,pass
lkft,linux-stable-rc-linux-4.9.y,v4.9.224-65-g8430888b29d8,2020-05-25T16:10:01.694182Z,qemu_x86_64,ltp-hugetlb-tests/hugeshmat04,pass
lkft,linux-stable-rc-linux-4.9.y,v4.9.224-65-g8430888b29d8,2020-05-25T16:10:01.694182Z,qemu_x86_64,ltp-hugetlb-tests/hugeshmget01,pass
lkft,linux-stable-rc-linux-4.9.y,v4.9.224-65-g8430888b29d8,2020-05-25T16:10:01.694182Z,qemu_x86_64,ltp-mm-tests/overcommit_memory04,pass
lkft,linux-stable-rc-linux-4.9.y,v4.9.224-65-g8430888b29d8,2020-05-25T16:10:01.694182Z,qemu_x86_64,ltp-hugetlb-tests/hugemmap01,pass
lkft,linux-stable-rc-linux-4.9.y,v4.9.224-65-g8430888b29d8,2020-05-25T16:10:01.694182Z,qemu_x86_64,ltp-mm-tests/swapping01,skip
lkft,linux-stable-rc-linux-4.9.y,v4.9.224-65-g8430888b29d8,2020-05-25T16:10:01.694182Z,qemu_x86_64,ltp-hugetlb-tests/hugeshmdt01,pass
lkft,linux-stable-rc-linux-4.9.y,v4.9.224-65-g8430888b29d8,2020-05-25T16:10:01.694182Z,qemu_x86_64,ltp-mm-tests/ksm04_1,skip
lkft,linux-stable-rc-linux-4.9.y,v4.9.224-65-g8430888b29d8,2020-05-25T16:10:01.694182Z,qemu_x86_64,ltp-mm-tests/mtest06_2,pass
lkft,linux-stable-rc-linux-4.9.y,v4.9.224-65-g8430888b29d8,2020-05-25T16:10:01.694182Z,qemu_x86_64,ltp-mm-tests/mtest06_3,pass
lkft,linux-stable-rc-linux-4.9.y,v4.9.224-65-g8430888b29d8,2020-05-25T16:10:01.694182Z,qemu_x86_64,ltp-mm-tests/page01,pass
lkft,linux-stable-rc-linux-4.9.y,v4.9.224-65-g8430888b29d8,2020-05-25T16:10:01.694182Z,qemu_x86_64,ltp-hugetlb-tests/hugemmap05_1,pass
lkft,linux-stable-rc-linux-4.9.y,v4.9.224-65-g8430888b29d8,2020-05-25T16:10:01.694182Z,qemu_x86_64,ltp-mm-tests/max_map_count,pass
lkft,linux-stable-rc-linux-4.9.y,v4.9.224-65-g8430888b29d8,2020-05-25T16:10:01.694182Z,qemu_x86_64,ltp-mm-tests/mem02,pass
lkft,linux-stable-rc-linux-4.9.y,v4.9.224-65-g8430888b29d8,2020-05-25T16:10:01.694182Z,qemu_x86_64,ltp-hugetlb-tests/hugeshmat03,pass
lkft,linux-stable-rc-linux-4.9.y,v4.9.224-65-g8430888b29d8,2020-05-25T16:10:01.694182Z,qemu_x86_64,ltp-mm-tests/mallocstress01,pass
lkft,linux-stable-rc-linux-4.9.y,v4.9.224-65-g8430888b29d8,2020-05-25T16:10:01.694182Z,qemu_x86_64,ltp-mm-tests/mtest06,pass
lkft,linux-stable-rc-linux-4.9.y,v4.9.224-65-g8430888b29d8,2020-05-25T16:10:01.694182Z,qemu_x86_64,ltp-hugetlb-tests/hugemmap02,pass
lkft,linux-stable-rc-linux-4.9.y,v4.9.224-65-g8430888b29d8,2020-05-25T16:10:01.694182Z,qemu_x86_64,ltp-mm-tests/overcommit_memory01,pass
lkft,linux-stable-rc-linux-4.9.y,v4.9.224-65-g8430888b29d8,2020-05-25T16:10:01.694182Z,qemu_x86_64,ltp-mm-tests/ksm04,skip
lkft,linux-stable-rc-linux-4.9.y,v4.9.224-65-g8430888b29d8,2020-05-25T16:10:01.694182Z,qemu_x86_64,ltp-hugetlb-tests/hugemmap05_3,pass
lkft,linux-stable-rc-linux-4.9.y,v4.9.224-65-g8430888b29d8,2020-05-25T16:10:01.694182Z,qemu_x86_64,ltp-mm-tests/vma03,skip
lkft,linux-stable-rc-linux-4.9.y,v4.9.224-65-g8430888b29d8,2020-05-25T16:10:01.694182Z,qemu_x86_64,ltp-mm-tests/mmapstress07,pass
lkft,linux-stable-rc-linux-4.9.y,v4.9.224-65-g8430888b29d8,2020-05-25T16:10:01.694182Z,qemu_x86_64,ltp-hugetlb-tests/hugemmap04,pass
lkft,linux-stable-rc-linux-4.9.y,v4.9.224-65-g8430888b29d8,2020-05-25T16:10:01.694182Z,qemu_x86_64,ltp-mm-tests/oom03,skip
lkft,linux-stable-rc-linux-4.9.y,v4.9.224-65-g8430888b29d8,2020-05-25T16:10:01.694182Z,qemu_x86_64,ltp-mm-tests/ksm01_1,pass
lkft,linux-stable-rc-linux-4.9.y,v4.9.224-65-g8430888b29d8,2020-05-25T16:10:01.694182Z,qemu_x86_64,ltp-mm-tests/ksm03,pass
lkft,linux-stable-rc-linux-4.9.y,v4.9.224-65-g8430888b29d8,2020-05-25T16:10:01.694182Z,qemu_x86_64,ltp-mm-tests/mmap10_2,pass
lkft,linux-stable-rc-linux-4.9.y,v4.9.224-65-g8430888b29d8,2020-05-25T16:10:01.694182Z,qemu_x86_64,ltp-mm-tests/oom05,skip
lkft,linux-stable-rc-linux-4.9.y,v4.9.224-65-g8430888b29d8,2020-05-25T16:10:01.694182Z,qemu_x86_64,linux-log-parser/check-kernel-exception-1450047,pass
lkft,linux-stable-rc-linux-4.9.y,v4.9.224-65-g8430888b29d8,2020-05-25T16:10:01.694182Z,qemu_x86_64,linux-log-parser/check-kernel-trace-1450047,pass
lkft,linux-stable-rc-linux-4.9.y,v4.9.224-65-g8430888b29d8,2020-05-25T16:10:01.694182Z,qemu_x86_64,linux-log-parser/check-kernel-oops-1450047,pass
lkft,linux-stable-rc-linux-4.9.y,v4.9.224-65-g8430888b29d8,2020-05-25T16:10:01.694182Z,qemu_x86_64,linux-log-parser/check-kernel-fault-1450047,pass
lkft,linux-stable-rc-linux-4.9.y,v4.9.224-65-g8430888b29d8,2020-05-25T16:10:01.694182Z,qemu_x86_64,linux-log-parser/check-kernel-warning-1450047,pass
lkft,linux-stable-rc-linux-4.9.y,v4.9.224-65-g8430888b29d8,2020-05-25T16:10:01.694182Z,qemu_x86_64,linux-log-parser/check-kernel-bug-1450047,pass
lkft,linux-stable-rc-linux-4.9.y,v4.9.224-65-g8430888b29d8,2020-05-25T16:10:01.694182Z,qemu_x86_64,linux-log-parser/check-kernel-panic-1450047,pass
lkft,linux-stable-rc-linux-4.9.y,v4.9.224-65-g8430888b29d8,2020-05-25T16:10:01.694182Z,x86,linux-log-parser/check-kernel-exception-1450049,pass
lkft,linux-stable-rc-linux-4.9.y,v4.9.224-65-g8430888b29d8,2020-05-25T16:10:01.694182Z,x86,linux-log-parser/check-kernel-trace-1450049,pass
lkft,linux-stable-rc-linux-4.9.y,v4.9.224-65-g8430888b29d8,2020-05-25T16:10:01.694182Z,x86,linux-log-parser/check-kernel-oops-1450049,pass
lkft,linux-stable-rc-linux-4.9.y,v4.9.224-65-g8430888b29d8,2020-05-25T16:10:01.694182Z,x86,linux-log-parser/check-kernel-fault-1450049,pass
lkft,linux-stable-rc-linux-4.9.y,v4.9.224-65-g8430888b29d8,2020-05-25T16:10:01.694182Z,x86,linux-log-parser/check-kernel-warning-1450049,pass
lkft,linux-stable-rc-linux-4.9.y,v4.9.224-65-g8430888b29d8,2020-05-25T16:10:01.694182Z,x86,linux-log-parser/check-kernel-bug-1450049,pass
lkft,linux-stable-rc-linux-4.9.y,v4.9.224-65-g8430888b29d8,2020-05-25T16:10:01.694182Z,x86,linux-log-parser/check-kernel-panic-1450049,pass
lkft,linux-stable-rc-linux-4.9.y,v4.9.224-65-g8430888b29d8,2020-05-25T16:10:01.694182Z,x86,linux-log-parser/check-kernel-exception-1450053,pass
lkft,linux-stable-rc-linux-4.9.y,v4.9.224-65-g8430888b29d8,2020-05-25T16:10:01.694182Z,x86,linux-log-parser/check-kernel-trace-1450053,pass
lkft,linux-stable-rc-linux-4.9.y,v4.9.224-65-g8430888b29d8,2020-05-25T16:10:01.694182Z,x86,linux-log-parser/check-kernel-oops-1450053,pass
lkft,linux-stable-rc-linux-4.9.y,v4.9.224-65-g8430888b29d8,2020-05-25T16:10:01.694182Z,x86,linux-log-parser/check-kernel-fault-1450053,pass
lkft,linux-stable-rc-linux-4.9.y,v4.9.224-65-g8430888b29d8,2020-05-25T16:10:01.694182Z,x86,linux-log-parser/check-kernel-warning-1450053,pass
lkft,linux-stable-rc-linux-4.9.y,v4.9.224-65-g8430888b29d8,2020-05-25T16:10:01.694182Z,x86,linux-log-parser/check-kernel-bug-1450053,pass
lkft,linux-stable-rc-linux-4.9.y,v4.9.224-65-g8430888b29d8,2020-05-25T16:10:01.694182Z,x86,linux-log-parser/check-kernel-panic-1450053,pass
