group.name,project.name,build.name,build.datetime,environment.name,test.name,test.status
lkft,linux-mainline-master,v5.3-12065-g5184d449600f,2019-09-24T20:48:12.504638Z,dragonboard-410c,build/build_process,fail
lkft,linux-mainline-master,v5.3-12065-g5184d449600f,2019-09-24T20:48:12.504638Z,i386,build/build_process,fail
lkft,linux-mainline-master,v5.3-12065-g5184d449600f,2019-09-24T20:48:12.504638Z,juno-r2,build/build_process,fail
lkft,linux-mainline-master,v5.3-12065-g5184d449600f,2019-09-24T20:48:12.504638Z,hi6220-hikey,build/build_process,fail
lkft,linux-mainline-master,v5.3-12065-g5184d449600f,2019-09-24T20:48:12.504638Z,x86,build/build_process,fail
lkft,linux-mainline-master,v5.3-12065-g5184d449600f,2019-09-24T20:48:12.504638Z,x15,build/build_process,fail
