group.name,project.name,build.name,build.datetime,environment.name,test.name,test.status
lkft,linux-mainline-master,v5.9-rc7-49-gfcadab740480,2020-10-01T18:08:39.341895Z,x86,build/build_process,pass
lkft,linux-mainline-master,v5.9-rc7-49-gfcadab740480,2020-10-01T18:08:39.341895Z,x86,linux-log-parser/check-kernel-exception-x86-3023,pass
lkft,linux-mainline-master,v5.9-rc7-49-gfcadab740480,2020-10-01T18:08:39.341895Z,x86,linux-log-parser/check-kernel-trace-x86-3023,pass
lkft,linux-mainline-master,v5.9-rc7-49-gfcadab740480,2020-10-01T18:08:39.341895Z,x86,linux-log-parser/check-kernel-oops-x86-3023,pass
lkft,linux-mainline-master,v5.9-rc7-49-gfcadab740480,2020-10-01T18:08:39.341895Z,x86,linux-log-parser/check-kernel-fault-x86-3023,pass
lkft,linux-mainline-master,v5.9-rc7-49-gfcadab740480,2020-10-01T18:08:39.341895Z,x86,linux-log-parser/check-kernel-warning-x86-3023,pass
lkft,linux-mainline-master,v5.9-rc7-49-gfcadab740480,2020-10-01T18:08:39.341895Z,x86,linux-log-parser/check-kernel-bug-x86-3023,pass
lkft,linux-mainline-master,v5.9-rc7-49-gfcadab740480,2020-10-01T18:08:39.341895Z,x86,linux-log-parser/check-kernel-invalid-opcode-x86-3023,pass
lkft,linux-mainline-master,v5.9-rc7-49-gfcadab740480,2020-10-01T18:08:39.341895Z,x86,linux-log-parser/check-kernel-panic-x86-3023,pass
lkft,linux-mainline-master,v5.9-rc7-49-gfcadab740480,2020-10-01T18:08:39.341895Z,juno-r2,build/build_process,pass
lkft,linux-mainline-master,v5.9-rc7-49-gfcadab740480,2020-10-01T18:08:39.341895Z,juno-r2,linux-log-parser/check-kernel-exception-juno-r2-3023,pass
lkft,linux-mainline-master,v5.9-rc7-49-gfcadab740480,2020-10-01T18:08:39.341895Z,juno-r2,linux-log-parser/check-kernel-trace-juno-r2-3023,pass
lkft,linux-mainline-master,v5.9-rc7-49-gfcadab740480,2020-10-01T18:08:39.341895Z,juno-r2,linux-log-parser/check-kernel-oops-juno-r2-3023,pass
lkft,linux-mainline-master,v5.9-rc7-49-gfcadab740480,2020-10-01T18:08:39.341895Z,juno-r2,linux-log-parser/check-kernel-fault-juno-r2-3023,pass
lkft,linux-mainline-master,v5.9-rc7-49-gfcadab740480,2020-10-01T18:08:39.341895Z,juno-r2,linux-log-parser/check-kernel-warning-juno-r2-3023,pass
lkft,linux-mainline-master,v5.9-rc7-49-gfcadab740480,2020-10-01T18:08:39.341895Z,juno-r2,linux-log-parser/check-kernel-bug-juno-r2-3023,pass
lkft,linux-mainline-master,v5.9-rc7-49-gfcadab740480,2020-10-01T18:08:39.341895Z,juno-r2,linux-log-parser/check-kernel-invalid-opcode-juno-r2-3023,pass
lkft,linux-mainline-master,v5.9-rc7-49-gfcadab740480,2020-10-01T18:08:39.341895Z,juno-r2,linux-log-parser/check-kernel-panic-juno-r2-3023,pass
lkft,linux-mainline-master,v5.9-rc7-49-gfcadab740480,2020-10-01T18:08:39.341895Z,dragonboard-845c,build/build_process,fail
lkft,linux-mainline-master,v5.9-rc7-49-gfcadab740480,2020-10-01T18:08:39.341895Z,dragonboard-845c,linux-log-parser/check-kernel-exception-dragonboard-845c-3023,pass
lkft,linux-mainline-master,v5.9-rc7-49-gfcadab740480,2020-10-01T18:08:39.341895Z,dragonboard-845c,linux-log-parser/check-kernel-trace-dragonboard-845c-3023,pass
lkft,linux-mainline-master,v5.9-rc7-49-gfcadab740480,2020-10-01T18:08:39.341895Z,dragonboard-845c,linux-log-parser/check-kernel-oops-dragonboard-845c-3023,pass
lkft,linux-mainline-master,v5.9-rc7-49-gfcadab740480,2020-10-01T18:08:39.341895Z,dragonboard-845c,linux-log-parser/check-kernel-fault-dragonboard-845c-3023,pass
lkft,linux-mainline-master,v5.9-rc7-49-gfcadab740480,2020-10-01T18:08:39.341895Z,dragonboard-845c,linux-log-parser/check-kernel-warning-dragonboard-845c-3023,pass
lkft,linux-mainline-master,v5.9-rc7-49-gfcadab740480,2020-10-01T18:08:39.341895Z,dragonboard-845c,linux-log-parser/check-kernel-bug-dragonboard-845c-3023,pass
lkft,linux-mainline-master,v5.9-rc7-49-gfcadab740480,2020-10-01T18:08:39.341895Z,dragonboard-845c,linux-log-parser/check-kernel-invalid-opcode-dragonboard-845c-3023,pass
lkft,linux-mainline-master,v5.9-rc7-49-gfcadab740480,2020-10-01T18:08:39.341895Z,dragonboard-845c,linux-log-parser/check-kernel-panic-dragonboard-845c-3023,pass
lkft,linux-mainline-master,v5.9-rc7-49-gfcadab740480,2020-10-01T18:08:39.341895Z,dragonboard-410c,build/build_process,pass
lkft,linux-mainline-master,v5.9-rc7-49-gfcadab740480,2020-10-01T18:08:39.341895Z,dragonboard-410c,linux-log-parser/check-kernel-exception-dragonboard-410c-3023,pass
lkft,linux-mainline-master,v5.9-rc7-49-gfcadab740480,2020-10-01T18:08:39.341895Z,dragonboard-410c,linux-log-parser/check-kernel-trace-dragonboard-410c-3023,pass
lkft,linux-mainline-master,v5.9-rc7-49-gfcadab740480,2020-10-01T18:08:39.341895Z,dragonboard-410c,linux-log-parser/check-kernel-oops-dragonboard-410c-3023,pass
lkft,linux-mainline-master,v5.9-rc7-49-gfcadab740480,2020-10-01T18:08:39.341895Z,dragonboard-410c,linux-log-parser/check-kernel-fault-dragonboard-410c-3023,pass
lkft,linux-mainline-master,v5.9-rc7-49-gfcadab740480,2020-10-01T18:08:39.341895Z,dragonboard-410c,linux-log-parser/check-kernel-warning-dragonboard-410c-3023,pass
lkft,linux-mainline-master,v5.9-rc7-49-gfcadab740480,2020-10-01T18:08:39.341895Z,dragonboard-410c,linux-log-parser/check-kernel-bug-dragonboard-410c-3023,pass
lkft,linux-mainline-master,v5.9-rc7-49-gfcadab740480,2020-10-01T18:08:39.341895Z,dragonboard-410c,linux-log-parser/check-kernel-invalid-opcode-dragonboard-410c-3023,pass
lkft,linux-mainline-master,v5.9-rc7-49-gfcadab740480,2020-10-01T18:08:39.341895Z,dragonboard-410c,linux-log-parser/check-kernel-panic-dragonboard-410c-3023,pass
lkft,linux-mainline-master,v5.9-rc7-49-gfcadab740480,2020-10-01T18:08:39.341895Z,i386,build/build_process,pass
lkft,linux-mainline-master,v5.9-rc7-49-gfcadab740480,2020-10-01T18:08:39.341895Z,i386,linux-log-parser/check-kernel-exception-i386-3023,pass
lkft,linux-mainline-master,v5.9-rc7-49-gfcadab740480,2020-10-01T18:08:39.341895Z,i386,linux-log-parser/check-kernel-trace-i386-3023,pass
lkft,linux-mainline-master,v5.9-rc7-49-gfcadab740480,2020-10-01T18:08:39.341895Z,i386,linux-log-parser/check-kernel-oops-i386-3023,pass
lkft,linux-mainline-master,v5.9-rc7-49-gfcadab740480,2020-10-01T18:08:39.341895Z,i386,linux-log-parser/check-kernel-fault-i386-3023,pass
lkft,linux-mainline-master,v5.9-rc7-49-gfcadab740480,2020-10-01T18:08:39.341895Z,i386,linux-log-parser/check-kernel-warning-i386-3023,pass
lkft,linux-mainline-master,v5.9-rc7-49-gfcadab740480,2020-10-01T18:08:39.341895Z,i386,linux-log-parser/check-kernel-bug-i386-3023,pass
lkft,linux-mainline-master,v5.9-rc7-49-gfcadab740480,2020-10-01T18:08:39.341895Z,i386,linux-log-parser/check-kernel-invalid-opcode-i386-3023,pass
lkft,linux-mainline-master,v5.9-rc7-49-gfcadab740480,2020-10-01T18:08:39.341895Z,i386,linux-log-parser/check-kernel-panic-i386-3023,pass
lkft,linux-mainline-master,v5.9-rc7-49-gfcadab740480,2020-10-01T18:08:39.341895Z,hi6220-hikey,build/build_process,pass
lkft,linux-mainline-master,v5.9-rc7-49-gfcadab740480,2020-10-01T18:08:39.341895Z,hi6220-hikey,linux-log-parser/check-kernel-exception-hi6220-hikey-3023,pass
lkft,linux-mainline-master,v5.9-rc7-49-gfcadab740480,2020-10-01T18:08:39.341895Z,hi6220-hikey,linux-log-parser/check-kernel-trace-hi6220-hikey-3023,pass
lkft,linux-mainline-master,v5.9-rc7-49-gfcadab740480,2020-10-01T18:08:39.341895Z,hi6220-hikey,linux-log-parser/check-kernel-oops-hi6220-hikey-3023,pass
lkft,linux-mainline-master,v5.9-rc7-49-gfcadab740480,2020-10-01T18:08:39.341895Z,hi6220-hikey,linux-log-parser/check-kernel-fault-hi6220-hikey-3023,pass
lkft,linux-mainline-master,v5.9-rc7-49-gfcadab740480,2020-10-01T18:08:39.341895Z,hi6220-hikey,linux-log-parser/check-kernel-warning-hi6220-hikey-3023,pass
lkft,linux-mainline-master,v5.9-rc7-49-gfcadab740480,2020-10-01T18:08:39.341895Z,hi6220-hikey,linux-log-parser/check-kernel-bug-hi6220-hikey-3023,pass
lkft,linux-mainline-master,v5.9-rc7-49-gfcadab740480,2020-10-01T18:08:39.341895Z,hi6220-hikey,linux-log-parser/check-kernel-invalid-opcode-hi6220-hikey-3023,pass
lkft,linux-mainline-master,v5.9-rc7-49-gfcadab740480,2020-10-01T18:08:39.341895Z,hi6220-hikey,linux-log-parser/check-kernel-panic-hi6220-hikey-3023,pass
lkft,linux-mainline-master,v5.9-rc7-49-gfcadab740480,2020-10-01T18:08:39.341895Z,x15,build/build_process,pass
lkft,linux-mainline-master,v5.9-rc7-49-gfcadab740480,2020-10-01T18:08:39.341895Z,x15,linux-log-parser/check-kernel-exception-x15-3023,pass
lkft,linux-mainline-master,v5.9-rc7-49-gfcadab740480,2020-10-01T18:08:39.341895Z,x15,linux-log-parser/check-kernel-trace-x15-3023,pass
lkft,linux-mainline-master,v5.9-rc7-49-gfcadab740480,2020-10-01T18:08:39.341895Z,x15,linux-log-parser/check-kernel-oops-x15-3023,pass
lkft,linux-mainline-master,v5.9-rc7-49-gfcadab740480,2020-10-01T18:08:39.341895Z,x15,linux-log-parser/check-kernel-fault-x15-3023,pass
lkft,linux-mainline-master,v5.9-rc7-49-gfcadab740480,2020-10-01T18:08:39.341895Z,x15,linux-log-parser/check-kernel-warning-x15-3023,pass
lkft,linux-mainline-master,v5.9-rc7-49-gfcadab740480,2020-10-01T18:08:39.341895Z,x15,linux-log-parser/check-kernel-bug-x15-3023,pass
lkft,linux-mainline-master,v5.9-rc7-49-gfcadab740480,2020-10-01T18:08:39.341895Z,x15,linux-log-parser/check-kernel-invalid-opcode-x15-3023,pass
lkft,linux-mainline-master,v5.9-rc7-49-gfcadab740480,2020-10-01T18:08:39.341895Z,x15,linux-log-parser/check-kernel-panic-x15-3023,pass
lkft,linux-mainline-master,v5.9-rc7-49-gfcadab740480,2020-10-01T18:08:39.341895Z,x15,install-android-platform-tools-r2600/install-fastboot,pass
lkft,linux-mainline-master,v5.9-rc7-49-gfcadab740480,2020-10-01T18:08:39.341895Z,x15,install-android-platform-tools-r2600/install-adb,pass
lkft,linux-mainline-master,v5.9-rc7-49-gfcadab740480,2020-10-01T18:08:39.341895Z,x15,linux-log-parser/check-kernel-exception-1810174,pass
lkft,linux-mainline-master,v5.9-rc7-49-gfcadab740480,2020-10-01T18:08:39.341895Z,x15,linux-log-parser/check-kernel-trace-1810174,pass
lkft,linux-mainline-master,v5.9-rc7-49-gfcadab740480,2020-10-01T18:08:39.341895Z,x15,linux-log-parser/check-kernel-oops-1810174,pass
lkft,linux-mainline-master,v5.9-rc7-49-gfcadab740480,2020-10-01T18:08:39.341895Z,x15,linux-log-parser/check-kernel-fault-1810174,pass
lkft,linux-mainline-master,v5.9-rc7-49-gfcadab740480,2020-10-01T18:08:39.341895Z,x15,linux-log-parser/check-kernel-warning-1810174,pass
lkft,linux-mainline-master,v5.9-rc7-49-gfcadab740480,2020-10-01T18:08:39.341895Z,x15,linux-log-parser/check-kernel-bug-1810174,pass
lkft,linux-mainline-master,v5.9-rc7-49-gfcadab740480,2020-10-01T18:08:39.341895Z,x15,linux-log-parser/check-kernel-invalid-opcode-1810174,pass
lkft,linux-mainline-master,v5.9-rc7-49-gfcadab740480,2020-10-01T18:08:39.341895Z,x15,linux-log-parser/check-kernel-panic-1810174,pass
lkft,linux-mainline-master,v5.9-rc7-49-gfcadab740480,2020-10-01T18:08:39.341895Z,x15,install-android-platform-tools-r2600/install-fastboot,pass
lkft,linux-mainline-master,v5.9-rc7-49-gfcadab740480,2020-10-01T18:08:39.341895Z,x15,install-android-platform-tools-r2600/install-adb,pass
lkft,linux-mainline-master,v5.9-rc7-49-gfcadab740480,2020-10-01T18:08:39.341895Z,x15,linux-log-parser/check-kernel-exception-1810173,pass
lkft,linux-mainline-master,v5.9-rc7-49-gfcadab740480,2020-10-01T18:08:39.341895Z,x15,linux-log-parser/check-kernel-trace-1810173,pass
lkft,linux-mainline-master,v5.9-rc7-49-gfcadab740480,2020-10-01T18:08:39.341895Z,x15,linux-log-parser/check-kernel-oops-1810173,pass
lkft,linux-mainline-master,v5.9-rc7-49-gfcadab740480,2020-10-01T18:08:39.341895Z,x15,linux-log-parser/check-kernel-fault-1810173,pass
lkft,linux-mainline-master,v5.9-rc7-49-gfcadab740480,2020-10-01T18:08:39.341895Z,x15,linux-log-parser/check-kernel-warning-1810173,pass
lkft,linux-mainline-master,v5.9-rc7-49-gfcadab740480,2020-10-01T18:08:39.341895Z,x15,linux-log-parser/check-kernel-bug-1810173,pass
lkft,linux-mainline-master,v5.9-rc7-49-gfcadab740480,2020-10-01T18:08:39.341895Z,x15,linux-log-parser/check-kernel-invalid-opcode-1810173,pass
lkft,linux-mainline-master,v5.9-rc7-49-gfcadab740480,2020-10-01T18:08:39.341895Z,x15,linux-log-parser/check-kernel-panic-1810173,pass
lkft,linux-mainline-master,v5.9-rc7-49-gfcadab740480,2020-10-01T18:08:39.341895Z,hi6220-hikey,perf/perf-existence-check,pass
lkft,linux-mainline-master,v5.9-rc7-49-gfcadab740480,2020-10-01T18:08:39.341895Z,hi6220-hikey,perf/perf_record_test,pass
lkft,linux-mainline-master,v5.9-rc7-49-gfcadab740480,2020-10-01T18:08:39.341895Z,hi6220-hikey,perf/perf_report_test,pass
lkft,linux-mainline-master,v5.9-rc7-49-gfcadab740480,2020-10-01T18:08:39.341895Z,hi6220-hikey,perf/perf_stat_test,skip
lkft,linux-mainline-master,v5.9-rc7-49-gfcadab740480,2020-10-01T18:08:39.341895Z,hi6220-hikey,perf/perf_test,pass
lkft,linux-mainline-master,v5.9-rc7-49-gfcadab740480,2020-10-01T18:08:39.341895Z,hi6220-hikey,perf/Detect-openat-syscall-event,pass
lkft,linux-mainline-master,v5.9-rc7-49-gfcadab740480,2020-10-01T18:08:39.341895Z,hi6220-hikey,perf/Detect-openat-syscall-event-on-all-cpus,pass
lkft,linux-mainline-master,v5.9-rc7-49-gfcadab740480,2020-10-01T18:08:39.341895Z,hi6220-hikey,perf/Read-samples-using-the-mmap-interface,pass
lkft,linux-mainline-master,v5.9-rc7-49-gfcadab740480,2020-10-01T18:08:39.341895Z,hi6220-hikey,perf/Test-data-source-output,pass
lkft,linux-mainline-master,v5.9-rc7-49-gfcadab740480,2020-10-01T18:08:39.341895Z,hi6220-hikey,perf/Parse-event-definition-strings,pass
lkft,linux-mainline-master,v5.9-rc7-49-gfcadab740480,2020-10-01T18:08:39.341895Z,hi6220-hikey,perf/Simple-expression-parser,pass
lkft,linux-mainline-master,v5.9-rc7-49-gfcadab740480,2020-10-01T18:08:39.341895Z,hi6220-hikey,perf/Parse-perf-pmu-format,pass
lkft,linux-mainline-master,v5.9-rc7-49-gfcadab740480,2020-10-01T18:08:39.341895Z,hi6220-hikey,perf/PMU-events-subtest-1,pass
lkft,linux-mainline-master,v5.9-rc7-49-gfcadab740480,2020-10-01T18:08:39.341895Z,hi6220-hikey,perf/PMU-events-subtest-2,pass
lkft,linux-mainline-master,v5.9-rc7-49-gfcadab740480,2020-10-01T18:08:39.341895Z,hi6220-hikey,perf/PMU-events-subtest-3,pass
lkft,linux-mainline-master,v5.9-rc7-49-gfcadab740480,2020-10-01T18:08:39.341895Z,hi6220-hikey,perf/PMU-events-subtest-4,pass
lkft,linux-mainline-master,v5.9-rc7-49-gfcadab740480,2020-10-01T18:08:39.341895Z,hi6220-hikey,perf/DSO-data-read,pass
lkft,linux-mainline-master,v5.9-rc7-49-gfcadab740480,2020-10-01T18:08:39.341895Z,hi6220-hikey,perf/DSO-data-cache,pass
lkft,linux-mainline-master,v5.9-rc7-49-gfcadab740480,2020-10-01T18:08:39.341895Z,hi6220-hikey,perf/DSO-data-reopen,pass
lkft,linux-mainline-master,v5.9-rc7-49-gfcadab740480,2020-10-01T18:08:39.341895Z,hi6220-hikey,perf/Parse-sched-tracepoints-fields,pass
lkft,linux-mainline-master,v5.9-rc7-49-gfcadab740480,2020-10-01T18:08:39.341895Z,hi6220-hikey,perf/syscallssys_enter_openat-event-fields,pass
lkft,linux-mainline-master,v5.9-rc7-49-gfcadab740480,2020-10-01T18:08:39.341895Z,hi6220-hikey,perf/Match-and-link-multiple-hists,pass
lkft,linux-mainline-master,v5.9-rc7-49-gfcadab740480,2020-10-01T18:08:39.341895Z,hi6220-hikey,perf/Breakpoint-accounting,pass
lkft,linux-mainline-master,v5.9-rc7-49-gfcadab740480,2020-10-01T18:08:39.341895Z,hi6220-hikey,perf/Watchpoint-subtest-1,pass
lkft,linux-mainline-master,v5.9-rc7-49-gfcadab740480,2020-10-01T18:08:39.341895Z,hi6220-hikey,perf/Watchpoint-subtest-2,pass
lkft,linux-mainline-master,v5.9-rc7-49-gfcadab740480,2020-10-01T18:08:39.341895Z,hi6220-hikey,perf/Watchpoint-subtest-3,pass
lkft,linux-mainline-master,v5.9-rc7-49-gfcadab740480,2020-10-01T18:08:39.341895Z,hi6220-hikey,perf/Watchpoint-subtest-4,pass
lkft,linux-mainline-master,v5.9-rc7-49-gfcadab740480,2020-10-01T18:08:39.341895Z,hi6220-hikey,perf/Software-clock-events-period-values,pass
lkft,linux-mainline-master,v5.9-rc7-49-gfcadab740480,2020-10-01T18:08:39.341895Z,hi6220-hikey,perf/Sample-parsing,pass
lkft,linux-mainline-master,v5.9-rc7-49-gfcadab740480,2020-10-01T18:08:39.341895Z,hi6220-hikey,perf/Parse-with-no-sample_id_all-bit-set,pass
lkft,linux-mainline-master,v5.9-rc7-49-gfcadab740480,2020-10-01T18:08:39.341895Z,hi6220-hikey,perf/Filter-hist-entries,pass
lkft,linux-mainline-master,v5.9-rc7-49-gfcadab740480,2020-10-01T18:08:39.341895Z,hi6220-hikey,perf/Lookup-mmap-thread,pass
lkft,linux-mainline-master,v5.9-rc7-49-gfcadab740480,2020-10-01T18:08:39.341895Z,hi6220-hikey,perf/Share-thread-maps,pass
lkft,linux-mainline-master,v5.9-rc7-49-gfcadab740480,2020-10-01T18:08:39.341895Z,hi6220-hikey,perf/Sort-output-of-hist-entries,pass
lkft,linux-mainline-master,v5.9-rc7-49-gfcadab740480,2020-10-01T18:08:39.341895Z,hi6220-hikey,perf/Cumulate-child-hist-entries,pass
lkft,linux-mainline-master,v5.9-rc7-49-gfcadab740480,2020-10-01T18:08:39.341895Z,hi6220-hikey,perf/Track-with-sched_switch,pass
lkft,linux-mainline-master,v5.9-rc7-49-gfcadab740480,2020-10-01T18:08:39.341895Z,hi6220-hikey,perf/Filter-fds-with-revents-mask-in-a-fdarray,pass
lkft,linux-mainline-master,v5.9-rc7-49-gfcadab740480,2020-10-01T18:08:39.341895Z,hi6220-hikey,"perf/Add-fd-to-a-fdarray,-making-it-autogrow",pass
lkft,linux-mainline-master,v5.9-rc7-49-gfcadab740480,2020-10-01T18:08:39.341895Z,hi6220-hikey,perf/kmod_path__parse,pass
lkft,linux-mainline-master,v5.9-rc7-49-gfcadab740480,2020-10-01T18:08:39.341895Z,hi6220-hikey,perf/Thread-map,pass
lkft,linux-mainline-master,v5.9-rc7-49-gfcadab740480,2020-10-01T18:08:39.341895Z,hi6220-hikey,perf/Session-topology,pass
lkft,linux-mainline-master,v5.9-rc7-49-gfcadab740480,2020-10-01T18:08:39.341895Z,hi6220-hikey,perf/Synthesize-thread-map,pass
lkft,linux-mainline-master,v5.9-rc7-49-gfcadab740480,2020-10-01T18:08:39.341895Z,hi6220-hikey,perf/Remove-thread-map,pass
lkft,linux-mainline-master,v5.9-rc7-49-gfcadab740480,2020-10-01T18:08:39.341895Z,hi6220-hikey,perf/Synthesize-cpu-map,pass
lkft,linux-mainline-master,v5.9-rc7-49-gfcadab740480,2020-10-01T18:08:39.341895Z,hi6220-hikey,perf/Synthesize-stat-config,pass
lkft,linux-mainline-master,v5.9-rc7-49-gfcadab740480,2020-10-01T18:08:39.341895Z,hi6220-hikey,perf/Synthesize-stat,pass
lkft,linux-mainline-master,v5.9-rc7-49-gfcadab740480,2020-10-01T18:08:39.341895Z,hi6220-hikey,perf/Synthesize-stat-round,pass
lkft,linux-mainline-master,v5.9-rc7-49-gfcadab740480,2020-10-01T18:08:39.341895Z,hi6220-hikey,perf/Synthesize-attr-update,pass
lkft,linux-mainline-master,v5.9-rc7-49-gfcadab740480,2020-10-01T18:08:39.341895Z,hi6220-hikey,perf/Event-times,pass
lkft,linux-mainline-master,v5.9-rc7-49-gfcadab740480,2020-10-01T18:08:39.341895Z,hi6220-hikey,perf/Read-backward-ring-buffer,pass
lkft,linux-mainline-master,v5.9-rc7-49-gfcadab740480,2020-10-01T18:08:39.341895Z,hi6220-hikey,perf/Print-cpu-map,pass
lkft,linux-mainline-master,v5.9-rc7-49-gfcadab740480,2020-10-01T18:08:39.341895Z,hi6220-hikey,perf/Merge-cpu-map,pass
lkft,linux-mainline-master,v5.9-rc7-49-gfcadab740480,2020-10-01T18:08:39.341895Z,hi6220-hikey,perf/is_printable_array,pass
lkft,linux-mainline-master,v5.9-rc7-49-gfcadab740480,2020-10-01T18:08:39.341895Z,hi6220-hikey,perf/Print-bitmap,pass
lkft,linux-mainline-master,v5.9-rc7-49-gfcadab740480,2020-10-01T18:08:39.341895Z,hi6220-hikey,perf/perf-hooks,pass
lkft,linux-mainline-master,v5.9-rc7-49-gfcadab740480,2020-10-01T18:08:39.341895Z,hi6220-hikey,perf/unit_number__scnprintf,pass
lkft,linux-mainline-master,v5.9-rc7-49-gfcadab740480,2020-10-01T18:08:39.341895Z,hi6220-hikey,perf/mem2node,pass
lkft,linux-mainline-master,v5.9-rc7-49-gfcadab740480,2020-10-01T18:08:39.341895Z,hi6220-hikey,perf/time-utils,pass
lkft,linux-mainline-master,v5.9-rc7-49-gfcadab740480,2020-10-01T18:08:39.341895Z,hi6220-hikey,perf/Test-jit_write_elf,pass
lkft,linux-mainline-master,v5.9-rc7-49-gfcadab740480,2020-10-01T18:08:39.341895Z,hi6220-hikey,perf/Test-api-io,pass
lkft,linux-mainline-master,v5.9-rc7-49-gfcadab740480,2020-10-01T18:08:39.341895Z,hi6220-hikey,perf/maps__merge_in,pass
lkft,linux-mainline-master,v5.9-rc7-49-gfcadab740480,2020-10-01T18:08:39.341895Z,hi6220-hikey,perf/Demangle-Java,pass
lkft,linux-mainline-master,v5.9-rc7-49-gfcadab740480,2020-10-01T18:08:39.341895Z,hi6220-hikey,perf/Parse-and-process-metrics,pass
lkft,linux-mainline-master,v5.9-rc7-49-gfcadab740480,2020-10-01T18:08:39.341895Z,hi6220-hikey,perf/DWARF-unwind,pass
lkft,linux-mainline-master,v5.9-rc7-49-gfcadab740480,2020-10-01T18:08:39.341895Z,hi6220-hikey,perf/PERF_RECORD_*-events-&-perf_sample-fields,fail
lkft,linux-mainline-master,v5.9-rc7-49-gfcadab740480,2020-10-01T18:08:39.341895Z,hi6220-hikey,perf/'import-perf'-in-python,fail
lkft,linux-mainline-master,v5.9-rc7-49-gfcadab740480,2020-10-01T18:08:39.341895Z,hi6220-hikey,perf/Object-code-reading,xfail
lkft,linux-mainline-master,v5.9-rc7-49-gfcadab740480,2020-10-01T18:08:39.341895Z,hi6220-hikey,perf/LLVM-search-and-compile-subtest-1,fail
lkft,linux-mainline-master,v5.9-rc7-49-gfcadab740480,2020-10-01T18:08:39.341895Z,hi6220-hikey,perf/vmlinux-symtab-matches-kallsyms,skip
lkft,linux-mainline-master,v5.9-rc7-49-gfcadab740480,2020-10-01T18:08:39.341895Z,hi6220-hikey,perf/Setup-struct-perf_event_attr,skip
lkft,linux-mainline-master,v5.9-rc7-49-gfcadab740480,2020-10-01T18:08:39.341895Z,hi6220-hikey,perf/Number-of-exit-events-of-a-simple-workload,skip
lkft,linux-mainline-master,v5.9-rc7-49-gfcadab740480,2020-10-01T18:08:39.341895Z,hi6220-hikey,perf/Use-a-dummy-software-event-to-keep-tracking,skip
lkft,linux-mainline-master,v5.9-rc7-49-gfcadab740480,2020-10-01T18:08:39.341895Z,hi6220-hikey,perf/LLVM-search-and-compile-subtest-2,skip
lkft,linux-mainline-master,v5.9-rc7-49-gfcadab740480,2020-10-01T18:08:39.341895Z,hi6220-hikey,perf/LLVM-search-and-compile-subtest-3,skip
lkft,linux-mainline-master,v5.9-rc7-49-gfcadab740480,2020-10-01T18:08:39.341895Z,hi6220-hikey,perf/LLVM-search-and-compile-subtest-4,skip
lkft,linux-mainline-master,v5.9-rc7-49-gfcadab740480,2020-10-01T18:08:39.341895Z,hi6220-hikey,perf/BPF-filter-subtest-1,skip
lkft,linux-mainline-master,v5.9-rc7-49-gfcadab740480,2020-10-01T18:08:39.341895Z,hi6220-hikey,perf/BPF-filter-subtest-2,skip
lkft,linux-mainline-master,v5.9-rc7-49-gfcadab740480,2020-10-01T18:08:39.341895Z,hi6220-hikey,perf/BPF-filter-subtest-3,skip
lkft,linux-mainline-master,v5.9-rc7-49-gfcadab740480,2020-10-01T18:08:39.341895Z,hi6220-hikey,perf/Probe-SDT-events,skip
lkft,linux-mainline-master,v5.9-rc7-49-gfcadab740480,2020-10-01T18:08:39.341895Z,hi6220-hikey,install-android-platform-tools-r2600/install-fastboot,pass
lkft,linux-mainline-master,v5.9-rc7-49-gfcadab740480,2020-10-01T18:08:39.341895Z,hi6220-hikey,install-android-platform-tools-r2600/install-adb,pass
lkft,linux-mainline-master,v5.9-rc7-49-gfcadab740480,2020-10-01T18:08:39.341895Z,hi6220-hikey,linux-log-parser/check-kernel-exception-1810172,pass
lkft,linux-mainline-master,v5.9-rc7-49-gfcadab740480,2020-10-01T18:08:39.341895Z,hi6220-hikey,linux-log-parser/check-kernel-trace-1810172,pass
lkft,linux-mainline-master,v5.9-rc7-49-gfcadab740480,2020-10-01T18:08:39.341895Z,hi6220-hikey,linux-log-parser/check-kernel-oops-1810172,pass
lkft,linux-mainline-master,v5.9-rc7-49-gfcadab740480,2020-10-01T18:08:39.341895Z,hi6220-hikey,linux-log-parser/check-kernel-fault-1810172,pass
lkft,linux-mainline-master,v5.9-rc7-49-gfcadab740480,2020-10-01T18:08:39.341895Z,hi6220-hikey,linux-log-parser/check-kernel-warning-1810172,pass
lkft,linux-mainline-master,v5.9-rc7-49-gfcadab740480,2020-10-01T18:08:39.341895Z,hi6220-hikey,linux-log-parser/check-kernel-bug-1810172,pass
lkft,linux-mainline-master,v5.9-rc7-49-gfcadab740480,2020-10-01T18:08:39.341895Z,hi6220-hikey,linux-log-parser/check-kernel-invalid-opcode-1810172,pass
lkft,linux-mainline-master,v5.9-rc7-49-gfcadab740480,2020-10-01T18:08:39.341895Z,hi6220-hikey,linux-log-parser/check-kernel-panic-1810172,pass
lkft,linux-mainline-master,v5.9-rc7-49-gfcadab740480,2020-10-01T18:08:39.341895Z,hi6220-hikey,network-basic-tests/print-network-statistics,pass
lkft,linux-mainline-master,v5.9-rc7-49-gfcadab740480,2020-10-01T18:08:39.341895Z,hi6220-hikey,network-basic-tests/list-all-network-interfaces,pass
lkft,linux-mainline-master,v5.9-rc7-49-gfcadab740480,2020-10-01T18:08:39.341895Z,hi6220-hikey,network-basic-tests/print-routing-tables,pass
lkft,linux-mainline-master,v5.9-rc7-49-gfcadab740480,2020-10-01T18:08:39.341895Z,hi6220-hikey,network-basic-tests/ip-link-loopback-up,pass
lkft,linux-mainline-master,v5.9-rc7-49-gfcadab740480,2020-10-01T18:08:39.341895Z,hi6220-hikey,network-basic-tests/route-dump-after-ip-link-loopback-up,pass
lkft,linux-mainline-master,v5.9-rc7-49-gfcadab740480,2020-10-01T18:08:39.341895Z,hi6220-hikey,network-basic-tests/ip-link-interface-up,pass
lkft,linux-mainline-master,v5.9-rc7-49-gfcadab740480,2020-10-01T18:08:39.341895Z,hi6220-hikey,network-basic-tests/ip-link-interface-down,skip
lkft,linux-mainline-master,v5.9-rc7-49-gfcadab740480,2020-10-01T18:08:39.341895Z,hi6220-hikey,network-basic-tests/Dynamic-Host-Configuration-Protocol-Client-dhclient-v,pass
lkft,linux-mainline-master,v5.9-rc7-49-gfcadab740480,2020-10-01T18:08:39.341895Z,hi6220-hikey,network-basic-tests/print-routing-tables-after-dhclient-request,pass
lkft,linux-mainline-master,v5.9-rc7-49-gfcadab740480,2020-10-01T18:08:39.341895Z,hi6220-hikey,network-basic-tests/ping-gateway,pass
lkft,linux-mainline-master,v5.9-rc7-49-gfcadab740480,2020-10-01T18:08:39.341895Z,hi6220-hikey,network-basic-tests/download-a-file,pass
lkft,linux-mainline-master,v5.9-rc7-49-gfcadab740480,2020-10-01T18:08:39.341895Z,hi6220-hikey,install-android-platform-tools-r2600/install-fastboot,pass
lkft,linux-mainline-master,v5.9-rc7-49-gfcadab740480,2020-10-01T18:08:39.341895Z,hi6220-hikey,install-android-platform-tools-r2600/install-adb,pass
lkft,linux-mainline-master,v5.9-rc7-49-gfcadab740480,2020-10-01T18:08:39.341895Z,hi6220-hikey,linux-log-parser/check-kernel-exception-1810171,pass
lkft,linux-mainline-master,v5.9-rc7-49-gfcadab740480,2020-10-01T18:08:39.341895Z,hi6220-hikey,linux-log-parser/check-kernel-trace-1810171,pass
lkft,linux-mainline-master,v5.9-rc7-49-gfcadab740480,2020-10-01T18:08:39.341895Z,hi6220-hikey,linux-log-parser/check-kernel-oops-1810171,pass
lkft,linux-mainline-master,v5.9-rc7-49-gfcadab740480,2020-10-01T18:08:39.341895Z,hi6220-hikey,linux-log-parser/check-kernel-fault-1810171,pass
lkft,linux-mainline-master,v5.9-rc7-49-gfcadab740480,2020-10-01T18:08:39.341895Z,hi6220-hikey,linux-log-parser/check-kernel-warning-1810171,pass
lkft,linux-mainline-master,v5.9-rc7-49-gfcadab740480,2020-10-01T18:08:39.341895Z,hi6220-hikey,linux-log-parser/check-kernel-bug-1810171,pass
lkft,linux-mainline-master,v5.9-rc7-49-gfcadab740480,2020-10-01T18:08:39.341895Z,hi6220-hikey,linux-log-parser/check-kernel-invalid-opcode-1810171,pass
lkft,linux-mainline-master,v5.9-rc7-49-gfcadab740480,2020-10-01T18:08:39.341895Z,hi6220-hikey,linux-log-parser/check-kernel-panic-1810171,pass
lkft,linux-mainline-master,v5.9-rc7-49-gfcadab740480,2020-10-01T18:08:39.341895Z,hi6220-hikey,install-android-platform-tools-r2600/install-fastboot,pass
lkft,linux-mainline-master,v5.9-rc7-49-gfcadab740480,2020-10-01T18:08:39.341895Z,hi6220-hikey,install-android-platform-tools-r2600/install-adb,pass
lkft,linux-mainline-master,v5.9-rc7-49-gfcadab740480,2020-10-01T18:08:39.341895Z,hi6220-hikey,linux-log-parser/check-kernel-exception-1810170,pass
lkft,linux-mainline-master,v5.9-rc7-49-gfcadab740480,2020-10-01T18:08:39.341895Z,hi6220-hikey,linux-log-parser/check-kernel-trace-1810170,pass
lkft,linux-mainline-master,v5.9-rc7-49-gfcadab740480,2020-10-01T18:08:39.341895Z,hi6220-hikey,linux-log-parser/check-kernel-oops-1810170,pass
lkft,linux-mainline-master,v5.9-rc7-49-gfcadab740480,2020-10-01T18:08:39.341895Z,hi6220-hikey,linux-log-parser/check-kernel-fault-1810170,pass
lkft,linux-mainline-master,v5.9-rc7-49-gfcadab740480,2020-10-01T18:08:39.341895Z,hi6220-hikey,linux-log-parser/check-kernel-warning-1810170,pass
lkft,linux-mainline-master,v5.9-rc7-49-gfcadab740480,2020-10-01T18:08:39.341895Z,hi6220-hikey,linux-log-parser/check-kernel-bug-1810170,pass
lkft,linux-mainline-master,v5.9-rc7-49-gfcadab740480,2020-10-01T18:08:39.341895Z,hi6220-hikey,linux-log-parser/check-kernel-invalid-opcode-1810170,pass
lkft,linux-mainline-master,v5.9-rc7-49-gfcadab740480,2020-10-01T18:08:39.341895Z,hi6220-hikey,linux-log-parser/check-kernel-panic-1810170,pass
lkft,linux-mainline-master,v5.9-rc7-49-gfcadab740480,2020-10-01T18:08:39.341895Z,dragonboard-410c,perf/perf-existence-check,pass
lkft,linux-mainline-master,v5.9-rc7-49-gfcadab740480,2020-10-01T18:08:39.341895Z,dragonboard-410c,perf/perf_record_test,pass
lkft,linux-mainline-master,v5.9-rc7-49-gfcadab740480,2020-10-01T18:08:39.341895Z,dragonboard-410c,perf/perf_report_test,pass
lkft,linux-mainline-master,v5.9-rc7-49-gfcadab740480,2020-10-01T18:08:39.341895Z,dragonboard-410c,perf/perf_stat_test,pass
lkft,linux-mainline-master,v5.9-rc7-49-gfcadab740480,2020-10-01T18:08:39.341895Z,dragonboard-410c,perf/perf_test,pass
lkft,linux-mainline-master,v5.9-rc7-49-gfcadab740480,2020-10-01T18:08:39.341895Z,dragonboard-410c,perf/Detect-openat-syscall-event,pass
lkft,linux-mainline-master,v5.9-rc7-49-gfcadab740480,2020-10-01T18:08:39.341895Z,dragonboard-410c,perf/Detect-openat-syscall-event-on-all-cpus,pass
lkft,linux-mainline-master,v5.9-rc7-49-gfcadab740480,2020-10-01T18:08:39.341895Z,dragonboard-410c,perf/Read-samples-using-the-mmap-interface,pass
lkft,linux-mainline-master,v5.9-rc7-49-gfcadab740480,2020-10-01T18:08:39.341895Z,dragonboard-410c,perf/Test-data-source-output,pass
lkft,linux-mainline-master,v5.9-rc7-49-gfcadab740480,2020-10-01T18:08:39.341895Z,dragonboard-410c,perf/Parse-event-definition-strings,pass
lkft,linux-mainline-master,v5.9-rc7-49-gfcadab740480,2020-10-01T18:08:39.341895Z,dragonboard-410c,perf/Simple-expression-parser,pass
lkft,linux-mainline-master,v5.9-rc7-49-gfcadab740480,2020-10-01T18:08:39.341895Z,dragonboard-410c,perf/Parse-perf-pmu-format,pass
lkft,linux-mainline-master,v5.9-rc7-49-gfcadab740480,2020-10-01T18:08:39.341895Z,dragonboard-410c,perf/PMU-events-subtest-1,pass
lkft,linux-mainline-master,v5.9-rc7-49-gfcadab740480,2020-10-01T18:08:39.341895Z,dragonboard-410c,perf/PMU-events-subtest-2,pass
lkft,linux-mainline-master,v5.9-rc7-49-gfcadab740480,2020-10-01T18:08:39.341895Z,dragonboard-410c,perf/PMU-events-subtest-3,pass
lkft,linux-mainline-master,v5.9-rc7-49-gfcadab740480,2020-10-01T18:08:39.341895Z,dragonboard-410c,perf/PMU-events-subtest-4,pass
lkft,linux-mainline-master,v5.9-rc7-49-gfcadab740480,2020-10-01T18:08:39.341895Z,dragonboard-410c,perf/DSO-data-read,pass
lkft,linux-mainline-master,v5.9-rc7-49-gfcadab740480,2020-10-01T18:08:39.341895Z,dragonboard-410c,perf/DSO-data-cache,pass
lkft,linux-mainline-master,v5.9-rc7-49-gfcadab740480,2020-10-01T18:08:39.341895Z,dragonboard-410c,perf/DSO-data-reopen,pass
lkft,linux-mainline-master,v5.9-rc7-49-gfcadab740480,2020-10-01T18:08:39.341895Z,dragonboard-410c,perf/Parse-sched-tracepoints-fields,pass
lkft,linux-mainline-master,v5.9-rc7-49-gfcadab740480,2020-10-01T18:08:39.341895Z,dragonboard-410c,perf/syscallssys_enter_openat-event-fields,pass
lkft,linux-mainline-master,v5.9-rc7-49-gfcadab740480,2020-10-01T18:08:39.341895Z,dragonboard-410c,perf/Match-and-link-multiple-hists,pass
lkft,linux-mainline-master,v5.9-rc7-49-gfcadab740480,2020-10-01T18:08:39.341895Z,dragonboard-410c,perf/Breakpoint-accounting,pass
lkft,linux-mainline-master,v5.9-rc7-49-gfcadab740480,2020-10-01T18:08:39.341895Z,dragonboard-410c,perf/Watchpoint-subtest-1,pass
lkft,linux-mainline-master,v5.9-rc7-49-gfcadab740480,2020-10-01T18:08:39.341895Z,dragonboard-410c,perf/Watchpoint-subtest-2,pass
lkft,linux-mainline-master,v5.9-rc7-49-gfcadab740480,2020-10-01T18:08:39.341895Z,dragonboard-410c,perf/Watchpoint-subtest-3,pass
lkft,linux-mainline-master,v5.9-rc7-49-gfcadab740480,2020-10-01T18:08:39.341895Z,dragonboard-410c,perf/Watchpoint-subtest-4,pass
lkft,linux-mainline-master,v5.9-rc7-49-gfcadab740480,2020-10-01T18:08:39.341895Z,dragonboard-410c,perf/Number-of-exit-events-of-a-simple-workload,pass
lkft,linux-mainline-master,v5.9-rc7-49-gfcadab740480,2020-10-01T18:08:39.341895Z,dragonboard-410c,perf/Software-clock-events-period-values,pass
lkft,linux-mainline-master,v5.9-rc7-49-gfcadab740480,2020-10-01T18:08:39.341895Z,dragonboard-410c,perf/Sample-parsing,pass
lkft,linux-mainline-master,v5.9-rc7-49-gfcadab740480,2020-10-01T18:08:39.341895Z,dragonboard-410c,perf/Use-a-dummy-software-event-to-keep-tracking,pass
lkft,linux-mainline-master,v5.9-rc7-49-gfcadab740480,2020-10-01T18:08:39.341895Z,dragonboard-410c,perf/Parse-with-no-sample_id_all-bit-set,pass
lkft,linux-mainline-master,v5.9-rc7-49-gfcadab740480,2020-10-01T18:08:39.341895Z,dragonboard-410c,perf/Filter-hist-entries,pass
lkft,linux-mainline-master,v5.9-rc7-49-gfcadab740480,2020-10-01T18:08:39.341895Z,dragonboard-410c,perf/Lookup-mmap-thread,pass
lkft,linux-mainline-master,v5.9-rc7-49-gfcadab740480,2020-10-01T18:08:39.341895Z,dragonboard-410c,perf/Share-thread-maps,pass
lkft,linux-mainline-master,v5.9-rc7-49-gfcadab740480,2020-10-01T18:08:39.341895Z,dragonboard-410c,perf/Sort-output-of-hist-entries,pass
lkft,linux-mainline-master,v5.9-rc7-49-gfcadab740480,2020-10-01T18:08:39.341895Z,dragonboard-410c,perf/Cumulate-child-hist-entries,pass
lkft,linux-mainline-master,v5.9-rc7-49-gfcadab740480,2020-10-01T18:08:39.341895Z,dragonboard-410c,perf/Track-with-sched_switch,pass
lkft,linux-mainline-master,v5.9-rc7-49-gfcadab740480,2020-10-01T18:08:39.341895Z,dragonboard-410c,perf/Filter-fds-with-revents-mask-in-a-fdarray,pass
lkft,linux-mainline-master,v5.9-rc7-49-gfcadab740480,2020-10-01T18:08:39.341895Z,dragonboard-410c,"perf/Add-fd-to-a-fdarray,-making-it-autogrow",pass
lkft,linux-mainline-master,v5.9-rc7-49-gfcadab740480,2020-10-01T18:08:39.341895Z,dragonboard-410c,perf/kmod_path__parse,pass
lkft,linux-mainline-master,v5.9-rc7-49-gfcadab740480,2020-10-01T18:08:39.341895Z,dragonboard-410c,perf/Thread-map,pass
lkft,linux-mainline-master,v5.9-rc7-49-gfcadab740480,2020-10-01T18:08:39.341895Z,dragonboard-410c,perf/Session-topology,pass
lkft,linux-mainline-master,v5.9-rc7-49-gfcadab740480,2020-10-01T18:08:39.341895Z,dragonboard-410c,perf/Synthesize-thread-map,pass
lkft,linux-mainline-master,v5.9-rc7-49-gfcadab740480,2020-10-01T18:08:39.341895Z,dragonboard-410c,perf/Remove-thread-map,pass
lkft,linux-mainline-master,v5.9-rc7-49-gfcadab740480,2020-10-01T18:08:39.341895Z,dragonboard-410c,perf/Synthesize-cpu-map,pass
lkft,linux-mainline-master,v5.9-rc7-49-gfcadab740480,2020-10-01T18:08:39.341895Z,dragonboard-410c,perf/Synthesize-stat-config,pass
lkft,linux-mainline-master,v5.9-rc7-49-gfcadab740480,2020-10-01T18:08:39.341895Z,dragonboard-410c,perf/Synthesize-stat,pass
lkft,linux-mainline-master,v5.9-rc7-49-gfcadab740480,2020-10-01T18:08:39.341895Z,dragonboard-410c,perf/Synthesize-stat-round,pass
lkft,linux-mainline-master,v5.9-rc7-49-gfcadab740480,2020-10-01T18:08:39.341895Z,dragonboard-410c,perf/Synthesize-attr-update,pass
lkft,linux-mainline-master,v5.9-rc7-49-gfcadab740480,2020-10-01T18:08:39.341895Z,dragonboard-410c,perf/Event-times,pass
lkft,linux-mainline-master,v5.9-rc7-49-gfcadab740480,2020-10-01T18:08:39.341895Z,dragonboard-410c,perf/Read-backward-ring-buffer,pass
lkft,linux-mainline-master,v5.9-rc7-49-gfcadab740480,2020-10-01T18:08:39.341895Z,dragonboard-410c,perf/Print-cpu-map,pass
lkft,linux-mainline-master,v5.9-rc7-49-gfcadab740480,2020-10-01T18:08:39.341895Z,dragonboard-410c,perf/Merge-cpu-map,pass
lkft,linux-mainline-master,v5.9-rc7-49-gfcadab740480,2020-10-01T18:08:39.341895Z,dragonboard-410c,perf/is_printable_array,pass
lkft,linux-mainline-master,v5.9-rc7-49-gfcadab740480,2020-10-01T18:08:39.341895Z,dragonboard-410c,perf/Print-bitmap,pass
lkft,linux-mainline-master,v5.9-rc7-49-gfcadab740480,2020-10-01T18:08:39.341895Z,dragonboard-410c,perf/perf-hooks,pass
lkft,linux-mainline-master,v5.9-rc7-49-gfcadab740480,2020-10-01T18:08:39.341895Z,dragonboard-410c,perf/unit_number__scnprintf,pass
lkft,linux-mainline-master,v5.9-rc7-49-gfcadab740480,2020-10-01T18:08:39.341895Z,dragonboard-410c,perf/mem2node,pass
lkft,linux-mainline-master,v5.9-rc7-49-gfcadab740480,2020-10-01T18:08:39.341895Z,dragonboard-410c,perf/time-utils,pass
lkft,linux-mainline-master,v5.9-rc7-49-gfcadab740480,2020-10-01T18:08:39.341895Z,dragonboard-410c,perf/Test-jit_write_elf,pass
lkft,linux-mainline-master,v5.9-rc7-49-gfcadab740480,2020-10-01T18:08:39.341895Z,dragonboard-410c,perf/Test-api-io,pass
lkft,linux-mainline-master,v5.9-rc7-49-gfcadab740480,2020-10-01T18:08:39.341895Z,dragonboard-410c,perf/maps__merge_in,pass
lkft,linux-mainline-master,v5.9-rc7-49-gfcadab740480,2020-10-01T18:08:39.341895Z,dragonboard-410c,perf/Demangle-Java,pass
lkft,linux-mainline-master,v5.9-rc7-49-gfcadab740480,2020-10-01T18:08:39.341895Z,dragonboard-410c,perf/Parse-and-process-metrics,pass
lkft,linux-mainline-master,v5.9-rc7-49-gfcadab740480,2020-10-01T18:08:39.341895Z,dragonboard-410c,perf/DWARF-unwind,pass
lkft,linux-mainline-master,v5.9-rc7-49-gfcadab740480,2020-10-01T18:08:39.341895Z,dragonboard-410c,perf/PERF_RECORD_*-events-&-perf_sample-fields,fail
lkft,linux-mainline-master,v5.9-rc7-49-gfcadab740480,2020-10-01T18:08:39.341895Z,dragonboard-410c,perf/'import-perf'-in-python,fail
lkft,linux-mainline-master,v5.9-rc7-49-gfcadab740480,2020-10-01T18:08:39.341895Z,dragonboard-410c,perf/Object-code-reading,xfail
lkft,linux-mainline-master,v5.9-rc7-49-gfcadab740480,2020-10-01T18:08:39.341895Z,dragonboard-410c,perf/LLVM-search-and-compile-subtest-1,fail
lkft,linux-mainline-master,v5.9-rc7-49-gfcadab740480,2020-10-01T18:08:39.341895Z,dragonboard-410c,perf/vmlinux-symtab-matches-kallsyms,skip
lkft,linux-mainline-master,v5.9-rc7-49-gfcadab740480,2020-10-01T18:08:39.341895Z,dragonboard-410c,perf/Setup-struct-perf_event_attr,skip
lkft,linux-mainline-master,v5.9-rc7-49-gfcadab740480,2020-10-01T18:08:39.341895Z,dragonboard-410c,perf/LLVM-search-and-compile-subtest-2,skip
lkft,linux-mainline-master,v5.9-rc7-49-gfcadab740480,2020-10-01T18:08:39.341895Z,dragonboard-410c,perf/LLVM-search-and-compile-subtest-3,skip
lkft,linux-mainline-master,v5.9-rc7-49-gfcadab740480,2020-10-01T18:08:39.341895Z,dragonboard-410c,perf/LLVM-search-and-compile-subtest-4,skip
lkft,linux-mainline-master,v5.9-rc7-49-gfcadab740480,2020-10-01T18:08:39.341895Z,dragonboard-410c,perf/BPF-filter-subtest-1,skip
lkft,linux-mainline-master,v5.9-rc7-49-gfcadab740480,2020-10-01T18:08:39.341895Z,dragonboard-410c,perf/BPF-filter-subtest-2,skip
lkft,linux-mainline-master,v5.9-rc7-49-gfcadab740480,2020-10-01T18:08:39.341895Z,dragonboard-410c,perf/BPF-filter-subtest-3,skip
lkft,linux-mainline-master,v5.9-rc7-49-gfcadab740480,2020-10-01T18:08:39.341895Z,dragonboard-410c,perf/Probe-SDT-events,skip
lkft,linux-mainline-master,v5.9-rc7-49-gfcadab740480,2020-10-01T18:08:39.341895Z,dragonboard-410c,install-android-platform-tools-r2600/install-fastboot,pass
lkft,linux-mainline-master,v5.9-rc7-49-gfcadab740480,2020-10-01T18:08:39.341895Z,dragonboard-410c,install-android-platform-tools-r2600/install-adb,pass
lkft,linux-mainline-master,v5.9-rc7-49-gfcadab740480,2020-10-01T18:08:39.341895Z,dragonboard-410c,linux-log-parser/check-kernel-exception-1810164,pass
lkft,linux-mainline-master,v5.9-rc7-49-gfcadab740480,2020-10-01T18:08:39.341895Z,dragonboard-410c,linux-log-parser/check-kernel-trace-1810164,pass
lkft,linux-mainline-master,v5.9-rc7-49-gfcadab740480,2020-10-01T18:08:39.341895Z,dragonboard-410c,linux-log-parser/check-kernel-oops-1810164,pass
lkft,linux-mainline-master,v5.9-rc7-49-gfcadab740480,2020-10-01T18:08:39.341895Z,dragonboard-410c,linux-log-parser/check-kernel-fault-1810164,pass
lkft,linux-mainline-master,v5.9-rc7-49-gfcadab740480,2020-10-01T18:08:39.341895Z,dragonboard-410c,linux-log-parser/check-kernel-warning-1810164,pass
lkft,linux-mainline-master,v5.9-rc7-49-gfcadab740480,2020-10-01T18:08:39.341895Z,dragonboard-410c,linux-log-parser/check-kernel-bug-1810164,pass
lkft,linux-mainline-master,v5.9-rc7-49-gfcadab740480,2020-10-01T18:08:39.341895Z,dragonboard-410c,linux-log-parser/check-kernel-invalid-opcode-1810164,pass
lkft,linux-mainline-master,v5.9-rc7-49-gfcadab740480,2020-10-01T18:08:39.341895Z,dragonboard-410c,linux-log-parser/check-kernel-panic-1810164,pass
lkft,linux-mainline-master,v5.9-rc7-49-gfcadab740480,2020-10-01T18:08:39.341895Z,dragonboard-410c,install-android-platform-tools-r2600/install-fastboot,pass
lkft,linux-mainline-master,v5.9-rc7-49-gfcadab740480,2020-10-01T18:08:39.341895Z,dragonboard-410c,install-android-platform-tools-r2600/install-adb,pass
lkft,linux-mainline-master,v5.9-rc7-49-gfcadab740480,2020-10-01T18:08:39.341895Z,dragonboard-410c,linux-log-parser/check-kernel-exception-1810163,pass
lkft,linux-mainline-master,v5.9-rc7-49-gfcadab740480,2020-10-01T18:08:39.341895Z,dragonboard-410c,linux-log-parser/check-kernel-trace-1810163,pass
lkft,linux-mainline-master,v5.9-rc7-49-gfcadab740480,2020-10-01T18:08:39.341895Z,dragonboard-410c,linux-log-parser/check-kernel-oops-1810163,pass
lkft,linux-mainline-master,v5.9-rc7-49-gfcadab740480,2020-10-01T18:08:39.341895Z,dragonboard-410c,linux-log-parser/check-kernel-fault-1810163,pass
lkft,linux-mainline-master,v5.9-rc7-49-gfcadab740480,2020-10-01T18:08:39.341895Z,dragonboard-410c,linux-log-parser/check-kernel-warning-1810163,pass
lkft,linux-mainline-master,v5.9-rc7-49-gfcadab740480,2020-10-01T18:08:39.341895Z,dragonboard-410c,linux-log-parser/check-kernel-bug-1810163,pass
lkft,linux-mainline-master,v5.9-rc7-49-gfcadab740480,2020-10-01T18:08:39.341895Z,dragonboard-410c,linux-log-parser/check-kernel-invalid-opcode-1810163,pass
lkft,linux-mainline-master,v5.9-rc7-49-gfcadab740480,2020-10-01T18:08:39.341895Z,dragonboard-410c,linux-log-parser/check-kernel-panic-1810163,pass
lkft,linux-mainline-master,v5.9-rc7-49-gfcadab740480,2020-10-01T18:08:39.341895Z,x15,install-android-platform-tools-r2600/install-fastboot,pass
lkft,linux-mainline-master,v5.9-rc7-49-gfcadab740480,2020-10-01T18:08:39.341895Z,x15,install-android-platform-tools-r2600/install-adb,pass
lkft,linux-mainline-master,v5.9-rc7-49-gfcadab740480,2020-10-01T18:08:39.341895Z,x15,linux-log-parser/check-kernel-exception-1810191,pass
lkft,linux-mainline-master,v5.9-rc7-49-gfcadab740480,2020-10-01T18:08:39.341895Z,x15,linux-log-parser/check-kernel-trace-1810191,pass
lkft,linux-mainline-master,v5.9-rc7-49-gfcadab740480,2020-10-01T18:08:39.341895Z,x15,linux-log-parser/check-kernel-oops-1810191,pass
lkft,linux-mainline-master,v5.9-rc7-49-gfcadab740480,2020-10-01T18:08:39.341895Z,x15,linux-log-parser/check-kernel-fault-1810191,pass
lkft,linux-mainline-master,v5.9-rc7-49-gfcadab740480,2020-10-01T18:08:39.341895Z,x15,linux-log-parser/check-kernel-warning-1810191,pass
lkft,linux-mainline-master,v5.9-rc7-49-gfcadab740480,2020-10-01T18:08:39.341895Z,x15,linux-log-parser/check-kernel-bug-1810191,pass
lkft,linux-mainline-master,v5.9-rc7-49-gfcadab740480,2020-10-01T18:08:39.341895Z,x15,linux-log-parser/check-kernel-invalid-opcode-1810191,pass
lkft,linux-mainline-master,v5.9-rc7-49-gfcadab740480,2020-10-01T18:08:39.341895Z,x15,linux-log-parser/check-kernel-panic-1810191,pass
lkft,linux-mainline-master,v5.9-rc7-49-gfcadab740480,2020-10-01T18:08:39.341895Z,x15,install-android-platform-tools-r2600/install-fastboot,pass
lkft,linux-mainline-master,v5.9-rc7-49-gfcadab740480,2020-10-01T18:08:39.341895Z,x15,install-android-platform-tools-r2600/install-adb,pass
lkft,linux-mainline-master,v5.9-rc7-49-gfcadab740480,2020-10-01T18:08:39.341895Z,x15,linux-log-parser/check-kernel-exception-1810176,pass
lkft,linux-mainline-master,v5.9-rc7-49-gfcadab740480,2020-10-01T18:08:39.341895Z,x15,linux-log-parser/check-kernel-trace-1810176,pass
lkft,linux-mainline-master,v5.9-rc7-49-gfcadab740480,2020-10-01T18:08:39.341895Z,x15,linux-log-parser/check-kernel-oops-1810176,pass
lkft,linux-mainline-master,v5.9-rc7-49-gfcadab740480,2020-10-01T18:08:39.341895Z,x15,linux-log-parser/check-kernel-fault-1810176,pass
lkft,linux-mainline-master,v5.9-rc7-49-gfcadab740480,2020-10-01T18:08:39.341895Z,x15,linux-log-parser/check-kernel-warning-1810176,pass
lkft,linux-mainline-master,v5.9-rc7-49-gfcadab740480,2020-10-01T18:08:39.341895Z,x15,linux-log-parser/check-kernel-bug-1810176,pass
lkft,linux-mainline-master,v5.9-rc7-49-gfcadab740480,2020-10-01T18:08:39.341895Z,x15,linux-log-parser/check-kernel-invalid-opcode-1810176,pass
lkft,linux-mainline-master,v5.9-rc7-49-gfcadab740480,2020-10-01T18:08:39.341895Z,x15,linux-log-parser/check-kernel-panic-1810176,pass
lkft,linux-mainline-master,v5.9-rc7-49-gfcadab740480,2020-10-01T18:08:39.341895Z,hi6220-hikey,install-android-platform-tools-r2600/install-fastboot,pass
lkft,linux-mainline-master,v5.9-rc7-49-gfcadab740480,2020-10-01T18:08:39.341895Z,hi6220-hikey,install-android-platform-tools-r2600/install-adb,pass
lkft,linux-mainline-master,v5.9-rc7-49-gfcadab740480,2020-10-01T18:08:39.341895Z,hi6220-hikey,linux-log-parser/check-kernel-exception-1810169,pass
lkft,linux-mainline-master,v5.9-rc7-49-gfcadab740480,2020-10-01T18:08:39.341895Z,hi6220-hikey,linux-log-parser/check-kernel-trace-1810169,pass
lkft,linux-mainline-master,v5.9-rc7-49-gfcadab740480,2020-10-01T18:08:39.341895Z,hi6220-hikey,linux-log-parser/check-kernel-oops-1810169,pass
lkft,linux-mainline-master,v5.9-rc7-49-gfcadab740480,2020-10-01T18:08:39.341895Z,hi6220-hikey,linux-log-parser/check-kernel-fault-1810169,pass
lkft,linux-mainline-master,v5.9-rc7-49-gfcadab740480,2020-10-01T18:08:39.341895Z,hi6220-hikey,linux-log-parser/check-kernel-warning-1810169,fail
lkft,linux-mainline-master,v5.9-rc7-49-gfcadab740480,2020-10-01T18:08:39.341895Z,hi6220-hikey,linux-log-parser/check-kernel-bug-1810169,pass
lkft,linux-mainline-master,v5.9-rc7-49-gfcadab740480,2020-10-01T18:08:39.341895Z,hi6220-hikey,linux-log-parser/check-kernel-invalid-opcode-1810169,pass
lkft,linux-mainline-master,v5.9-rc7-49-gfcadab740480,2020-10-01T18:08:39.341895Z,hi6220-hikey,linux-log-parser/check-kernel-panic-1810169,pass
lkft,linux-mainline-master,v5.9-rc7-49-gfcadab740480,2020-10-01T18:08:39.341895Z,x15,install-android-platform-tools-r2600/install-fastboot,pass
lkft,linux-mainline-master,v5.9-rc7-49-gfcadab740480,2020-10-01T18:08:39.341895Z,x15,install-android-platform-tools-r2600/install-adb,pass
lkft,linux-mainline-master,v5.9-rc7-49-gfcadab740480,2020-10-01T18:08:39.341895Z,x15,linux-log-parser/check-kernel-exception-1810175,pass
lkft,linux-mainline-master,v5.9-rc7-49-gfcadab740480,2020-10-01T18:08:39.341895Z,x15,linux-log-parser/check-kernel-trace-1810175,pass
lkft,linux-mainline-master,v5.9-rc7-49-gfcadab740480,2020-10-01T18:08:39.341895Z,x15,linux-log-parser/check-kernel-oops-1810175,pass
lkft,linux-mainline-master,v5.9-rc7-49-gfcadab740480,2020-10-01T18:08:39.341895Z,x15,linux-log-parser/check-kernel-fault-1810175,pass
lkft,linux-mainline-master,v5.9-rc7-49-gfcadab740480,2020-10-01T18:08:39.341895Z,x15,linux-log-parser/check-kernel-warning-1810175,pass
lkft,linux-mainline-master,v5.9-rc7-49-gfcadab740480,2020-10-01T18:08:39.341895Z,x15,linux-log-parser/check-kernel-bug-1810175,pass
lkft,linux-mainline-master,v5.9-rc7-49-gfcadab740480,2020-10-01T18:08:39.341895Z,x15,linux-log-parser/check-kernel-invalid-opcode-1810175,pass
lkft,linux-mainline-master,v5.9-rc7-49-gfcadab740480,2020-10-01T18:08:39.341895Z,x15,linux-log-parser/check-kernel-panic-1810175,pass
lkft,linux-mainline-master,v5.9-rc7-49-gfcadab740480,2020-10-01T18:08:39.341895Z,dragonboard-410c,install-android-platform-tools-r2600/install-fastboot,pass
lkft,linux-mainline-master,v5.9-rc7-49-gfcadab740480,2020-10-01T18:08:39.341895Z,dragonboard-410c,install-android-platform-tools-r2600/install-adb,pass
lkft,linux-mainline-master,v5.9-rc7-49-gfcadab740480,2020-10-01T18:08:39.341895Z,dragonboard-410c,linux-log-parser/check-kernel-exception-1810162,pass
lkft,linux-mainline-master,v5.9-rc7-49-gfcadab740480,2020-10-01T18:08:39.341895Z,dragonboard-410c,linux-log-parser/check-kernel-trace-1810162,pass
lkft,linux-mainline-master,v5.9-rc7-49-gfcadab740480,2020-10-01T18:08:39.341895Z,dragonboard-410c,linux-log-parser/check-kernel-oops-1810162,pass
lkft,linux-mainline-master,v5.9-rc7-49-gfcadab740480,2020-10-01T18:08:39.341895Z,dragonboard-410c,linux-log-parser/check-kernel-fault-1810162,pass
lkft,linux-mainline-master,v5.9-rc7-49-gfcadab740480,2020-10-01T18:08:39.341895Z,dragonboard-410c,linux-log-parser/check-kernel-warning-1810162,fail
lkft,linux-mainline-master,v5.9-rc7-49-gfcadab740480,2020-10-01T18:08:39.341895Z,dragonboard-410c,linux-log-parser/check-kernel-bug-1810162,pass
lkft,linux-mainline-master,v5.9-rc7-49-gfcadab740480,2020-10-01T18:08:39.341895Z,dragonboard-410c,linux-log-parser/check-kernel-invalid-opcode-1810162,pass
lkft,linux-mainline-master,v5.9-rc7-49-gfcadab740480,2020-10-01T18:08:39.341895Z,dragonboard-410c,linux-log-parser/check-kernel-panic-1810162,pass
lkft,linux-mainline-master,v5.9-rc7-49-gfcadab740480,2020-10-01T18:08:39.341895Z,x86,linux-log-parser/check-kernel-exception-1810134,pass
lkft,linux-mainline-master,v5.9-rc7-49-gfcadab740480,2020-10-01T18:08:39.341895Z,x86,linux-log-parser/check-kernel-trace-1810134,pass
lkft,linux-mainline-master,v5.9-rc7-49-gfcadab740480,2020-10-01T18:08:39.341895Z,x86,linux-log-parser/check-kernel-oops-1810134,pass
lkft,linux-mainline-master,v5.9-rc7-49-gfcadab740480,2020-10-01T18:08:39.341895Z,x86,linux-log-parser/check-kernel-fault-1810134,pass
lkft,linux-mainline-master,v5.9-rc7-49-gfcadab740480,2020-10-01T18:08:39.341895Z,x86,linux-log-parser/check-kernel-warning-1810134,pass
lkft,linux-mainline-master,v5.9-rc7-49-gfcadab740480,2020-10-01T18:08:39.341895Z,x86,linux-log-parser/check-kernel-bug-1810134,pass
lkft,linux-mainline-master,v5.9-rc7-49-gfcadab740480,2020-10-01T18:08:39.341895Z,x86,linux-log-parser/check-kernel-invalid-opcode-1810134,pass
lkft,linux-mainline-master,v5.9-rc7-49-gfcadab740480,2020-10-01T18:08:39.341895Z,x86,linux-log-parser/check-kernel-panic-1810134,pass
lkft,linux-mainline-master,v5.9-rc7-49-gfcadab740480,2020-10-01T18:08:39.341895Z,x86,linux-log-parser/check-kernel-exception-1810137,pass
lkft,linux-mainline-master,v5.9-rc7-49-gfcadab740480,2020-10-01T18:08:39.341895Z,x86,linux-log-parser/check-kernel-trace-1810137,pass
lkft,linux-mainline-master,v5.9-rc7-49-gfcadab740480,2020-10-01T18:08:39.341895Z,x86,linux-log-parser/check-kernel-oops-1810137,pass
lkft,linux-mainline-master,v5.9-rc7-49-gfcadab740480,2020-10-01T18:08:39.341895Z,x86,linux-log-parser/check-kernel-fault-1810137,pass
lkft,linux-mainline-master,v5.9-rc7-49-gfcadab740480,2020-10-01T18:08:39.341895Z,x86,linux-log-parser/check-kernel-warning-1810137,pass
lkft,linux-mainline-master,v5.9-rc7-49-gfcadab740480,2020-10-01T18:08:39.341895Z,x86,linux-log-parser/check-kernel-bug-1810137,pass
lkft,linux-mainline-master,v5.9-rc7-49-gfcadab740480,2020-10-01T18:08:39.341895Z,x86,linux-log-parser/check-kernel-invalid-opcode-1810137,pass
lkft,linux-mainline-master,v5.9-rc7-49-gfcadab740480,2020-10-01T18:08:39.341895Z,x86,linux-log-parser/check-kernel-panic-1810137,pass
lkft,linux-mainline-master,v5.9-rc7-49-gfcadab740480,2020-10-01T18:08:39.341895Z,x86,linux-log-parser/check-kernel-exception-1810132,pass
lkft,linux-mainline-master,v5.9-rc7-49-gfcadab740480,2020-10-01T18:08:39.341895Z,x86,linux-log-parser/check-kernel-trace-1810132,pass
lkft,linux-mainline-master,v5.9-rc7-49-gfcadab740480,2020-10-01T18:08:39.341895Z,x86,linux-log-parser/check-kernel-oops-1810132,pass
lkft,linux-mainline-master,v5.9-rc7-49-gfcadab740480,2020-10-01T18:08:39.341895Z,x86,linux-log-parser/check-kernel-fault-1810132,pass
lkft,linux-mainline-master,v5.9-rc7-49-gfcadab740480,2020-10-01T18:08:39.341895Z,x86,linux-log-parser/check-kernel-warning-1810132,pass
lkft,linux-mainline-master,v5.9-rc7-49-gfcadab740480,2020-10-01T18:08:39.341895Z,x86,linux-log-parser/check-kernel-bug-1810132,pass
lkft,linux-mainline-master,v5.9-rc7-49-gfcadab740480,2020-10-01T18:08:39.341895Z,x86,linux-log-parser/check-kernel-invalid-opcode-1810132,pass
lkft,linux-mainline-master,v5.9-rc7-49-gfcadab740480,2020-10-01T18:08:39.341895Z,x86,linux-log-parser/check-kernel-panic-1810132,pass
lkft,linux-mainline-master,v5.9-rc7-49-gfcadab740480,2020-10-01T18:08:39.341895Z,x86,linux-log-parser/check-kernel-exception-1810135,pass
lkft,linux-mainline-master,v5.9-rc7-49-gfcadab740480,2020-10-01T18:08:39.341895Z,x86,linux-log-parser/check-kernel-trace-1810135,pass
lkft,linux-mainline-master,v5.9-rc7-49-gfcadab740480,2020-10-01T18:08:39.341895Z,x86,linux-log-parser/check-kernel-oops-1810135,pass
lkft,linux-mainline-master,v5.9-rc7-49-gfcadab740480,2020-10-01T18:08:39.341895Z,x86,linux-log-parser/check-kernel-fault-1810135,pass
lkft,linux-mainline-master,v5.9-rc7-49-gfcadab740480,2020-10-01T18:08:39.341895Z,x86,linux-log-parser/check-kernel-warning-1810135,pass
lkft,linux-mainline-master,v5.9-rc7-49-gfcadab740480,2020-10-01T18:08:39.341895Z,x86,linux-log-parser/check-kernel-bug-1810135,pass
lkft,linux-mainline-master,v5.9-rc7-49-gfcadab740480,2020-10-01T18:08:39.341895Z,x86,linux-log-parser/check-kernel-invalid-opcode-1810135,pass
lkft,linux-mainline-master,v5.9-rc7-49-gfcadab740480,2020-10-01T18:08:39.341895Z,x86,linux-log-parser/check-kernel-panic-1810135,pass
lkft,linux-mainline-master,v5.9-rc7-49-gfcadab740480,2020-10-01T18:08:39.341895Z,x86,linux-log-parser/check-kernel-exception-1810138,pass
lkft,linux-mainline-master,v5.9-rc7-49-gfcadab740480,2020-10-01T18:08:39.341895Z,x86,linux-log-parser/check-kernel-trace-1810138,pass
lkft,linux-mainline-master,v5.9-rc7-49-gfcadab740480,2020-10-01T18:08:39.341895Z,x86,linux-log-parser/check-kernel-oops-1810138,pass
lkft,linux-mainline-master,v5.9-rc7-49-gfcadab740480,2020-10-01T18:08:39.341895Z,x86,linux-log-parser/check-kernel-fault-1810138,pass
lkft,linux-mainline-master,v5.9-rc7-49-gfcadab740480,2020-10-01T18:08:39.341895Z,x86,linux-log-parser/check-kernel-warning-1810138,pass
lkft,linux-mainline-master,v5.9-rc7-49-gfcadab740480,2020-10-01T18:08:39.341895Z,x86,linux-log-parser/check-kernel-bug-1810138,pass
lkft,linux-mainline-master,v5.9-rc7-49-gfcadab740480,2020-10-01T18:08:39.341895Z,x86,linux-log-parser/check-kernel-invalid-opcode-1810138,pass
lkft,linux-mainline-master,v5.9-rc7-49-gfcadab740480,2020-10-01T18:08:39.341895Z,x86,linux-log-parser/check-kernel-panic-1810138,pass
lkft,linux-mainline-master,v5.9-rc7-49-gfcadab740480,2020-10-01T18:08:39.341895Z,juno-r2,linux-log-parser/check-kernel-exception-1810142,pass
lkft,linux-mainline-master,v5.9-rc7-49-gfcadab740480,2020-10-01T18:08:39.341895Z,juno-r2,linux-log-parser/check-kernel-trace-1810142,pass
lkft,linux-mainline-master,v5.9-rc7-49-gfcadab740480,2020-10-01T18:08:39.341895Z,juno-r2,linux-log-parser/check-kernel-oops-1810142,pass
lkft,linux-mainline-master,v5.9-rc7-49-gfcadab740480,2020-10-01T18:08:39.341895Z,juno-r2,linux-log-parser/check-kernel-fault-1810142,pass
lkft,linux-mainline-master,v5.9-rc7-49-gfcadab740480,2020-10-01T18:08:39.341895Z,juno-r2,linux-log-parser/check-kernel-warning-1810142,pass
lkft,linux-mainline-master,v5.9-rc7-49-gfcadab740480,2020-10-01T18:08:39.341895Z,juno-r2,linux-log-parser/check-kernel-bug-1810142,pass
lkft,linux-mainline-master,v5.9-rc7-49-gfcadab740480,2020-10-01T18:08:39.341895Z,juno-r2,linux-log-parser/check-kernel-invalid-opcode-1810142,pass
lkft,linux-mainline-master,v5.9-rc7-49-gfcadab740480,2020-10-01T18:08:39.341895Z,juno-r2,linux-log-parser/check-kernel-panic-1810142,pass
lkft,linux-mainline-master,v5.9-rc7-49-gfcadab740480,2020-10-01T18:08:39.341895Z,juno-r2,linux-log-parser/check-kernel-exception-1810143,pass
lkft,linux-mainline-master,v5.9-rc7-49-gfcadab740480,2020-10-01T18:08:39.341895Z,juno-r2,linux-log-parser/check-kernel-trace-1810143,pass
lkft,linux-mainline-master,v5.9-rc7-49-gfcadab740480,2020-10-01T18:08:39.341895Z,juno-r2,linux-log-parser/check-kernel-oops-1810143,pass
lkft,linux-mainline-master,v5.9-rc7-49-gfcadab740480,2020-10-01T18:08:39.341895Z,juno-r2,linux-log-parser/check-kernel-fault-1810143,pass
lkft,linux-mainline-master,v5.9-rc7-49-gfcadab740480,2020-10-01T18:08:39.341895Z,juno-r2,linux-log-parser/check-kernel-warning-1810143,pass
lkft,linux-mainline-master,v5.9-rc7-49-gfcadab740480,2020-10-01T18:08:39.341895Z,juno-r2,linux-log-parser/check-kernel-bug-1810143,pass
lkft,linux-mainline-master,v5.9-rc7-49-gfcadab740480,2020-10-01T18:08:39.341895Z,juno-r2,linux-log-parser/check-kernel-invalid-opcode-1810143,pass
lkft,linux-mainline-master,v5.9-rc7-49-gfcadab740480,2020-10-01T18:08:39.341895Z,juno-r2,linux-log-parser/check-kernel-panic-1810143,pass
lkft,linux-mainline-master,v5.9-rc7-49-gfcadab740480,2020-10-01T18:08:39.341895Z,juno-r2,linux-log-parser/check-kernel-exception-1810141,pass
lkft,linux-mainline-master,v5.9-rc7-49-gfcadab740480,2020-10-01T18:08:39.341895Z,juno-r2,linux-log-parser/check-kernel-trace-1810141,pass
lkft,linux-mainline-master,v5.9-rc7-49-gfcadab740480,2020-10-01T18:08:39.341895Z,juno-r2,linux-log-parser/check-kernel-oops-1810141,pass
lkft,linux-mainline-master,v5.9-rc7-49-gfcadab740480,2020-10-01T18:08:39.341895Z,juno-r2,linux-log-parser/check-kernel-fault-1810141,pass
lkft,linux-mainline-master,v5.9-rc7-49-gfcadab740480,2020-10-01T18:08:39.341895Z,juno-r2,linux-log-parser/check-kernel-warning-1810141,pass
lkft,linux-mainline-master,v5.9-rc7-49-gfcadab740480,2020-10-01T18:08:39.341895Z,juno-r2,linux-log-parser/check-kernel-bug-1810141,pass
lkft,linux-mainline-master,v5.9-rc7-49-gfcadab740480,2020-10-01T18:08:39.341895Z,juno-r2,linux-log-parser/check-kernel-invalid-opcode-1810141,pass
lkft,linux-mainline-master,v5.9-rc7-49-gfcadab740480,2020-10-01T18:08:39.341895Z,juno-r2,linux-log-parser/check-kernel-panic-1810141,pass
lkft,linux-mainline-master,v5.9-rc7-49-gfcadab740480,2020-10-01T18:08:39.341895Z,x86,linux-log-parser/check-kernel-exception-1810133,pass
lkft,linux-mainline-master,v5.9-rc7-49-gfcadab740480,2020-10-01T18:08:39.341895Z,x86,linux-log-parser/check-kernel-trace-1810133,pass
lkft,linux-mainline-master,v5.9-rc7-49-gfcadab740480,2020-10-01T18:08:39.341895Z,x86,linux-log-parser/check-kernel-oops-1810133,pass
lkft,linux-mainline-master,v5.9-rc7-49-gfcadab740480,2020-10-01T18:08:39.341895Z,x86,linux-log-parser/check-kernel-fault-1810133,pass
lkft,linux-mainline-master,v5.9-rc7-49-gfcadab740480,2020-10-01T18:08:39.341895Z,x86,linux-log-parser/check-kernel-warning-1810133,pass
lkft,linux-mainline-master,v5.9-rc7-49-gfcadab740480,2020-10-01T18:08:39.341895Z,x86,linux-log-parser/check-kernel-bug-1810133,pass
lkft,linux-mainline-master,v5.9-rc7-49-gfcadab740480,2020-10-01T18:08:39.341895Z,x86,linux-log-parser/check-kernel-invalid-opcode-1810133,pass
lkft,linux-mainline-master,v5.9-rc7-49-gfcadab740480,2020-10-01T18:08:39.341895Z,x86,linux-log-parser/check-kernel-panic-1810133,pass
lkft,linux-mainline-master,v5.9-rc7-49-gfcadab740480,2020-10-01T18:08:39.341895Z,juno-r2,linux-log-parser/check-kernel-exception-1810144,pass
lkft,linux-mainline-master,v5.9-rc7-49-gfcadab740480,2020-10-01T18:08:39.341895Z,juno-r2,linux-log-parser/check-kernel-trace-1810144,pass
lkft,linux-mainline-master,v5.9-rc7-49-gfcadab740480,2020-10-01T18:08:39.341895Z,juno-r2,linux-log-parser/check-kernel-oops-1810144,pass
lkft,linux-mainline-master,v5.9-rc7-49-gfcadab740480,2020-10-01T18:08:39.341895Z,juno-r2,linux-log-parser/check-kernel-fault-1810144,pass
lkft,linux-mainline-master,v5.9-rc7-49-gfcadab740480,2020-10-01T18:08:39.341895Z,juno-r2,linux-log-parser/check-kernel-warning-1810144,pass
lkft,linux-mainline-master,v5.9-rc7-49-gfcadab740480,2020-10-01T18:08:39.341895Z,juno-r2,linux-log-parser/check-kernel-bug-1810144,pass
lkft,linux-mainline-master,v5.9-rc7-49-gfcadab740480,2020-10-01T18:08:39.341895Z,juno-r2,linux-log-parser/check-kernel-invalid-opcode-1810144,pass
lkft,linux-mainline-master,v5.9-rc7-49-gfcadab740480,2020-10-01T18:08:39.341895Z,juno-r2,linux-log-parser/check-kernel-panic-1810144,pass
lkft,linux-mainline-master,v5.9-rc7-49-gfcadab740480,2020-10-01T18:08:39.341895Z,x86,linux-log-parser/check-kernel-exception-1810136,pass
lkft,linux-mainline-master,v5.9-rc7-49-gfcadab740480,2020-10-01T18:08:39.341895Z,x86,linux-log-parser/check-kernel-trace-1810136,pass
lkft,linux-mainline-master,v5.9-rc7-49-gfcadab740480,2020-10-01T18:08:39.341895Z,x86,linux-log-parser/check-kernel-oops-1810136,pass
lkft,linux-mainline-master,v5.9-rc7-49-gfcadab740480,2020-10-01T18:08:39.341895Z,x86,linux-log-parser/check-kernel-fault-1810136,pass
lkft,linux-mainline-master,v5.9-rc7-49-gfcadab740480,2020-10-01T18:08:39.341895Z,x86,linux-log-parser/check-kernel-warning-1810136,pass
lkft,linux-mainline-master,v5.9-rc7-49-gfcadab740480,2020-10-01T18:08:39.341895Z,x86,linux-log-parser/check-kernel-bug-1810136,pass
lkft,linux-mainline-master,v5.9-rc7-49-gfcadab740480,2020-10-01T18:08:39.341895Z,x86,linux-log-parser/check-kernel-invalid-opcode-1810136,pass
lkft,linux-mainline-master,v5.9-rc7-49-gfcadab740480,2020-10-01T18:08:39.341895Z,x86,linux-log-parser/check-kernel-panic-1810136,pass
lkft,linux-mainline-master,v5.9-rc7-49-gfcadab740480,2020-10-01T18:08:39.341895Z,i386,linux-log-parser/check-kernel-exception-1810166,pass
lkft,linux-mainline-master,v5.9-rc7-49-gfcadab740480,2020-10-01T18:08:39.341895Z,i386,linux-log-parser/check-kernel-trace-1810166,pass
lkft,linux-mainline-master,v5.9-rc7-49-gfcadab740480,2020-10-01T18:08:39.341895Z,i386,linux-log-parser/check-kernel-oops-1810166,pass
lkft,linux-mainline-master,v5.9-rc7-49-gfcadab740480,2020-10-01T18:08:39.341895Z,i386,linux-log-parser/check-kernel-fault-1810166,pass
lkft,linux-mainline-master,v5.9-rc7-49-gfcadab740480,2020-10-01T18:08:39.341895Z,i386,linux-log-parser/check-kernel-warning-1810166,pass
lkft,linux-mainline-master,v5.9-rc7-49-gfcadab740480,2020-10-01T18:08:39.341895Z,i386,linux-log-parser/check-kernel-bug-1810166,pass
lkft,linux-mainline-master,v5.9-rc7-49-gfcadab740480,2020-10-01T18:08:39.341895Z,i386,linux-log-parser/check-kernel-invalid-opcode-1810166,pass
lkft,linux-mainline-master,v5.9-rc7-49-gfcadab740480,2020-10-01T18:08:39.341895Z,i386,linux-log-parser/check-kernel-panic-1810166,pass
lkft,linux-mainline-master,v5.9-rc7-49-gfcadab740480,2020-10-01T18:08:39.341895Z,i386,linux-log-parser/check-kernel-exception-1810165,pass
lkft,linux-mainline-master,v5.9-rc7-49-gfcadab740480,2020-10-01T18:08:39.341895Z,i386,linux-log-parser/check-kernel-trace-1810165,pass
lkft,linux-mainline-master,v5.9-rc7-49-gfcadab740480,2020-10-01T18:08:39.341895Z,i386,linux-log-parser/check-kernel-oops-1810165,pass
lkft,linux-mainline-master,v5.9-rc7-49-gfcadab740480,2020-10-01T18:08:39.341895Z,i386,linux-log-parser/check-kernel-fault-1810165,pass
lkft,linux-mainline-master,v5.9-rc7-49-gfcadab740480,2020-10-01T18:08:39.341895Z,i386,linux-log-parser/check-kernel-warning-1810165,pass
lkft,linux-mainline-master,v5.9-rc7-49-gfcadab740480,2020-10-01T18:08:39.341895Z,i386,linux-log-parser/check-kernel-bug-1810165,pass
lkft,linux-mainline-master,v5.9-rc7-49-gfcadab740480,2020-10-01T18:08:39.341895Z,i386,linux-log-parser/check-kernel-invalid-opcode-1810165,pass
lkft,linux-mainline-master,v5.9-rc7-49-gfcadab740480,2020-10-01T18:08:39.341895Z,i386,linux-log-parser/check-kernel-panic-1810165,pass
lkft,linux-mainline-master,v5.9-rc7-49-gfcadab740480,2020-10-01T18:08:39.341895Z,i386,linux-log-parser/check-kernel-exception-1810168,pass
lkft,linux-mainline-master,v5.9-rc7-49-gfcadab740480,2020-10-01T18:08:39.341895Z,i386,linux-log-parser/check-kernel-trace-1810168,pass
lkft,linux-mainline-master,v5.9-rc7-49-gfcadab740480,2020-10-01T18:08:39.341895Z,i386,linux-log-parser/check-kernel-oops-1810168,pass
lkft,linux-mainline-master,v5.9-rc7-49-gfcadab740480,2020-10-01T18:08:39.341895Z,i386,linux-log-parser/check-kernel-fault-1810168,pass
lkft,linux-mainline-master,v5.9-rc7-49-gfcadab740480,2020-10-01T18:08:39.341895Z,i386,linux-log-parser/check-kernel-warning-1810168,pass
lkft,linux-mainline-master,v5.9-rc7-49-gfcadab740480,2020-10-01T18:08:39.341895Z,i386,linux-log-parser/check-kernel-bug-1810168,pass
lkft,linux-mainline-master,v5.9-rc7-49-gfcadab740480,2020-10-01T18:08:39.341895Z,i386,linux-log-parser/check-kernel-invalid-opcode-1810168,pass
lkft,linux-mainline-master,v5.9-rc7-49-gfcadab740480,2020-10-01T18:08:39.341895Z,i386,linux-log-parser/check-kernel-panic-1810168,pass
lkft,linux-mainline-master,v5.9-rc7-49-gfcadab740480,2020-10-01T18:08:39.341895Z,i386,linux-log-parser/check-kernel-exception-1810167,pass
lkft,linux-mainline-master,v5.9-rc7-49-gfcadab740480,2020-10-01T18:08:39.341895Z,i386,linux-log-parser/check-kernel-trace-1810167,pass
lkft,linux-mainline-master,v5.9-rc7-49-gfcadab740480,2020-10-01T18:08:39.341895Z,i386,linux-log-parser/check-kernel-oops-1810167,pass
lkft,linux-mainline-master,v5.9-rc7-49-gfcadab740480,2020-10-01T18:08:39.341895Z,i386,linux-log-parser/check-kernel-fault-1810167,pass
lkft,linux-mainline-master,v5.9-rc7-49-gfcadab740480,2020-10-01T18:08:39.341895Z,i386,linux-log-parser/check-kernel-warning-1810167,pass
lkft,linux-mainline-master,v5.9-rc7-49-gfcadab740480,2020-10-01T18:08:39.341895Z,i386,linux-log-parser/check-kernel-bug-1810167,pass
lkft,linux-mainline-master,v5.9-rc7-49-gfcadab740480,2020-10-01T18:08:39.341895Z,i386,linux-log-parser/check-kernel-invalid-opcode-1810167,pass
lkft,linux-mainline-master,v5.9-rc7-49-gfcadab740480,2020-10-01T18:08:39.341895Z,i386,linux-log-parser/check-kernel-panic-1810167,pass
