{
  "nodes": [
    {
      "op": "null", 
      "name": "input_1", 
      "inputs": []
    }, 
    {
      "op": "tvm_op", 
      "name": "tvmgen_default_fused_transpose_layout_transform", 
      "attrs": {
        "num_outputs": "1", 
        "src_layout": "NCHW", 
        "flatten_data": "0", 
        "dst_layout": "NCHW3c", 
        "hash": "7d0e552be37c872e", 
        "func_name": "tvmgen_default_fused_transpose_layout_transform", 
        "num_inputs": "1"
      }, 
      "inputs": [
        [
          0, 
          0, 
          0
        ]
      ]
    }, 
    {
      "op": "null", 
      "name": "p0", 
      "inputs": []
    }, 
    {
      "op": "null", 
      "name": "p1", 
      "inputs": []
    }, 
    {
      "op": "tvm_op", 
      "name": "tvmgen_default_fused_nn_contrib_conv2d_NCHWc_add_nn_leaky_relu", 
      "attrs": {
        "num_outputs": "1", 
        "num_inputs": "3", 
        "data_layout": "NCHW3c", 
        "kernel_layout": "OIHW3i4o", 
        "hash": "cbe098c0f86d97df", 
        "func_name": "tvmgen_default_fused_nn_contrib_conv2d_NCHWc_add_nn_leaky_relu", 
        "out_layout": "NCHW4c", 
        "flatten_data": "0"
      }, 
      "inputs": [
        [
          1, 
          0, 
          0
        ], 
        [
          2, 
          0, 
          0
        ], 
        [
          3, 
          0, 
          0
        ]
      ]
    }, 
    {
      "op": "null", 
      "name": "p2", 
      "inputs": []
    }, 
    {
      "op": "null", 
      "name": "p3", 
      "inputs": []
    }, 
    {
      "op": "tvm_op", 
      "name": "tvmgen_default_fused_nn_contrib_conv2d_NCHWc_add_nn_leaky_relu_1", 
      "attrs": {
        "num_outputs": "1", 
        "num_inputs": "3", 
        "data_layout": "NCHW4c", 
        "kernel_layout": "OIHW4i4o", 
        "hash": "a0cd0605ebec27f7", 
        "func_name": "tvmgen_default_fused_nn_contrib_conv2d_NCHWc_add_nn_leaky_relu_1", 
        "out_layout": "NCHW4c", 
        "flatten_data": "0"
      }, 
      "inputs": [
        [
          4, 
          0, 
          0
        ], 
        [
          5, 
          0, 
          0
        ], 
        [
          6, 
          0, 
          0
        ]
      ]
    }, 
    {
      "op": "null", 
      "name": "p4", 
      "inputs": []
    }, 
    {
      "op": "null", 
      "name": "p5", 
      "inputs": []
    }, 
    {
      "op": "tvm_op", 
      "name": "tvmgen_default_fused_nn_contrib_conv2d_NCHWc_add_nn_leaky_relu_2", 
      "attrs": {
        "num_outputs": "1", 
        "num_inputs": "3", 
        "data_layout": "NCHW4c", 
        "kernel_layout": "OIHW4i4o", 
        "hash": "046ade4572c89112", 
        "func_name": "tvmgen_default_fused_nn_contrib_conv2d_NCHWc_add_nn_leaky_relu_2", 
        "out_layout": "NCHW4c", 
        "flatten_data": "0"
      }, 
      "inputs": [
        [
          7, 
          0, 
          0
        ], 
        [
          8, 
          0, 
          0
        ], 
        [
          9, 
          0, 
          0
        ]
      ]
    }, 
    {
      "op": "null", 
      "name": "p6", 
      "inputs": []
    }, 
    {
      "op": "null", 
      "name": "p7", 
      "inputs": []
    }, 
    {
      "op": "tvm_op", 
      "name": "tvmgen_default_fused_nn_contrib_conv2d_NCHWc_add_nn_leaky_relu_add", 
      "attrs": {
        "num_outputs": "1", 
        "num_inputs": "4", 
        "data_layout": "NCHW4c", 
        "kernel_layout": "OIHW4i4o", 
        "hash": "b257a6fe9d293dca", 
        "func_name": "tvmgen_default_fused_nn_contrib_conv2d_NCHWc_add_nn_leaky_relu_add", 
        "out_layout": "NCHW4c", 
        "flatten_data": "0"
      }, 
      "inputs": [
        [
          10, 
          0, 
          0
        ], 
        [
          11, 
          0, 
          0
        ], 
        [
          12, 
          0, 
          0
        ], 
        [
          7, 
          0, 
          0
        ]
      ]
    }, 
    {
      "op": "null", 
      "name": "p8", 
      "inputs": []
    }, 
    {
      "op": "null", 
      "name": "p9", 
      "inputs": []
    }, 
    {
      "op": "tvm_op", 
      "name": "tvmgen_default_fused_nn_contrib_conv2d_NCHWc_add_nn_leaky_relu_3", 
      "attrs": {
        "num_outputs": "1", 
        "num_inputs": "3", 
        "data_layout": "NCHW4c", 
        "kernel_layout": "OIHW4i4o", 
        "hash": "a133ad88044849d4", 
        "func_name": "tvmgen_default_fused_nn_contrib_conv2d_NCHWc_add_nn_leaky_relu_3", 
        "out_layout": "NCHW4c", 
        "flatten_data": "0"
      }, 
      "inputs": [
        [
          13, 
          0, 
          0
        ], 
        [
          14, 
          0, 
          0
        ], 
        [
          15, 
          0, 
          0
        ]
      ]
    }, 
    {
      "op": "null", 
      "name": "p10", 
      "inputs": []
    }, 
    {
      "op": "null", 
      "name": "p11", 
      "inputs": []
    }, 
    {
      "op": "tvm_op", 
      "name": "tvmgen_default_fused_nn_contrib_conv2d_NCHWc_add_nn_leaky_relu_4", 
      "attrs": {
        "num_outputs": "1", 
        "num_inputs": "3", 
        "data_layout": "NCHW4c", 
        "kernel_layout": "OIHW4i4o", 
        "hash": "02982f0834a95ff5", 
        "func_name": "tvmgen_default_fused_nn_contrib_conv2d_NCHWc_add_nn_leaky_relu_4", 
        "out_layout": "NCHW4c", 
        "flatten_data": "0"
      }, 
      "inputs": [
        [
          16, 
          0, 
          0
        ], 
        [
          17, 
          0, 
          0
        ], 
        [
          18, 
          0, 
          0
        ]
      ]
    }, 
    {
      "op": "null", 
      "name": "p12", 
      "inputs": []
    }, 
    {
      "op": "null", 
      "name": "p13", 
      "inputs": []
    }, 
    {
      "op": "tvm_op", 
      "name": "tvmgen_default_fused_nn_contrib_conv2d_NCHWc_add_nn_leaky_relu_add_1", 
      "attrs": {
        "num_outputs": "1", 
        "num_inputs": "4", 
        "data_layout": "NCHW4c", 
        "kernel_layout": "OIHW4i4o", 
        "hash": "8b0e987d06b54d00", 
        "func_name": "tvmgen_default_fused_nn_contrib_conv2d_NCHWc_add_nn_leaky_relu_add_1", 
        "out_layout": "NCHW4c", 
        "flatten_data": "0"
      }, 
      "inputs": [
        [
          19, 
          0, 
          0
        ], 
        [
          20, 
          0, 
          0
        ], 
        [
          21, 
          0, 
          0
        ], 
        [
          16, 
          0, 
          0
        ]
      ]
    }, 
    {
      "op": "null", 
      "name": "p14", 
      "inputs": []
    }, 
    {
      "op": "null", 
      "name": "p15", 
      "inputs": []
    }, 
    {
      "op": "tvm_op", 
      "name": "tvmgen_default_fused_nn_contrib_conv2d_NCHWc_add_nn_leaky_relu_41", 
      "attrs": {
        "num_outputs": "1", 
        "num_inputs": "3", 
        "data_layout": "NCHW4c", 
        "kernel_layout": "OIHW4i4o", 
        "hash": "02982f0834a95ff5", 
        "func_name": "tvmgen_default_fused_nn_contrib_conv2d_NCHWc_add_nn_leaky_relu_4", 
        "out_layout": "NCHW4c", 
        "flatten_data": "0"
      }, 
      "inputs": [
        [
          22, 
          0, 
          0
        ], 
        [
          23, 
          0, 
          0
        ], 
        [
          24, 
          0, 
          0
        ]
      ]
    }, 
    {
      "op": "null", 
      "name": "p16", 
      "inputs": []
    }, 
    {
      "op": "null", 
      "name": "p17", 
      "inputs": []
    }, 
    {
      "op": "tvm_op", 
      "name": "tvmgen_default_fused_nn_contrib_conv2d_NCHWc_add_nn_leaky_relu_add_11", 
      "attrs": {
        "num_outputs": "1", 
        "num_inputs": "4", 
        "data_layout": "NCHW4c", 
        "kernel_layout": "OIHW4i4o", 
        "hash": "8b0e987d06b54d00", 
        "func_name": "tvmgen_default_fused_nn_contrib_conv2d_NCHWc_add_nn_leaky_relu_add_1", 
        "out_layout": "NCHW4c", 
        "flatten_data": "0"
      }, 
      "inputs": [
        [
          25, 
          0, 
          0
        ], 
        [
          26, 
          0, 
          0
        ], 
        [
          27, 
          0, 
          0
        ], 
        [
          22, 
          0, 
          0
        ]
      ]
    }, 
    {
      "op": "null", 
      "name": "p18", 
      "inputs": []
    }, 
    {
      "op": "null", 
      "name": "p19", 
      "inputs": []
    }, 
    {
      "op": "tvm_op", 
      "name": "tvmgen_default_fused_nn_contrib_conv2d_NCHWc_add_nn_leaky_relu_5", 
      "attrs": {
        "num_outputs": "1", 
        "num_inputs": "3", 
        "data_layout": "NCHW4c", 
        "kernel_layout": "OIHW4i4o", 
        "hash": "8d475ebf78dc88b6", 
        "func_name": "tvmgen_default_fused_nn_contrib_conv2d_NCHWc_add_nn_leaky_relu_5", 
        "out_layout": "NCHW4c", 
        "flatten_data": "0"
      }, 
      "inputs": [
        [
          28, 
          0, 
          0
        ], 
        [
          29, 
          0, 
          0
        ], 
        [
          30, 
          0, 
          0
        ]
      ]
    }, 
    {
      "op": "null", 
      "name": "p20", 
      "inputs": []
    }, 
    {
      "op": "null", 
      "name": "p21", 
      "inputs": []
    }, 
    {
      "op": "tvm_op", 
      "name": "tvmgen_default_fused_nn_contrib_conv2d_NCHWc_add_nn_leaky_relu_6", 
      "attrs": {
        "num_outputs": "1", 
        "num_inputs": "3", 
        "data_layout": "NCHW4c", 
        "kernel_layout": "OIHW4i4o", 
        "hash": "26478f57fbc719f7", 
        "func_name": "tvmgen_default_fused_nn_contrib_conv2d_NCHWc_add_nn_leaky_relu_6", 
        "out_layout": "NCHW4c", 
        "flatten_data": "0"
      }, 
      "inputs": [
        [
          31, 
          0, 
          0
        ], 
        [
          32, 
          0, 
          0
        ], 
        [
          33, 
          0, 
          0
        ]
      ]
    }, 
    {
      "op": "null", 
      "name": "p22", 
      "inputs": []
    }, 
    {
      "op": "null", 
      "name": "p23", 
      "inputs": []
    }, 
    {
      "op": "tvm_op", 
      "name": "tvmgen_default_fused_nn_contrib_conv2d_NCHWc_add_nn_leaky_relu_add_2", 
      "attrs": {
        "num_outputs": "1", 
        "num_inputs": "4", 
        "data_layout": "NCHW4c", 
        "kernel_layout": "OIHW4i4o", 
        "hash": "d6f5ddcd2fe96c08", 
        "func_name": "tvmgen_default_fused_nn_contrib_conv2d_NCHWc_add_nn_leaky_relu_add_2", 
        "out_layout": "NCHW4c", 
        "flatten_data": "0"
      }, 
      "inputs": [
        [
          34, 
          0, 
          0
        ], 
        [
          35, 
          0, 
          0
        ], 
        [
          36, 
          0, 
          0
        ], 
        [
          31, 
          0, 
          0
        ]
      ]
    }, 
    {
      "op": "null", 
      "name": "p24", 
      "inputs": []
    }, 
    {
      "op": "null", 
      "name": "p25", 
      "inputs": []
    }, 
    {
      "op": "tvm_op", 
      "name": "tvmgen_default_fused_nn_contrib_conv2d_NCHWc_add_nn_leaky_relu_61", 
      "attrs": {
        "num_outputs": "1", 
        "num_inputs": "3", 
        "data_layout": "NCHW4c", 
        "kernel_layout": "OIHW4i4o", 
        "hash": "26478f57fbc719f7", 
        "func_name": "tvmgen_default_fused_nn_contrib_conv2d_NCHWc_add_nn_leaky_relu_6", 
        "out_layout": "NCHW4c", 
        "flatten_data": "0"
      }, 
      "inputs": [
        [
          37, 
          0, 
          0
        ], 
        [
          38, 
          0, 
          0
        ], 
        [
          39, 
          0, 
          0
        ]
      ]
    }, 
    {
      "op": "null", 
      "name": "p26", 
      "inputs": []
    }, 
    {
      "op": "null", 
      "name": "p27", 
      "inputs": []
    }, 
    {
      "op": "tvm_op", 
      "name": "tvmgen_default_fused_nn_contrib_conv2d_NCHWc_add_nn_leaky_relu_add_21", 
      "attrs": {
        "num_outputs": "1", 
        "num_inputs": "4", 
        "data_layout": "NCHW4c", 
        "kernel_layout": "OIHW4i4o", 
        "hash": "d6f5ddcd2fe96c08", 
        "func_name": "tvmgen_default_fused_nn_contrib_conv2d_NCHWc_add_nn_leaky_relu_add_2", 
        "out_layout": "NCHW4c", 
        "flatten_data": "0"
      }, 
      "inputs": [
        [
          40, 
          0, 
          0
        ], 
        [
          41, 
          0, 
          0
        ], 
        [
          42, 
          0, 
          0
        ], 
        [
          37, 
          0, 
          0
        ]
      ]
    }, 
    {
      "op": "null", 
      "name": "p28", 
      "inputs": []
    }, 
    {
      "op": "null", 
      "name": "p29", 
      "inputs": []
    }, 
    {
      "op": "tvm_op", 
      "name": "tvmgen_default_fused_nn_contrib_conv2d_NCHWc_add_nn_leaky_relu_62", 
      "attrs": {
        "num_outputs": "1", 
        "num_inputs": "3", 
        "data_layout": "NCHW4c", 
        "kernel_layout": "OIHW4i4o", 
        "hash": "26478f57fbc719f7", 
        "func_name": "tvmgen_default_fused_nn_contrib_conv2d_NCHWc_add_nn_leaky_relu_6", 
        "out_layout": "NCHW4c", 
        "flatten_data": "0"
      }, 
      "inputs": [
        [
          43, 
          0, 
          0
        ], 
        [
          44, 
          0, 
          0
        ], 
        [
          45, 
          0, 
          0
        ]
      ]
    }, 
    {
      "op": "null", 
      "name": "p30", 
      "inputs": []
    }, 
    {
      "op": "null", 
      "name": "p31", 
      "inputs": []
    }, 
    {
      "op": "tvm_op", 
      "name": "tvmgen_default_fused_nn_contrib_conv2d_NCHWc_add_nn_leaky_relu_add_22", 
      "attrs": {
        "num_outputs": "1", 
        "num_inputs": "4", 
        "data_layout": "NCHW4c", 
        "kernel_layout": "OIHW4i4o", 
        "hash": "d6f5ddcd2fe96c08", 
        "func_name": "tvmgen_default_fused_nn_contrib_conv2d_NCHWc_add_nn_leaky_relu_add_2", 
        "out_layout": "NCHW4c", 
        "flatten_data": "0"
      }, 
      "inputs": [
        [
          46, 
          0, 
          0
        ], 
        [
          47, 
          0, 
          0
        ], 
        [
          48, 
          0, 
          0
        ], 
        [
          43, 
          0, 
          0
        ]
      ]
    }, 
    {
      "op": "null", 
      "name": "p32", 
      "inputs": []
    }, 
    {
      "op": "null", 
      "name": "p33", 
      "inputs": []
    }, 
    {
      "op": "tvm_op", 
      "name": "tvmgen_default_fused_nn_contrib_conv2d_NCHWc_add_nn_leaky_relu_63", 
      "attrs": {
        "num_outputs": "1", 
        "num_inputs": "3", 
        "data_layout": "NCHW4c", 
        "kernel_layout": "OIHW4i4o", 
        "hash": "26478f57fbc719f7", 
        "func_name": "tvmgen_default_fused_nn_contrib_conv2d_NCHWc_add_nn_leaky_relu_6", 
        "out_layout": "NCHW4c", 
        "flatten_data": "0"
      }, 
      "inputs": [
        [
          49, 
          0, 
          0
        ], 
        [
          50, 
          0, 
          0
        ], 
        [
          51, 
          0, 
          0
        ]
      ]
    }, 
    {
      "op": "null", 
      "name": "p34", 
      "inputs": []
    }, 
    {
      "op": "null", 
      "name": "p35", 
      "inputs": []
    }, 
    {
      "op": "tvm_op", 
      "name": "tvmgen_default_fused_nn_contrib_conv2d_NCHWc_add_nn_leaky_relu_add_23", 
      "attrs": {
        "num_outputs": "1", 
        "num_inputs": "4", 
        "data_layout": "NCHW4c", 
        "kernel_layout": "OIHW4i4o", 
        "hash": "d6f5ddcd2fe96c08", 
        "func_name": "tvmgen_default_fused_nn_contrib_conv2d_NCHWc_add_nn_leaky_relu_add_2", 
        "out_layout": "NCHW4c", 
        "flatten_data": "0"
      }, 
      "inputs": [
        [
          52, 
          0, 
          0
        ], 
        [
          53, 
          0, 
          0
        ], 
        [
          54, 
          0, 
          0
        ], 
        [
          49, 
          0, 
          0
        ]
      ]
    }, 
    {
      "op": "null", 
      "name": "p36", 
      "inputs": []
    }, 
    {
      "op": "null", 
      "name": "p37", 
      "inputs": []
    }, 
    {
      "op": "tvm_op", 
      "name": "tvmgen_default_fused_nn_contrib_conv2d_NCHWc_add_nn_leaky_relu_64", 
      "attrs": {
        "num_outputs": "1", 
        "num_inputs": "3", 
        "data_layout": "NCHW4c", 
        "kernel_layout": "OIHW4i4o", 
        "hash": "26478f57fbc719f7", 
        "func_name": "tvmgen_default_fused_nn_contrib_conv2d_NCHWc_add_nn_leaky_relu_6", 
        "out_layout": "NCHW4c", 
        "flatten_data": "0"
      }, 
      "inputs": [
        [
          55, 
          0, 
          0
        ], 
        [
          56, 
          0, 
          0
        ], 
        [
          57, 
          0, 
          0
        ]
      ]
    }, 
    {
      "op": "null", 
      "name": "p38", 
      "inputs": []
    }, 
    {
      "op": "null", 
      "name": "p39", 
      "inputs": []
    }, 
    {
      "op": "tvm_op", 
      "name": "tvmgen_default_fused_nn_contrib_conv2d_NCHWc_add_nn_leaky_relu_add_24", 
      "attrs": {
        "num_outputs": "1", 
        "num_inputs": "4", 
        "data_layout": "NCHW4c", 
        "kernel_layout": "OIHW4i4o", 
        "hash": "d6f5ddcd2fe96c08", 
        "func_name": "tvmgen_default_fused_nn_contrib_conv2d_NCHWc_add_nn_leaky_relu_add_2", 
        "out_layout": "NCHW4c", 
        "flatten_data": "0"
      }, 
      "inputs": [
        [
          58, 
          0, 
          0
        ], 
        [
          59, 
          0, 
          0
        ], 
        [
          60, 
          0, 
          0
        ], 
        [
          55, 
          0, 
          0
        ]
      ]
    }, 
    {
      "op": "null", 
      "name": "p40", 
      "inputs": []
    }, 
    {
      "op": "null", 
      "name": "p41", 
      "inputs": []
    }, 
    {
      "op": "tvm_op", 
      "name": "tvmgen_default_fused_nn_contrib_conv2d_NCHWc_add_nn_leaky_relu_65", 
      "attrs": {
        "num_outputs": "1", 
        "num_inputs": "3", 
        "data_layout": "NCHW4c", 
        "kernel_layout": "OIHW4i4o", 
        "hash": "26478f57fbc719f7", 
        "func_name": "tvmgen_default_fused_nn_contrib_conv2d_NCHWc_add_nn_leaky_relu_6", 
        "out_layout": "NCHW4c", 
        "flatten_data": "0"
      }, 
      "inputs": [
        [
          61, 
          0, 
          0
        ], 
        [
          62, 
          0, 
          0
        ], 
        [
          63, 
          0, 
          0
        ]
      ]
    }, 
    {
      "op": "null", 
      "name": "p42", 
      "inputs": []
    }, 
    {
      "op": "null", 
      "name": "p43", 
      "inputs": []
    }, 
    {
      "op": "tvm_op", 
      "name": "tvmgen_default_fused_nn_contrib_conv2d_NCHWc_add_nn_leaky_relu_add_25", 
      "attrs": {
        "num_outputs": "1", 
        "num_inputs": "4", 
        "data_layout": "NCHW4c", 
        "kernel_layout": "OIHW4i4o", 
        "hash": "d6f5ddcd2fe96c08", 
        "func_name": "tvmgen_default_fused_nn_contrib_conv2d_NCHWc_add_nn_leaky_relu_add_2", 
        "out_layout": "NCHW4c", 
        "flatten_data": "0"
      }, 
      "inputs": [
        [
          64, 
          0, 
          0
        ], 
        [
          65, 
          0, 
          0
        ], 
        [
          66, 
          0, 
          0
        ], 
        [
          61, 
          0, 
          0
        ]
      ]
    }, 
    {
      "op": "null", 
      "name": "p44", 
      "inputs": []
    }, 
    {
      "op": "null", 
      "name": "p45", 
      "inputs": []
    }, 
    {
      "op": "tvm_op", 
      "name": "tvmgen_default_fused_nn_contrib_conv2d_NCHWc_add_nn_leaky_relu_66", 
      "attrs": {
        "num_outputs": "1", 
        "num_inputs": "3", 
        "data_layout": "NCHW4c", 
        "kernel_layout": "OIHW4i4o", 
        "hash": "26478f57fbc719f7", 
        "func_name": "tvmgen_default_fused_nn_contrib_conv2d_NCHWc_add_nn_leaky_relu_6", 
        "out_layout": "NCHW4c", 
        "flatten_data": "0"
      }, 
      "inputs": [
        [
          67, 
          0, 
          0
        ], 
        [
          68, 
          0, 
          0
        ], 
        [
          69, 
          0, 
          0
        ]
      ]
    }, 
    {
      "op": "null", 
      "name": "p46", 
      "inputs": []
    }, 
    {
      "op": "null", 
      "name": "p47", 
      "inputs": []
    }, 
    {
      "op": "tvm_op", 
      "name": "tvmgen_default_fused_nn_contrib_conv2d_NCHWc_add_nn_leaky_relu_add_26", 
      "attrs": {
        "num_outputs": "1", 
        "num_inputs": "4", 
        "data_layout": "NCHW4c", 
        "kernel_layout": "OIHW4i4o", 
        "hash": "d6f5ddcd2fe96c08", 
        "func_name": "tvmgen_default_fused_nn_contrib_conv2d_NCHWc_add_nn_leaky_relu_add_2", 
        "out_layout": "NCHW4c", 
        "flatten_data": "0"
      }, 
      "inputs": [
        [
          70, 
          0, 
          0
        ], 
        [
          71, 
          0, 
          0
        ], 
        [
          72, 
          0, 
          0
        ], 
        [
          67, 
          0, 
          0
        ]
      ]
    }, 
    {
      "op": "null", 
      "name": "p48", 
      "inputs": []
    }, 
    {
      "op": "null", 
      "name": "p49", 
      "inputs": []
    }, 
    {
      "op": "tvm_op", 
      "name": "tvmgen_default_fused_nn_contrib_conv2d_NCHWc_add_nn_leaky_relu_67", 
      "attrs": {
        "num_outputs": "1", 
        "num_inputs": "3", 
        "data_layout": "NCHW4c", 
        "kernel_layout": "OIHW4i4o", 
        "hash": "26478f57fbc719f7", 
        "func_name": "tvmgen_default_fused_nn_contrib_conv2d_NCHWc_add_nn_leaky_relu_6", 
        "out_layout": "NCHW4c", 
        "flatten_data": "0"
      }, 
      "inputs": [
        [
          73, 
          0, 
          0
        ], 
        [
          74, 
          0, 
          0
        ], 
        [
          75, 
          0, 
          0
        ]
      ]
    }, 
    {
      "op": "null", 
      "name": "p50", 
      "inputs": []
    }, 
    {
      "op": "null", 
      "name": "p51", 
      "inputs": []
    }, 
    {
      "op": "tvm_op", 
      "name": "tvmgen_default_fused_nn_contrib_conv2d_NCHWc_add_nn_leaky_relu_add_27", 
      "attrs": {
        "num_outputs": "1", 
        "num_inputs": "4", 
        "data_layout": "NCHW4c", 
        "kernel_layout": "OIHW4i4o", 
        "hash": "d6f5ddcd2fe96c08", 
        "func_name": "tvmgen_default_fused_nn_contrib_conv2d_NCHWc_add_nn_leaky_relu_add_2", 
        "out_layout": "NCHW4c", 
        "flatten_data": "0"
      }, 
      "inputs": [
        [
          76, 
          0, 
          0
        ], 
        [
          77, 
          0, 
          0
        ], 
        [
          78, 
          0, 
          0
        ], 
        [
          73, 
          0, 
          0
        ]
      ]
    }, 
    {
      "op": "null", 
      "name": "p52", 
      "inputs": []
    }, 
    {
      "op": "null", 
      "name": "p53", 
      "inputs": []
    }, 
    {
      "op": "tvm_op", 
      "name": "tvmgen_default_fused_nn_contrib_conv2d_NCHWc_add_nn_leaky_relu_7", 
      "attrs": {
        "num_outputs": "1", 
        "num_inputs": "3", 
        "data_layout": "NCHW4c", 
        "kernel_layout": "OIHW4i4o", 
        "hash": "51487ffa65e0f333", 
        "func_name": "tvmgen_default_fused_nn_contrib_conv2d_NCHWc_add_nn_leaky_relu_7", 
        "out_layout": "NCHW4c", 
        "flatten_data": "0"
      }, 
      "inputs": [
        [
          79, 
          0, 
          0
        ], 
        [
          80, 
          0, 
          0
        ], 
        [
          81, 
          0, 
          0
        ]
      ]
    }, 
    {
      "op": "null", 
      "name": "p54", 
      "inputs": []
    }, 
    {
      "op": "null", 
      "name": "p55", 
      "inputs": []
    }, 
    {
      "op": "tvm_op", 
      "name": "tvmgen_default_fused_nn_contrib_conv2d_NCHWc_add_nn_leaky_relu_8", 
      "attrs": {
        "num_outputs": "1", 
        "num_inputs": "3", 
        "data_layout": "NCHW4c", 
        "kernel_layout": "OIHW4i4o", 
        "hash": "553742bf1f0ea1bf", 
        "func_name": "tvmgen_default_fused_nn_contrib_conv2d_NCHWc_add_nn_leaky_relu_8", 
        "out_layout": "NCHW4c", 
        "flatten_data": "0"
      }, 
      "inputs": [
        [
          82, 
          0, 
          0
        ], 
        [
          83, 
          0, 
          0
        ], 
        [
          84, 
          0, 
          0
        ]
      ]
    }, 
    {
      "op": "null", 
      "name": "p56", 
      "inputs": []
    }, 
    {
      "op": "null", 
      "name": "p57", 
      "inputs": []
    }, 
    {
      "op": "tvm_op", 
      "name": "tvmgen_default_fused_nn_contrib_conv2d_NCHWc_add_nn_leaky_relu_add_3", 
      "attrs": {
        "num_outputs": "1", 
        "num_inputs": "4", 
        "data_layout": "NCHW4c", 
        "kernel_layout": "OIHW4i4o", 
        "hash": "835f9ec6a8f78d8d", 
        "func_name": "tvmgen_default_fused_nn_contrib_conv2d_NCHWc_add_nn_leaky_relu_add_3", 
        "out_layout": "NCHW4c", 
        "flatten_data": "0"
      }, 
      "inputs": [
        [
          85, 
          0, 
          0
        ], 
        [
          86, 
          0, 
          0
        ], 
        [
          87, 
          0, 
          0
        ], 
        [
          82, 
          0, 
          0
        ]
      ]
    }, 
    {
      "op": "null", 
      "name": "p58", 
      "inputs": []
    }, 
    {
      "op": "null", 
      "name": "p59", 
      "inputs": []
    }, 
    {
      "op": "tvm_op", 
      "name": "tvmgen_default_fused_nn_contrib_conv2d_NCHWc_add_nn_leaky_relu_81", 
      "attrs": {
        "num_outputs": "1", 
        "num_inputs": "3", 
        "data_layout": "NCHW4c", 
        "kernel_layout": "OIHW4i4o", 
        "hash": "553742bf1f0ea1bf", 
        "func_name": "tvmgen_default_fused_nn_contrib_conv2d_NCHWc_add_nn_leaky_relu_8", 
        "out_layout": "NCHW4c", 
        "flatten_data": "0"
      }, 
      "inputs": [
        [
          88, 
          0, 
          0
        ], 
        [
          89, 
          0, 
          0
        ], 
        [
          90, 
          0, 
          0
        ]
      ]
    }, 
    {
      "op": "null", 
      "name": "p60", 
      "inputs": []
    }, 
    {
      "op": "null", 
      "name": "p61", 
      "inputs": []
    }, 
    {
      "op": "tvm_op", 
      "name": "tvmgen_default_fused_nn_contrib_conv2d_NCHWc_add_nn_leaky_relu_add_31", 
      "attrs": {
        "num_outputs": "1", 
        "num_inputs": "4", 
        "data_layout": "NCHW4c", 
        "kernel_layout": "OIHW4i4o", 
        "hash": "835f9ec6a8f78d8d", 
        "func_name": "tvmgen_default_fused_nn_contrib_conv2d_NCHWc_add_nn_leaky_relu_add_3", 
        "out_layout": "NCHW4c", 
        "flatten_data": "0"
      }, 
      "inputs": [
        [
          91, 
          0, 
          0
        ], 
        [
          92, 
          0, 
          0
        ], 
        [
          93, 
          0, 
          0
        ], 
        [
          88, 
          0, 
          0
        ]
      ]
    }, 
    {
      "op": "null", 
      "name": "p62", 
      "inputs": []
    }, 
    {
      "op": "null", 
      "name": "p63", 
      "inputs": []
    }, 
    {
      "op": "tvm_op", 
      "name": "tvmgen_default_fused_nn_contrib_conv2d_NCHWc_add_nn_leaky_relu_82", 
      "attrs": {
        "num_outputs": "1", 
        "num_inputs": "3", 
        "data_layout": "NCHW4c", 
        "kernel_layout": "OIHW4i4o", 
        "hash": "553742bf1f0ea1bf", 
        "func_name": "tvmgen_default_fused_nn_contrib_conv2d_NCHWc_add_nn_leaky_relu_8", 
        "out_layout": "NCHW4c", 
        "flatten_data": "0"
      }, 
      "inputs": [
        [
          94, 
          0, 
          0
        ], 
        [
          95, 
          0, 
          0
        ], 
        [
          96, 
          0, 
          0
        ]
      ]
    }, 
    {
      "op": "null", 
      "name": "p64", 
      "inputs": []
    }, 
    {
      "op": "null", 
      "name": "p65", 
      "inputs": []
    }, 
    {
      "op": "tvm_op", 
      "name": "tvmgen_default_fused_nn_contrib_conv2d_NCHWc_add_nn_leaky_relu_add_32", 
      "attrs": {
        "num_outputs": "1", 
        "num_inputs": "4", 
        "data_layout": "NCHW4c", 
        "kernel_layout": "OIHW4i4o", 
        "hash": "835f9ec6a8f78d8d", 
        "func_name": "tvmgen_default_fused_nn_contrib_conv2d_NCHWc_add_nn_leaky_relu_add_3", 
        "out_layout": "NCHW4c", 
        "flatten_data": "0"
      }, 
      "inputs": [
        [
          97, 
          0, 
          0
        ], 
        [
          98, 
          0, 
          0
        ], 
        [
          99, 
          0, 
          0
        ], 
        [
          94, 
          0, 
          0
        ]
      ]
    }, 
    {
      "op": "null", 
      "name": "p66", 
      "inputs": []
    }, 
    {
      "op": "null", 
      "name": "p67", 
      "inputs": []
    }, 
    {
      "op": "tvm_op", 
      "name": "tvmgen_default_fused_nn_contrib_conv2d_NCHWc_add_nn_leaky_relu_83", 
      "attrs": {
        "num_outputs": "1", 
        "num_inputs": "3", 
        "data_layout": "NCHW4c", 
        "kernel_layout": "OIHW4i4o", 
        "hash": "553742bf1f0ea1bf", 
        "func_name": "tvmgen_default_fused_nn_contrib_conv2d_NCHWc_add_nn_leaky_relu_8", 
        "out_layout": "NCHW4c", 
        "flatten_data": "0"
      }, 
      "inputs": [
        [
          100, 
          0, 
          0
        ], 
        [
          101, 
          0, 
          0
        ], 
        [
          102, 
          0, 
          0
        ]
      ]
    }, 
    {
      "op": "null", 
      "name": "p68", 
      "inputs": []
    }, 
    {
      "op": "null", 
      "name": "p69", 
      "inputs": []
    }, 
    {
      "op": "tvm_op", 
      "name": "tvmgen_default_fused_nn_contrib_conv2d_NCHWc_add_nn_leaky_relu_add_33", 
      "attrs": {
        "num_outputs": "1", 
        "num_inputs": "4", 
        "data_layout": "NCHW4c", 
        "kernel_layout": "OIHW4i4o", 
        "hash": "835f9ec6a8f78d8d", 
        "func_name": "tvmgen_default_fused_nn_contrib_conv2d_NCHWc_add_nn_leaky_relu_add_3", 
        "out_layout": "NCHW4c", 
        "flatten_data": "0"
      }, 
      "inputs": [
        [
          103, 
          0, 
          0
        ], 
        [
          104, 
          0, 
          0
        ], 
        [
          105, 
          0, 
          0
        ], 
        [
          100, 
          0, 
          0
        ]
      ]
    }, 
    {
      "op": "null", 
      "name": "p70", 
      "inputs": []
    }, 
    {
      "op": "null", 
      "name": "p71", 
      "inputs": []
    }, 
    {
      "op": "tvm_op", 
      "name": "tvmgen_default_fused_nn_contrib_conv2d_NCHWc_add_nn_leaky_relu_84", 
      "attrs": {
        "num_outputs": "1", 
        "num_inputs": "3", 
        "data_layout": "NCHW4c", 
        "kernel_layout": "OIHW4i4o", 
        "hash": "553742bf1f0ea1bf", 
        "func_name": "tvmgen_default_fused_nn_contrib_conv2d_NCHWc_add_nn_leaky_relu_8", 
        "out_layout": "NCHW4c", 
        "flatten_data": "0"
      }, 
      "inputs": [
        [
          106, 
          0, 
          0
        ], 
        [
          107, 
          0, 
          0
        ], 
        [
          108, 
          0, 
          0
        ]
      ]
    }, 
    {
      "op": "null", 
      "name": "p72", 
      "inputs": []
    }, 
    {
      "op": "null", 
      "name": "p73", 
      "inputs": []
    }, 
    {
      "op": "tvm_op", 
      "name": "tvmgen_default_fused_nn_contrib_conv2d_NCHWc_add_nn_leaky_relu_add_34", 
      "attrs": {
        "num_outputs": "1", 
        "num_inputs": "4", 
        "data_layout": "NCHW4c", 
        "kernel_layout": "OIHW4i4o", 
        "hash": "835f9ec6a8f78d8d", 
        "func_name": "tvmgen_default_fused_nn_contrib_conv2d_NCHWc_add_nn_leaky_relu_add_3", 
        "out_layout": "NCHW4c", 
        "flatten_data": "0"
      }, 
      "inputs": [
        [
          109, 
          0, 
          0
        ], 
        [
          110, 
          0, 
          0
        ], 
        [
          111, 
          0, 
          0
        ], 
        [
          106, 
          0, 
          0
        ]
      ]
    }, 
    {
      "op": "null", 
      "name": "p74", 
      "inputs": []
    }, 
    {
      "op": "null", 
      "name": "p75", 
      "inputs": []
    }, 
    {
      "op": "tvm_op", 
      "name": "tvmgen_default_fused_nn_contrib_conv2d_NCHWc_add_nn_leaky_relu_85", 
      "attrs": {
        "num_outputs": "1", 
        "num_inputs": "3", 
        "data_layout": "NCHW4c", 
        "kernel_layout": "OIHW4i4o", 
        "hash": "553742bf1f0ea1bf", 
        "func_name": "tvmgen_default_fused_nn_contrib_conv2d_NCHWc_add_nn_leaky_relu_8", 
        "out_layout": "NCHW4c", 
        "flatten_data": "0"
      }, 
      "inputs": [
        [
          112, 
          0, 
          0
        ], 
        [
          113, 
          0, 
          0
        ], 
        [
          114, 
          0, 
          0
        ]
      ]
    }, 
    {
      "op": "null", 
      "name": "p76", 
      "inputs": []
    }, 
    {
      "op": "null", 
      "name": "p77", 
      "inputs": []
    }, 
    {
      "op": "tvm_op", 
      "name": "tvmgen_default_fused_nn_contrib_conv2d_NCHWc_add_nn_leaky_relu_add_35", 
      "attrs": {
        "num_outputs": "1", 
        "num_inputs": "4", 
        "data_layout": "NCHW4c", 
        "kernel_layout": "OIHW4i4o", 
        "hash": "835f9ec6a8f78d8d", 
        "func_name": "tvmgen_default_fused_nn_contrib_conv2d_NCHWc_add_nn_leaky_relu_add_3", 
        "out_layout": "NCHW4c", 
        "flatten_data": "0"
      }, 
      "inputs": [
        [
          115, 
          0, 
          0
        ], 
        [
          116, 
          0, 
          0
        ], 
        [
          117, 
          0, 
          0
        ], 
        [
          112, 
          0, 
          0
        ]
      ]
    }, 
    {
      "op": "null", 
      "name": "p78", 
      "inputs": []
    }, 
    {
      "op": "null", 
      "name": "p79", 
      "inputs": []
    }, 
    {
      "op": "tvm_op", 
      "name": "tvmgen_default_fused_nn_contrib_conv2d_NCHWc_add_nn_leaky_relu_86", 
      "attrs": {
        "num_outputs": "1", 
        "num_inputs": "3", 
        "data_layout": "NCHW4c", 
        "kernel_layout": "OIHW4i4o", 
        "hash": "553742bf1f0ea1bf", 
        "func_name": "tvmgen_default_fused_nn_contrib_conv2d_NCHWc_add_nn_leaky_relu_8", 
        "out_layout": "NCHW4c", 
        "flatten_data": "0"
      }, 
      "inputs": [
        [
          118, 
          0, 
          0
        ], 
        [
          119, 
          0, 
          0
        ], 
        [
          120, 
          0, 
          0
        ]
      ]
    }, 
    {
      "op": "null", 
      "name": "p80", 
      "inputs": []
    }, 
    {
      "op": "null", 
      "name": "p81", 
      "inputs": []
    }, 
    {
      "op": "tvm_op", 
      "name": "tvmgen_default_fused_nn_contrib_conv2d_NCHWc_add_nn_leaky_relu_add_36", 
      "attrs": {
        "num_outputs": "1", 
        "num_inputs": "4", 
        "data_layout": "NCHW4c", 
        "kernel_layout": "OIHW4i4o", 
        "hash": "835f9ec6a8f78d8d", 
        "func_name": "tvmgen_default_fused_nn_contrib_conv2d_NCHWc_add_nn_leaky_relu_add_3", 
        "out_layout": "NCHW4c", 
        "flatten_data": "0"
      }, 
      "inputs": [
        [
          121, 
          0, 
          0
        ], 
        [
          122, 
          0, 
          0
        ], 
        [
          123, 
          0, 
          0
        ], 
        [
          118, 
          0, 
          0
        ]
      ]
    }, 
    {
      "op": "null", 
      "name": "p82", 
      "inputs": []
    }, 
    {
      "op": "null", 
      "name": "p83", 
      "inputs": []
    }, 
    {
      "op": "tvm_op", 
      "name": "tvmgen_default_fused_nn_contrib_conv2d_NCHWc_add_nn_leaky_relu_87", 
      "attrs": {
        "num_outputs": "1", 
        "num_inputs": "3", 
        "data_layout": "NCHW4c", 
        "kernel_layout": "OIHW4i4o", 
        "hash": "553742bf1f0ea1bf", 
        "func_name": "tvmgen_default_fused_nn_contrib_conv2d_NCHWc_add_nn_leaky_relu_8", 
        "out_layout": "NCHW4c", 
        "flatten_data": "0"
      }, 
      "inputs": [
        [
          124, 
          0, 
          0
        ], 
        [
          125, 
          0, 
          0
        ], 
        [
          126, 
          0, 
          0
        ]
      ]
    }, 
    {
      "op": "null", 
      "name": "p84", 
      "inputs": []
    }, 
    {
      "op": "null", 
      "name": "p85", 
      "inputs": []
    }, 
    {
      "op": "tvm_op", 
      "name": "tvmgen_default_fused_nn_contrib_conv2d_NCHWc_add_nn_leaky_relu_add_37", 
      "attrs": {
        "num_outputs": "1", 
        "num_inputs": "4", 
        "data_layout": "NCHW4c", 
        "kernel_layout": "OIHW4i4o", 
        "hash": "835f9ec6a8f78d8d", 
        "func_name": "tvmgen_default_fused_nn_contrib_conv2d_NCHWc_add_nn_leaky_relu_add_3", 
        "out_layout": "NCHW4c", 
        "flatten_data": "0"
      }, 
      "inputs": [
        [
          127, 
          0, 
          0
        ], 
        [
          128, 
          0, 
          0
        ], 
        [
          129, 
          0, 
          0
        ], 
        [
          124, 
          0, 
          0
        ]
      ]
    }, 
    {
      "op": "null", 
      "name": "p86", 
      "inputs": []
    }, 
    {
      "op": "null", 
      "name": "p87", 
      "inputs": []
    }, 
    {
      "op": "tvm_op", 
      "name": "tvmgen_default_fused_nn_contrib_conv2d_NCHWc_add_nn_leaky_relu_9", 
      "attrs": {
        "num_outputs": "1", 
        "num_inputs": "3", 
        "data_layout": "NCHW4c", 
        "kernel_layout": "OIHW4i4o", 
        "hash": "8c4f57696859ca53", 
        "func_name": "tvmgen_default_fused_nn_contrib_conv2d_NCHWc_add_nn_leaky_relu_9", 
        "out_layout": "NCHW4c", 
        "flatten_data": "0"
      }, 
      "inputs": [
        [
          130, 
          0, 
          0
        ], 
        [
          131, 
          0, 
          0
        ], 
        [
          132, 
          0, 
          0
        ]
      ]
    }, 
    {
      "op": "null", 
      "name": "p88", 
      "inputs": []
    }, 
    {
      "op": "null", 
      "name": "p89", 
      "inputs": []
    }, 
    {
      "op": "tvm_op", 
      "name": "tvmgen_default_fused_nn_contrib_conv2d_NCHWc_add_nn_leaky_relu_10", 
      "attrs": {
        "num_outputs": "1", 
        "num_inputs": "3", 
        "data_layout": "NCHW4c", 
        "kernel_layout": "OIHW4i4o", 
        "hash": "d33fcb2f8cfafe6e", 
        "func_name": "tvmgen_default_fused_nn_contrib_conv2d_NCHWc_add_nn_leaky_relu_10", 
        "out_layout": "NCHW4c", 
        "flatten_data": "0"
      }, 
      "inputs": [
        [
          133, 
          0, 
          0
        ], 
        [
          134, 
          0, 
          0
        ], 
        [
          135, 
          0, 
          0
        ]
      ]
    }, 
    {
      "op": "null", 
      "name": "p90", 
      "inputs": []
    }, 
    {
      "op": "null", 
      "name": "p91", 
      "inputs": []
    }, 
    {
      "op": "tvm_op", 
      "name": "tvmgen_default_fused_nn_contrib_conv2d_NCHWc_add_nn_leaky_relu_add_4", 
      "attrs": {
        "num_outputs": "1", 
        "num_inputs": "4", 
        "data_layout": "NCHW4c", 
        "kernel_layout": "OIHW4i4o", 
        "hash": "cc4d093cd065035b", 
        "func_name": "tvmgen_default_fused_nn_contrib_conv2d_NCHWc_add_nn_leaky_relu_add_4", 
        "out_layout": "NCHW4c", 
        "flatten_data": "0"
      }, 
      "inputs": [
        [
          136, 
          0, 
          0
        ], 
        [
          137, 
          0, 
          0
        ], 
        [
          138, 
          0, 
          0
        ], 
        [
          133, 
          0, 
          0
        ]
      ]
    }, 
    {
      "op": "null", 
      "name": "p92", 
      "inputs": []
    }, 
    {
      "op": "null", 
      "name": "p93", 
      "inputs": []
    }, 
    {
      "op": "tvm_op", 
      "name": "tvmgen_default_fused_nn_contrib_conv2d_NCHWc_add_nn_leaky_relu_101", 
      "attrs": {
        "num_outputs": "1", 
        "num_inputs": "3", 
        "data_layout": "NCHW4c", 
        "kernel_layout": "OIHW4i4o", 
        "hash": "d33fcb2f8cfafe6e", 
        "func_name": "tvmgen_default_fused_nn_contrib_conv2d_NCHWc_add_nn_leaky_relu_10", 
        "out_layout": "NCHW4c", 
        "flatten_data": "0"
      }, 
      "inputs": [
        [
          139, 
          0, 
          0
        ], 
        [
          140, 
          0, 
          0
        ], 
        [
          141, 
          0, 
          0
        ]
      ]
    }, 
    {
      "op": "null", 
      "name": "p94", 
      "inputs": []
    }, 
    {
      "op": "null", 
      "name": "p95", 
      "inputs": []
    }, 
    {
      "op": "tvm_op", 
      "name": "tvmgen_default_fused_nn_contrib_conv2d_NCHWc_add_nn_leaky_relu_add_41", 
      "attrs": {
        "num_outputs": "1", 
        "num_inputs": "4", 
        "data_layout": "NCHW4c", 
        "kernel_layout": "OIHW4i4o", 
        "hash": "cc4d093cd065035b", 
        "func_name": "tvmgen_default_fused_nn_contrib_conv2d_NCHWc_add_nn_leaky_relu_add_4", 
        "out_layout": "NCHW4c", 
        "flatten_data": "0"
      }, 
      "inputs": [
        [
          142, 
          0, 
          0
        ], 
        [
          143, 
          0, 
          0
        ], 
        [
          144, 
          0, 
          0
        ], 
        [
          139, 
          0, 
          0
        ]
      ]
    }, 
    {
      "op": "null", 
      "name": "p96", 
      "inputs": []
    }, 
    {
      "op": "null", 
      "name": "p97", 
      "inputs": []
    }, 
    {
      "op": "tvm_op", 
      "name": "tvmgen_default_fused_nn_contrib_conv2d_NCHWc_add_nn_leaky_relu_102", 
      "attrs": {
        "num_outputs": "1", 
        "num_inputs": "3", 
        "data_layout": "NCHW4c", 
        "kernel_layout": "OIHW4i4o", 
        "hash": "d33fcb2f8cfafe6e", 
        "func_name": "tvmgen_default_fused_nn_contrib_conv2d_NCHWc_add_nn_leaky_relu_10", 
        "out_layout": "NCHW4c", 
        "flatten_data": "0"
      }, 
      "inputs": [
        [
          145, 
          0, 
          0
        ], 
        [
          146, 
          0, 
          0
        ], 
        [
          147, 
          0, 
          0
        ]
      ]
    }, 
    {
      "op": "null", 
      "name": "p98", 
      "inputs": []
    }, 
    {
      "op": "null", 
      "name": "p99", 
      "inputs": []
    }, 
    {
      "op": "tvm_op", 
      "name": "tvmgen_default_fused_nn_contrib_conv2d_NCHWc_add_nn_leaky_relu_add_42", 
      "attrs": {
        "num_outputs": "1", 
        "num_inputs": "4", 
        "data_layout": "NCHW4c", 
        "kernel_layout": "OIHW4i4o", 
        "hash": "cc4d093cd065035b", 
        "func_name": "tvmgen_default_fused_nn_contrib_conv2d_NCHWc_add_nn_leaky_relu_add_4", 
        "out_layout": "NCHW4c", 
        "flatten_data": "0"
      }, 
      "inputs": [
        [
          148, 
          0, 
          0
        ], 
        [
          149, 
          0, 
          0
        ], 
        [
          150, 
          0, 
          0
        ], 
        [
          145, 
          0, 
          0
        ]
      ]
    }, 
    {
      "op": "null", 
      "name": "p100", 
      "inputs": []
    }, 
    {
      "op": "null", 
      "name": "p101", 
      "inputs": []
    }, 
    {
      "op": "tvm_op", 
      "name": "tvmgen_default_fused_nn_contrib_conv2d_NCHWc_add_nn_leaky_relu_103", 
      "attrs": {
        "num_outputs": "1", 
        "num_inputs": "3", 
        "data_layout": "NCHW4c", 
        "kernel_layout": "OIHW4i4o", 
        "hash": "d33fcb2f8cfafe6e", 
        "func_name": "tvmgen_default_fused_nn_contrib_conv2d_NCHWc_add_nn_leaky_relu_10", 
        "out_layout": "NCHW4c", 
        "flatten_data": "0"
      }, 
      "inputs": [
        [
          151, 
          0, 
          0
        ], 
        [
          152, 
          0, 
          0
        ], 
        [
          153, 
          0, 
          0
        ]
      ]
    }, 
    {
      "op": "null", 
      "name": "p102", 
      "inputs": []
    }, 
    {
      "op": "null", 
      "name": "p103", 
      "inputs": []
    }, 
    {
      "op": "tvm_op", 
      "name": "tvmgen_default_fused_nn_contrib_conv2d_NCHWc_add_nn_leaky_relu_add_43", 
      "attrs": {
        "num_outputs": "1", 
        "num_inputs": "4", 
        "data_layout": "NCHW4c", 
        "kernel_layout": "OIHW4i4o", 
        "hash": "cc4d093cd065035b", 
        "func_name": "tvmgen_default_fused_nn_contrib_conv2d_NCHWc_add_nn_leaky_relu_add_4", 
        "out_layout": "NCHW4c", 
        "flatten_data": "0"
      }, 
      "inputs": [
        [
          154, 
          0, 
          0
        ], 
        [
          155, 
          0, 
          0
        ], 
        [
          156, 
          0, 
          0
        ], 
        [
          151, 
          0, 
          0
        ]
      ]
    }, 
    {
      "op": "null", 
      "name": "p104", 
      "inputs": []
    }, 
    {
      "op": "null", 
      "name": "p105", 
      "inputs": []
    }, 
    {
      "op": "tvm_op", 
      "name": "tvmgen_default_fused_nn_contrib_conv2d_NCHWc_add_nn_leaky_relu_104", 
      "attrs": {
        "num_outputs": "1", 
        "num_inputs": "3", 
        "data_layout": "NCHW4c", 
        "kernel_layout": "OIHW4i4o", 
        "hash": "d33fcb2f8cfafe6e", 
        "func_name": "tvmgen_default_fused_nn_contrib_conv2d_NCHWc_add_nn_leaky_relu_10", 
        "out_layout": "NCHW4c", 
        "flatten_data": "0"
      }, 
      "inputs": [
        [
          157, 
          0, 
          0
        ], 
        [
          158, 
          0, 
          0
        ], 
        [
          159, 
          0, 
          0
        ]
      ]
    }, 
    {
      "op": "null", 
      "name": "p106", 
      "inputs": []
    }, 
    {
      "op": "null", 
      "name": "p107", 
      "inputs": []
    }, 
    {
      "op": "tvm_op", 
      "name": "tvmgen_default_fused_nn_contrib_conv2d_NCHWc_add_nn_leaky_relu_11", 
      "attrs": {
        "num_outputs": "1", 
        "num_inputs": "3", 
        "data_layout": "NCHW4c", 
        "kernel_layout": "OIHW4i4o", 
        "hash": "69249bbd6011705d", 
        "func_name": "tvmgen_default_fused_nn_contrib_conv2d_NCHWc_add_nn_leaky_relu_11", 
        "out_layout": "NCHW4c", 
        "flatten_data": "0"
      }, 
      "inputs": [
        [
          160, 
          0, 
          0
        ], 
        [
          161, 
          0, 
          0
        ], 
        [
          162, 
          0, 
          0
        ]
      ]
    }, 
    {
      "op": "null", 
      "name": "p108", 
      "inputs": []
    }, 
    {
      "op": "null", 
      "name": "p109", 
      "inputs": []
    }, 
    {
      "op": "tvm_op", 
      "name": "tvmgen_default_fused_nn_contrib_conv2d_NCHWc_add_nn_leaky_relu_105", 
      "attrs": {
        "num_outputs": "1", 
        "num_inputs": "3", 
        "data_layout": "NCHW4c", 
        "kernel_layout": "OIHW4i4o", 
        "hash": "d33fcb2f8cfafe6e", 
        "func_name": "tvmgen_default_fused_nn_contrib_conv2d_NCHWc_add_nn_leaky_relu_10", 
        "out_layout": "NCHW4c", 
        "flatten_data": "0"
      }, 
      "inputs": [
        [
          163, 
          0, 
          0
        ], 
        [
          164, 
          0, 
          0
        ], 
        [
          165, 
          0, 
          0
        ]
      ]
    }, 
    {
      "op": "null", 
      "name": "p110", 
      "inputs": []
    }, 
    {
      "op": "null", 
      "name": "p111", 
      "inputs": []
    }, 
    {
      "op": "tvm_op", 
      "name": "tvmgen_default_fused_nn_contrib_conv2d_NCHWc_add_nn_leaky_relu_111", 
      "attrs": {
        "num_outputs": "1", 
        "num_inputs": "3", 
        "data_layout": "NCHW4c", 
        "kernel_layout": "OIHW4i4o", 
        "hash": "69249bbd6011705d", 
        "func_name": "tvmgen_default_fused_nn_contrib_conv2d_NCHWc_add_nn_leaky_relu_11", 
        "out_layout": "NCHW4c", 
        "flatten_data": "0"
      }, 
      "inputs": [
        [
          166, 
          0, 
          0
        ], 
        [
          167, 
          0, 
          0
        ], 
        [
          168, 
          0, 
          0
        ]
      ]
    }, 
    {
      "op": "null", 
      "name": "p112", 
      "inputs": []
    }, 
    {
      "op": "null", 
      "name": "p113", 
      "inputs": []
    }, 
    {
      "op": "tvm_op", 
      "name": "tvmgen_default_fused_nn_contrib_conv2d_NCHWc_add_nn_leaky_relu_106", 
      "attrs": {
        "num_outputs": "1", 
        "num_inputs": "3", 
        "data_layout": "NCHW4c", 
        "kernel_layout": "OIHW4i4o", 
        "hash": "d33fcb2f8cfafe6e", 
        "func_name": "tvmgen_default_fused_nn_contrib_conv2d_NCHWc_add_nn_leaky_relu_10", 
        "out_layout": "NCHW4c", 
        "flatten_data": "0"
      }, 
      "inputs": [
        [
          169, 
          0, 
          0
        ], 
        [
          170, 
          0, 
          0
        ], 
        [
          171, 
          0, 
          0
        ]
      ]
    }, 
    {
      "op": "null", 
      "name": "p114", 
      "inputs": []
    }, 
    {
      "op": "null", 
      "name": "p115", 
      "inputs": []
    }, 
    {
      "op": "tvm_op", 
      "name": "tvmgen_default_fused_nn_contrib_conv2d_NCHWc_add_nn_leaky_relu_112", 
      "attrs": {
        "num_outputs": "1", 
        "num_inputs": "3", 
        "data_layout": "NCHW4c", 
        "kernel_layout": "OIHW4i4o", 
        "hash": "69249bbd6011705d", 
        "func_name": "tvmgen_default_fused_nn_contrib_conv2d_NCHWc_add_nn_leaky_relu_11", 
        "out_layout": "NCHW4c", 
        "flatten_data": "0"
      }, 
      "inputs": [
        [
          172, 
          0, 
          0
        ], 
        [
          173, 
          0, 
          0
        ], 
        [
          174, 
          0, 
          0
        ]
      ]
    }, 
    {
      "op": "tvm_op", 
      "name": "tvmgen_default_fused_layout_transform", 
      "attrs": {
        "num_outputs": "1", 
        "src_layout": "NCHW4c", 
        "flatten_data": "0", 
        "dst_layout": "NCHW2c", 
        "hash": "9b2f04fda1b548ad", 
        "func_name": "tvmgen_default_fused_layout_transform", 
        "num_inputs": "1"
      }, 
      "inputs": [
        [
          175, 
          0, 
          0
        ]
      ]
    }, 
    {
      "op": "null", 
      "name": "p116", 
      "inputs": []
    }, 
    {
      "op": "null", 
      "name": "p117", 
      "inputs": []
    }, 
    {
      "op": "tvm_op", 
      "name": "tvmgen_default_fused_nn_contrib_conv2d_NCHWc_add", 
      "attrs": {
        "num_outputs": "1", 
        "num_inputs": "3", 
        "out_layout": "NCHW3c", 
        "kernel_layout": "OIHW2i3o", 
        "hash": "dbcd2e00abe7fa30", 
        "func_name": "tvmgen_default_fused_nn_contrib_conv2d_NCHWc_add", 
        "data_layout": "NCHW2c", 
        "flatten_data": "0"
      }, 
      "inputs": [
        [
          176, 
          0, 
          0
        ], 
        [
          177, 
          0, 
          0
        ], 
        [
          178, 
          0, 
          0
        ]
      ]
    }, 
    {
      "op": "tvm_op", 
      "name": "tvmgen_default_fused_layout_transform_transpose", 
      "attrs": {
        "num_outputs": "1", 
        "src_layout": "NCHW3c", 
        "flatten_data": "0", 
        "dst_layout": "NCHW", 
        "hash": "d84e5e5bd0e538ce", 
        "func_name": "tvmgen_default_fused_layout_transform_transpose", 
        "num_inputs": "1"
      }, 
      "inputs": [
        [
          179, 
          0, 
          0
        ]
      ]
    }, 
    {
      "op": "null", 
      "name": "p118", 
      "inputs": []
    }, 
    {
      "op": "null", 
      "name": "p119", 
      "inputs": []
    }, 
    {
      "op": "tvm_op", 
      "name": "tvmgen_default_fused_nn_contrib_conv2d_NCHWc_add_nn_leaky_relu_12", 
      "attrs": {
        "num_outputs": "1", 
        "num_inputs": "3", 
        "data_layout": "NCHW4c", 
        "kernel_layout": "OIHW4i4o", 
        "hash": "cd33c758fbabbb7f", 
        "func_name": "tvmgen_default_fused_nn_contrib_conv2d_NCHWc_add_nn_leaky_relu_12", 
        "out_layout": "NCHW4c", 
        "flatten_data": "0"
      }, 
      "inputs": [
        [
          172, 
          0, 
          0
        ], 
        [
          181, 
          0, 
          0
        ], 
        [
          182, 
          0, 
          0
        ]
      ]
    }, 
    {
      "op": "tvm_op", 
      "name": "tvmgen_default_fused_layout_transform_image_resize2d_layout_transform_concatenate_layout_transf_1bf4794317454c42_", 
      "attrs": {
        "num_outputs": "1", 
        "num_inputs": "2", 
        "layout": "NCHW", 
        "src_layout": "NCHW", 
        "flatten_data": "0", 
        "dst_layout": "NCHW4c", 
        "hash": "796e3c4d2fb96673", 
        "func_name": "tvmgen_default_fused_layout_transform_image_resize2d_layout_transform_concatenate_layout_transf_1bf4794317454c42_"
      }, 
      "inputs": [
        [
          183, 
          0, 
          0
        ], 
        [
          130, 
          0, 
          0
        ]
      ]
    }, 
    {
      "op": "null", 
      "name": "p120", 
      "inputs": []
    }, 
    {
      "op": "null", 
      "name": "p121", 
      "inputs": []
    }, 
    {
      "op": "tvm_op", 
      "name": "tvmgen_default_fused_nn_contrib_conv2d_NCHWc_add_nn_leaky_relu_13", 
      "attrs": {
        "num_outputs": "1", 
        "num_inputs": "3", 
        "data_layout": "NCHW4c", 
        "kernel_layout": "OIHW4i4o", 
        "hash": "458ee6bc9a55f4c8", 
        "func_name": "tvmgen_default_fused_nn_contrib_conv2d_NCHWc_add_nn_leaky_relu_13", 
        "out_layout": "NCHW4c", 
        "flatten_data": "0"
      }, 
      "inputs": [
        [
          184, 
          0, 
          0
        ], 
        [
          185, 
          0, 
          0
        ], 
        [
          186, 
          0, 
          0
        ]
      ]
    }, 
    {
      "op": "null", 
      "name": "p122", 
      "inputs": []
    }, 
    {
      "op": "null", 
      "name": "p123", 
      "inputs": []
    }, 
    {
      "op": "tvm_op", 
      "name": "tvmgen_default_fused_nn_contrib_conv2d_NCHWc_add_nn_leaky_relu_14", 
      "attrs": {
        "num_outputs": "1", 
        "num_inputs": "3", 
        "data_layout": "NCHW4c", 
        "kernel_layout": "OIHW4i4o", 
        "hash": "a8bf04fbe5df65de", 
        "func_name": "tvmgen_default_fused_nn_contrib_conv2d_NCHWc_add_nn_leaky_relu_14", 
        "out_layout": "NCHW4c", 
        "flatten_data": "0"
      }, 
      "inputs": [
        [
          187, 
          0, 
          0
        ], 
        [
          188, 
          0, 
          0
        ], 
        [
          189, 
          0, 
          0
        ]
      ]
    }, 
    {
      "op": "null", 
      "name": "p124", 
      "inputs": []
    }, 
    {
      "op": "null", 
      "name": "p125", 
      "inputs": []
    }, 
    {
      "op": "tvm_op", 
      "name": "tvmgen_default_fused_nn_contrib_conv2d_NCHWc_add_nn_leaky_relu_88", 
      "attrs": {
        "num_outputs": "1", 
        "num_inputs": "3", 
        "data_layout": "NCHW4c", 
        "kernel_layout": "OIHW4i4o", 
        "hash": "553742bf1f0ea1bf", 
        "func_name": "tvmgen_default_fused_nn_contrib_conv2d_NCHWc_add_nn_leaky_relu_8", 
        "out_layout": "NCHW4c", 
        "flatten_data": "0"
      }, 
      "inputs": [
        [
          190, 
          0, 
          0
        ], 
        [
          191, 
          0, 
          0
        ], 
        [
          192, 
          0, 
          0
        ]
      ]
    }, 
    {
      "op": "null", 
      "name": "p126", 
      "inputs": []
    }, 
    {
      "op": "null", 
      "name": "p127", 
      "inputs": []
    }, 
    {
      "op": "tvm_op", 
      "name": "tvmgen_default_fused_nn_contrib_conv2d_NCHWc_add_nn_leaky_relu_141", 
      "attrs": {
        "num_outputs": "1", 
        "num_inputs": "3", 
        "data_layout": "NCHW4c", 
        "kernel_layout": "OIHW4i4o", 
        "hash": "a8bf04fbe5df65de", 
        "func_name": "tvmgen_default_fused_nn_contrib_conv2d_NCHWc_add_nn_leaky_relu_14", 
        "out_layout": "NCHW4c", 
        "flatten_data": "0"
      }, 
      "inputs": [
        [
          193, 
          0, 
          0
        ], 
        [
          194, 
          0, 
          0
        ], 
        [
          195, 
          0, 
          0
        ]
      ]
    }, 
    {
      "op": "null", 
      "name": "p128", 
      "inputs": []
    }, 
    {
      "op": "null", 
      "name": "p129", 
      "inputs": []
    }, 
    {
      "op": "tvm_op", 
      "name": "tvmgen_default_fused_nn_contrib_conv2d_NCHWc_add_nn_leaky_relu_89", 
      "attrs": {
        "num_outputs": "1", 
        "num_inputs": "3", 
        "data_layout": "NCHW4c", 
        "kernel_layout": "OIHW4i4o", 
        "hash": "553742bf1f0ea1bf", 
        "func_name": "tvmgen_default_fused_nn_contrib_conv2d_NCHWc_add_nn_leaky_relu_8", 
        "out_layout": "NCHW4c", 
        "flatten_data": "0"
      }, 
      "inputs": [
        [
          196, 
          0, 
          0
        ], 
        [
          197, 
          0, 
          0
        ], 
        [
          198, 
          0, 
          0
        ]
      ]
    }, 
    {
      "op": "null", 
      "name": "p130", 
      "inputs": []
    }, 
    {
      "op": "null", 
      "name": "p131", 
      "inputs": []
    }, 
    {
      "op": "tvm_op", 
      "name": "tvmgen_default_fused_nn_contrib_conv2d_NCHWc_add_nn_leaky_relu_142", 
      "attrs": {
        "num_outputs": "1", 
        "num_inputs": "3", 
        "data_layout": "NCHW4c", 
        "kernel_layout": "OIHW4i4o", 
        "hash": "a8bf04fbe5df65de", 
        "func_name": "tvmgen_default_fused_nn_contrib_conv2d_NCHWc_add_nn_leaky_relu_14", 
        "out_layout": "NCHW4c", 
        "flatten_data": "0"
      }, 
      "inputs": [
        [
          199, 
          0, 
          0
        ], 
        [
          200, 
          0, 
          0
        ], 
        [
          201, 
          0, 
          0
        ]
      ]
    }, 
    {
      "op": "tvm_op", 
      "name": "tvmgen_default_fused_layout_transform_1", 
      "attrs": {
        "num_outputs": "1", 
        "src_layout": "NCHW4c", 
        "flatten_data": "0", 
        "dst_layout": "NCHW2c", 
        "hash": "147a86ff751a25c3", 
        "func_name": "tvmgen_default_fused_layout_transform_1", 
        "num_inputs": "1"
      }, 
      "inputs": [
        [
          202, 
          0, 
          0
        ]
      ]
    }, 
    {
      "op": "null", 
      "name": "p132", 
      "inputs": []
    }, 
    {
      "op": "null", 
      "name": "p133", 
      "inputs": []
    }, 
    {
      "op": "tvm_op", 
      "name": "tvmgen_default_fused_nn_contrib_conv2d_NCHWc_add_1", 
      "attrs": {
        "num_outputs": "1", 
        "num_inputs": "3", 
        "data_layout": "NCHW2c", 
        "kernel_layout": "OIHW2i3o", 
        "hash": "7f574fb163cd1b00", 
        "func_name": "tvmgen_default_fused_nn_contrib_conv2d_NCHWc_add_1", 
        "out_layout": "NCHW3c", 
        "flatten_data": "0"
      }, 
      "inputs": [
        [
          203, 
          0, 
          0
        ], 
        [
          204, 
          0, 
          0
        ], 
        [
          205, 
          0, 
          0
        ]
      ]
    }, 
    {
      "op": "tvm_op", 
      "name": "tvmgen_default_fused_layout_transform_transpose_1", 
      "attrs": {
        "num_outputs": "1", 
        "src_layout": "NCHW3c", 
        "flatten_data": "0", 
        "dst_layout": "NCHW", 
        "hash": "49e394f687f0791d", 
        "func_name": "tvmgen_default_fused_layout_transform_transpose_1", 
        "num_inputs": "1"
      }, 
      "inputs": [
        [
          206, 
          0, 
          0
        ]
      ]
    }, 
    {
      "op": "null", 
      "name": "p134", 
      "inputs": []
    }, 
    {
      "op": "null", 
      "name": "p135", 
      "inputs": []
    }, 
    {
      "op": "tvm_op", 
      "name": "tvmgen_default_fused_nn_contrib_conv2d_NCHWc_add_nn_leaky_relu_15", 
      "attrs": {
        "num_outputs": "1", 
        "num_inputs": "3", 
        "data_layout": "NCHW4c", 
        "kernel_layout": "OIHW4i4o", 
        "hash": "f83a257c0c5721b7", 
        "func_name": "tvmgen_default_fused_nn_contrib_conv2d_NCHWc_add_nn_leaky_relu_15", 
        "out_layout": "NCHW4c", 
        "flatten_data": "0"
      }, 
      "inputs": [
        [
          199, 
          0, 
          0
        ], 
        [
          208, 
          0, 
          0
        ], 
        [
          209, 
          0, 
          0
        ]
      ]
    }, 
    {
      "op": "tvm_op", 
      "name": "tvmgen_default_fused_layout_transform_image_resize2d_layout_transform_concatenate_layout_transf_1bf4794317454c42__1", 
      "attrs": {
        "num_outputs": "1", 
        "num_inputs": "2", 
        "layout": "NCHW", 
        "src_layout": "NCHW", 
        "flatten_data": "0", 
        "dst_layout": "NCHW4c", 
        "hash": "5dd7aa754abdd83f", 
        "func_name": "tvmgen_default_fused_layout_transform_image_resize2d_layout_transform_concatenate_layout_transf_1bf4794317454c42__1"
      }, 
      "inputs": [
        [
          210, 
          0, 
          0
        ], 
        [
          79, 
          0, 
          0
        ]
      ]
    }, 
    {
      "op": "null", 
      "name": "p136", 
      "inputs": []
    }, 
    {
      "op": "null", 
      "name": "p137", 
      "inputs": []
    }, 
    {
      "op": "tvm_op", 
      "name": "tvmgen_default_fused_nn_contrib_conv2d_NCHWc_add_nn_leaky_relu_16", 
      "attrs": {
        "num_outputs": "1", 
        "num_inputs": "3", 
        "data_layout": "NCHW4c", 
        "kernel_layout": "OIHW4i4o", 
        "hash": "2e5538a4f8b4080d", 
        "func_name": "tvmgen_default_fused_nn_contrib_conv2d_NCHWc_add_nn_leaky_relu_16", 
        "out_layout": "NCHW4c", 
        "flatten_data": "0"
      }, 
      "inputs": [
        [
          211, 
          0, 
          0
        ], 
        [
          212, 
          0, 
          0
        ], 
        [
          213, 
          0, 
          0
        ]
      ]
    }, 
    {
      "op": "null", 
      "name": "p138", 
      "inputs": []
    }, 
    {
      "op": "null", 
      "name": "p139", 
      "inputs": []
    }, 
    {
      "op": "tvm_op", 
      "name": "tvmgen_default_fused_nn_contrib_conv2d_NCHWc_add_nn_leaky_relu_17", 
      "attrs": {
        "num_outputs": "1", 
        "num_inputs": "3", 
        "data_layout": "NCHW4c", 
        "kernel_layout": "OIHW4i4o", 
        "hash": "d27be4423cb324b3", 
        "func_name": "tvmgen_default_fused_nn_contrib_conv2d_NCHWc_add_nn_leaky_relu_17", 
        "out_layout": "NCHW4c", 
        "flatten_data": "0"
      }, 
      "inputs": [
        [
          214, 
          0, 
          0
        ], 
        [
          215, 
          0, 
          0
        ], 
        [
          216, 
          0, 
          0
        ]
      ]
    }, 
    {
      "op": "null", 
      "name": "p140", 
      "inputs": []
    }, 
    {
      "op": "null", 
      "name": "p141", 
      "inputs": []
    }, 
    {
      "op": "tvm_op", 
      "name": "tvmgen_default_fused_nn_contrib_conv2d_NCHWc_add_nn_leaky_relu_68", 
      "attrs": {
        "num_outputs": "1", 
        "num_inputs": "3", 
        "data_layout": "NCHW4c", 
        "kernel_layout": "OIHW4i4o", 
        "hash": "26478f57fbc719f7", 
        "func_name": "tvmgen_default_fused_nn_contrib_conv2d_NCHWc_add_nn_leaky_relu_6", 
        "out_layout": "NCHW4c", 
        "flatten_data": "0"
      }, 
      "inputs": [
        [
          217, 
          0, 
          0
        ], 
        [
          218, 
          0, 
          0
        ], 
        [
          219, 
          0, 
          0
        ]
      ]
    }, 
    {
      "op": "null", 
      "name": "p142", 
      "inputs": []
    }, 
    {
      "op": "null", 
      "name": "p143", 
      "inputs": []
    }, 
    {
      "op": "tvm_op", 
      "name": "tvmgen_default_fused_nn_contrib_conv2d_NCHWc_add_nn_leaky_relu_171", 
      "attrs": {
        "num_outputs": "1", 
        "num_inputs": "3", 
        "data_layout": "NCHW4c", 
        "kernel_layout": "OIHW4i4o", 
        "hash": "d27be4423cb324b3", 
        "func_name": "tvmgen_default_fused_nn_contrib_conv2d_NCHWc_add_nn_leaky_relu_17", 
        "out_layout": "NCHW4c", 
        "flatten_data": "0"
      }, 
      "inputs": [
        [
          220, 
          0, 
          0
        ], 
        [
          221, 
          0, 
          0
        ], 
        [
          222, 
          0, 
          0
        ]
      ]
    }, 
    {
      "op": "null", 
      "name": "p144", 
      "inputs": []
    }, 
    {
      "op": "null", 
      "name": "p145", 
      "inputs": []
    }, 
    {
      "op": "tvm_op", 
      "name": "tvmgen_default_fused_nn_contrib_conv2d_NCHWc_add_nn_leaky_relu_69", 
      "attrs": {
        "num_outputs": "1", 
        "num_inputs": "3", 
        "data_layout": "NCHW4c", 
        "kernel_layout": "OIHW4i4o", 
        "hash": "26478f57fbc719f7", 
        "func_name": "tvmgen_default_fused_nn_contrib_conv2d_NCHWc_add_nn_leaky_relu_6", 
        "out_layout": "NCHW4c", 
        "flatten_data": "0"
      }, 
      "inputs": [
        [
          223, 
          0, 
          0
        ], 
        [
          224, 
          0, 
          0
        ], 
        [
          225, 
          0, 
          0
        ]
      ]
    }, 
    {
      "op": "null", 
      "name": "p146", 
      "inputs": []
    }, 
    {
      "op": "null", 
      "name": "p147", 
      "inputs": []
    }, 
    {
      "op": "tvm_op", 
      "name": "tvmgen_default_fused_nn_contrib_conv2d_NCHWc_add_nn_leaky_relu_172", 
      "attrs": {
        "num_outputs": "1", 
        "num_inputs": "3", 
        "data_layout": "NCHW4c", 
        "kernel_layout": "OIHW4i4o", 
        "hash": "d27be4423cb324b3", 
        "func_name": "tvmgen_default_fused_nn_contrib_conv2d_NCHWc_add_nn_leaky_relu_17", 
        "out_layout": "NCHW4c", 
        "flatten_data": "0"
      }, 
      "inputs": [
        [
          226, 
          0, 
          0
        ], 
        [
          227, 
          0, 
          0
        ], 
        [
          228, 
          0, 
          0
        ]
      ]
    }, 
    {
      "op": "tvm_op", 
      "name": "tvmgen_default_fused_layout_transform_2", 
      "attrs": {
        "num_outputs": "1", 
        "src_layout": "NCHW4c", 
        "flatten_data": "0", 
        "dst_layout": "NCHW2c", 
        "hash": "97754cf11506f699", 
        "func_name": "tvmgen_default_fused_layout_transform_2", 
        "num_inputs": "1"
      }, 
      "inputs": [
        [
          229, 
          0, 
          0
        ]
      ]
    }, 
    {
      "op": "null", 
      "name": "p148", 
      "inputs": []
    }, 
    {
      "op": "null", 
      "name": "p149", 
      "inputs": []
    }, 
    {
      "op": "tvm_op", 
      "name": "tvmgen_default_fused_nn_contrib_conv2d_NCHWc_add_2", 
      "attrs": {
        "num_outputs": "1", 
        "num_inputs": "3", 
        "data_layout": "NCHW2c", 
        "kernel_layout": "OIHW2i3o", 
        "hash": "893346d5e93c63d5", 
        "func_name": "tvmgen_default_fused_nn_contrib_conv2d_NCHWc_add_2", 
        "out_layout": "NCHW3c", 
        "flatten_data": "0"
      }, 
      "inputs": [
        [
          230, 
          0, 
          0
        ], 
        [
          231, 
          0, 
          0
        ], 
        [
          232, 
          0, 
          0
        ]
      ]
    }, 
    {
      "op": "tvm_op", 
      "name": "tvmgen_default_fused_layout_transform_transpose_2", 
      "attrs": {
        "num_outputs": "1", 
        "src_layout": "NCHW3c", 
        "flatten_data": "0", 
        "dst_layout": "NCHW", 
        "hash": "ebc81fe68f9db937", 
        "func_name": "tvmgen_default_fused_layout_transform_transpose_2", 
        "num_inputs": "1"
      }, 
      "inputs": [
        [
          233, 
          0, 
          0
        ]
      ]
    }
  ], 
  "arg_nodes": [
    0, 
    2, 
    3, 
    5, 
    6, 
    8, 
    9, 
    11, 
    12, 
    14, 
    15, 
    17, 
    18, 
    20, 
    21, 
    23, 
    24, 
    26, 
    27, 
    29, 
    30, 
    32, 
    33, 
    35, 
    36, 
    38, 
    39, 
    41, 
    42, 
    44, 
    45, 
    47, 
    48, 
    50, 
    51, 
    53, 
    54, 
    56, 
    57, 
    59, 
    60, 
    62, 
    63, 
    65, 
    66, 
    68, 
    69, 
    71, 
    72, 
    74, 
    75, 
    77, 
    78, 
    80, 
    81, 
    83, 
    84, 
    86, 
    87, 
    89, 
    90, 
    92, 
    93, 
    95, 
    96, 
    98, 
    99, 
    101, 
    102, 
    104, 
    105, 
    107, 
    108, 
    110, 
    111, 
    113, 
    114, 
    116, 
    117, 
    119, 
    120, 
    122, 
    123, 
    125, 
    126, 
    128, 
    129, 
    131, 
    132, 
    134, 
    135, 
    137, 
    138, 
    140, 
    141, 
    143, 
    144, 
    146, 
    147, 
    149, 
    150, 
    152, 
    153, 
    155, 
    156, 
    158, 
    159, 
    161, 
    162, 
    164, 
    165, 
    167, 
    168, 
    170, 
    171, 
    173, 
    174, 
    177, 
    178, 
    181, 
    182, 
    185, 
    186, 
    188, 
    189, 
    191, 
    192, 
    194, 
    195, 
    197, 
    198, 
    200, 
    201, 
    204, 
    205, 
    208, 
    209, 
    212, 
    213, 
    215, 
    216, 
    218, 
    219, 
    221, 
    222, 
    224, 
    225, 
    227, 
    228, 
    231, 
    232
  ], 
  "heads": [
    [
      180, 
      0, 
      0
    ], 
    [
      207, 
      0, 
      0
    ], 
    [
      234, 
      0, 
      0
    ]
  ], 
  "attrs": {
    "dltype": [
      "list_str", 
      [
        "float32", 
        "float32", 
        "float32", 
        "float32", 
        "float32", 
        "float32", 
        "float32", 
        "float32", 
        "float32", 
        "float32", 
        "float32", 
        "float32", 
        "float32", 
        "float32", 
        "float32", 
        "float32", 
        "float32", 
        "float32", 
        "float32", 
        "float32", 
        "float32", 
        "float32", 
        "float32", 
        "float32", 
        "float32", 
        "float32", 
        "float32", 
        "float32", 
        "float32", 
        "float32", 
        "float32", 
        "float32", 
        "float32", 
        "float32", 
        "float32", 
        "float32", 
        "float32", 
        "float32", 
        "float32", 
        "float32", 
        "float32", 
        "float32", 
        "float32", 
        "float32", 
        "float32", 
        "float32", 
        "float32", 
        "float32", 
        "float32", 
        "float32", 
        "float32", 
        "float32", 
        "float32", 
        "float32", 
        "float32", 
        "float32", 
        "float32", 
        "float32", 
        "float32", 
        "float32", 
        "float32", 
        "float32", 
        "float32", 
        "float32", 
        "float32", 
        "float32", 
        "float32", 
        "float32", 
        "float32", 
        "float32", 
        "float32", 
        "float32", 
        "float32", 
        "float32", 
        "float32", 
        "float32", 
        "float32", 
        "float32", 
        "float32", 
        "float32", 
        "float32", 
        "float32", 
        "float32", 
        "float32", 
        "float32", 
        "float32", 
        "float32", 
        "float32", 
        "float32", 
        "float32", 
        "float32", 
        "float32", 
        "float32", 
        "float32", 
        "float32", 
        "float32", 
        "float32", 
        "float32", 
        "float32", 
        "float32", 
        "float32", 
        "float32", 
        "float32", 
        "float32", 
        "float32", 
        "float32", 
        "float32", 
        "float32", 
        "float32", 
        "float32", 
        "float32", 
        "float32", 
        "float32", 
        "float32", 
        "float32", 
        "float32", 
        "float32", 
        "float32", 
        "float32", 
        "float32", 
        "float32", 
        "float32", 
        "float32", 
        "float32", 
        "float32", 
        "float32", 
        "float32", 
        "float32", 
        "float32", 
        "float32", 
        "float32", 
        "float32", 
        "float32", 
        "float32", 
        "float32", 
        "float32", 
        "float32", 
        "float32", 
        "float32", 
        "float32", 
        "float32", 
        "float32", 
        "float32", 
        "float32", 
        "float32", 
        "float32", 
        "float32", 
        "float32", 
        "float32", 
        "float32", 
        "float32", 
        "float32", 
        "float32", 
        "float32", 
        "float32", 
        "float32", 
        "float32", 
        "float32", 
        "float32", 
        "float32", 
        "float32", 
        "float32", 
        "float32", 
        "float32", 
        "float32", 
        "float32", 
        "float32", 
        "float32", 
        "float32", 
        "float32", 
        "float32", 
        "float32", 
        "float32", 
        "float32", 
        "float32", 
        "float32", 
        "float32", 
        "float32", 
        "float32", 
        "float32", 
        "float32", 
        "float32", 
        "float32", 
        "float32", 
        "float32", 
        "float32", 
        "float32", 
        "float32", 
        "float32", 
        "float32", 
        "float32", 
        "float32", 
        "float32", 
        "float32", 
        "float32", 
        "float32", 
        "float32", 
        "float32", 
        "float32", 
        "float32", 
        "float32", 
        "float32", 
        "float32", 
        "float32", 
        "float32", 
        "float32", 
        "float32", 
        "float32", 
        "float32", 
        "float32", 
        "float32", 
        "float32", 
        "float32", 
        "float32", 
        "float32", 
        "float32", 
        "float32", 
        "float32", 
        "float32", 
        "float32", 
        "float32", 
        "float32", 
        "float32", 
        "float32", 
        "float32", 
        "float32", 
        "float32", 
        "float32", 
        "float32", 
        "float32", 
        "float32", 
        "float32", 
        "float32", 
        "float32", 
        "float32"
      ]
    ], 
    "shape": [
      "list_shape", 
      [
        [1, 416, 416, 3], 
        [1, 1, 416, 416, 3], 
        [8, 1, 3, 3, 3, 4], 
        [1, 8, 1, 1, 4], 
        [1, 8, 416, 416, 4], 
        [16, 8, 3, 3, 4, 4], 
        [1, 16, 1, 1, 4], 
        [1, 16, 208, 208, 4], 
        [8, 16, 1, 1, 4, 4], 
        [1, 8, 1, 1, 4], 
        [1, 8, 208, 208, 4], 
        [16, 8, 3, 3, 4, 4], 
        [1, 16, 1, 1, 4], 
        [1, 16, 208, 208, 4], 
        [32, 16, 3, 3, 4, 4], 
        [1, 32, 1, 1, 4], 
        [1, 32, 104, 104, 4], 
        [16, 32, 1, 1, 4, 4], 
        [1, 16, 1, 1, 4], 
        [1, 16, 104, 104, 4], 
        [32, 16, 3, 3, 4, 4], 
        [1, 32, 1, 1, 4], 
        [1, 32, 104, 104, 4], 
        [16, 32, 1, 1, 4, 4], 
        [1, 16, 1, 1, 4], 
        [1, 16, 104, 104, 4], 
        [32, 16, 3, 3, 4, 4], 
        [1, 32, 1, 1, 4], 
        [1, 32, 104, 104, 4], 
        [64, 32, 3, 3, 4, 4], 
        [1, 64, 1, 1, 4], 
        [1, 64, 52, 52, 4], 
        [32, 64, 1, 1, 4, 4], 
        [1, 32, 1, 1, 4], 
        [1, 32, 52, 52, 4], 
        [64, 32, 3, 3, 4, 4], 
        [1, 64, 1, 1, 4], 
        [1, 64, 52, 52, 4], 
        [32, 64, 1, 1, 4, 4], 
        [1, 32, 1, 1, 4], 
        [1, 32, 52, 52, 4], 
        [64, 32, 3, 3, 4, 4], 
        [1, 64, 1, 1, 4], 
        [1, 64, 52, 52, 4], 
        [32, 64, 1, 1, 4, 4], 
        [1, 32, 1, 1, 4], 
        [1, 32, 52, 52, 4], 
        [64, 32, 3, 3, 4, 4], 
        [1, 64, 1, 1, 4], 
        [1, 64, 52, 52, 4], 
        [32, 64, 1, 1, 4, 4], 
        [1, 32, 1, 1, 4], 
        [1, 32, 52, 52, 4], 
        [64, 32, 3, 3, 4, 4], 
        [1, 64, 1, 1, 4], 
        [1, 64, 52, 52, 4], 
        [32, 64, 1, 1, 4, 4], 
        [1, 32, 1, 1, 4], 
        [1, 32, 52, 52, 4], 
        [64, 32, 3, 3, 4, 4], 
        [1, 64, 1, 1, 4], 
        [1, 64, 52, 52, 4], 
        [32, 64, 1, 1, 4, 4], 
        [1, 32, 1, 1, 4], 
        [1, 32, 52, 52, 4], 
        [64, 32, 3, 3, 4, 4], 
        [1, 64, 1, 1, 4], 
        [1, 64, 52, 52, 4], 
        [32, 64, 1, 1, 4, 4], 
        [1, 32, 1, 1, 4], 
        [1, 32, 52, 52, 4], 
        [64, 32, 3, 3, 4, 4], 
        [1, 64, 1, 1, 4], 
        [1, 64, 52, 52, 4], 
        [32, 64, 1, 1, 4, 4], 
        [1, 32, 1, 1, 4], 
        [1, 32, 52, 52, 4], 
        [64, 32, 3, 3, 4, 4], 
        [1, 64, 1, 1, 4], 
        [1, 64, 52, 52, 4], 
        [128, 64, 3, 3, 4, 4], 
        [1, 128, 1, 1, 4], 
        [1, 128, 26, 26, 4], 
        [64, 128, 1, 1, 4, 4], 
        [1, 64, 1, 1, 4], 
        [1, 64, 26, 26, 4], 
        [128, 64, 3, 3, 4, 4], 
        [1, 128, 1, 1, 4], 
        [1, 128, 26, 26, 4], 
        [64, 128, 1, 1, 4, 4], 
        [1, 64, 1, 1, 4], 
        [1, 64, 26, 26, 4], 
        [128, 64, 3, 3, 4, 4], 
        [1, 128, 1, 1, 4], 
        [1, 128, 26, 26, 4], 
        [64, 128, 1, 1, 4, 4], 
        [1, 64, 1, 1, 4], 
        [1, 64, 26, 26, 4], 
        [128, 64, 3, 3, 4, 4], 
        [1, 128, 1, 1, 4], 
        [1, 128, 26, 26, 4], 
        [64, 128, 1, 1, 4, 4], 
        [1, 64, 1, 1, 4], 
        [1, 64, 26, 26, 4], 
        [128, 64, 3, 3, 4, 4], 
        [1, 128, 1, 1, 4], 
        [1, 128, 26, 26, 4], 
        [64, 128, 1, 1, 4, 4], 
        [1, 64, 1, 1, 4], 
        [1, 64, 26, 26, 4], 
        [128, 64, 3, 3, 4, 4], 
        [1, 128, 1, 1, 4], 
        [1, 128, 26, 26, 4], 
        [64, 128, 1, 1, 4, 4], 
        [1, 64, 1, 1, 4], 
        [1, 64, 26, 26, 4], 
        [128, 64, 3, 3, 4, 4], 
        [1, 128, 1, 1, 4], 
        [1, 128, 26, 26, 4], 
        [64, 128, 1, 1, 4, 4], 
        [1, 64, 1, 1, 4], 
        [1, 64, 26, 26, 4], 
        [128, 64, 3, 3, 4, 4], 
        [1, 128, 1, 1, 4], 
        [1, 128, 26, 26, 4], 
        [64, 128, 1, 1, 4, 4], 
        [1, 64, 1, 1, 4], 
        [1, 64, 26, 26, 4], 
        [128, 64, 3, 3, 4, 4], 
        [1, 128, 1, 1, 4], 
        [1, 128, 26, 26, 4], 
        [256, 128, 3, 3, 4, 4], 
        [1, 256, 1, 1, 4], 
        [1, 256, 13, 13, 4], 
        [128, 256, 1, 1, 4, 4], 
        [1, 128, 1, 1, 4], 
        [1, 128, 13, 13, 4], 
        [256, 128, 3, 3, 4, 4], 
        [1, 256, 1, 1, 4], 
        [1, 256, 13, 13, 4], 
        [128, 256, 1, 1, 4, 4], 
        [1, 128, 1, 1, 4], 
        [1, 128, 13, 13, 4], 
        [256, 128, 3, 3, 4, 4], 
        [1, 256, 1, 1, 4], 
        [1, 256, 13, 13, 4], 
        [128, 256, 1, 1, 4, 4], 
        [1, 128, 1, 1, 4], 
        [1, 128, 13, 13, 4], 
        [256, 128, 3, 3, 4, 4], 
        [1, 256, 1, 1, 4], 
        [1, 256, 13, 13, 4], 
        [128, 256, 1, 1, 4, 4], 
        [1, 128, 1, 1, 4], 
        [1, 128, 13, 13, 4], 
        [256, 128, 3, 3, 4, 4], 
        [1, 256, 1, 1, 4], 
        [1, 256, 13, 13, 4], 
        [128, 256, 1, 1, 4, 4], 
        [1, 128, 1, 1, 4], 
        [1, 128, 13, 13, 4], 
        [256, 128, 3, 3, 4, 4], 
        [1, 256, 1, 1, 4], 
        [1, 256, 13, 13, 4], 
        [128, 256, 1, 1, 4, 4], 
        [1, 128, 1, 1, 4], 
        [1, 128, 13, 13, 4], 
        [256, 128, 3, 3, 4, 4], 
        [1, 256, 1, 1, 4], 
        [1, 256, 13, 13, 4], 
        [128, 256, 1, 1, 4, 4], 
        [1, 128, 1, 1, 4], 
        [1, 128, 13, 13, 4], 
        [256, 128, 3, 3, 4, 4], 
        [1, 256, 1, 1, 4], 
        [1, 256, 13, 13, 4], 
        [1, 512, 13, 13, 2], 
        [10, 512, 1, 1, 2, 3], 
        [1, 10, 1, 1, 3], 
        [1, 10, 13, 13, 3], 
        [1, 13, 13, 30], 
        [64, 128, 1, 1, 4, 4], 
        [1, 64, 1, 1, 4], 
        [1, 64, 13, 13, 4], 
        [1, 192, 26, 26, 4], 
        [64, 192, 1, 1, 4, 4], 
        [1, 64, 1, 1, 4], 
        [1, 64, 26, 26, 4], 
        [128, 64, 3, 3, 4, 4], 
        [1, 128, 1, 1, 4], 
        [1, 128, 26, 26, 4], 
        [64, 128, 1, 1, 4, 4], 
        [1, 64, 1, 1, 4], 
        [1, 64, 26, 26, 4], 
        [128, 64, 3, 3, 4, 4], 
        [1, 128, 1, 1, 4], 
        [1, 128, 26, 26, 4], 
        [64, 128, 1, 1, 4, 4], 
        [1, 64, 1, 1, 4], 
        [1, 64, 26, 26, 4], 
        [128, 64, 3, 3, 4, 4], 
        [1, 128, 1, 1, 4], 
        [1, 128, 26, 26, 4], 
        [1, 256, 26, 26, 2], 
        [10, 256, 1, 1, 2, 3], 
        [1, 10, 1, 1, 3], 
        [1, 10, 26, 26, 3], 
        [1, 26, 26, 30], 
        [32, 64, 1, 1, 4, 4], 
        [1, 32, 1, 1, 4], 
        [1, 32, 26, 26, 4], 
        [1, 96, 52, 52, 4], 
        [32, 96, 1, 1, 4, 4], 
        [1, 32, 1, 1, 4], 
        [1, 32, 52, 52, 4], 
        [64, 32, 3, 3, 4, 4], 
        [1, 64, 1, 1, 4], 
        [1, 64, 52, 52, 4], 
        [32, 64, 1, 1, 4, 4], 
        [1, 32, 1, 1, 4], 
        [1, 32, 52, 52, 4], 
        [64, 32, 3, 3, 4, 4], 
        [1, 64, 1, 1, 4], 
        [1, 64, 52, 52, 4], 
        [32, 64, 1, 1, 4, 4], 
        [1, 32, 1, 1, 4], 
        [1, 32, 52, 52, 4], 
        [64, 32, 3, 3, 4, 4], 
        [1, 64, 1, 1, 4], 
        [1, 64, 52, 52, 4], 
        [1, 128, 52, 52, 2], 
        [10, 128, 1, 1, 2, 3], 
        [1, 10, 1, 1, 3], 
        [1, 10, 52, 52, 3], 
        [1, 52, 52, 30]
      ]
    ], 
    "device_index": [
      "list_int", 
      [
        1, 
        1, 
        1, 
        1, 
        1, 
        1, 
        1, 
        1, 
        1, 
        1, 
        1, 
        1, 
        1, 
        1, 
        1, 
        1, 
        1, 
        1, 
        1, 
        1, 
        1, 
        1, 
        1, 
        1, 
        1, 
        1, 
        1, 
        1, 
        1, 
        1, 
        1, 
        1, 
        1, 
        1, 
        1, 
        1, 
        1, 
        1, 
        1, 
        1, 
        1, 
        1, 
        1, 
        1, 
        1, 
        1, 
        1, 
        1, 
        1, 
        1, 
        1, 
        1, 
        1, 
        1, 
        1, 
        1, 
        1, 
        1, 
        1, 
        1, 
        1, 
        1, 
        1, 
        1, 
        1, 
        1, 
        1, 
        1, 
        1, 
        1, 
        1, 
        1, 
        1, 
        1, 
        1, 
        1, 
        1, 
        1, 
        1, 
        1, 
        1, 
        1, 
        1, 
        1, 
        1, 
        1, 
        1, 
        1, 
        1, 
        1, 
        1, 
        1, 
        1, 
        1, 
        1, 
        1, 
        1, 
        1, 
        1, 
        1, 
        1, 
        1, 
        1, 
        1, 
        1, 
        1, 
        1, 
        1, 
        1, 
        1, 
        1, 
        1, 
        1, 
        1, 
        1, 
        1, 
        1, 
        1, 
        1, 
        1, 
        1, 
        1, 
        1, 
        1, 
        1, 
        1, 
        1, 
        1, 
        1, 
        1, 
        1, 
        1, 
        1, 
        1, 
        1, 
        1, 
        1, 
        1, 
        1, 
        1, 
        1, 
        1, 
        1, 
        1, 
        1, 
        1, 
        1, 
        1, 
        1, 
        1, 
        1, 
        1, 
        1, 
        1, 
        1, 
        1, 
        1, 
        1, 
        1, 
        1, 
        1, 
        1, 
        1, 
        1, 
        1, 
        1, 
        1, 
        1, 
        1, 
        1, 
        1, 
        1, 
        1, 
        1, 
        1, 
        1, 
        1, 
        1, 
        1, 
        1, 
        1, 
        1, 
        1, 
        1, 
        1, 
        1, 
        1, 
        1, 
        1, 
        1, 
        1, 
        1, 
        1, 
        1, 
        1, 
        1, 
        1, 
        1, 
        1, 
        1, 
        1, 
        1, 
        1, 
        1, 
        1, 
        1, 
        1, 
        1, 
        1, 
        1, 
        1, 
        1, 
        1, 
        1, 
        1, 
        1, 
        1, 
        1, 
        1, 
        1, 
        1, 
        1, 
        1, 
        1, 
        1, 
        1, 
        1, 
        1, 
        1, 
        1, 
        1, 
        1, 
        1, 
        1, 
        1
      ]
    ], 
    "storage_id": [
      "list_int", 
      [
        0, 
        1, 
        2, 
        3, 
        4, 
        5, 
        6, 
        1, 
        7, 
        8, 
        4, 
        9, 
        10, 
        11, 
        12, 
        13, 
        1, 
        14, 
        15, 
        11, 
        16, 
        17, 
        4, 
        18, 
        19, 
        11, 
        20, 
        21, 
        1, 
        22, 
        23, 
        11, 
        24, 
        25, 
        1, 
        26, 
        27, 
        4, 
        28, 
        29, 
        1, 
        30, 
        31, 
        11, 
        32, 
        33, 
        1, 
        34, 
        35, 
        4, 
        36, 
        37, 
        1, 
        38, 
        39, 
        11, 
        40, 
        41, 
        1, 
        42, 
        43, 
        4, 
        44, 
        45, 
        1, 
        46, 
        47, 
        11, 
        48, 
        49, 
        1, 
        50, 
        51, 
        4, 
        52, 
        53, 
        1, 
        54, 
        55, 
        11, 
        56, 
        57, 
        1, 
        58, 
        59, 
        60, 
        61, 
        62, 
        4, 
        63, 
        64, 
        60, 
        65, 
        66, 
        1, 
        67, 
        68, 
        60, 
        69, 
        70, 
        4, 
        71, 
        72, 
        60, 
        73, 
        74, 
        1, 
        75, 
        76, 
        60, 
        77, 
        78, 
        4, 
        79, 
        80, 
        60, 
        81, 
        82, 
        1, 
        83, 
        84, 
        60, 
        85, 
        86, 
        4, 
        87, 
        88, 
        60, 
        89, 
        90, 
        1, 
        91, 
        92, 
        60, 
        93, 
        94, 
        95, 
        96, 
        97, 
        98, 
        99, 
        100, 
        95, 
        101, 
        102, 
        60, 
        103, 
        104, 
        95, 
        105, 
        106, 
        98, 
        107, 
        108, 
        95, 
        109, 
        110, 
        60, 
        111, 
        112, 
        95, 
        113, 
        114, 
        98, 
        115, 
        116, 
        95, 
        117, 
        118, 
        60, 
        119, 
        120, 
        95, 
        121, 
        122, 
        98, 
        60, 
        123, 
        124, 
        125, 
        126, 
        127, 
        128, 
        98, 
        4, 
        129, 
        130, 
        60, 
        131, 
        132, 
        1, 
        133, 
        134, 
        98, 
        135, 
        136, 
        1, 
        137, 
        138, 
        60, 
        139, 
        140, 
        1, 
        4, 
        141, 
        142, 
        95, 
        98, 
        143, 
        144, 
        95, 
        1, 
        145, 
        146, 
        11, 
        147, 
        148, 
        1, 
        149, 
        150, 
        11, 
        151, 
        152, 
        1, 
        153, 
        154, 
        11, 
        155, 
        156, 
        1, 
        11, 
        157, 
        158, 
        95, 
        60
      ]
    ]
  }, 
  "node_row_ptr": [
    0, 
    1, 
    2, 
    3, 
    4, 
    5, 
    6, 
    7, 
    8, 
    9, 
    10, 
    11, 
    12, 
    13, 
    14, 
    15, 
    16, 
    17, 
    18, 
    19, 
    20, 
    21, 
    22, 
    23, 
    24, 
    25, 
    26, 
    27, 
    28, 
    29, 
    30, 
    31, 
    32, 
    33, 
    34, 
    35, 
    36, 
    37, 
    38, 
    39, 
    40, 
    41, 
    42, 
    43, 
    44, 
    45, 
    46, 
    47, 
    48, 
    49, 
    50, 
    51, 
    52, 
    53, 
    54, 
    55, 
    56, 
    57, 
    58, 
    59, 
    60, 
    61, 
    62, 
    63, 
    64, 
    65, 
    66, 
    67, 
    68, 
    69, 
    70, 
    71, 
    72, 
    73, 
    74, 
    75, 
    76, 
    77, 
    78, 
    79, 
    80, 
    81, 
    82, 
    83, 
    84, 
    85, 
    86, 
    87, 
    88, 
    89, 
    90, 
    91, 
    92, 
    93, 
    94, 
    95, 
    96, 
    97, 
    98, 
    99, 
    100, 
    101, 
    102, 
    103, 
    104, 
    105, 
    106, 
    107, 
    108, 
    109, 
    110, 
    111, 
    112, 
    113, 
    114, 
    115, 
    116, 
    117, 
    118, 
    119, 
    120, 
    121, 
    122, 
    123, 
    124, 
    125, 
    126, 
    127, 
    128, 
    129, 
    130, 
    131, 
    132, 
    133, 
    134, 
    135, 
    136, 
    137, 
    138, 
    139, 
    140, 
    141, 
    142, 
    143, 
    144, 
    145, 
    146, 
    147, 
    148, 
    149, 
    150, 
    151, 
    152, 
    153, 
    154, 
    155, 
    156, 
    157, 
    158, 
    159, 
    160, 
    161, 
    162, 
    163, 
    164, 
    165, 
    166, 
    167, 
    168, 
    169, 
    170, 
    171, 
    172, 
    173, 
    174, 
    175, 
    176, 
    177, 
    178, 
    179, 
    180, 
    181, 
    182, 
    183, 
    184, 
    185, 
    186, 
    187, 
    188, 
    189, 
    190, 
    191, 
    192, 
    193, 
    194, 
    195, 
    196, 
    197, 
    198, 
    199, 
    200, 
    201, 
    202, 
    203, 
    204, 
    205, 
    206, 
    207, 
    208, 
    209, 
    210, 
    211, 
    212, 
    213, 
    214, 
    215, 
    216, 
    217, 
    218, 
    219, 
    220, 
    221, 
    222, 
    223, 
    224, 
    225, 
    226, 
    227, 
    228, 
    229, 
    230, 
    231, 
    232, 
    233, 
    234, 
    235
  ]
}