{
  "nodes": [
    {
      "op": "null", 
      "name": "input_1", 
      "inputs": []
    }, 
    {
      "op": "tvm_op", 
      "name": "tvmgen_default_fused_transpose_layout_transform", 
      "attrs": {
        "num_outputs": "1", 
        "src_layout": "NCHW", 
        "flatten_data": "0", 
        "dst_layout": "NCHW3c", 
        "hash": "7d0e552be37c872e", 
        "func_name": "tvmgen_default_fused_transpose_layout_transform", 
        "num_inputs": "1"
      }, 
      "inputs": [
        [
          0, 
          0, 
          0
        ]
      ]
    }, 
    {
      "op": "null", 
      "name": "p0", 
      "inputs": []
    }, 
    {
      "op": "null", 
      "name": "p1", 
      "inputs": []
    }, 
    {
      "op": "tvm_op", 
      "name": "tvmgen_default_fused_nn_contrib_conv2d_NCHWc_add_nn_leaky_relu", 
      "attrs": {
        "num_outputs": "1", 
        "num_inputs": "3", 
        "data_layout": "NCHW3c", 
        "kernel_layout": "OIHW3i4o", 
        "hash": "f0ea8e81fdc1f9e7", 
        "func_name": "tvmgen_default_fused_nn_contrib_conv2d_NCHWc_add_nn_leaky_relu", 
        "out_layout": "NCHW4c", 
        "flatten_data": "0"
      }, 
      "inputs": [
        [
          1, 
          0, 
          0
        ], 
        [
          2, 
          0, 
          0
        ], 
        [
          3, 
          0, 
          0
        ]
      ]
    }, 
    {
      "op": "tvm_op", 
      "name": "tvmgen_default_fused_nn_max_pool2d", 
      "attrs": {
        "num_outputs": "1", 
        "out_layout": "", 
        "hash": "86a909129a5a8fd2", 
        "func_name": "tvmgen_default_fused_nn_max_pool2d", 
        "layout": "NCHW4c", 
        "flatten_data": "0", 
        "num_inputs": "1"
      }, 
      "inputs": [
        [
          4, 
          0, 
          0
        ]
      ]
    }, 
    {
      "op": "null", 
      "name": "p2", 
      "inputs": []
    }, 
    {
      "op": "null", 
      "name": "p3", 
      "inputs": []
    }, 
    {
      "op": "tvm_op", 
      "name": "tvmgen_default_fused_nn_contrib_conv2d_NCHWc_add_nn_leaky_relu_1", 
      "attrs": {
        "num_outputs": "1", 
        "num_inputs": "3", 
        "data_layout": "NCHW4c", 
        "kernel_layout": "OIHW4i4o", 
        "hash": "5267f1b152039530", 
        "func_name": "tvmgen_default_fused_nn_contrib_conv2d_NCHWc_add_nn_leaky_relu_1", 
        "out_layout": "NCHW4c", 
        "flatten_data": "0"
      }, 
      "inputs": [
        [
          5, 
          0, 
          0
        ], 
        [
          6, 
          0, 
          0
        ], 
        [
          7, 
          0, 
          0
        ]
      ]
    }, 
    {
      "op": "tvm_op", 
      "name": "tvmgen_default_fused_nn_max_pool2d_1", 
      "attrs": {
        "num_outputs": "1", 
        "out_layout": "", 
        "hash": "34be699a76f3dc26", 
        "func_name": "tvmgen_default_fused_nn_max_pool2d_1", 
        "layout": "NCHW4c", 
        "flatten_data": "0", 
        "num_inputs": "1"
      }, 
      "inputs": [
        [
          8, 
          0, 
          0
        ]
      ]
    }, 
    {
      "op": "null", 
      "name": "p4", 
      "inputs": []
    }, 
    {
      "op": "null", 
      "name": "p5", 
      "inputs": []
    }, 
    {
      "op": "tvm_op", 
      "name": "tvmgen_default_fused_nn_contrib_conv2d_NCHWc_add_nn_leaky_relu_2", 
      "attrs": {
        "num_outputs": "1", 
        "num_inputs": "3", 
        "data_layout": "NCHW4c", 
        "kernel_layout": "OIHW4i4o", 
        "hash": "69bf0dedc8d51ac7", 
        "func_name": "tvmgen_default_fused_nn_contrib_conv2d_NCHWc_add_nn_leaky_relu_2", 
        "out_layout": "NCHW4c", 
        "flatten_data": "0"
      }, 
      "inputs": [
        [
          9, 
          0, 
          0
        ], 
        [
          10, 
          0, 
          0
        ], 
        [
          11, 
          0, 
          0
        ]
      ]
    }, 
    {
      "op": "tvm_op", 
      "name": "tvmgen_default_fused_nn_max_pool2d_2", 
      "attrs": {
        "num_outputs": "1", 
        "out_layout": "", 
        "hash": "ee8c883fdf6e0be5", 
        "func_name": "tvmgen_default_fused_nn_max_pool2d_2", 
        "layout": "NCHW4c", 
        "flatten_data": "0", 
        "num_inputs": "1"
      }, 
      "inputs": [
        [
          12, 
          0, 
          0
        ]
      ]
    }, 
    {
      "op": "null", 
      "name": "p6", 
      "inputs": []
    }, 
    {
      "op": "null", 
      "name": "p7", 
      "inputs": []
    }, 
    {
      "op": "tvm_op", 
      "name": "tvmgen_default_fused_nn_contrib_conv2d_NCHWc_add_nn_leaky_relu_3", 
      "attrs": {
        "num_outputs": "1", 
        "num_inputs": "3", 
        "data_layout": "NCHW4c", 
        "kernel_layout": "OIHW4i4o", 
        "hash": "3b17f6b5d441cfec", 
        "func_name": "tvmgen_default_fused_nn_contrib_conv2d_NCHWc_add_nn_leaky_relu_3", 
        "out_layout": "NCHW4c", 
        "flatten_data": "0"
      }, 
      "inputs": [
        [
          13, 
          0, 
          0
        ], 
        [
          14, 
          0, 
          0
        ], 
        [
          15, 
          0, 
          0
        ]
      ]
    }, 
    {
      "op": "tvm_op", 
      "name": "tvmgen_default_fused_nn_max_pool2d_3", 
      "attrs": {
        "num_outputs": "1", 
        "out_layout": "", 
        "hash": "947f990495fec935", 
        "func_name": "tvmgen_default_fused_nn_max_pool2d_3", 
        "layout": "NCHW4c", 
        "flatten_data": "0", 
        "num_inputs": "1"
      }, 
      "inputs": [
        [
          16, 
          0, 
          0
        ]
      ]
    }, 
    {
      "op": "null", 
      "name": "p8", 
      "inputs": []
    }, 
    {
      "op": "null", 
      "name": "p9", 
      "inputs": []
    }, 
    {
      "op": "tvm_op", 
      "name": "tvmgen_default_fused_nn_contrib_conv2d_NCHWc_add_nn_leaky_relu_4", 
      "attrs": {
        "num_outputs": "1", 
        "num_inputs": "3", 
        "data_layout": "NCHW4c", 
        "kernel_layout": "OIHW4i4o", 
        "hash": "e993273a99fd994e", 
        "func_name": "tvmgen_default_fused_nn_contrib_conv2d_NCHWc_add_nn_leaky_relu_4", 
        "out_layout": "NCHW4c", 
        "flatten_data": "0"
      }, 
      "inputs": [
        [
          17, 
          0, 
          0
        ], 
        [
          18, 
          0, 
          0
        ], 
        [
          19, 
          0, 
          0
        ]
      ]
    }, 
    {
      "op": "tvm_op", 
      "name": "tvmgen_default_fused_nn_max_pool2d_4", 
      "attrs": {
        "num_outputs": "1", 
        "out_layout": "", 
        "hash": "2bf1e5a02cde2bac", 
        "func_name": "tvmgen_default_fused_nn_max_pool2d_4", 
        "layout": "NCHW4c", 
        "flatten_data": "0", 
        "num_inputs": "1"
      }, 
      "inputs": [
        [
          20, 
          0, 
          0
        ]
      ]
    }, 
    {
      "op": "null", 
      "name": "p10", 
      "inputs": []
    }, 
    {
      "op": "null", 
      "name": "p11", 
      "inputs": []
    }, 
    {
      "op": "tvm_op", 
      "name": "tvmgen_default_fused_nn_contrib_conv2d_NCHWc_add_nn_leaky_relu_5", 
      "attrs": {
        "num_outputs": "1", 
        "num_inputs": "3", 
        "data_layout": "NCHW4c", 
        "kernel_layout": "OIHW4i4o", 
        "hash": "93fb0c5d052aac28", 
        "func_name": "tvmgen_default_fused_nn_contrib_conv2d_NCHWc_add_nn_leaky_relu_5", 
        "out_layout": "NCHW4c", 
        "flatten_data": "0"
      }, 
      "inputs": [
        [
          21, 
          0, 
          0
        ], 
        [
          22, 
          0, 
          0
        ], 
        [
          23, 
          0, 
          0
        ]
      ]
    }, 
    {
      "op": "tvm_op", 
      "name": "tvmgen_default_fused_nn_max_pool2d_5", 
      "attrs": {
        "num_outputs": "1", 
        "out_layout": "", 
        "hash": "df65af37c3d6695c", 
        "func_name": "tvmgen_default_fused_nn_max_pool2d_5", 
        "layout": "NCHW4c", 
        "flatten_data": "0", 
        "num_inputs": "1"
      }, 
      "inputs": [
        [
          24, 
          0, 
          0
        ]
      ]
    }, 
    {
      "op": "null", 
      "name": "p12", 
      "inputs": []
    }, 
    {
      "op": "null", 
      "name": "p13", 
      "inputs": []
    }, 
    {
      "op": "tvm_op", 
      "name": "tvmgen_default_fused_nn_contrib_conv2d_NCHWc_add_nn_leaky_relu_6", 
      "attrs": {
        "num_outputs": "1", 
        "num_inputs": "3", 
        "data_layout": "NCHW4c", 
        "kernel_layout": "OIHW4i4o", 
        "hash": "69249bbd6011705d", 
        "func_name": "tvmgen_default_fused_nn_contrib_conv2d_NCHWc_add_nn_leaky_relu_6", 
        "out_layout": "NCHW4c", 
        "flatten_data": "0"
      }, 
      "inputs": [
        [
          25, 
          0, 
          0
        ], 
        [
          26, 
          0, 
          0
        ], 
        [
          27, 
          0, 
          0
        ]
      ]
    }, 
    {
      "op": "null", 
      "name": "p14", 
      "inputs": []
    }, 
    {
      "op": "null", 
      "name": "p15", 
      "inputs": []
    }, 
    {
      "op": "tvm_op", 
      "name": "tvmgen_default_fused_nn_contrib_conv2d_NCHWc_add_nn_leaky_relu_7", 
      "attrs": {
        "num_outputs": "1", 
        "num_inputs": "3", 
        "data_layout": "NCHW4c", 
        "kernel_layout": "OIHW4i4o", 
        "hash": "f8f202ecf29cd44a", 
        "func_name": "tvmgen_default_fused_nn_contrib_conv2d_NCHWc_add_nn_leaky_relu_7", 
        "out_layout": "NCHW4c", 
        "flatten_data": "0"
      }, 
      "inputs": [
        [
          28, 
          0, 
          0
        ], 
        [
          29, 
          0, 
          0
        ], 
        [
          30, 
          0, 
          0
        ]
      ]
    }, 
    {
      "op": "null", 
      "name": "p16", 
      "inputs": []
    }, 
    {
      "op": "null", 
      "name": "p17", 
      "inputs": []
    }, 
    {
      "op": "tvm_op", 
      "name": "tvmgen_default_fused_nn_contrib_conv2d_NCHWc_add_nn_leaky_relu_51", 
      "attrs": {
        "num_outputs": "1", 
        "num_inputs": "3", 
        "data_layout": "NCHW4c", 
        "kernel_layout": "OIHW4i4o", 
        "hash": "93fb0c5d052aac28", 
        "func_name": "tvmgen_default_fused_nn_contrib_conv2d_NCHWc_add_nn_leaky_relu_5", 
        "out_layout": "NCHW4c", 
        "flatten_data": "0"
      }, 
      "inputs": [
        [
          31, 
          0, 
          0
        ], 
        [
          32, 
          0, 
          0
        ], 
        [
          33, 
          0, 
          0
        ]
      ]
    }, 
    {
      "op": "tvm_op", 
      "name": "tvmgen_default_fused_layout_transform", 
      "attrs": {
        "num_outputs": "1", 
        "src_layout": "NCHW4c", 
        "flatten_data": "0", 
        "dst_layout": "NCHW2c", 
        "hash": "a19bdb7a3d24ffda", 
        "func_name": "tvmgen_default_fused_layout_transform", 
        "num_inputs": "1"
      }, 
      "inputs": [
        [
          34, 
          0, 
          0
        ]
      ]
    }, 
    {
      "op": "null", 
      "name": "p18", 
      "inputs": []
    }, 
    {
      "op": "null", 
      "name": "p19", 
      "inputs": []
    }, 
    {
      "op": "tvm_op", 
      "name": "tvmgen_default_fused_nn_contrib_conv2d_NCHWc_add", 
      "attrs": {
        "num_outputs": "1", 
        "num_inputs": "3", 
        "out_layout": "NCHW3c", 
        "kernel_layout": "OIHW2i3o", 
        "hash": "ceaad6d9b88aed45", 
        "func_name": "tvmgen_default_fused_nn_contrib_conv2d_NCHWc_add", 
        "data_layout": "NCHW2c", 
        "flatten_data": "0"
      }, 
      "inputs": [
        [
          35, 
          0, 
          0
        ], 
        [
          36, 
          0, 
          0
        ], 
        [
          37, 
          0, 
          0
        ]
      ]
    }, 
    {
      "op": "tvm_op", 
      "name": "tvmgen_default_fused_layout_transform_transpose", 
      "attrs": {
        "num_outputs": "1", 
        "src_layout": "NCHW3c", 
        "flatten_data": "0", 
        "dst_layout": "NCHW", 
        "hash": "d84e5e5bd0e538ce", 
        "func_name": "tvmgen_default_fused_layout_transform_transpose", 
        "num_inputs": "1"
      }, 
      "inputs": [
        [
          38, 
          0, 
          0
        ]
      ]
    }, 
    {
      "op": "null", 
      "name": "p20", 
      "inputs": []
    }, 
    {
      "op": "null", 
      "name": "p21", 
      "inputs": []
    }, 
    {
      "op": "tvm_op", 
      "name": "tvmgen_default_fused_nn_contrib_conv2d_NCHWc_add_nn_leaky_relu_8", 
      "attrs": {
        "num_outputs": "1", 
        "num_inputs": "3", 
        "data_layout": "NCHW4c", 
        "kernel_layout": "OIHW4i4o", 
        "hash": "0ffc6c475532b95c", 
        "func_name": "tvmgen_default_fused_nn_contrib_conv2d_NCHWc_add_nn_leaky_relu_8", 
        "out_layout": "NCHW4c", 
        "flatten_data": "0"
      }, 
      "inputs": [
        [
          31, 
          0, 
          0
        ], 
        [
          40, 
          0, 
          0
        ], 
        [
          41, 
          0, 
          0
        ]
      ]
    }, 
    {
      "op": "tvm_op", 
      "name": "tvmgen_default_fused_layout_transform_image_resize2d_layout_transform_concatenate_layout_transf_1bf4794317454c42_", 
      "attrs": {
        "num_outputs": "1", 
        "num_inputs": "2", 
        "layout": "NCHW", 
        "src_layout": "NCHW", 
        "flatten_data": "0", 
        "dst_layout": "NCHW4c", 
        "hash": "c9e1bdf533ceeb28", 
        "func_name": "tvmgen_default_fused_layout_transform_image_resize2d_layout_transform_concatenate_layout_transf_1bf4794317454c42_"
      }, 
      "inputs": [
        [
          42, 
          0, 
          0
        ], 
        [
          20, 
          0, 
          0
        ]
      ]
    }, 
    {
      "op": "null", 
      "name": "p22", 
      "inputs": []
    }, 
    {
      "op": "null", 
      "name": "p23", 
      "inputs": []
    }, 
    {
      "op": "tvm_op", 
      "name": "tvmgen_default_fused_nn_contrib_conv2d_NCHWc_add_nn_leaky_relu_9", 
      "attrs": {
        "num_outputs": "1", 
        "num_inputs": "3", 
        "data_layout": "NCHW4c", 
        "kernel_layout": "OIHW4i4o", 
        "hash": "792538107b6eb1e5", 
        "func_name": "tvmgen_default_fused_nn_contrib_conv2d_NCHWc_add_nn_leaky_relu_9", 
        "out_layout": "NCHW4c", 
        "flatten_data": "0"
      }, 
      "inputs": [
        [
          43, 
          0, 
          0
        ], 
        [
          44, 
          0, 
          0
        ], 
        [
          45, 
          0, 
          0
        ]
      ]
    }, 
    {
      "op": "tvm_op", 
      "name": "tvmgen_default_fused_layout_transform_1", 
      "attrs": {
        "num_outputs": "1", 
        "src_layout": "NCHW4c", 
        "flatten_data": "0", 
        "dst_layout": "NCHW2c", 
        "hash": "6ec25d51c44f27b7", 
        "func_name": "tvmgen_default_fused_layout_transform_1", 
        "num_inputs": "1"
      }, 
      "inputs": [
        [
          46, 
          0, 
          0
        ]
      ]
    }, 
    {
      "op": "null", 
      "name": "p24", 
      "inputs": []
    }, 
    {
      "op": "null", 
      "name": "p25", 
      "inputs": []
    }, 
    {
      "op": "tvm_op", 
      "name": "tvmgen_default_fused_nn_contrib_conv2d_NCHWc_add_1", 
      "attrs": {
        "num_outputs": "1", 
        "num_inputs": "3", 
        "data_layout": "NCHW2c", 
        "kernel_layout": "OIHW2i3o", 
        "hash": "0a831a3066f8d22d", 
        "func_name": "tvmgen_default_fused_nn_contrib_conv2d_NCHWc_add_1", 
        "out_layout": "NCHW3c", 
        "flatten_data": "0"
      }, 
      "inputs": [
        [
          47, 
          0, 
          0
        ], 
        [
          48, 
          0, 
          0
        ], 
        [
          49, 
          0, 
          0
        ]
      ]
    }, 
    {
      "op": "tvm_op", 
      "name": "tvmgen_default_fused_layout_transform_transpose_1", 
      "attrs": {
        "num_outputs": "1", 
        "src_layout": "NCHW3c", 
        "flatten_data": "0", 
        "dst_layout": "NCHW", 
        "hash": "49e394f687f0791d", 
        "func_name": "tvmgen_default_fused_layout_transform_transpose_1", 
        "num_inputs": "1"
      }, 
      "inputs": [
        [
          50, 
          0, 
          0
        ]
      ]
    }
  ], 
  "arg_nodes": [
    0, 
    2, 
    3, 
    6, 
    7, 
    10, 
    11, 
    14, 
    15, 
    18, 
    19, 
    22, 
    23, 
    26, 
    27, 
    29, 
    30, 
    32, 
    33, 
    36, 
    37, 
    40, 
    41, 
    44, 
    45, 
    48, 
    49
  ], 
  "heads": [
    [
      39, 
      0, 
      0
    ], 
    [
      51, 
      0, 
      0
    ]
  ], 
  "attrs": {
    "dltype": [
      "list_str", 
      [
        "float32", 
        "float32", 
        "float32", 
        "float32", 
        "float32", 
        "float32", 
        "float32", 
        "float32", 
        "float32", 
        "float32", 
        "float32", 
        "float32", 
        "float32", 
        "float32", 
        "float32", 
        "float32", 
        "float32", 
        "float32", 
        "float32", 
        "float32", 
        "float32", 
        "float32", 
        "float32", 
        "float32", 
        "float32", 
        "float32", 
        "float32", 
        "float32", 
        "float32", 
        "float32", 
        "float32", 
        "float32", 
        "float32", 
        "float32", 
        "float32", 
        "float32", 
        "float32", 
        "float32", 
        "float32", 
        "float32", 
        "float32", 
        "float32", 
        "float32", 
        "float32", 
        "float32", 
        "float32", 
        "float32", 
        "float32", 
        "float32", 
        "float32", 
        "float32", 
        "float32"
      ]
    ], 
    "shape": [
      "list_shape", 
      [
        [1, 416, 416, 3], 
        [1, 1, 416, 416, 3], 
        [4, 1, 3, 3, 3, 4], 
        [1, 4, 1, 1, 4], 
        [1, 4, 416, 416, 4], 
        [1, 4, 208, 208, 4], 
        [8, 4, 3, 3, 4, 4], 
        [1, 8, 1, 1, 4], 
        [1, 8, 208, 208, 4], 
        [1, 8, 104, 104, 4], 
        [16, 8, 3, 3, 4, 4], 
        [1, 16, 1, 1, 4], 
        [1, 16, 104, 104, 4], 
        [1, 16, 52, 52, 4], 
        [32, 16, 3, 3, 4, 4], 
        [1, 32, 1, 1, 4], 
        [1, 32, 52, 52, 4], 
        [1, 32, 26, 26, 4], 
        [64, 32, 3, 3, 4, 4], 
        [1, 64, 1, 1, 4], 
        [1, 64, 26, 26, 4], 
        [1, 64, 13, 13, 4], 
        [128, 64, 3, 3, 4, 4], 
        [1, 128, 1, 1, 4], 
        [1, 128, 13, 13, 4], 
        [1, 128, 13, 13, 4], 
        [256, 128, 3, 3, 4, 4], 
        [1, 256, 1, 1, 4], 
        [1, 256, 13, 13, 4], 
        [64, 256, 1, 1, 4, 4], 
        [1, 64, 1, 1, 4], 
        [1, 64, 13, 13, 4], 
        [128, 64, 3, 3, 4, 4], 
        [1, 128, 1, 1, 4], 
        [1, 128, 13, 13, 4], 
        [1, 256, 13, 13, 2], 
        [10, 256, 1, 1, 2, 3], 
        [1, 10, 1, 1, 3], 
        [1, 10, 13, 13, 3], 
        [1, 13, 13, 30], 
        [32, 64, 1, 1, 4, 4], 
        [1, 32, 1, 1, 4], 
        [1, 32, 13, 13, 4], 
        [1, 96, 26, 26, 4], 
        [64, 96, 3, 3, 4, 4], 
        [1, 64, 1, 1, 4], 
        [1, 64, 26, 26, 4], 
        [1, 128, 26, 26, 2], 
        [10, 128, 1, 1, 2, 3], 
        [1, 10, 1, 1, 3], 
        [1, 10, 26, 26, 3], 
        [1, 26, 26, 30]
      ]
    ], 
    "device_index": [
      "list_int", 
      [
        1, 
        1, 
        1, 
        1, 
        1, 
        1, 
        1, 
        1, 
        1, 
        1, 
        1, 
        1, 
        1, 
        1, 
        1, 
        1, 
        1, 
        1, 
        1, 
        1, 
        1, 
        1, 
        1, 
        1, 
        1, 
        1, 
        1, 
        1, 
        1, 
        1, 
        1, 
        1, 
        1, 
        1, 
        1, 
        1, 
        1, 
        1, 
        1, 
        1, 
        1, 
        1, 
        1, 
        1, 
        1, 
        1, 
        1, 
        1, 
        1, 
        1, 
        1, 
        1
      ]
    ], 
    "storage_id": [
      "list_int", 
      [
        0, 
        1, 
        2, 
        3, 
        4, 
        1, 
        5, 
        6, 
        4, 
        1, 
        7, 
        8, 
        4, 
        1, 
        9, 
        10, 
        4, 
        1, 
        11, 
        12, 
        4, 
        1, 
        13, 
        14, 
        15, 
        1, 
        16, 
        17, 
        15, 
        18, 
        19, 
        1, 
        20, 
        21, 
        15, 
        22, 
        23, 
        24, 
        25, 
        26, 
        27, 
        28, 
        22, 
        1, 
        29, 
        30, 
        15, 
        1, 
        31, 
        32, 
        22, 
        15
      ]
    ]
  }, 
  "node_row_ptr": [
    0, 
    1, 
    2, 
    3, 
    4, 
    5, 
    6, 
    7, 
    8, 
    9, 
    10, 
    11, 
    12, 
    13, 
    14, 
    15, 
    16, 
    17, 
    18, 
    19, 
    20, 
    21, 
    22, 
    23, 
    24, 
    25, 
    26, 
    27, 
    28, 
    29, 
    30, 
    31, 
    32, 
    33, 
    34, 
    35, 
    36, 
    37, 
    38, 
    39, 
    40, 
    41, 
    42, 
    43, 
    44, 
    45, 
    46, 
    47, 
    48, 
    49, 
    50, 
    51, 
    52
  ]
}