{
  "Ethos-U NPU": {
    "custom": {
      "model_name": "",
      "model_dtype": "",
      "image_size": "",
      "model_path": "",
      "strides" : "",
      "anchors" : "",
      "mask" : "",
      "class_name_path" : "custom_model/classes.txt",
      "desired_class_ids" : [],
      "model_type":"",
      "score_threshold": 0.3
    },
    "yolov3": {
      "model_name": "YOLO V3",
      "model_dtype": "Int8",
      "image_size": "416 x 416",
      "model_path": "models/yolov3/yolov3_npu.tflite",
      "strides" : "32,16,8",
      "anchors" : "10,13 16,30 33,23 30,61 62,45 59,119 116,90 156,198 373,326",
      "mask" : "6,7,8 3,4,5 0,1,2",
      "class_name_path" : "classes/classes.txt",
      "desired_class_ids" : [0,1,2,3,4],
      "model_type":"object_detection",
      "score_threshold": 0.495
    },
    "tiny_yolov3": {
      "model_name": "TINY YOLO V3",
      "model_dtype": "Int8",
      "image_size": "416 x 416",
      "model_path":"models/tiny_yolov3/tiny_yolov3_npu.tflite",
      "strides" : "32,16",
      "anchors" : "23,27 37,58 81,82 81,82 135,169 344,319",
      "mask" : "3,4,5 0,1,2",
      "class_name_path" : "classes/classes.txt",
      "desired_class_ids" : [0,1,2,3,4],
      "model_type":"object_detection",
      "score_threshold": 0.3
    },
    "mssd_v1": {
      "model_name": "SSD MOBILENET V1",
      "model_dtype": "Int8",
      "image_size": "300 x 300",
      "model_path": "models/mssd_v1/mssd_v1_npu.tflite",
      "strides" : "",
      "anchors" : "",
      "mask" : "",
      "class_name_path" : "classes/mssd_v1_classes.txt",
      "desired_class_ids" : [1,2,3,4,5],
      "model_type":"object_detection",
      "score_threshold": 0.3
    },
    "mobnet_v2": {
      "model_name": "MOBILENET V2",
      "model_dtype": "Int8",
      "image_size": "224 x 224",
      "model_path": "models/mobnet_v2/mobnet_v2_npu.tflite",
      "strides" : "",
      "anchors" : "",
      "mask" : "",
      "class_name_path" : "classes/ImageNetLabels.txt",
      "model_type":"classification",
      "score_threshold": 0.3
    },
    "mssd_v2": {
      "model_name":"MobileNet SSD V2",
      "model_dtype":"UINT8",
      "image_size":"300 x 300",
      "model_path": "models/mssd_v2/mssd_v2_npu.tflite",
      "strides" : "",
      "anchors" : "",
      "mask" : "",
      "class_name_path" : "classes/90class.txt",
      "desired_class_ids" : [0,1,2,5,7],
      "model_type":"object_detection",
      "score_threshold": 0.3
    },
    "yolov3_mm": {
      "model_name": "YOLO V3",
      "model_dtype": "Int8",
      "image_size": "416 x 416",
      "model_path": "models/yolov3_mm/yolov3_mm_npu.tflite",
      "strides" : "32,16,8",
      "anchors" : "10,13 16,30 33,23 30,61 62,45 59,119 116,90 156,198 373,326",
      "mask" : "6,7,8 3,4,5 0,1,2",
      "class_name_path" : "classes/classes_mm.txt",
      "desired_class_ids" : [0,26,28],
      "model_type":"object_detection",
      "score_threshold": 0.3
    }
  },

  "Cortex-A55 CPU": {
    "yolov3": {
      "model_name": "YOLO V3",
      "model_dtype": "Float32",
      "image_size": "416 x 416",
      "model_path": "models/yolov3/yolov3_cpu.tflite",
      "strides" : "32,16,8",
      "anchors" : "10,13 16,30 33,23 30,61 62,45 59,119 116,90 156,198 373,326",
      "mask" : "6,7,8 3,4,5 0,1,2",
      "class_name_path" : "classes/classes.txt",
      "desired_class_ids" : [0,1,2,3,4],
      "model_type":"object_detection",
      "score_threshold": 0.495
    },
    "tiny_yolov3": {
      "model_name": "TINY YOLO V3",
      "model_dtype": "Float32",
      "image_size": "416 x 416" ,
      "model_path": "models/tiny_yolov3/tiny_yolov3_cpu.tflite",
      "strides" : "32,16",
      "anchors" : "23,27 37,58 81,82 81,82 135,169 344,319",
      "mask" : "3,4,5 0,1,2",
      "class_name_path" : "classes/classes.txt",
      "desired_class_ids" : [0,1,2,3,4],
      "model_type":"object_detection",
      "score_threshold": 0.3
    },
    "mssd_v1": {
      "model_name": "SSD MOBILENET V1",
      "model_dtype": "int8",
      "image_size": "300 x 300",
      "model_path": "models/mssd_v1/mssd_v1_cpu.tflite",
      "strides" : "",
      "anchors" : "",
      "mask" : "",
      "class_name_path" : "classes/mssd_v1_classes.txt",
      "desired_class_ids" : [1,2,3,4,5],
      "model_type":"object_detection",
      "score_threshold": 0.3
    },
    "mobnet_v2": {
      "model_name": "MOBILENET V2",
      "model_dtype": "Int8",
      "image_size": "224 x 224",
      "model_path": "models/mobnet_v2/mobnet_v2_cpu.tflite",
      "strides" : "",
      "anchors" : "",
      "mask" : "",
      "class_name_path" : "classes/ImageNetLabels.txt",
      "score_threshold": 0.3,
      "model_type":"classification",
      "top_classes_count":5
    },
    "mssd_v2": {
      "model_name":"MobileNet SSD V2",
      "model_dtype":"Uint8",
      "image_size":"300 x 300",
      "model_path": "models/mssd_v2/mssd_v2_cpu.tflite",
      "strides" : "",
      "anchors" : "",
      "mask" : "",
      "class_name_path" : "classes/90class.txt",
      "desired_class_ids" : [0,1,2,5,7],
      "model_type":"object_detection",
      "score_threshold": 0.3
    },
    "yolov3_mm": {
      "model_name": "YOLO V3",
      "model_dtype": "FLoat32",
      "image_size": "416 x 416",
      "model_path": "models/yolov3_mm/yolov3_mm_cpu.tflite",
      "strides" : "32,16,8",
      "anchors" : "10,13 16,30 33,23 30,61 62,45 59,119 116,90 156,198 373,326",
      "mask" : "6,7,8 3,4,5 0,1,2",
      "class_name_path" : "classes/classes_mm.txt",
      "desired_class_ids" : [0,26,28],
      "model_type":"object_detection",
      "score_threshold": 0.3
    }
  }
}
