[
  {
    "name": "Peanut butter"
  },
  {
    "name": "Tuna"
  },
  {
    "name": "Cereal"
  },
  {
    "name": "Pasta"
  },
  {
    "name": "Pasta sauce"
  },
  {
    "name": "Soup"
  },
  {
    "name": "Canned fruit"
  },
  {
    "name": "Canned vegetables"
  }
]