{
    "name": "Node.js",
	"build": {
	  "dockerfile": "Dockerfile",
	  "args": { "VARIANT": "18" }
	},
  
	"settings": {
	  "files.insertFinalNewline": true,
	  "files.trimFinalNewlines": true,
	  "editor.defaultFormatter": "esbenp.prettier-vscode",
	  "[javascript]": {
		"editor.defaultFormatter": "esbenp.prettier-vscode"
	  }
	},
  
	"extensions": [
		"dbaeumer.vscode-eslint",
		"arjun.swagger-viewer",
		"streetsidesoftware.code-spell-checker",
		"yzhang.markdown-all-in-one",
		"DavidAnson.vscode-markdownlint",
		"codezombiech.gitignore",
		"hashhar.gitattributes",
		"timonwong.shellcheck",
		"esbenp.prettier-vscode",
		"stoplight.spectral"
	],
  
	"remoteUser": "node",
	"features": {
	  "git": "os-provided",
	  "docker-in-docker": "20.10"
	}
  }
  