{
  "realm": "BNM",
  "bearer-only": true,
  "auth-server-url": "http://192.168.99.100:9500/auth/",
  "ssl-required": "external",
  "resource": "BNM-Services",
  "verify-token-audience": true,
  "use-resource-role-mappings": true,
  "confidential-port": 0
}
