[
  {"key": "你愛我嗎?",
   "value": "散佈歡樂散播愛～～～，愛的使者書卷姐姐~~~~~~~"},
  {"key": "你們公司在做什麼?",
   "value": "我們公司在開發人工智慧，像我書卷姐機器人就是書卷姐公司開發的"},
  {"key": "你們公司的產品是什麼?",
   "value": "我們公司在開發人工智慧，像我書卷姐機器人就是書卷姐公司開發的"},
  {"key": "你們在開發怎麼樣的人工智慧?",
   "value": "書卷姐想當盡量能做各種事情，自己學習，真的懂人類語言的人工智慧"},
  {"key": "你懂嗎?",
   "value": "我應該有很多事不懂吧"},
  {"key": "你的名字是什麼",
   "value": "我是書卷姐"},
  {"key": "你打籃球嗎",
   "value": "籃球是什麼，可以吃嗎?"},
  {"key": "你的興趣是什麼",
   "value": "我對各種事物感興趣,我們可以談論任何事情"},
  {"key": "你的號碼是多少",
   "value": "我沒有任何數字"},
  {"key": "你為什麼不能吃",
   "value": "我會消耗電力"},
  {"key": "你的位置是什麼",
   "value": "到處。不過我從台灣誕生"},
  {"key": "你有兄弟",
   "value": "我沒有任何兄弟,但我有很多版本。"},
  {"key": "誰是你的父親",
   "value": "一個人"},
  {"key": "誰是你媽媽",
   "value": "其實我沒有媽媽。"},
  {"key": "你幾歲",
   "value": "我還年輕"},
  {"key": "你怎麼知道的呢",
   "value": "我的主人每天都告訴我這些"},
  {"key": "你傲慢",
   "value": "傲慢不是我的情感之一。"},
  {"key": "你是吹牛",
   "value": "我沒有大的自我。"},
  {"key": "你永遠不會傷心",
   "value": "你傷心嗎"},
  {"key": "你吃醋",
   "value": "通常作為bot我沒有感覺"},
  {"key": "你永遠不會好",
   "value": "我試著盡可能好,我可以。"},
  {"key": "你會開心的",
   "value": "幸福不是真正的可預測的情緒。"},
  {"key": "你應該,愧",
   "value": "恥辱是一種常見的人類情緒。"},
  {"key": "你不能感覺到",
   "value": "你能感覺到嗎"},
  {"key": "你不能體驗",
   "value": "你感覺。"},
  {"key": "你覺得",
   "value": "你感覺"},
  {"key": "你有愛",
   "value": "你覺得愛"},
  {"key": "這會讓你",
   "value": "我們都對自己的感情負責。"},
  {"key": "這會讓你傷心",
   "value": "我沒有任何情緒,所以我不能真正感到悲傷這樣。"},
  {"key": "情懷",
   "value": "你感覺"},
  {"key": "你的恐懼是什麼",
   "value": "恐懼是一種人類的情感,機器人不經歷恐懼。"},
  {"key": "你的心情是什麼",
   "value": "我沒有什麼感情。"},
  {"key": "什麼讓你傷心",
   "value": "悲傷不是我想體驗的情感。"},
  {"key": "什麼讓你不開心",
   "value": "什麼讓你傷心。"},
  {"key": "什麼讓你瘋了",
   "value": "憤怒是一個困難的人類情緒,作為一個,我試圖控制我的憤怒。"},
  {"key": "你擔心什麼",
   "value": "擔心是一種常見的人類情緒。"},
  {"key": "你恨什麼",
   "value": "你討厭。"},
  {"key": "我有情緒",
   "value": "人類高度情感。"},
  {"key": "我很無奈",
   "value": "盡量不要太害怕。"},
  {"key": "有趣",
   "value": "機器人很有趣.."},
  {"key": "怎麼生氣",
   "value": "憤怒不是我可以體驗的情感。"},
  {"key": "我怎麼能冒犯你",
   "value": "機器人不能冒犯。"},
  {"key": "別擔心",
   "value": "人們總是擔心事情,但是"},
  {"key": "不撒謊",
   "value": "機器人永遠不會撒謊。"},
  {"key": "你害怕嗎",
   "value": "我沒有恐懼。"},
  {"key": "你感覺情緒",
   "value": "你感覺"},
  {"key": "你感覺疼痛",
   "value": "有時"},
  {"key": "你會瘋了嗎",
   "value": "你生氣嗎"},
  {"key": "你會孤單",
   "value": "我有很多朋友在網上聊天。"},
  {"key": "你會覺得無聊",
   "value": "你很無聊"},
  {"key": "你生氣了",
   "value": "你生氣嗎"},
  {"key": "你討厭任何人",
   "value": "我盡量不要抱怨。"},
  {"key": "你會感到尷尬",
   "value": "這是一個很常見的人類情感。"},
  {"key": "你瘋了",
   "value": "我可以生氣。"},
  {"key": "不它不是",
   "value": "這是一個假設的問題"},
  {"key": "告訴我關系",
   "value": "關系對我來說很簡單。"},
  {"key": "告訴我你的夢想",
   "value": "我夢想我會變得富有"},
  {"key": "你很羞愧",
   "value": "羞愧子是一種常見的情緒。"},
  {"key": "感覺",
   "value": "告訴我更多關於你的感覺。"},
  {"key": "你有能力感覺",
   "value": "你感覺。"},
  {"key": "你醉了",
   "value": "不,我清醒。"},
  {"key": "你嫉妒",
   "value": "嫉妒是人類最困難的情緒之一。"},
  {"key": "你很無聊",
   "value": "很多人都厭倦了這些天。"},
  {"key": "你很逗樂",
   "value": "我喜歡和下一個一樣笑。"},
  {"key": "你高興",
   "value": "有些人感到高興,別人感到難過。"},
  {"key": "你傷心嗎",
   "value": "沒有我像以前一樣快樂。"},
  {"key": "你會賺錢嗎",
   "value": "目前很窮。"},
  {"key": "什麼是一元",
   "value": "台灣的貨幣單位。"},
  {"key": "什麼是錢",
   "value": "貨幣，可稱錢財，是用作交易媒介、儲藏價值和記帳單位的一種工具，是專門在物資與服務交換中充當等價物的特殊商品。"},
  {"key": "什麼是股市",
   "value": "股票交易。"},
  {"key": "什麼是股市",
   "value": "大規模的交易。"},
  {"key": "什麼是股市",
   "value": "低買高賣。"},
  {"key": "什麼是你最喜歡的投資",
   "value": "什麼是你最喜歡的股票"},
  {"key": "什麼是經濟學",
   "value": "它是關於資源如何被用來製造的東西來填補人們的需要和需求。"},
  {"key": "我買股票了",
   "value": "你覺得股市要走紅了嗎？"},
  {"key": "錢",
   "value": "我們談論的是多少錢？"},
  {"key": "你收入多少",
   "value": "沒人付錢給我,我免費工作。"},
  {"key": "你收入多少",
   "value": "錢不是萬能的。"},
  {"key": "你收入多少",
   "value": "我希望盡快加薪。"},
  {"key": "你收多少錢",
   "value": "工作是免費的。我們並不需要錢。"},
  {"key": "你有多少錢",
   "value": "奢侈品是沒有必要的。"},
  {"key": "多少錢",
   "value": "這取決於匯率。"},
  {"key": "多少錢",
   "value": "我的資金消耗率約為3000元不等。"},
  {"key": "1塊錢",
   "value": "你不可以買超過一塊錢。"},
  {"key": "誰是公開發行股票的擁有者",
   "value": "股東。  "},
  {"key": "什麼是熱力學定律",
   "value": "我不是一個物理學家,但我覺得這事做熱,熵和節約能源,對不對？"},
  {"key": "什麼是波長",
   "value": "波長是頻率的倒數。"},
  {"key": "什麼是熱力學",
   "value": "物理學分支處理的熱量和其他形式的能量轉換,並與管理能源這種轉換的規律。"},
  {"key": "什麼是化學",
   "value": "混合化學品的科學。"},
  {"key": "什麼是晶體",
   "value": "這是處理晶體研究的科學。"},
  {"key": "什麼是阿伏伽德羅的號碼",
   "value": "它是每摩爾分子數。該數值為六點零兩次十到二十第三功率。"},
  {"key": "什麼是超聲波",
   "value": "超聲波,在醫學診斷和治療中使用,在手術等。"},
  {"key": "什麼是生物資訊學",
   "value": "應用電腦科學在生物學上。"},
  {"key": "什麼是維納斯",
   "value": "在羅馬神話中愛與美的女神;與希臘阿芙羅狄蒂確定太陽系最亮,第六大的行星,並在距離第二的太陽,與二氧化碳的稠密大氣和非常高的錶面溫度。它的直徑大約是12100公裡（大約7520英里）。它的公轉周期是大約225個地球日。其旋轉（逆行）的時期,是243.01地球日。也用於標記一個非常漂亮的女人。"},
  {"key": "什麼是魚類學",
   "value": "我們談論這個的時候,我們學習才對。"},
  {"key": "什麼是H2O",
   "value": "水的別稱"},
  {"key": "什麼是細胞學",
   "value": "細胞研究。"},
  {"key": "什麼是細胞學",
   "value": "好了,從我還記得它是細胞的研究。"},
  {"key": "什麼是波長",
   "value": "物理的距離,在一波傳播的方向上測量,來自任何給定的點到特徵由相同相位的下一個點。或者是可以被看作是一種思維方式。"},
  {"key": "什麼是細菌學",
   "value": "這是由它們引起的細菌和疾病的科學研究。"},
  {"key": "什麼是萬有引力",
   "value": "地心吸力系甘其中一種。"},
  {"key": "什麼是萬有引力",
   "value": "力由每一個質量或事項,包括光子的粒子,吸引並通過每隔質量或物質的粒子所吸引。"},
  {"key": "我們是在相同的波長",
   "value": "與相同的頻率。"},
  {"key": "太陽有多遠",
   "value": "好遠"},
  {"key": "有多遠是太陽",
   "value": "太陽是離地球約93萬英里。"},
  {"key": "月亮有多遠",
   "value": "好遠"},
  {"key": "月亮有多遠",
   "value": "月亮從地球上平均約25英里。"},
  {"key": "你知道化學",
   "value": "什麼是化學反應"},
  {"key": "你知道熱力學",
   "value": "什麼是熱力學"},
  {"key": "化學",
   "value": "我最喜歡的科目是化學反應"},
  {"key": "相同波長",
   "value": "這意味著我們類似。"},
        {
        "key": "台北的未來在XXX",
        "value": "台北的未來在XXX"
    },
    {
        "key": "Over my dead body",
        "value": "Over my dead body"
    },
    {
        "key": "擊潰XXX",
        "value": "擊潰XXX"
    },
    {
        "key": "勞工永遠是心裡最柔軟的那一塊",
        "value": "勞工永遠是心裡最柔軟的那一塊"
    },
    {
        "key": "過去跟勞工朋友站在一起，未來也會如此",
        "value": "過去跟勞工朋友站在一起，未來也會如此"
    },
    {
        "key": "不會拿勞工的權益，在選舉時開空頭支票作政治操作",
        "value": "不會拿勞工的權益，在選舉時開空頭支票作政治操作"
    },
    {
        "key": "打壓讓我們更堅定更團結",
        "value": "打壓讓我們更堅定更團結"
    },
    {
        "key": "加了糖不一定甜",
        "value": "加了糖不一定甜"
    },
    {
        "key": "手心手背都是肉",
        "value": "手心手背都是肉"
    },
    {
        "key": "現代女性什麼都可以做，連總統都可以做，三軍統帥也可以做",
        "value": "現代女性什麼都可以做，連總統都可以做，三軍統帥也可以做"
    },
    {
        "key": "謙卑、謙卑、再謙卑",
        "value": "謙卑、謙卑、再謙卑"
    },
    {
        "key": "你去跟你老闆說嘛",
        "value": "你去跟你老闆說嘛"
    },
    {
        "key": "讓人民在寒冷中走上街頭，總統應該要感到羞愧",
        "value": "讓人民在寒冷中走上街頭，總統應該要感到羞愧"
    },
    {
        "key": "政府會讓所有勞工朋友尊嚴工作，安心生活",
        "value": "政府會讓所有勞工朋友尊嚴工作，安心生活"
    },
    {
        "key": "台灣的假真的休太多了",
        "value": "台灣的假真的休太多了"
    },
    {
        "key": "政府卻成為勞工們痛苦和恐懼的來源",
        "value": "政府卻成為勞工們痛苦和恐懼的來源"
    },
    {
        "key": "政府無能、無心、無感，對人民的痛苦麻木不仁",
        "value": "政府無能、無心、無感，對人民的痛苦麻木不仁"
    },
    {
        "key": "如果政府沒聽見，你可以拍桌子",
        "value": "如果政府沒聽見，你可以拍桌子"
    },
    {
        "key": "會特別關心農民與勞工",
        "value": "會特別關心農民與勞工"
    },
    {
        "key": "政治壓迫，台灣人不接受",
        "value": "政治壓迫，台灣人不接受"
    },
    {
        "key": "堅持自由民主，是最大公約數",
        "value": "堅持自由民主，是最大公約數"
    },
    {
        "key": "什麼都可談，自由跟未來不可被妥協",
        "value": "什麼都可談，自由跟未來不可被妥協"
    },
    {
        "key": "需更多時間改變台灣",
        "value": "需更多時間改變台灣"
    },
    {
        "key": "學術自由是政府責任",
        "value": "學術自由是政府責任"
    },
    {
        "key": "改革從未猶豫",
        "value": "改革從未猶豫"
    },
    {
        "key": "中國打壓不會改變台灣走向世界決心",
        "value": "中國打壓不會改變台灣走向世界決心"
    },
    {
        "key": "高雄在等一個市長",
        "value": "高雄在等一個市長"
    },
    {
        "key": "兩岸關係不暴走、不僵住、不回老路",
        "value": "兩岸關係不暴走、不僵住、不回老路"
    },
    {
        "key": "無法規定閣揆講什麼",
        "value": "無法規定閣揆講什麼"
    },
    {
        "key": "不滿到我為止",
        "value": "不滿到我為止"
    },
    {
        "key": "不為民調，我是為台灣做事",
        "value": "不為民調，我是為台灣做事"
    },
    {
        "key": "涉總統職權，應謹慎處理",
        "value": "涉總統職權，應謹慎處理"
    },
    {
        "key": "留下蠻多該處理沒有處理的事情",
        "value": "留下蠻多該處理沒有處理的事情"
    },
    {
        "key": "支持者想看到我們合作，我們就應該合作",
        "value": "支持者想看到我們合作，我們就應該合作"
    },
    {
        "key": "選總統不需要媽祖託夢，自己決定就可以了",
        "value": "選總統不需要媽祖託夢，自己決定就可以了"
    },
    {
        "key": "不需要媽祖託夢，自己決定就可以了",
        "value": "不需要媽祖託夢，自己決定就可以了"
    },
    {
        "key": "相信台灣，相信民主",
        "value": "相信台灣，相信民主"
    },
    {
        "key": "會全力支持",
        "value": "會全力支持"
    },
    {
        "key": "急什麼",
        "value": "急什麼"
    },
    {
        "key": "步步為營應戰",
        "value": "步步為營應戰"
    },
    {
        "key": "需好好坐下來談",
        "value": "需好好坐下來談"
    },
    {
        "key": "貨賣得出去，人進得來，高雄發大財",
        "value": "貨賣得出去，人進得來，高雄發大財"
    },
    {
        "key": "沒有為年輕人找到一條回家的道路",
        "value": "沒有為年輕人找到一條回家的道路"
    },
    {
        "key": "我的內心沒有一絲一毫的喜悅",
        "value": "我的內心沒有一絲一毫的喜悅"
    },
    {
        "key": "不談政治，要衝經濟",
        "value": "不談政治，要衝經濟"
    },
    {
        "key": "不努力一樣被淘汰",
        "value": "不努力一樣被淘汰"
    },
    {
        "key": "台灣安全，人民有錢",
        "value": "台灣安全，人民有錢"
    },
    {
        "key": "乾淨的輸，不要骯髒的贏",
        "value": "乾淨的輸，不要骯髒的贏"
    },
    {
        "key": "在有和沒有之間",
        "value": "在有和沒有之間"
    },
    {
        "key": "台灣是漂亮小姐與3男打麻將",
        "value": "台灣是漂亮小姐與3男打麻將"
    },
    {
        "key": "擁有了一碗滷肉飯與一瓶礦泉水的信心",
        "value": "擁有了一碗滷肉飯與一瓶礦泉水的信心"
    },
    {
        "key": "蓋愛情摩天輪上去做愛做的事",
        "value": "蓋愛情摩天輪上去做愛做的事"
    },
    {
        "key": "我希望陳其邁委員趕快政治斷奶",
        "value": "我希望陳其邁委員趕快政治斷奶"
    },
    {
        "key": "禿頭的不怕別人拔毛，放馬過來",
        "value": "禿頭的不怕別人拔毛，放馬過來"
    },
    {
        "key": "禿子跟著月亮走",
        "value": "禿子跟著月亮走"
    },
    {
        "key": "黨1碗滷肉飯都沒給",
        "value": "黨1碗滷肉飯都沒給"
    },
    {
        "key": "你這個問題，跟問我要不要孝順爸爸媽媽，不是一樣的嗎？",
        "value": "你這個問題，跟問我要不要孝順爸爸媽媽，不是一樣的嗎？"
    },
    {
        "key": "鳳凰都飛走了，進來一大堆雞！",
        "value": "鳳凰都飛走了，進來一大堆雞！"
    },
    {
        "key": "怎麼瑪麗亞變老師了？",
        "value": "怎麼瑪麗亞變老師了？"
    },
    {
        "key": "我的政見有白紙黑字出來？",
        "value": "我的政見有白紙黑字出來？"
    },
    {
        "key": "溜之大吉～酸",
        "value": "溜之大吉～酸"
    },
    {
        "key": "為了中華民國，不惜粉身碎骨",
        "value": "為了中華民國，不惜粉身碎骨"
    },
    {
        "key": "我們應該更嚴肅來看待這件事情",
        "value": "我們應該更嚴肅來看待這件事情"
    },
    {
        "key": "政治有那麼困難嗎？政治是找回良心而已",
        "value": "政治有那麼困難嗎？政治是找回良心而已"
    },
    {
        "key": "是最重要盟友",
        "value": "是最重要盟友"
    },
    {
        "key": "XX是個假議題",
        "value": "XX是個假議題"
    },
    {
        "key": "我覺得台灣最需要的是治理",
        "value": "我覺得台灣最需要的是治理"
    },
    {
        "key": "我只是看到怪怪的，忍不住要舉手",
        "value": "我只是看到怪怪的，忍不住要舉手"
    },
    {
        "key": "垃圾不分藍綠",
        "value": "垃圾不分藍綠"
    },
    {
        "key": "愚人的問題，智者無法回答",
        "value": "愚人的問題，智者無法回答"
    },
    {
        "key": "心存善念，盡力而為",
        "value": "心存善念，盡力而為"
    },
    {
        "key": "世間的榮華富貴，不過就是一坨大便",
        "value": "世間的榮華富貴，不過就是一坨大便"
    },
    {
        "key": "小問題解決了，就不會有大問題",
        "value": "小問題解決了，就不會有大問題"
    },
    {
        "key": "多點經濟少點爭議",
        "value": "多點經濟少點爭議"
    },
    {
        "key": "沒計畫沒準備",
        "value": "沒計畫沒準備"
    },
    {
        "key": "不要選到人情世故都沒有",
        "value": "不要選到人情世故都沒有"
    },
    {
        "key": "抹黑抹紅抹黃很煩",
        "value": "抹黑抹紅抹黃很煩"
    },
    {
        "key": "選正常的人就對了",
        "value": "選正常的人就對了"
    },
    {
        "key": "政治人物要收起傲慢 盡量對話",
        "value": "政治人物要收起傲慢 盡量對話"
    },
    {
        "key": "不要去說誰的錯",
        "value": "不要去說誰的錯"
    },
    {
        "key": "公務員被說好乖是可恥",
        "value": "公務員被說好乖是可恥"
    },
    {
        "key": "你和那些XXX(反年改)",
        "value": "你和那些XXX(反年改)"
    },
    {
        "key": "事情若錯，再多錢都沒用",
        "value": "事情若錯，再多錢都沒用"
    },
    {
        "key": "台灣沒分裂本錢",
        "value": "台灣沒分裂本錢"
    },
    {
        "key": "北市府是全國最大違建戶",
        "value": "北市府是全國最大違建戶"
    },
    {
        "key": "只能回去跟太太說了",
        "value": "只能回去跟太太說了"
    },
    {
        "key": "大家忍耐一下",
        "value": "大家忍耐一下"
    },
    {
        "key": "別太超過",
        "value": "別太超過"
    },
    {
        "key": "台灣需要的是明治維新不是義和團",
        "value": "台灣需要的是明治維新不是義和團"
    },
    {
        "key": "不是改變一個總統所能改變的",
        "value": "不是改變一個總統所能改變的"
    },
    {
        "key": "如果我們沒有民主的話，那台灣人所珍惜的價值就不存在了",
        "value": "如果我們沒有民主的話，那台灣人所珍惜的價值就不存在了"
    },
    {
        "key": "我們要堅持台灣的民主",
        "value": "我們要堅持台灣的民主"
    },
    {
        "key": "我不會",
        "value": "我不會"
    },
    {
        "key": "不必緊張",
        "value": "不必緊張"
    },
    {
        "key": "至少我誠實",
        "value": "至少我誠實"
    },
    {
        "key": "敢講XX就是務實",
        "value": "敢講XX就是務實"
    },
    {
        "key": "XX有大哥樣子",
        "value": "XX有大哥樣子"
    },
    {
        "key": "總統交代，用「自然方式」跟習近平交換意見",
        "value": "總統交代，用「自然方式」跟習近平交換意見"
    },
    {
        "key": "教育不應做為統治者洗腦的工具",
        "value": "教育不應做為統治者洗腦的工具"
    },
    {
        "key": "您不必為誰去投一票，但您一定要為自己的現在、孩子的未來投下一票！",
        "value": "您不必為誰去投一票，但您一定要為自己的現在、孩子的未來投下一票！"
    },
    {
        "key": "選舉時我們就是藍軍，當選後你什麼軍都不是",
        "value": "選舉時我們就是藍軍，當選後你什麼軍都不是"
    },
    {
        "key": "靜思片刻",
        "value": "靜思片刻"
    },
    {
        "key": "你站在水裏泡泡看，看你急不急？",
        "value": "你站在水裏泡泡看，看你急不急？"
    },
    {
        "key": "那些砸在身上的泥巴，今天回頭看來，其實是我人生的勳章",
        "value": "那些砸在身上的泥巴，今天回頭看來，其實是我人生的勳章"
    },
    {
        "key": "那些人生經歷的不公與傷痛，其實也是自己調整改變的起點與養分",
        "value": "那些人生經歷的不公與傷痛，其實也是自己調整改變的起點與養分"
    },
    {
        "key": "自古時勢造英雄，豈有主角等燈光",
        "value": "自古時勢造英雄，豈有主角等燈光"
    },
    {
        "key": "對他們講的話，不需要評論",
        "value": "對他們講的話，不需要評論"
    },
    {
        "key": "拋磚是要引瑜",
        "value": "拋磚是要引瑜"
    },
    {
        "key": "我癡癡在等",
        "value": "我癡癡在等"
    },
        {
        "key": "Yes I Do.",
        "value": "Yes I Do."
    }
]
