[
    {
        "key": "台北的未來在手中",
        "value": "台北的未來在手中"
    },
    {
        "key": "Over my dead body",
        "value": "Over my dead body"
    },
    {
        "key": "不會拿勞工的權益，在選舉時開空頭支票作政治操作",
        "value": "不會拿勞工的權益，在選舉時開空頭支票作政治操作"
    },
    {
        "key": "打壓讓我們更堅定更團結",
        "value": "打壓讓我們更堅定更團結"
    },
    {
        "key": "加了糖不一定甜",
        "value": "加了糖不一定甜"
    },
    {
        "key": "現代女性什麼都可以做，連總統都可以做，三軍統帥也可以做",
        "value": "現代女性什麼都可以做，連總統都可以做，三軍統帥也可以做"
    },
    {
        "key": "謙卑、謙卑、再謙卑",
        "value": "謙卑、謙卑、再謙卑"
    },
    {
        "key": "你去跟你老闆說嘛",
        "value": "你去跟你老闆說嘛"
    },
    {
        "key": "讓人民在寒冷中走上街頭，總統應該要感到羞愧",
        "value": "讓人民在寒冷中走上街頭，總統應該要感到羞愧"
    },
    {
        "key": "政府會讓所有勞工朋友尊嚴工作，安心生活",
        "value": "政府會讓所有勞工朋友尊嚴工作，安心生活"
    },
    {
        "key": "台灣的假真的休太多了",
        "value": "台灣的假真的休太多了"
    },
    {
        "key": "政府卻成為勞工們痛苦和恐懼的來源",
        "value": "政府卻成為勞工們痛苦和恐懼的來源"
    },
    {
        "key": "政府無能、無心、無感，對人民的痛苦麻木不仁",
        "value": "政府無能、無心、無感，對人民的痛苦麻木不仁"
    },
    {
        "key": "如果政府沒聽見，你可以拍桌子",
        "value": "如果政府沒聽見，你可以拍桌子"
    },
    {
        "key": "會特別關心農民與勞工",
        "value": "會特別關心農民與勞工"
    },
    {
        "key": "政治壓迫，台灣人不接受",
        "value": "政治壓迫，台灣人不接受"
    },
    {
        "key": "堅持自由民主，是最大公約數",
        "value": "堅持自由民主，是最大公約數"
    },
    {
        "key": "什麼都可談，自由跟未來不可被妥協",
        "value": "什麼都可談，自由跟未來不可被妥協"
    },
    {
        "key": "需更多時間改變台灣",
        "value": "需更多時間改變台灣"
    },
    {
        "key": "學術自由是政府責任",
        "value": "學術自由是政府責任"
    },
    {
        "key": "改革從未猶豫",
        "value": "改革從未猶豫"
    },
    {
        "key": "中國打壓不會改變台灣走向世界決心",
        "value": "中國打壓不會改變台灣走向世界決心"
    },
    {
        "key": "兩岸關係不暴走、不僵住、不回老路",
        "value": "兩岸關係不暴走、不僵住、不回老路"
    },
    {
        "key": "無法規定閣揆講什麼",
        "value": "無法規定閣揆講什麼"
    },
    {
        "key": "不滿到我為止",
        "value": "不滿到我為止"
    },
    {
        "key": "不為民調，我是為台灣做事",
        "value": "不為民調，我是為台灣做事"
    },
    {
        "key": "涉總統職權，應謹慎處理",
        "value": "涉總統職權，應謹慎處理"
    },
    {
        "key": "留下蠻多該處理沒有處理的事情",
        "value": "留下蠻多該處理沒有處理的事情"
    },
    {
        "key": "支持者想看到我們合作，我們就應該合作",
        "value": "支持者想看到我們合作，我們就應該合作"
    },
    {
        "key": "選總統不需要媽祖託夢，自己決定就可以了",
        "value": "選總統不需要媽祖託夢，自己決定就可以了"
    },
    {
        "key": "不需要媽祖託夢，自己決定就可以了",
        "value": "不需要媽祖託夢，自己決定就可以了"
    },
    {
        "key": "相信台灣，相信民主",
        "value": "相信台灣，相信民主"
    },
    {
        "key": "會全力支持",
        "value": "會全力支持"
    },
    {
        "key": "急什麼",
        "value": "急什麼"
    },
    {
        "key": "步步為營應戰",
        "value": "步步為營應戰"
    },
    {
        "key": "需好好坐下來談",
        "value": "需好好坐下來談"
    },
    {
        "key": "高雄又老又窮，各行各業蕭條的不得了",
        "value": "高雄又老又窮，各行各業蕭條的不得了"
    },
    {
        "key": "一萬個工作機會，我就以身相許，晚上跟你睡覺",
        "value": "一萬個工作機會，我就以身相許，晚上跟你睡覺"
    },
    {
        "key": "貨賣得出去，人進得來，高雄發大財",
        "value": "貨賣得出去，人進得來，高雄發大財"
    },
    {
        "key": "武大郎跟潘金蓮蓋一條棉被",
        "value": "武大郎跟潘金蓮蓋一條棉被"
    },
    {
        "key": "立足台灣、胸懷大陸、放眼世界、征服宇宙",
        "value": "立足台灣、胸懷大陸、放眼世界、征服宇宙"
    },
    {
        "key": "在有和沒有之間",
        "value": "在有和沒有之間"
    },
    {
        "key": "擁有了一碗滷肉飯與一瓶礦泉水的信心",
        "value": "擁有了一碗滷肉飯與一瓶礦泉水的信心"
    },
    {
        "key": "蓋愛情摩天輪上去做愛做的事",
        "value": "蓋愛情摩天輪上去做愛做的事"
    },
    {
        "key": "對我來講都一樣，我們還是全力以赴",
        "value": "對我來講都一樣，我們還是全力以赴"
    },
    {
        "key": "禿頭的不怕別人拔毛，放馬過來",
        "value": "禿頭的不怕別人拔毛，放馬過來"
    },
    {
        "key": "禿子跟著月亮走",
        "value": "禿子跟著月亮走"
    },
    {
        "key": "黨1碗滷肉飯都沒給",
        "value": "黨1碗滷肉飯都沒給"
    },
    {
        "key": "你這個問題，跟問我要不要孝順爸爸媽媽，不是一樣的嗎？",
        "value": "你這個問題，跟問我要不要孝順爸爸媽媽，不是一樣的嗎？"
    },
    {
        "key": "鳳凰都飛走了，進來一大堆雞！",
        "value": "鳳凰都飛走了，進來一大堆雞！"
    },
    {
        "key": "怎麼瑪麗亞變老師了？",
        "value": "怎麼瑪麗亞變老師了？"
    },
    {
        "key": "我的政見有白紙黑字出來？",
        "value": "我的政見有白紙黑字出來？"
    },
    {
        "key": "溜之大吉～酸",
        "value": "溜之大吉～酸"
    },
    {
        "key": "為了中華民國，不惜粉身碎骨",
        "value": "為了中華民國，不惜粉身碎骨"
    },
    {
        "key": "我們應該更嚴肅來看待這件事情",
        "value": "我們應該更嚴肅來看待這件事情"
    },
    {
        "key": "我覺得台灣最需要的是治理",
        "value": "我覺得台灣最需要的是治理"
    },
    {
        "key": "我只是看到怪怪的，忍不住要舉手",
        "value": "我只是看到怪怪的，忍不住要舉手"
    },
    {
        "key": "垃圾不分藍綠",
        "value": "垃圾不分藍綠"
    },
    {
        "key": "愚人的問題，智者無法回答",
        "value": "愚人的問題，智者無法回答"
    },
    {
        "key": "心存善念，盡力而為",
        "value": "心存善念，盡力而為"
    },
    {
        "key": "世間的榮華富貴，不過就是一坨大便",
        "value": "世間的榮華富貴，不過就是一坨大便"
    },
    {
        "key": "小問題解決了，就不會有大問題",
        "value": "小問題解決了，就不會有大問題"
    },
    {
        "key": "多點經濟少點爭議",
        "value": "多點經濟少點爭議"
    },
    {
        "key": "沒計畫沒準備",
        "value": "沒計畫沒準備"
    },
    {
        "key": "不要選到人情世故都沒有",
        "value": "不要選到人情世故都沒有"
    },
    {
        "key": "抹黑抹紅抹黃很煩",
        "value": "抹黑抹紅抹黃很煩"
    },
    {
        "key": "選正常的人就對了",
        "value": "選正常的人就對了"
    },
    {
        "key": "政治人物要收起傲慢 盡量對話",
        "value": "政治人物要收起傲慢 盡量對話"
    },
    {
        "key": "不要去說誰的錯",
        "value": "不要去說誰的錯"
    },
    {
        "key": "公務員被說好乖是可恥",
        "value": "公務員被說好乖是可恥"
    },
    {
        "key": "你和那些反年改",
        "value": "你和那些反年改"
    },
    {
        "key": "事情若錯，再多錢都沒用",
        "value": "事情若錯，再多錢都沒用"
    },
    {
        "key": "台灣沒分裂本錢",
        "value": "台灣沒分裂本錢"
    },
    {
        "key": "北市府是全國最大違建戶",
        "value": "北市府是全國最大違建戶"
    },
    {
        "key": "只能回去跟太太說了",
        "value": "只能回去跟太太說了"
    },
    {
        "key": "大家忍耐一下",
        "value": "大家忍耐一下"
    },
    {
        "key": "別太超過",
        "value": "別太超過"
    },
    {
        "key": "台灣需要的是明治維新不是義和團",
        "value": "台灣需要的是明治維新不是義和團"
    },
    {
        "key": "不是改變一個總統所能改變的",
        "value": "不是改變一個總統所能改變的"
    },
    {
        "key": "如果我們沒有民主的話，那台灣人所珍惜的價值就不存在了",
        "value": "如果我們沒有民主的話，那台灣人所珍惜的價值就不存在了"
    },
    {
        "key": "我們要堅持台灣的民主",
        "value": "我們要堅持台灣的民主"
    },
    {
        "key": "我不會",
        "value": "我不會"
    },
    {
        "key": "不必緊張",
        "value": "不必緊張"
    },
    {
        "key": "至少我誠實",
        "value": "至少我誠實"
    },
    {
        "key": "敢講就是務實",
        "value": "敢講就是務實"
    },
    {
        "key": "1月11日將是「終局之戰」，我期待扮演「獨孤求敗」的角色",
        "value": "1月11日將是「終局之戰」，我期待扮演「獨孤求敗」的角色"
    },
    {
        "key": "有大哥樣子",
        "value": "有大哥樣子"
    },
    {
        "key": "總統交代，用「自然方式」跟習近平交換意見",
        "value": "總統交代，用「自然方式」跟習近平交換意見"
    },
    {
        "key": "教育不應做為統治者洗腦的工具",
        "value": "教育不應做為統治者洗腦的工具"
    },
    {
        "key": "您不必為誰去投一票，但您一定要為自己的現在、孩子的未來投下一票！",
        "value": "您不必為誰去投一票，但您一定要為自己的現在、孩子的未來投下一票！"
    },
    {
        "key": "選舉時我們就是藍軍綠軍紅軍白軍黃軍，當選後你什麼軍都不是",
        "value": "選舉時我們就是藍軍綠軍紅軍白軍黃軍，當選後你什麼軍都不是"
    },
    {
        "key": "靜思片刻",
        "value": "靜思片刻"
    },
    {
        "key": "你站在水裏泡泡看，看你急不急？",
        "value": "你站在水裏泡泡看，看你急不急？"
    },
    {
        "key": "那些砸在身上的泥巴，今天回頭看來，其實是我人生的勳章",
        "value": "那些砸在身上的泥巴，今天回頭看來，其實是我人生的勳章"
    },
    {
        "key": "那些人生經歷的不公與傷痛，其實也是自己調整改變的起點與養分",
        "value": "那些人生經歷的不公與傷痛，其實也是自己調整改變的起點與養分"
    },
    {
        "key": "自古時勢造英雄，豈有主角等燈光",
        "value": "自古時勢造英雄，豈有主角等燈光"
    },
    {
        "key": "對他們講的話，不需要評論",
        "value": "對他們講的話，不需要評論"
    },
    {
        "key": "拋磚是要引瑜",
        "value": "拋磚是要引瑜"
    },
    {
        "key": "我癡癡在等",
        "value": "我癡癡在等"
    }
]
