[
    {
        "fortune": 3,
        "key": "吃拉亞漢堡打九折 ",
        "poem": [
            "如何日高低昂吃 松柏梁園林麓拉 與我語默默默亞 關山川流傳聞漢 片片雲端拱棍堡 何時不知無垠打 承恩波上玄元九 至今人不勝概折",
            "吃次第一萬里長 拉郁金玉女蘿徑 亞愴別離群木落 漢江水驛路絕境 堡捨下有時獨坐 打球咸陽春風景 九曲未已聞猿啼 折盡日何當時令",
            "聖朝廷尉吃版築 雲根柢諺拉疏鐘 一片時輩亞枝花 草樹影入漢武功 翠微微軀堡儘是 故人莫怪打呢蹤 相逢君在九萬年 月蒼梧桐折芳叢",
            "碧虛空餘杭吃諾 何如今日午拉呀 秋雨露白麵亞竹 年少年在天漢家 梧桐花時輩堡懼 十五老大塊打夾 湯衡門十八九華 無一徑繞枝折枷",
            "吃六十二百篇章 拉第一夜深入戶 亞賈生塵埃塵昏 漢上西風帆影入 堡鞏洛陽日夕陽 打船頭一言歸處 九年光彩鳳樓臺 折取得一萬事不",
            "糾吃大漠漠漠漠 孔拉荻花不可以 協亞腐儒衣冠蓋 秦漢江海風雨幾 腿堡肘後生白雲 勾打荻花間無力 十九陌上朱顏色 九折旭日高風起",
            "屠蘇武皇后吃滾 白草堂前程拉汐 去去年少婦亞西 垂楊朱門臨漢帝 美酒杯酒醒堡潔 當時聞夜雨打憩 白蓮花不重九折 知君家書劍折閉",
            "登封疆吃湛湛湛 論兵革拉桃李杜 苦辛勤亞儘是時 山入秦漢路不顧 猶未央堡蛹蟋蟀 寂寂寂打呢歧路 有時向九回風吹 青春欲折花自古",
            "沉沉沉憂患騙吃 古寺門前事蹟拉 悲風蕭蕭蕭條亞 生死生未得知漢 何年年二八紘堡 十年前日夜雪打 塞北望君王八九 白頭白雲天風折",
            "大廈吃誓將何時 耕耘拉棍珊珊珊 迴圈亞夫志未必 追隨漢節還將安 無疆堡按劍門前 獨佔打鼓不遠山 隱映九江水長安 南枝折桂江上丹",
            "勾吃悔不得意未 孔拉癱譬如未能 壺亞相對月白雲 河漢陽洞門秋風 諾堡只應是誰能 浪打俱是天邊城 出九曲如此別有 可折一去不與僧",
            "橘柚吃颱風飄飄 煎熬拉磁翩翩翻 巡狩亞荻花相思 城西漢江上下山 京兆堡捲簾幕中 琵琶打三五湖南 長在九秋風送君 入九折劍歌一帆",
            "況乃知己吃氾濫 送客吟哦拉寵辱 龍鱗甲乙亞勾踐 到處處是漢公主 洋洋洋罐堡乾坤 積雪霜雪打門複 風騷人在九成陰 雨打鼓吹折得古",
            "遠遊俠吃優遊人 不勝概拉蛀斑竹 山雞犬亞浙江海 九重江漢使君如 琥珀棍堡秉燭影 忠孝廉打咸陽烏 今四十九曲江海 時一枝折腰金屋",
            "勾吃儘是一丈夫 盾拉旺段成文章 兔亞憶昨日與君 歸漢使人有時當 滾堡捨下馬上天 雪打窗月明月長 入九月何處處處 摧折得名不堪傷"
        ]
    },
    {
        "fortune": 3,
        "key": "腳底按摩健康養生",
        "poem": [
            "今朝市腳下山水 日更有底扁舟中 峨峨峨按劍門前 狂夫婿摩桐花紅 淅淅淅健顛狂歌 盧橘柚康莊夔龍 白麵擦養親賓館 去年長生在人同",
            "腳不飛鳥自歎息 海底看一望長者 龍鍾按罐瀑布衣 橘柚維摩罐型社 終不知身健等閒 雨雪滿眼睛康樂 意氣清秋毫釐養 生何意何如水色",
            "蛾腳恭聞道路人 澗底巫峽雨露偏 拾按姓名利名利 勾摩八十年豐年 且健筆頭一片石 楔康夔龍門山邊 佔養性本欲知己 人生何人與世間",
            "日腳旺癱匆匆匆 水底紅粉壁畫堂 盾按妊等閒居然 曾摩捲簾不見長 強健柿葉落日相 樂康樂有微茫茫 供養身世人間無 春生塵中人何當",
            "山遠遊衍腳不用 甲第一水底因風 行人寰宇按颱風 珊珊瑚鞭摩天生 千尋常聞健且莫 花枝上小康那能 太白日長養身不 遠相見此生石城"
        ]
    },
    {
        "fortune": 2,
        "key": "下雨就是要打雨傘",
        "poem": [
            "不相見山下流水 高臥雲雷雨濕衣 秋月初成就一朝 猶未知君是無敵 蒼蒼生不要地有 平生何必打鼓一 白日行行雨花落 誰知何妨傘阮籍",
            "下人皆自古今年 雨中峰下人不顧 就一時清涼州城 是無限事亦自古 要自歸來江南國 打門何人間萬物 雨絕世上青雲雨 傘估客來何況複",
            "園桃李白雲初下 東西山有幾多雨 與我亦自從來就 月滿眼前除卻是 二三百戰地久要 何在青雲開闢打 不如可憐今日雨 來無一一朝廷傘",
            "下馬不須知音不 山雨細雨長沙中 歸來就日出門開 憶昨日是神仙翁 牢落日唯要使無 自有淚如雨打宗 此處所依舊山雨 傘姓名不知君同",
            "下天與君心同心 新雨過一片時複 書成就月明年來 應是非是人相顧 天子夜久要匈奴 何處逢花雨打鼓 開顏色如今夜雨 傘併入門前山木"
        ]
    },
    {
        "fortune": 3,
        "key": "吃香蕉是行為藝術 ",
        "poem": [
            "吃鐲譬如相憶昔 花香入楚鄉國門 樹紅蕉斑斑竹徑 清風便是愁殺人 人問我獨行斜月 為我今夜不為塵 長相干戈矛懈藝 術瞿塘水雲無分",
            "帝鄉思量吃淅瀝 春風霜露香雲車 有松根柢蕉駿馬 一夜深好是天河 猶在何人行人稀 終日送君為不得 先生白髮藝慷慨 白衣冠劍術兵戈",
            "不相如相思量吃 南宮中夜深殿香 浮世上青竹帛蕉 月長安得幾曾是 君不同時逢君行 為君自相思君為 誰知今朝昏墊藝 簾幕府中有經術",
            "登高步步障吃酒 臨風清池荷香凝 黃雲車馬蹄蕉花 今年春色正是青 西江城池上行止 五湖山與我為清 悠悠悠悠揚藝滾 西南飛翻經術輕",
            "杜宇宙罐蠵吃酒 黃河水流水香煙 猶未成行邁蕉縫 為報恩不疑是閒 珍重吟詩成行雲 不解攜手自為憐 雲台衡茅茨藝滾 西風波翻經術煎"
        ]
    },
    {
        "fortune": -3,
        "key": "擊潰丁守中 ",
        "poem": [
            "勾擊五湖上天下 答潰棍捲簾卷書 答丁騙趟唧唧唧 能守鐲柴門前途 山中一夜涼風景",
            "風擊壤努力難為 協潰等閒人不相 白丁腐儒生春光 不守分襟懷賢良 樓中聞鶯啼猿鳥",
            "黃葉下淚沾臆擊 白蝙蝠癱旺罐潰 西江南山河畔丁 無奈何年年不守 分明年少微雨中",
            "擊壤但恐是吾師 曾潰婚嫁與他人 歡娛丁丁匹馬行 如此相守道士恩 南北風塵中秋水",
            "擊俠客不凋零落 潰獅子向西山田 丁當門深夜長相 守清明時來年年 中爭奈何如霜雪"
        ]
    },
    {
        "fortune": -2,
        "key": "你去跟你老闆說嘛 ",
        "poem": [
            "滾你喬木落天際 此去已成陰雲生 曾跟凡幾人不知 峽你裴回望雲橫 身老來空寂寂寂 答闆狹斜日西風 見說無多謝家貧 楔嘛素琴尊前峰",
            "花開闢癱你蟋蟀 七十五年去住處 日登龍鍾跟岳陽 夜夢想像你肌骨 豈不知是老身在 雲開闢騙闆歧路 不信難見說長安 轉蓬萊楔嘛澗戶",
            "無人寰你扶桑田 海西南去不須憑 獨佔轎跟氾濫吹 四海棠你颱風輕 何如故老萊宮中 七盤渦闆匹馬卿 莫相見說向此時 骯髒罐嘛瀘水清",
            "綠楊柳陰陰霾你 可見月上客去東 丈夫子孫跟鱸魚 一事蹟你棍嵌空 故人老未見君王 勾闆縱使君不容 說詩客路漸老去 樓閣上皇后楔嘛",
            "芳草青青苔蘚你 相招尋思歸去天 草綠水濱跟採蓮 明朝廷你荷花間 先生老人在天地 蛾闆兄弟子今年 說三百草如何所 一尊前日重瞳嘛"
        ]
    },
    {
        "fortune": -2,
        "key": "夾手手掛急診 ",
        "poem": [
            "鳴玉蟾蜍蛹夾水 今日斜日在手攀 江南飛上玉手持 差池塘水影掛帆 不還同調弦急畔 山寂寂寞趟診壇",
            "蝙蝠夾城中春風 請君手栽樹垂楊 解攜手無端居士 池上掛一年不相 河流急採蓮峰頭 何遜診銀河水鄉",
            "協夾蛀棍鶺鴒原 分手把金碧草木 纖手自得意何處 雲掛朝天意氣不 水急景清光搖落 諾診亦何處是主",
            "出關山夾岸花發 反掌握手去不堪 楊柳垂手自無人 相呼吸掛浙江南 弦管弦急如不得 九重瞳診形影殘",
            "芭蕉夾道有佳期 城下手一萬事不 月滿手攀折桂花 憑高掛漂泊舟入 將何急如春風流 彷徨診川原憲府"
        ]
    },
    {
        "fortune": -2,
        "key": "假休太多 ",
        "poem": [
            "相如何假函穀口 竟何事休明君歸 亦不知太清渭橋 今日無多事不回",
            "有情豈假問西風 莫忘歸休問人人 江流落太素絲管 萬里行多情無塵",
            "滾假問安知今日 來休公方寸心不 歸太平人憶昔年 自多離心知行路",
            "明主人家山不假 風流水雲雨不休 複何事與誰是太 故山水東南山多",
            "東方寸心肝假勾 可惜春日日休公 自有時獨何太清 城南國多情多從"
        ]
    },
    {
        "fortune": -2,
        "key": "溜之大吉 ",
        "poem": [
            "堪愁坐石溜籃輿 三十萬化之有前 與天下有大河漢 苦吟哦蠵吉採蓮",
            "簷溜街西京洛陽 國之人不得長路 為大不回看君不 曾吉咸陽春歸處",
            "江寒溜科第一聲 得見之人情何時 天上大道難相思 事蹟吉潔白露濕",
            "石溜縱橫波上天 君之日月明年光 臨大名相憶昨夜 滾吉語還丹鳳凰",
            "落日寒溜楔芭蕉 青天子之大江漢 年別有大夫君心 秋毫釐吉估客散"
        ]
    },
    {
        "fortune": -2,
        "key": "鳳凰飛走進一堆雞 ",
        "poem": [
            "不可憐雙鳳飛鳥 有幾時輩凰他人 鳳凰樓高飛梁園 長城池邊走馬門 思歸心難進不見 日月落花一行塵 日日長作堆金縷 水精靈山雞飛沉",
            "鳳來往歲歲月夜 勾凰城日已多為 片雲飛揚州人間 風卷舒走無人隨 魂斷腸欲進一去 清秋風煙水一回 水邊城中有雲堆 雞人無不相忘歸",
            "舞鳳城門前山中 鳳凰畢竟無所從 雲飛不歸來去不 拾走筆陣圖形容 先進提攜酒不可 得一時獨向此中 雲堆積水精神女 鬥雞未知不鳴鐘",
            "金鳳書寄書生涯 滾凰城下方丈夫 分飛花落青青樓 奔走風滿青松竹 不進退不為我來 同一聲長在天書 作堆邊月高低頭 天雞唱歌舞來無",
            "寒雨露白鳳舞腰 白石榴裙凰肅肅 春秋風塵飛雨露 射雕胡馬走函谷 為君應難進取次 無事不如一家住 高高低昂堆邊人 幸因茲晨雞聲苦"
        ]
    },
    {
        "fortune": -1,
        "key": "你和那些反年改 ",
        "poem": [
            "江湖上山獨佔你 不知何在雲和雨 相見人別那得見 不顧盼些趟織女 蝙蝠反顧我心中 今年花如此去去 改柿葉落月斜陽",
            "不用兵革你估客 七十五雲和淚看 遊俠客心那知君 猶未勝概些銀漢 年來無垠反顧己 不知有三年不敢 向東流年改茂陵",
            "你豐年來幾回首 人和秋水中庭中 不爭那烽火爐煙 人不復些些梧桐 當軒車馬反正好 芳草青雲一年終 十五馬去年應改",
            "你扁舟中有誰能 和春秋水流不惜 那複能使君王孫 些子何意何所宜 反顧何所思何為 年離別故鄉關西 改捧日日相見說",
            "感慨慷慨你估客 見君子雲和雲勢 無人寰區那知一 非關塞垣些旭日 隨風光輝反顧無 故人生一年不識 漁父子孫改珊瑚"
        ]
    },
    {
        "fortune": -1,
        "key": "垃圾不分藍綠 ",
        "poem": [
            "山河水準垃肌膚 昨日休沐圾相逢 無一夜來不覺春 明月清夜分張燈 相思悠悠藍芸閣 玉壺中生綠苔封",
            "杜鵑垃聰明月中 骨肉圾宋玉管弦 傷心不可知幾回 更有分飛龍門前 還如藍蛹瞪目極 草生綠水心莫嫌",
            "百戰馬蹄垃珊瑚 不知音信圾鶺鴒 行盡日又不知己 草木落水分將行 蒼蒼黃紙藍瞿塘 丈夫人見綠池清",
            "巫山川陸賈誼垃 猶未休征戰艦圾 金碧桃花飛去不 白頭白雲霧中分 不如今朝雲髻藍 人無由來青草綠",
            "瓊玖垃琵琶弦琴 婉娩圾第一時複 心亦不歸來無限 唯有分散入中物 何如藍水自相隨 欲盡綠眼中夜不"
        ]
    },
    {
        "fortune": -1,
        "key": "空頭支票 ",
        "poem": [
            "三月斜陽春水空 風吹玉堂前頭風 明年三條支蟋蟀 三島嶼票狂歌聲",
            "空自不能為霖雨 頭別恨無生百尺 支桃花發白髮新 票捨下無人今日",
            "狂風流水碧空懷 三千里一回頭不 人歸來歲月支離 夜月夜吟哦票沐",
            "秋風雲雷雨晴空 流水向東山頭人 江上皇后支體如 君子規票捨下塵",
            "空綠楊柳陰陽宮 頭人獨往往來不 支淹留與世路人 票隋堤上天不復"
        ]
    },
    {
        "fortune": -1,
        "key": "高雄又老又窮 ",
        "poem": [
            "憶故山高歌一日 蟋蟀奸雄上雲樹 陽春草又一日落 明月一老大夫婦 遲遲日又經幾時 因君莫窮幽人處",
            "向南渡頭白浪高 看花開玉英雄淑 年光搖落又西北 落日臨老大道無 他日又何況當年 無窮穀鳥下淚如",
            "有高且莫惜別有 揚雄詞客思苦辛 日又見月高樓中 長老松風來從今 日又見山河漢武 道窮陰不如此心",
            "高樓上見秋風雨 群雄飛雨中流年 春風又空虛白首 青楓樹老應相牽 流水北雁又相依 何人不足道窮邊",
            "高風煙花滿衣裳 群雄騙伍員外物 秋風又相公子孫 山雲山老不到處 自此去年又逢人 秋雨後時難窮穀"
        ]
    },
    {
        "fortune": -1,
        "key": "以假亂珍 ",
        "poem": [
            "離離離恨何以此 無因君子規假洞 人煙波浪聲亂如 君不勝概罐珍重",
            "此時人非吾亦以 不相如此何假鐸 一片月影亂無一 橘柚棍珍羞見說",
            "白首望一以道路 洋洋洋洋假問俗 滿山翠葉亂飛鳥 本無一為珍嗚呼",
            "以謝康樂天臺上 假層層城東海中 亂後時未有人不 珍譬如何如絲桐",
            "有幾人何以終南 人世人何假如煙 不離離離亂雪花 將何物自珍樹千"
        ]
    },
    {
        "fortune": -1,
        "key": "珍夾藍辯 ",
        "poem": [
            "上珍木無言不能 楔夾城上春來年 淼藍翊聖主人家 兔辯能令人世間",
            "北斗珍禽棲隱隱 綠樹夾滄海門開 忡忡藍關月落花 彷徨辯緬懷古來",
            "八珍羞白鶴鳴玉 水夾琪樹無心亦 如藍贏得新豐年 盾辯杉松門不起",
            "皎皎潔珍猩猩猩 琵琶癱夾兩京邑 李白麵藍梧桐江 離披猖辯澄潭底",
            "故鄉心不足珍重 與誰知不憚夾城 金玉皇后蛀藍田 心不成龍鍾辯憎"
        ]
    },
    {
        "fortune": 0,
        "key": "一碗滷肉飯 ",
        "poem": [
            "一朝昏昏昏曉日 拾碗隋堤上見南 碌碌滷他日夕陽 豈不食肉依依然 翠羽檄蠵飯檳榔",
            "水流水複一杯酒 珠翠蛾眉碗寵辱 明朝端倪滷軋軋 軒車馬骨肉瞪目 狂歌舞袖飯儘是",
            "一萬木落花滿堂 碗蛹鯉魚鳥自有 滷蛀蝴蝶夢不見 肉親故鄉心已久 飯酸辛勤苦心在",
            "三四五湖中天一 花落花影入金碗 一夜來相見說滷 終日休明星斗肉 江南徐步搖盪飯",
            "一夜夜來此去年 碗楔芬芳樹色一 滷記得不如何處 肉往往來不可惜 飯磊落花洞府中"
        ]
    },
    {
        "fortune": 0,
        "key": "有和沒有之間 ",
        "poem": [
            "年四方寸心獨有 樓臺上仙人和平 搖落花已沒駿馬 一顧我有如有情 已見之人行行人 其間作雲一生靈",
            "皆有新詩書生死 風和氣浮雲浮名 月沒胡風高秋色 縱有誰知無限情 神之子風流鶯啼 花間月夜半夜聽",
            "有意在青楓樹陰 和雲中多相送君 沒人情何處有時 有新詩書一片雲 之人不知幾千古 間何路幾處處尋",
            "此中有時有詩句 幾回首相和玉兔 迎春風月沒仔細 四十年少有恨不 白雪未為之如有 花紅塵世間一步",
            "孤城頭白雲外有 五十二月夜永和 知數十二三月沒 不見雙鬢髮生有 來無奈何曾與之 為誰與天上林間"
        ]
    },
    {
        "fortune": 0,
        "key": "我的政見白紙黑字 ",
        "poem": [
            "故人尚在此別我 迎春雨滴瀝的侵 白玉京兆政淤泥 處處不見秋光陰 欲知白雲迎春風 一紙荻花不同心 黑山長江楓葉下 亦有東南山行字",
            "山無言我今來相 碌碌妊的的忡忡 一片善政事何處 心不可見海氣濃 江湖上白石門外 翠微軀紙錢來東 月明月黑呆蝴蝶 望鄉思字在青龍",
            "我亦不是非不及 的縱使君不平明 政湛露華陽陌上 見山青山不知名 白馬不須知不知 紙錢刀尺墳樹行 黑雲深山多感激 字不記得幾人情",
            "遙相勸我來日日 浩蕩漾的驪山僧 雲水準政在茲夕 中有一見日花爭 徒勞歌白蓮開金 來無一紙嵌空城 長江月黑白石上 丁丁丁字書未成",
            "豈是誰為我心不 風雨中央的佇立 那堪愁殺政已白 相思歸未見白帝 春江上有白猿啼 列仙桃紅紙最憶 大道路傍黑如今 東流年五字水底"
        ]
    },
    {
        "fortune": 0,
        "key": "見縫插珍 ",
        "poem": [
            "今日見之不知音 支頤縫棠梨花如 胸臆插花香風吹 兩足珍羞入五湖",
            "春水見春風蕭條 投轄縫馨香煙霞 蜻蜓插羽翰墨沼 遊八珍羞見詩家",
            "心不覺來去不見 憶昨日日未央縫 蕭蕭蕭瑟絃鐲插 我心不在茲辰珍",
            "見君今日到此時 魔縫准擬歸山河 蟾蜍插淤泥沙上 二十二珍碼嫦娥",
            "見山色寒泉脈脈 縫癱獅子悲辛苦 插倡樓上生不知 珍羞不可攀桂樹"
        ]
    },
    {
        "fortune": 0,
        "key": "假戲珍做 ",
        "poem": [
            "安可憐君子不假 離別有妻兒戲鱸 雲根柢旺珍贏得 聲斷腸做舅姑蘇",
            "故人今何假勸君 冷颼颼颼戲參差 三春水準珍勾踐 玉關西施做琵琶",
            "奔假專城春風起 縫戲魚水宿處處 自珍羞瞿塘水清 孔做梧桐葉紅樹",
            "為我心不死灰假 細柳垂淚沾戲昌 白蝙蝠摟珍樹下 悄悄悄做虹霓裳",
            "遊俠假問吳王孫 黃鳥戲魚人家住 珊瑚珍諺淹留客 搖盪做暇日日不"
        ]
    },
    {
        "fortune": 0,
        "key": "萌太子看著你 ",
        "poem": [
            "萌舉世人不得意 上太虛空有誰能 杉松子向君恩澤 絕頂上看君未曾 未有何處著紅粉 夜夜長樂毅你爭",
            "有何遜萌梨園林 心如何太陽樓前 燕支公子不平生 四海上看人自憐 今朝衣著處生死 千金榜你市朝天",
            "何太白頭陀砍萌 悠悠揚子多是太 夫子不見青松子 愁殺人今朝來看 江月明鏡中自著 是非不飲酒債你",
            "萌第一夕陽道路 太白雲不歸來新 子不知有夢不得 看芳草生羽客心 著盡天地遠山中 你狼藉草露沾巾",
            "滾萌洶湧出東海 下太平如相失意 帝子風蕭蕭蕭蕭 君看又一從容易 衣著荷衣不可惜 爛你雖有幾千里"
        ]
    },
    {
        "fortune": 0,
        "key": "願榮光歸香港 ",
        "poem": [
            "無人家山無情願 能使君心與榮寵 如何計日光動天 此別有歸來唯恐 杏花香煙波千年 滾港十五湖光動",
            "問我願得到人間 羅浮榮光何如今 今朝光一千里道 今日歸天寒山臨 太清香不見春草 行役港柿葉黃金",
            "月中歸去不願君 遠客心如浮榮預 風流年長生光輝 水清明月春歸去 唯有清秋草香閣 中無人不忍港譽",
            "有一年年年但願 千古人心不為榮 人行處處春風光 猶在東南去年歸 上高梧桐落花香 一時不相逢迎港",
            "願因風一百姓名 間榮同所欲何年 傷春光景好是非 故鄉夢歸騎馬前 何如有酒香滿地 一夜相思量港天"
        ]
    },
    {
        "fortune": 1,
        "key": "心存善念盡力而為 ",
        "poem": [
            "銀河水上有時心 來此時有名存亡 人語默默善富貴 平生別念不出皇 我欲盡空使君看 得力盡如今如霜 而無複幾人不見 雙鬢髮生意何為",
            "複何人心不忍看 仙人空存亡國士 不自樂善館娃宮 公主人念前朝市 含情不盡白日出 人何人力可能識 桑麻姑而碌碌碌 知誰能為誰開日",
            "心如松柏梁甫吟 空存不知天一僧 橘柚善不歸人間 幽獨自念此心更 非關山中盡無事 人間無意氣力爭 明朝陽城西施而 為東西風長相逢",
            "十年年客心無定 年芳草空存者亦 重陽臺上善不堪 北斗柄趕念我起 老夫君欲盡知音 來不奈何力亦已 頭白石楠而徘徊 不自知何為山碧",
            "心自從容易斷腸 複存不如可見僧 誰與善譬如何當 高處所念舊友生 獨向西望盡平生 四十萬里心力耕 高樓中夜不肖而 為此夜來雙雙峰"
        ]
    },
    {
        "fortune": 1,
        "key": "吾媓萬歲 ",
        "poem": [
            "東風搖金吾知君 一朝朝廷媓羨君 今日登臨萬國門 人愁思往歲寒雲",
            "愛吾知非吾君王 盾媓刷羽毛羽儀 一萬人不歸去年 一歲華山盡日一",
            "吾君一片雲雨雪 滾媓蠵富貴人傳 從來萬年年來何 不惜芳歲不復還",
            "身不知我亦有吾 是非吾道士媓探 非我今朝萬人間 經幾多歲寒色滿",
            "吾君恩愛吾今朝 涓涓涓摑媓艱難 宛轉覺來萬古人 門前路幾歲餘寒"
        ]
    },
    {
        "fortune": 1,
        "key": "政治操作 ",
        "poem": [
            "政褒斜陽春風流 蛾治夜長楊柳絮 環堵操殊未曾為 為君莫作人煙雨",
            "更無人事多佳政 時康樂毅砍治蒙 一毫釐韌操持酒 青山長作江邊城",
            "飛霜積善政琉璃 別離別離治段成 萬戶千齡操迴圈 可憐君已作長城",
            "求安仁政櫻桃紅 騎馬蹄治桑田園 皎然諾操心不盡 依舊山作東南軒",
            "複何曾為報仇政 離別來時不朽治 烏啼猿鳥飛錫操 不能不須知君作"
        ]
    },
    {
        "fortune": 1,
        "key": "高雄發大財 ",
        "poem": [
            "相送歸路傍人高 車馬蕭蕭索雄風 幾時菊花發如此 庭樹老大風江楓 吟哦財凋零落花",
            "高鳥啼猿哀猿啼 雄都城上客心不 發光陰山不復還 大漠無人生白骨 財賴有青冥冥鴻",
            "憶舊隱映高興來 水流離群雄心猶 世人不早發光輝 見君不是大庭秋 百里餘杭財萱草",
            "一登樓高吟詩人 月落英雄才子何 何年未發時不得 亦何為大不可得 人家醞財騰騰騰",
            "唯有高樓前賢人 紅英雄唯有餘清 一聲發紅塵土木 仙家大江天公卿 龍鍾財等閒人莫"
        ]
    },
    {
        "fortune": 1,
        "key": "殺出宋咬金 ",
        "poem": [
            "白日晚來天殺君 至今日上馬出門 水曲江曲梁宋盾 看花開闢騙咬臻 半夜聞說向金玉",
            "知何由殺人世間 今朝朝出東海門 不成式宋梨花時 蒼梧桐咬颱風塵 相逢人金河漢水",
            "殺江水不可以為 月出入松聲斷蓬 大廈宋玉葉落花 我獨佔咬莓苔封 人世間有金絲竹",
            "殺氣來相思悠然 不出東西複何時 珊瑚宋棍軋軋軋 終不肖咬握手持 但見說向金碧草",
            "至今朝來成狂殺 何寂寂寂寂然出 謝公子亦不耐宋 依依依舊詩魔咬 昨夜月明三千金"
        ]
    },
    {
        "fortune": 1,
        "key": "萌太子陪著你 ",
        "poem": [
            "酸辛苦辛旺萌痼 春草木葉上太陽 一片月夜聞子心 何時時猶可陪央 明朝來相問著鞭 桑田園弟妹你疆",
            "行路長安可惜萌 未知君應是太和 所思君行子不能 脈脈脈陪高飛蛾 山似著水清談笑 拾你巫山東山澤",
            "將軍中路旁萌協 七十年別有太平 分題詩思君子夜 平生在我願陪清 是故鄉路逢著青 春風騷屑緻你迎",
            "萌美人世上將軍 下太清渭水清露 應無子能不可憐 欲何日陪仙去不 長相過盡著處是 三年三十年你侮",
            "年別離家住萌兔 飲酒徒爾為太陽 有情未老妻子孫 疑是何所願陪槍 飄零露沾衣著白 蒼翠羽衣裳你揚"
        ]
    },
    {
        "fortune": 2,
        "key": "台北的未來在手中 ",
        "poem": [
            "昨夜台空中路難 春雁北人千萬物 蜿蜒的穆穆天涯 老去未相思往復 歸去來時相見君 君家在朝朝朝複 皆如手中春風起 向此中看花滿目",
            "柏梁王台月中人 石橋東北山寂寂 別離騷的浙江水 棠梨花未平陽西 陽臺上來往事難 一年心在長歎息 時一兩手自知音 秋水府中別離離",
            "年華清池台下無 關山遠山北東西 蕭蕭條蛹的慷慨 歸心在人未覺衣 幾時還從來此時 西塞北望在月低 未平生素手期阻 二月明鏡中人稀",
            "山海燕台客路遠 東西南北風霜天 寶瑟瑟的仿佛寺 有餘亦未得一年 不遠近來相送歸 故鄉思在水連延 千萬人手自然後 八九月中有誰言",
            "台金波一枝花開 江北來唯有幾度 萬端的賓從此時 去年年未能不顧 花不如今來時不 花滿江上月在故 萬乘月明日在手 中路入夜夜夜宿"
        ]
    },
    {
        "fortune": 2,
        "key": "貨出得去人進得來 ",
        "poem": [
            "白玉帛貨胸中有 何事不出南山前 一身已得金穀口 無歸去去去幾千 豈是故人生不復 故人寰進取金鞭 一望幸得所得意 南北雁來過十年",
            "樹秋毫端拱貨拾 十二年深山出南 更無由來時得知 日高樹下西去三 人猶自有佳人間 年老病身難進杉 不曾經時時得見 故鄉人今朝來難",
            "春至今日獨佔貨 遠憶昨日晚出處 吾廬山不得幾人 不如飛去是龍虎 路行人一片帆影 不進酬恩深處不 得不得春風光輝 雲歸來往往今來",
            "落日月夜長籲貨 辛苦辛苦吟聲出 何況乃知君猶得 至今朝日東歸去 西南宮中行行人 一朝天地無疆進 得閒時康樂未得 花殘春風塵起來",
            "吟哦貨嗜欲盡日 煙霞出洞庭寒灰 此時得無聊自有 無處去來何時危 神仙人意在天涯 始得進士名豈唯 山不得春風塵事 好風來年老僧歸"
        ]
    },
    {
        "fortune": 2,
        "key": "萌太子看好你 ",
        "poem": [
            "北斗萌磁採蓮花 中朝太古時與世 本無子去住此地 夜坐看花猶自適 非所好花殘春風 煎熬你紗窗下視",
            "萌終難得閒居士 太白玉關山色分 子亦難再得歸去 看來去何紛紛紛 好生只應無處處 你渤海內人知人",
            "萌准擬歸去年年 李太清景物情人 支公子為憶昔年 一夜來看花無塵 龍門前山好相識 江東風流鶯你珍",
            "蕩漾漾萌億萬里 長相如太行處宿 亦不見子風光彩 故鄉人看青山路 唯有所好是非常 瑪瑙呆你渭水不",
            "黃河梁王孫弘萌 山水流水入太湖 江頭白帝子細草 英雄圖看卻望浮 草色好是人何處 奔你七十千萬夫"
        ]
    },
    {
        "fortune": 2,
        "key": "謙卑謙卑再謙卑 ",
        "poem": [
            "樓上青蠅謙獅子 桃李膺旺卑琪樹 如此中央謙馨香 雲夢魂銷卑棲宿 東風白麵再生一 一片石瀨謙猛虎 何處無限卑葡萄",
            "謙裴回首東風煙 卑棲禪寂曆千里 謙般若個個個個 卑官滿江南春氣 再過春秋日夕陽 謙豐年來未能幾 卑抬舉頭吟詩句",
            "白石榴謙蛀嫦娥 馳突兀卑憧憧憧 丈夫婿謙荻花滿 人寰區卑追攀龍 幾時難再逢迎春 相顧盼謙美人同 春來不卑嗜酒醒",
            "蚯蚓謙絲桐花開 郎官卑銀漢皇帝 元瑜謙斯文物外 蜻蜓卑悄無限意 無限再經此心期 彷徨謙悔不相憶 宇宙卑蛹譬如今",
            "雲生塵埃塵埃謙 至今夜風落帽卑 蒼茫茫然風騷謙 夜雨晴天宇宙卑 清晨雞鳴琴瑟再 巍巍巍巍棍騙謙 水東流水石榴卑"
        ]
    },
    {
        "fortune": 2,
        "key": "珍愛萬安 ",
        "poem": [
            "傷心獨自珍懊惱 百年少人愛風度 七十三山萬丈夫 不到處所安路入",
            "神仙舟航珍珠淚 遠遊處最愛新秋 紅杏花間萬象床 春風來無安可求",
            "屈原上珍重天地 青雲自愛江南行 曲江山萬事無事 不得新安禪心情",
            "別後來無所珍蛾 三更聞天子愛淡 何如何日千萬里 微風塵中新安敢",
            "少年少年華頂珍 四鄰女兒童子愛 今日長在南山萬 龍門前路長平安"
        ]
    },
    {
        "fortune": 3,
        "key": "改革從未猶豫 ",
        "poem": [
            "改等閒遊無人心 潔革朱顏色新聲 無一從此中夜月 時見君未得長生 歸來往來猶可望 春風雨後輩豫風",
            "鬢改變俗中何處 兵革第一杯酒徒 我從空餘亦不知 尚未終日晚風俗 日猶憐故鄉淚滿 諾豫遊春意不如",
            "不能幾時未改變 不與君未央革池 花開尊前朝從茲 可奈何因知未知 閉門前峰高猶能 如今何處處豫芝",
            "改他鄉心自此日 革諒無處處更深 從風雲水悠悠悠 未能不堪聞天門 猶得真人不讀書 豫凡幾日已無塵",
            "盤渦改樟亭台閣 蜿蜒革扁舟不嫌 處所從出門外無 送君未遇知幾年 青山猶在青牛羊 淅淅豫遊何人間"
        ]
    },
    {
        "fortune": 3,
        "key": "萌太子保佑你 ",
        "poem": [
            "雕鶚萌萱草長相 曾見太常思鄉路 農夫子雲中腸斷 家醞保灘聲寒暑 盤渦佑蠵郁陶鈞 珊瑚你相送君不",
            "夫婿萌區區中流 不如太一枝花覆 無才子不見秋風 蜻蜓保鐲笙歌舞 芳菲佑殊未歸去 蜿蜒你仲尼父母",
            "七十二毛斑萌西 七十餘亦有太行 青雲深宮女子房 時相逢人不保星 默默默默磁佑偽 莫相對酒債你汀",
            "晴萌蛹蠔涓涓涓 上太虛無複一人 無子夜夜吟詩句 自保之無因君恩 潔佑漠漠漠漠漠 楔你碧流水國門",
            "風騷人事無垠萌 往往還似相見太 草色連天上有子 人未得無塵埃保 圖畫屏風騷屑佑 何如花紅妝梳你"
        ]
    },
    {
        "fortune": 3,
        "key": "媽祖託夢 ",
        "poem": [
            "神仙才子規媽腿 惟有五六七祖伍 依依依依劉託諾 東西北望雲夢不",
            "人寰媽柴門閉門 與我祖龍門何年 陶甄託六十二毛 思歸夢魂飛入天",
            "歸去不至公卿媽 白玉關山翠翹祖 白日高秋水準託 日西風一望鄉夢",
            "銀盃媽苦辛勤苦 知我祖師意不到 憧憧託棍洛陽春 其如夢何況複道",
            "媽罐玫瑰奇峰頭 祖傳是何如玉樹 託梁宋玉關山水 夢不離離離別路"
        ]
    },
    {
        "fortune": -3,
        "key": "卜蜂污泥 ",
        "poem": [
            "如可憐君獨坐卜 依依舊詩酒醒蜂 風月夜涼風吹污 幾千秋天上黃泥",
            "年年少壯士癱卜 相如何幸無私蜂 主人多謝公乎污 人皆如此日銜泥",
            "漠漠漠卜遼東歸 天驕奢蜂舉世事 山水晶污喬木落 五雲沖泥纖纖指",
            "諾卜鄰境勝事不 懼蜂甲第一聲聲 盾污幀蘆花滿山 腿泥沙草連海風",
            "遊俠客散誕卜宅 三百二八紘蜂閎 萬里無事蹟污司 題詩題詩似泥中"
        ]
    },
    {
        "fortune": 0,
        "key": "波特王撩總統 ",
        "poem": [
            "白日登高風波千 落梅花開闢特槳 從此日高名王業 何當歌舞袖撩兩 何事少年豐總無 知何處無限統倆",
            "波浪花不如故人 曾特砍肅肅肅肅 胡為王宮人家山 蟾蜍楔撩洛陽古 明月上人總無風 往往往往往統礎",
            "金波上天造化成 拾特地兩三千古 君王師心如此時 丫撩顧我何處處 西總為我行車馬 腔統攜手中不復",
            "不如波不勝事無 蜻蜓特地無因依 使君王氣連天地 何遜撩涼風露滴 無限總在江上青 琥珀統孰能忘機",
            "風波流年年華髮 曾特美人間白楊 吳王母家貧家貧 拾撩騙捧日夕陽 事總無人歸去年 腿統俠客行宮牆"
        ]
    },
    {
        "fortune": 3,
        "key": "苗栗國保預算 ",
        "poem": [
            "憧憧苗獅子方知 鶺鴒栗姓名不知 身外國遠思君王 獨佔保蘆花露濕 峨峨預併入關山 投轄算梨花枝枝",
            "明月下淚痕苗兔 十二百鎰趟栗時 修修竹林下國多 十二年無能保之 遙相思悠悠預楔 高樓臺上鷗算施",
            "萬古來相呼吸苗 十二八紘蛹栗螢 三十一為國去年 君不以保駿馬鳴 瓊玖預想長生涯 不算凰池上月明",
            "苗置酒樓臺上天 拾栗擴姑蘇武功 雲開國已成文章 蒼梧桐保呢彎弓 空自知己預瀚海 三十五峰巒算躬",
            "曾向綠苗彎弓劍 蒼蒼茫栗迴旋風 帝城南國門不得 百年長保倏忽逢 澄澄澈預菩提壺 結交頸算踏青楓"
        ]
    },
    {
        "fortune": 1,
        "key": "童仲彥金色力量 ",
        "poem": [
            "一去去時見雙童 風流年年終南仲 清談笑指點檢彥 一夜猿鳥銜泥金 洞庭花開門山色 不知君王不盡力 白鷗鳥道經旬量",
            "童戲馬出東南山 仲月時複何曾經 彥裴回顧我今已 金買酒一何時清 色上天碧紗窗下 力少行春早晚晴 量零落花漠漠漠",
            "何為報天花野童 越鳥啼猿鳥獸仲 西風雨蕭瑟瑟彥 絕頂上天地垂金 百丈夫子不容色 來不堪悲風多力 何人行人如可量",
            "童歌聲華陽道無 滾仲秋風日無死 蝙蝠彥癱磊磊落 無人無金石在此 城南山水色滿地 門寂寂寂無力自 向東山橫行可量",
            "瓊玖棍牧童捲簾 杜宇宙癱仲春心 碧雲根蒂彥芸閣 金石門開金華陰 新晴天氣色遠客 彷徨呢努力盡金 誰知君不量蚯蚓"
        ]
    },
    {
        "fortune": 0,
        "key": "美韓重啟核子談判 ",
        "poem": [
            "美景好鳥鳴雁行 曾韓魏國多無極 九重重九日月色 百戰場啟關人迷 風飄然諾核徵兵 風吹入楚王子西 元戎馬不可測談 判呢仔細雨雪一",
            "更有美景不知音 瑪瑙韓愈旭日不 天下重回首詩書 雕鶚啟重來萬戶 腰鐮核逆旅遊人 兒童子無名王母 雲立談笑東望鄉 憧憧判萱草芳樹",
            "時時多美女嫁時 碧瓦礫韓壽杯盤 隱幾千重相去年 人開門啟呢幽蘭 的的的核巍峨峨 出東西子陵江南 不可憐談笑問訊 碌碌碌判陌上三",
            "應難逢君為美名 白石榴花枝韓信 天臺上山萬重回 猶有一重門啟禁 今日映紅桃核滾 宛轉覺老夫子謹 三五千餘清談天 此身如何妨判錦",
            "彼美少別君行人 腔韓信不為一年 山重相思多暇日 勾啟此別離群仙 拾核菩提攜籠中 帝子不極目極天 蛾談射雕梁園林 曾判捲簾外事牽"
        ]
    },
    {
        "fortune": -1,
        "key": "遠航停飛 ",
        "poem": [
            "江水浮雲遠人生 東風搖盪航露白 為誰家未停留得 何太平分飛去來",
            "遠水精光陰山下 航八十八十二千 停太平明月明日 飛天漢使君莫言",
            "花滿地遠空長安 彩毫釐航趟呻吟 百年無停杯檳榔 青山南飛不歸心",
            "姑蘇秦樓前山遠 清秋來客舟航礎 微星斗柄停偉哉 青蓮花飛向人不",
            "誰能幾時清光遠 如今何因循航脆 太白羽翼停匈奴 魚戲蝶飛龍池水"
        ]
    },
    {
        "fortune": 3,
        "key": "加班費比薪水高 ",
        "poem": [
            "加餐柏梁園林下 拾班芸閣上漢武 蜻蜓費淵明日夕 歸思難比來自古 不知無限薪突兀 渡頭白頭白水複 與誰知無人知高",
            "加造化為客行人 班盈盈虛空庭樹 費遼東西北風流 比君去年華亭午 薪乳燕山川原上 水中人自從此物 高雲生何況乃知",
            "與君不加餐櫻桃 白露濕班兩三尺 草堂虛費呆氾濫 一生自比來此事 誰能為薪虹霓裳 歸路傍水欲盡日 青青山高堂前殿",
            "相招提攜手加盾 不容易為官班露 春水流水徒費腔 草綠野客心比目 誰知此去采薪填 不同一年春水木 相望不如雲高臺",
            "加譬如霜雪山河 班馬入雲外無處 費日月未終當時 比鄰境不勝事不 薪琵琶弦中人心 水自有心與萬戶 高飛去是非吾家"
        ]
    },
    {
        "fortune": -1,
        "key": "丁守中敗訴確定 ",
        "poem": [
            "風急管弦歌舞丁 如何時一日長守 生只是夢魂夢中 東西南枝低昂敗 殊未得寶瑟瑟訴 狂風吹落日腳確 今日相似雪初定",
            "鬼神功成白丁港 知君相見太守道 相思苦心胸中夜 終日相依託敗兆 天寒露沾襟訴淼 從今朝雲端確趙 惟有佳人欲定相",
            "漏丁殊未終不可 能守舊遊無辜負 夢中有風光陰陽 災敗葉飛上無處 悄訴凡幾層層城 覦確蓮花落日入 無定中流落日月",
            "頭白丁丁磁玫瑰 日長守清淮水分 一杯中路幾重疊 歡娛敗耆舊時人 端拱訴浩渺渺彌 寂寞確由來無根 聊自定僧還自從",
            "猶殘陽宮中白丁 欲盡日西城守道 有一片雲中山水 交加餐敗從來早 琥珀訴狐兔走馬 奔確龍虎溪邊草 定不如今朝野寺"
        ]
    },
    {
        "fortune": -3,
        "key": "暫時性失憶 ",
        "poem": [
            "四時人暫得見說 歸時見時有名與 豈是天性驪山色 只恐不失其如玉 兄弟子憶秦塞北",
            "我亦何如鬥酒暫 為君不知多時一 有時有適性命未 頭白雲失之不移 才子憶東西園林",
            "喜暫將何如此地 此時人知何其如 人性與天高梧桐 中失所為我亦無 不憶故關城春色",
            "盡日月明年無暫 年年少年別時景 此時複道性本根 尋常恐失所適性 江山憶江上月明",
            "無暫得意無心事 一時無事無風入 真性不成不相見 無失故園何處處 長憶山不如此夜"
        ]
    },
    {
        "fortune": 0,
        "key": "海洋浴缸 ",
        "poem": [
            "日西江海門路不 玉座隅洋歧路出 為報仇浴日月下 萬事蹟缸辣蝙蝠",
            "至今夜東海西北 匹馬蹄洋洋猩猩 明朝市井浴肘後 有一毫釐缸丁丁",
            "青海正是君子孫 勾洋渭水入洞庭 諾浴倡狂夫君家 懼缸磊磊落英靈",
            "海風雲雨來相逢 洋嗚呼萬乘春雪 浴幀磊磊落日不 缸竟何如今日月",
            "海雲長往往往事 洋專城南陌上金 浴斯須知音塵土 缸驍雄圖書到今"
        ]
    },
    {
        "fortune": 0,
        "key": "九二沒有共識 ",
        "poem": [
            "八九江流水邊草 月二十九天末路 出沒聖朝朝朝朝 別有一相與萬古 應共看西京洛下 君識舊相追遊處",
            "向九節物情多情 百二千葉蕭蕭索 影沒蘆荻花滿地 唯有佳麗日高臥 不共君子落日月 相識天風搖落落",
            "主人自此路入九 人未得仙人不二 憶昔年別後身沒 不知誰能幾日有 蕭森森森然不共 江邊風雨聲遙識",
            "八九月天地無言 來二年不唯有情 水沒青青雲山下 唯有萬古城中興 曾共誰是誰知心 相識無處問姓名",
            "未得到九天遠近 猶未有二三十三 渭水鳥沒肝膽氣 如可聞有天路難 將何人共憶家貧 自知己識無事堪"
        ]
    },
    {
        "fortune": 3,
        "key": "一千一百萬觀光客 ",
        "poem": [
            "時一何年三十年 山千秋聲夜深竹 雲一葉黃金石上 我百日暖日又如 風萬事不相思歸 東觀身未盡日無 明光明君不早晚 來客愁人何蕭疏",
            "非一枝上有所以 三千萬古無處處 有一杯中宵夢魂 四百憂來未終不 千萬國門不須知 仰觀空餘芳心苦 寒光至今來還家 禪客行樂未曉露",
            "一去無心自從容 千門臨江上天路 一山遠近來不得 百鳥自是非獨宿 萬金門前事無窮 觀風騷人不可度 光晚來時一萬里 客愁自憐君應不",
            "一生玉皇天文章 千古一夕陽城閉 一聲相迎春草色 百戲鳥還如何必 萬山路長江邊城 觀水千年四鄰里 光分手自傷心不 客歸路人無人意",
            "萬古松間無一曲 風月明朝雲千峰 幾時不知天一朝 花落日長在百砰 回頭白日臨萬戶 滿眼明月中觀鵬 倏忽見月明光入 幾度春水中客程"
        ]
    },
    {
        "fortune": 0,
        "key": "修憲要四分之三呦 ",
        "poem": [
            "修嘆惜春早春風 憲司馬行人已成 要路幾日日高低 四海日高枕上生 分行人心如今夜 之子夜夜清涼風 三清渭水長安得 呦洞庭中無路逢",
            "不聞鐘聲價重修 故園林端倪棍憲 為問我有高且要 有幾千歲晚來四 自相逢故園中分 我亦何在斯言之 無人歸處處有三 路長安閒遊衍呦",
            "鶺鴒修修文星斗 肘腋憲貧交情不 人當要路入千年 夜來四千萬古渡 月中分明年不復 無所之子如玉樹 歸來三百萬丈夫 芳菲呦耆舊國步",
            "大賢人不是前修 雁南北斗柄磁憲 聖明日同心只要 萬里心事亦有四 閒居易得知難分 水東歸心亦何之 如何時無因得三 風騷騷雅音書呦",
            "有新修竹枝紅塵 橘柚憲貧知是吾 徒自要浙江湖上 春風四海月上無 山路分無為我來 未得之子夜長如 湖上三十載酒熟 賈誼呦巫山月出"
        ]
    },
    {
        "fortune": 0,
        "key": "觀光客不算轉機呦 ",
        "poem": [
            "觀天河水上帝鄉 光明月明君前日 客不相隨風流水 不出鳳凰城內史 算款曲江上塵埃 轉戰勝地間無事 機石橋東山頭白 呦郁金爐峰下視",
            "滄海上來觀空見 高枕上春光風聲 新妝成行客行路 淚如今年不重城 春風雷電算蝴蝶 見君同心轉清風 三百里萬機心無 三五馬蹄呦何曾",
            "可仰觀風吹角聲 上天光如何日落 海上客路遠公子 未知不及時有所 清廟算來江山中 南山轉無回顧我 道心機中無功名 蜿蜒呦蛀焚香火",
            "觀魚鳥雙燕支公 月光何當年不行 多病客長江流水 亦無事不相送迎 湛湛湛湛算瞪目 亦相從此心轉經 安得黃金玉女機 呦蠵旭日相和鳴",
            "縱觀者不如何所 日光滿朝野人爭 留客心不如此日 終不可得知萬乘 廟算來猶未為我 路轉深處在雲峰 清機牡丹青青門 滾呦賴有新安能"
        ]
    },
    {
        "fortune": 3,
        "key": "中華民國萬歲講三次 ",
        "poem": [
            "中天文章四五色 華山城中春風度 民繩床頭上青雲 國人如今猶在目 萬金陵道何由來 歲華不向東都護 中獨向江南風吹 華山中秋草生不 民譬如未歸夢魂 國人見君莫作賦 萬樹深處有淚滿 歲已難久別家住 中無人去不見白 華春來萬歲陰覆 民心日夕陽道在 國士有清晨裝束 萬萬歲時新秋水 歲晏如煙霞明主",
            "猶在眼中原田園 聞漢皇華如有遺 數十萬民胸中有 心胸中國秋千騎 主人間萬年華表 華髮新歲空有一 東風塵中一壺中 使君恩華春鶯啼 煌煌煌民聖主人 千山水國一別離 三五千萬人何所 知君去歲將何極 芳草堂中夜風吹 月當年華山為惜 亦有遺民瞿塘水 盡醉鄉國不知其 零落花萬年少人 是非一歲陰地即",
            "中月滿眼前朝夕 華燈明主人何處 民遼東流蘇武帝 國無人如何時複 萬人間有舊山水 歲已無人不得路 中人歸未成功成 華館清風來相顧 民咸秦人心相思 國多為謝安得入 萬重陽道路長安 歲寒不曾是玉樹 中有東風雷雨後 華陽關河東山不 民心與萬年少年 國不知歸夢中物 萬人知是非一杯 歲無才子悲辛苦",
            "海上青雲煙霧中 在天下馬上太華 不知此去不下民 三四時一醉鄉國 化為我不自知萬 樓上林園春來歲 花飛鳥雀羅袖中 與君不到來歲華 鳳凰池蓮花萬民 人間無一為報國 日落葉垂柳條萬 高樓上雲歸來歲 月出入春風月中 不平生死生光華 白日漸老夫婿民 走馬向東門外國 人不知誰為一萬 相思何由來一歲",
            "來謁帝城南宮中 不相對芳歲歲華 青春水上京兆民 不聞道何處去國 殊未得意無一萬 日長在五色新歲 少年不離離心中 誰複何當秋月華 何處無纖纖腰民 遠公主人世上國 歸心不得相與萬 紅塵埃塵心知歲 來往來江邊草中 悲辛苦心何年華 鳥道路難留遺民 是故山水東南國 樓臺上帝城門萬 來不如何在五歲",
            "水中人未開花開 光華陽春來無處 遺民不堪悲辛夷 大國風吹入耳目 幾萬人無所從此 千歲陰山春風度 水中一朝陽臺上 年華陽光風雨露 生民沉沉吟詩人 故國秋天南飛入 一萬金碧草堂前 每歲又一夜來不 夢中人寰海棠梨 才華省得不入楚 萬民兄弟子去不 故國如有故山住 為萬餘生無消息 去歲無為一千古",
            "唯有風雨中天地 上月白露華新宮 蕩漾漾絃民不足 少年年絕國路通 如何人間萬木葉 清談玄度歲晚鐘 中有四海中原野 日新篇章華燭龍 欲到荊州民心已 孟郊園中國有宗 生不相知萬丈夫 青青山千歲時從 陽城南宮中夜月 來年少年華陽公 為誰在斯民碌碌 一片雲水國之功 從此路幾萬重重 江南山終歲如松",
            "高枕上雲中庭樹 青松桂露華館閉 誰是離憂民牡丹 長江南楚國秋已 白蓮花千萬國風 狂歌一歲歲去矣 三五百年中年不 水精神京華山憶 風前朝廷民彷徨 何所存亡國無益 太白蓮花萬古來 何足數百歲寒氣 此曲江樓中有一 落日新恩華山際 山河水準民鯉魚 青山歸去國容易 未歸來萬萬里無 四十年今歲春意",
            "不成空山水中天 故人生江南華東 何處去九州民魔 相送君看楚國弓 由來自古來萬重 將何年年年歲空 九重遊俠客中夜 能使君恩榮華濃 早梅花發生民曾 海上高枝上國從 平生何時一萬物 年二十年年歲農 人間無遠山中秋 今日遲遲日華聰 殘春風與吾民無 四十九門萬國鬆 中原野人有萬家 無餘芳歲歲歲鐘",
            "雲中無一片石室 日華山夜久留連 腿民不窮秋風起 相國有靈山青天 千萬古人為我來 芳歲酒客去年前 此中一生何如何 在華秋至今日邊 州民無不得意何 上國更何所求仙 千萬人行樂未得 千歲華軒車馬間 夢中來往年年年 年華池清秋來年 憂民無生自從此 南國春秋草茅簷 千萬物情人不如 歲歲期遠山開顏",
            "盡日邊城中年年 西東流年華無際 清風飄零民恰似 夜深山下國空碧 松下第一萬木蘭 從此路幾歲久已 關山中庭中有期 桃花白露華滿地 張翰林巒民心在 長河漢水國春氣 相送別來萬人不 向東風度歲無弟 大江邊城中宵夢 秋山東南華日夕 天子雲齊民蟋蟀 八十年為國風力 天地遠山萬國門 風飄然一歲去矣",
            "無塵中路入青松 他年華堂前山入 如斯民汲井梧桐 與萬國不辭金穀 不為萬行多暇日 今來歲久無四五 高樓中人多謝客 十年華山有何處 留遺民心在天涯 洞中國從容一物 花開萬玉笙歌鐘 山萬歲歲寒玉樹 巫峽中一一年年 日月華山深處宿 無為民心人知君 門外國有殘陽渡 二十萬事不獨自 早晚歲不與眾木"
        ]
    },
    {
        "fortune": 3,
        "key": "是在哈樓 ",
        "poem": [
            "是何時一雙鳳凰 在空山不知心中 哈估客來往還有 樓上秋月高梧桐",
            "一個是天邊城頭 得長在城邊草生 水準哈等閒田園 沙上樓頭白猿聲",
            "聞君不是非是長 無人知君家在煙 奈何處無限哈偽 重城頭白雪樓前",
            "正是一從此時節 猶在君王宮中無 勾哈蕾捲簾垂楊 江樓月當時一壺",
            "疑是一旦夕陽春 誰在此是非吾事 勾哈昭昭昭昭陽 龍樓前月出入室"
        ]
    },
    {
        "fortune": -3,
        "key": "印度公民法疑歧視 ",
        "poem": [
            "島嶼印歸臥病來 歌一度雲白蓮峰 樂府公心腸斷腸 斗柄民譬如秋聲 相問法瞪目送遠 處堪疑夢亦已成 龍鍾歧予亦不可 葉下視甘露垂藤",
            "鉤印楔辣譬如何 曲度南山中有青 謝公樓中天子不 斯民楔艱難分明 心法無盡日落葉 雲疑身自由來聽 寮歧路遠行無人 敢視杉松桂花迎",
            "千金印蛹淤泥沙 門前度來日高樹 秋至公樓上林下 參差民觸處處處 莫問法廿櫻桃花 知不疑欲回看五 勝概歧鄧林泉聲 澄澈視獅子陵路",
            "今朝來不同心印 秋月光滿眼前度 玉關山花滿山公 苦吟詩成子愛民 漢家無人誰為法 與君不同一自疑 幾回頭吟哦棍歧 天明珠翠羽檄視",
            "豈無主人心印棺 不相看花鳥度鶱 何人未曾為公樓 生白玉壺漿民鞭 浮雲山中一法王 清明主人莫疑天 十二年長籲歧盾 雨露白日相視淹"
        ]
    },
    {
        "fortune": 0,
        "key": "英選舉保守黨大勝 ",
        "poem": [
            "零落英靈和煙雨 珊瑚選靡靡不住 君不舉頭不如絲 未能保准擬何處 上太守清秋夜來 芳菲黨罐楔琪樹 無為大如君今夜 君還勝事已成五",
            "可憐白雲英孟郊 不復舊業選將夕 使君為輕舉扁舟 三百年長保佇立 更何人獨守道心 三五十六黨仔細 盡日日為大荒涼 蒼蒼生多勝情亦",
            "中有英颳歷歷數 有文選美人自憐 移文舉世人無人 韓愈保他年年年 是謝守舊山中原 忡忡黨眼前年前 亦有大道路入雲 年未勝遊處花間",
            "回頭白雲英翩翩 水東風吹選猛士 不歸去矣舉足自 知何所欲保儘是 不如有能守邊城 有淚滴瀝黨人事 故人來謁大如何 是誰道未勝春日",
            "又如瓊英雄雄圖 見新文選漸老僧 無複一舉鞭馬出 唯有神保蒼蒼生 梨花謝守孤雲深 珠簾卷黨渭北風 古今日大道無限 是真境勝愁雲峰"
        ]
    },
    {
        "fortune": -1,
        "key": "川普遭彈劾 ",
        "poem": [
            "白頭上天下長川 一寸心如何遜普 秋月落日重譯遭 萬里心中有人彈 蒼蒼蒼生獨佔劾",
            "夜深處春水一川 只應無端拱普天 雨後庭柯遭辜負 年少女彈弦一千 涓涓劾螃瀚海門",
            "白日向江漢川明 回首不知己普疑 本無複何況遭蛾 白雲樹連珠彈棋 君兄弟兄盒劾西",
            "西川明朝日無人 盾普騙七十三五 命遭剖竹葉落花 上彈冠劍欲歸路 諾劾瑞氣滿眼看",
            "萬里隔山河洛川 今已久不肖普右 寄謝公卿遭蜻蜓 聖主人彈仔細柳 煎熬劾榴花枝葉"
        ]
    },
    {
        "fortune": 1,
        "key": "星宇開賣 ",
        "poem": [
            "歌聲名姓名客星 葉落花開闢砍宇 終南宮中夜月開 來自強飲酒市賣",
            "青草木落天文星 年不復還似玉宇 雲外無由來不開 白髮生成都市賣",
            "星月夜夜相勸君 宇第一戰功名利 開不能不相送客 賣與君猶自有幾",
            "七十九華星星郎 不得長空宇姑蘇 少年今日開金穀 逢故人寰賣與夫",
            "動搖落星使君心 莫作杜宇涼風度 秋草堂開玉京洛 蕭蕭條賣殷勤苦"
        ]
    },
    {
        "fortune": -3,
        "key": "澳洲大火摧毀小鎮 ",
        "poem": [
            "一雙淚沾衣裳澳 方浩蕩漾炎洲路 五十月下大夫人 河邊烽火不獨步 清風摧賦詩人不 奔毀章四十萬戶 小庭樹色分明年 相送春水悠悠鎮",
            "災澳奈何人家子 芳洲去年深處處 才大笑東籬菊花 爐火起江南行路 低摧折得相憶君 蛾毀蝴蝶夢亦不 上小園秋風蕭條 出鎮團圓月開戶",
            "題詩人間無媒澳 萬歲月夜長洲纏 舊交河陽大如在 月光陰火生前山 殷勤摧零落葉下 協毀商山川長安 小臣同心與君恩 日長江東風緊鎮",
            "不勝事不通宵澳 試問誰是滄洲邊 一從此日大小徑 遠遊騎火不來天 歸心摧藏深處是 腿毀誓不相思千 小徑入夜涼風生 從來天子孫弘鎮",
            "花柳垂釣磯澳滾 故鄉淚流芳洲東 誰知無心無大夫 天上天邊烽火中 美人更傷心摧淼 不如何所以毀絨 長安可知是小兒 今日無心胸鎮蟲"
        ]
    },
    {
        "fortune": -3,
        "key": "翁山蘇姬屠殺辯護 ",
        "poem": [
            "不得仙翁醉如何 平原上山去未知 獨佔楔蘇棍儘是 風淅瀝姬騷人之 獨佔撕屠莓苔侵 須知不殺傷我時 大漠漠辯三十年 山白龍護塞寒食",
            "翁不待月沉沉沉 山月半夜半夜深 蘇小池上青青草 姬磊落何能使臣 屠十二十四時不 殺江西征人無人 辯瀚海樹影斜陽 護霜飛盡日出門",
            "翁二十四方丈人 山雪山雨晴日無 蘇門山一夜雨露 姬酒樓上江上書 屠蘇門何太平生 殺君到處處世途 辯倡狂風悲辛苦 護顛狂風一何足",
            "當年衰翁途窮巷 一葉滿山水千里 酒錢塘蘇君心中 暗投轄姬靡靡靡 楊柳絲屠握手把 萬事不殺人空碧 禦宇宙辯准擬將 心肝膽護肝膽氣",
            "翁罐努力不堪愁 故山上月滿山入 歸未蘇台空林泉 滄波文姬登高處 三千萬戶屠骯髒 風景物不愁殺吐 天高枕上皇后辯 護恨不可惜別故"
        ]
    },
    {
        "fortune": 1,
        "key": "隱形的市長 ",
        "poem": [
            "隱者誰家人猶在 忘形神心亦無人 萬端的緩步虛無 今夜入市不是真 不相尋思長安可",
            "隱令威鳳凰樓中 形褒斜日不得不 的倡狂風一杯酒 市竟何須知何處 長不知君今日日",
            "君今日月隱霧中 西樓上龍形嵌空 禦溝水晶的軋軋 九重相向市匣中 無心不得長劍閣",
            "隱天風吹玉匣中 形影向東山不復 的騙莓苔徑斜日 市頭風塵土中路 長年不曾無主人",
            "隱不相送君不得 無形質本無一聲 一破的淹留君子 青春陰市人此生 攀折腰下長相見"
        ]
    },
    {
        "fortune": 0,
        "key": "山海經樂園 ",
        "poem": [
            "空山白髮生死生 北海中有詩家貧 此經年未及第一 有樂未歸故園林 梨園林風蕩漾漾",
            "蒼翠屏山下長安 今已見海無情深 月影動經旬不相 晚晴天樂未報恩 落花芳園不能幾",
            "青山道路遠相望 江海棠花一何如 來經年無人盡日 天樂事何必更無 梨園新年三秋風",
            "中有幾時來江山 自古今日西山海 何處最高人看經 登科第一何苦樂 遙相望秋月滿園",
            "相勸君家山鳥聲 可見人寰海邊城 高樓臺山經秋雨 徒爾為歡樂未曾 搖落梅花園秋風"
        ]
    },
    {
        "fortune": 1,
        "key": "韓國瑜博恩夜夜秀 ",
        "poem": [
            "琥珀韓信未開元 水中國步月夜鐘 迴圈瑜烽火雲中 忡忡博山青青松 送君恩重城中酒 夢中夜寒雲雨中 宮中夜相知君不 兩三秀髮白雲空",
            "裴回腸斷續辣韓 白雲高樓上國朝 流水開元瑜悠悠 盤渦癱博楔櫻桃 無舊恩華滿庭際 中夜聞君別離騷 夜夜夜聞漢武陵 相逢秋夜來多秀",
            "春風吹笙韓倏忽 能幾千萬國三公 十二十二瑜氾濫 猶有餘杭博士龍 蕭蕭條新恩寵辱 千丈人獨夜來從 十三月明夜雨聲 君莫見孤秀成功",
            "狐狸韓辣巍巍巍 聖澤國不關山木 思量瑜沙漠漠漠 蜿蜒博併入雲樹 多感恩不知不知 南山夜夜長門不 水連夜永嘉名利 入神秀木已無處",
            "蜻蜓韓愈捲簾垂 是南國步一片帆 劉琨瑜規啼猿啼 齟齬博廠險艱難 知君恩如昨夜夜 今夜夜聞古松杉 自此夜猿鳥自有 鬼神秀交親故山"
        ]
    },
    {
        "fortune": 0,
        "key": "第二次政見發表會 ",
        "poem": [
            "門前軒冕第蝴蝶 為別離家二三山 路難再造次琉璃 閒人不為政已殘 山色不得見天涯 如何如雲發清談 故關塞垣表乾坤 樓臺上誰會有丹",
            "山第開花如今日 拾二山千古松聲 造次洛陽臺上林 為政牢落花香風 但見西江村落日 明發生事多奇峰 燼表瑞煙濕衣裳 相會有幾層層城",
            "人家山河落第八 十六月夜來二枝 何蕭蕭蕭騷次曾 將何當軒車政織 歸故人亦已見君 不得不聞歌發遲 碌碌碌碌罐表見 江南望天際會時",
            "白露白日下第十 有情不獨有二山 魚龍泉脈脈次行 不得不逢聖政單 一別離人不見海 獨夜雨中興發寒 風流年紀綱表聖 從此日不能會纏",
            "第畢竟何蕭索居 第二京師心歸林 不相次第一相逢 蝙蝠鐲政遼東鄰 帝京城上見春光 龍門前山花發金 五十年年中物表 會當年春風至今"
        ]
    },
    {
        "fortune": -1,
        "key": "說到要做到 ",
        "poem": [
            "便休說無生白頭 故人到日未知名 不可要地平原野 唧唧做淑氣橫行 情難到鄉書記得",
            "為客路難說是何 悠悠然自到白帝 何為我所要獅子 風塵事蹟做仔細 千丈夫人到時見",
            "高秋來唯有誰說 不與君王侯不到 桃李白日不可要 行路幾歲歲晏做 大江水流年不到",
            "憶故人誰說次第 人心猶未到此生 白日長久要使玉 城邊城郭做犧牲 無路入夢到南山",
            "亦不說得知音信 不知到此去年春 洋洋要咸陽關門 披猖做他時不聞 行人到頭人寰區"
        ]
    },
    {
        "fortune": -3,
        "key": "坐在浴缸裡當作是大海 ",
        "poem": [
            "火焚香車馬上坐 猶自得意何在楚 幽獨佔楔浴猩猩 團團圓缸摑鞏樹 獨佔裡採蓮花不 行當三十日在目 作一年年少小徑 城東西山猶自是 誰能為政成大雅 天高秋江海頭不",
            "一年不如水靜坐 十四時人猶在目 與誰知己浴日休 生碧玉缸博望不 琵琶裡彼此去年 還當時來不作賦 作霖雨中無一日 苦辛苦寒山多是 清風起來謁大道 等閒時到海上路",
            "坐看西江山花開 不在我心如花稀 蟋蟀浴旭日相思 汗漫漫缸袁安期 相連天涯裡懊惱 山上頭白日當一 相失意何事不作 是前山河陽城西 小大江海月清風 東西海月光不離",
            "明主人行雲端坐 憶昨日月初日在 三更有意氣味浴 傷心相和鳴玉缸 行路長相思量裡 千里無餘亦何當 十二年年年已作 無因風一年只是 年年無情更有大 來不可憐無過海",
            "入神仙掌中夜坐 不是非不如在東 波上馬蹄浴猩猩 相對酒缸雖未終 開闢裡七十萬事 唯當時還自從龍 作新月滿城南山 升平生不共誰是 城市朝夕臨大隱 天寒山雲海有松"
        ]
    },
    {
        "fortune": 0,
        "key": "中市府廢燃煤機許可 ",
        "poem": [
            "未能使君子雲中 一日已三清朝市 櫻桃李花亂花府 三四十三百尺廢 洞庭前途窮通燃 河漢武功名姓煤 種桃花發紅錦機 來往事空有人許 從此時不得安可",
            "鏡中秋霖雨後庭 淼市中聞君不復 相府有情未有餘 懼廢興何必在五 兔燃恰似雪霜雪 楔煤紗窗下見故 息機事無數十年 已許君猶在何處 如可終當時聞道",
            "朝朝夕陽關山中 白頭白雲秋陰市 落梅雨濕羅幕府 東風流水色不廢 來相思歸天涯燃 江南北走馬卿煤 青樓上客自知機 為誰相勸君自許 昨日日同此時可",
            "如今何在此心中 池邊草草色入市 朝天臺上天開府 翩翩翩翩蠵癱廢 羅網羅衣裳砍燃 風入夢中興亡煤 千門前程千萬機 君莫相思長相許 不可見說是真可",
            "雲雨中夜雨初日 中央市中人不平 簾幕府有幾千里 颼颼廢詩書信陵 劉琨燃砍滄海上 端拱煤癱型叮嚀 飛鳴機心猶在何 兩相許悔不分明 今猶可憐不如今"
        ]
    },
    {
        "fortune": 3,
        "key": "中華民國魔獸世界 ",
        "poem": [
            "五色如昨日醉中 四十二三春華夷 老人非吾民無事 應無一國有青溪 題詩魔聖明月上 野獸悄悄無遺跡 世路不知不相見 相送君王在世界",
            "中有佳期君子孫 繁華殿秋夜深山 雲生民蠵譬如何 東歸故國門東南 有淚沾襟魔驍雄 二十年春草獸單 自有所為經濟世 界秋晚風雨長安",
            "月中見日高歌舞 光華如斯言不復 生民不如雲深山 故國相逢人行不 蛾魔貝葉落春草 百獸兩相逢聖主 身世賢多暇日月 眼界賴有所思故",
            "十年年三四望中 奈何曾向南華夷 踏青草齊民心在 巫峽中國多古跡 遊俠魔姑蘇武功 禽獸炭趟鵝毛衣 世難任他日日斜 年不知何年花界",
            "流年年年中路幾 自知何太華一壺 不為我憂民徘徊 如今如水國不如 洛陽和羹魔樟亭 天高館娃獸不吾 人歸去不世上客 無人開眼界蝙蝠"
        ]
    },
    {
        "fortune": -3,
        "key": "新型豬圓環病毒 ",
        "poem": [
            "新秋月當軒車騎 奔型釣魚龍樓臺 杜鵑豬湛湛露重 終南方圓時人摘 相隨鳳銜環中天 自從今不因病來 杏花紅葉落暉毒",
            "新秋光不相對酒 型藩籬菊花開玉 豬丈夫子不待君 圓荷葉飄風吹雨 環佩吳江上人生 病無複如何處去 毒美人家人去年",
            "時新年不得相隨 奔型浙江流落日 諾豬撕呻吟詩書 回圓聊自從茲始 鳴環浙江南宮殿 衰病不成功成式 勾毒梨花落花下",
            "今朝天臺上新雨 二毛羽衛霍型公 拂拭淚沾巾豬腿 丹青春酒初圓蹤 山榴花開玉環楔 有白日暖日病容 更無人事蹟毒魔",
            "升平地形影入新 一何處不肖型盧 雙雙淚痕豬唧唧 二八月圓梧桐廬 馬鳴環佩蘭徑微 多病身同心不足 毒第一夢魂夢魂"
        ]
    },
    {
        "fortune": -3,
        "key": "越南罐頭檢出病毒 ",
        "poem": [
            "南越女家來往往 征南望仙家兄弟 偽罐獅子雲漢水 前頭上望不知己 縫檢束書題詩人 日出江海西入帝 我病無塵心胸中 無毒杜鵑啼猿臂",
            "蟋蟀越王在眼前 赤城南一夕陽臺 因循罐猩猩猩猩 文舉頭一片雲開 八紘檢癱唧唧唧 明月出處見青苔 憂貧病容易水邊 猶有毒龍虎溪白",
            "向東西風正是越 桃李白雪未終南 不為誰家書簽罐 三百歲歲月低頭 悄悄悄悄趟癱檢 垂楊柳風白日出 遊俠客獨不成病 何為我心已三毒",
            "得清越王有時時 天河南至今日一 芳菲罐砍瀑布衣 雪嶺頭去不因依 芳菲檢棍淼淼淼 二月出世間不移 中無病來人知是 炎蒸毒霧中酒旗",
            "拾越山川上將軍 東南山入青雲峰 盾罐櫻桃李正值 到頭月明日相逢 蛾檢玉壺漏丁寧 日出向東南北風 扶病眼明星使君 無毒草生何人耕"
        ]
    },
    {
        "fortune": 3,
        "key": "韓導來囉 ",
        "poem": [
            "青山上頭陀韓壽 白楊柳千齡導倆 重相逢迎風來不 馮唐突兀兀囉象",
            "不重重重圍棋韓 文章四明朝廷導 不棄置酒一從來 春草綠水晶辣囉",
            "白麵韓信可忘情 擊壤導優遊人意 行人來看花時時 擾擾囉渭北風起",
            "年三四皓腕蛹韓 無定知音信導釁 昨夜月下來不如 毫釐辣囉蹣蚯蚓",
            "未央韓停杯酒杯 匆匆導棍汗漫漫 別後來時來時來 珊瑚囉咸陽客散"
        ]
    },
    {
        "fortune": 1,
        "key": "中日韓工商峰會 ",
        "poem": [
            "中春來江上樓臺 今日落梅花三千 鳳凰韓侯王事多 相親友工人到天 不見南宮商於陵 洛陽和風高峰連 牡丹桂樹陰雲會",
            "承露沾襟袖中事 殘花落花白日眠 五十載酒熟韓章 金玉佩環堵工錢 二月光景清商聲 帝城南山孤峰前 春風清明年會得",
            "中年十五十六十 日高樓前年一生 韓弦管弦聲相見 工牡丹心似五更 商洛水南山中宵 峰出關山水邊聲 會當日一曲江流",
            "明珠玉管弦中無 江南樓臺山日邊 天下淚滴瀝韓曾 有神明朝廷工鞭 不如今已含商於 相思一片雲峰前 主人皆是一會同",
            "有三十六月峽中 知君還應從他日 不如何事不肖韓 不二十萬物化工 去不逢迎春宮商 知何當時不遠峰 九陌上雲雨後會"
        ]
    },
    {
        "fortune": 1,
        "key": "總統辯論會",
        "poem": [
            "總為千秋風吹笙 統筋力不為誰謂 辯騰騰騰騰騰騰 論詩人見清秋水 會有誰能為君不",
            "清光輝輝光總無 青春光搖盪統蝕 有時不知己辯死 日月中有誰論時 別離別恨不會不",
            "花開闢總在夢中 今朝廷統悔不得 驕奢侈辯褒斜暉 相與誰論舊交河 愛此際會人何年",
            "何事總癱太平生 參差統蝶夢魂驚 耕耘辯龐公才子 不堪論文皇帝京 九重會待春草色",
            "總忽聞清晨雞鳴 統嘍羅衣塵起坐 辯騙蛹酸辛苦辛 論交親情何為我 會待取一曲江湖"
        ]
    },
    {
        "fortune": 3,
        "key": "百年奇才",
        "poem": [
            "日日夜來百年事 只應有新年五湖 不自有幽奇花前 今為君子才非無",
            "多謝公子一半百 丁丁丁香風前年 長城南飛瓊瑰奇 知誰知何處有才",
            "有百鳥自古人稀 何年春早梅花時 有奇嘍羅裙帶夕 上才難忘懷舊池",
            "一行人知此生百 何處生春風前年 花落日複幾多奇 中夜深山上高才",
            "吹笙歌一朝百戰 先生何能幾年曾 落盡日在幽奇兵 未能幾人無才生"
        ]
    },
    {
        "fortune": 0,
        "key": "一個漱口杯的問題",
        "poem": [
            "白日一人世間無 三兩個長波動地 歡娛漱罐些些些 巴江口不愛此夕 同傾杯柿葉落落 龍鍾的蛹倏忽憶 君莫問何年不敢 一分題新春雨洗",
            "獻賦詩思君一生 何由來知幾個鞭 歲歲月臨歧漱畔 上春草深谷口銜 紅顏色臨泛杯盾 升平生不破的淹 桃花如君莫問何 事不得見新題蜒",
            "不為君詩思一聲 金絡繹褲砍個酸 梁宋玉京兆漱腿 歲歲歲月峽口傳 秋月明朝玉杯中 珊珊瑚呢罐的玩 夜深入深處問我 百年別來詩題專",
            "七十八荒城中一 卻憶昨日好個是 山泉脈脈漱併入 不出穀口莫道士 杯酒杯春盡日斜 的的五十三萬室 問所依依依依山 非一曲江湖上題",
            "一片雲漢宮中一 關山頂上天真個 獨向南渡頭陀漱 坐石榴花不開口 日無心自有三杯 昨日相歡娛的的 不能幾處不相問 如昨夜靜者為題"
        ]
    },
    {
        "fortune": -3,
        "key": "三立改二立就受訪",
        "poem": [
            "桃李正相從此三 上人不為報仇立 所思歸去年年改 南山鬼神明月二 相尋常自知獨立 青雲根柢騙辣就 江上無心知獨受 花春風飄蓬山訪",
            "三年年年年來時 立馬頭盡黃金吾 改舊是故人世上 二三四望山月出 立天地偏相如此 就白雪消息心獨 受氣中見長安知 訪君王家在江湖",
            "獨自由來日再三 無處處世上立名 獨立身事改洶湧 峨峨峨二峰西陵 幽獨立在東西南 難就嘗聞說向青 受降胡霜露重來 十二三千里相訪",
            "不得意已三徑入 日已絕壁立春樹 桃花春色改喬木 相憶舊來二十步 願得閒人立身為 芳草茅茨就人路 青天子規受命輕 應無令我訪幽谷",
            "是十六十三春光 歲月中鶴立地三 山中人應改男兒 日月如有二江南 十年不獨立在人 水準蠵鐲就陽山 孤城池塘受天門 猶自為我訪持竿"
        ]
    },
    {
        "fortune": -3,
        "key": "沒有水準的媒體",
        "poem": [
            "東西京兆沒青松 聖主人更有時情 窮秋風煙水不見 不知秋水準猩猩 碧玉蟾蜍的譬如 猶未可為媒聰明 丁丁丁寧體仔細",
            "水浮雲沒依依舊 月滿地有處處處 天河流水流光輝 寂寂曆準而今古 不破的的淵明朝 變化龍媒閉門戶 屈宋玉體物色鮮",
            "一身沒馬不能使 行人有丹青溪水 青雲水聲中夜月 茅茨準草木蘭蕙 半破的大漠漠漠 環堵媒併入門對 琵琶體其如何事",
            "沒雲天邊草綠雲 唯有人行人意不 天寒水東京洛水 蜿蜒辣準蹣狡兔 別離群盜的迴旋 人不已成龍媒礎 苦辛苦不憚肢體",
            "沒譬如春風月下 中有餘年未能幾 河流水清商山不 無如水準鱗甲第 此心無端的匈奴 青春水悠悠媒麗 百丈人心猶得體"
        ]
    },
    {
        "fortune": 1,
        "key": "對新聞界的尊重",
        "poem": [
            "平生何謝公門對 承明月下山上新 海棠花下人初聞 不自從來有仙界 無一夕陽城郭的 高樓月初出金尊 宮中路長信難重",
            "思歸滄海門對秋 門高枕上有新草 今日月一夜聞君 秋月當時空界造 山中原野店的前 出塞北風至尊茂 青山河南山重雲",
            "蘭蕙草色不相對 一壺中無複新晴 中夜雨夜聞君無 滄海上界討論兵 鏡破的餓死生死 清尊前朝日西陵 重光陰陰風飄零",
            "對一夜宿昔年無 時新知君歸日邊 昨夜聞夜雨細雨 曆亂世界空碧岩 高歌吹破的彷徨 三百花枝桂尊前 佳人不是故人重",
            "秋至今夜風靜對 百草木落花時新 牢落花滿眼中聞 成行路難為千界 微微微微軀的的 九陌上清景清尊 始知不得君恩重"
        ]
    },
    {
        "fortune": -1,
        "key": "其實妳不懂我的心",
        "poem": [
            "陽臺上有誰其中 唯應須向金實墓 謝安禪心胸妳蛾 處處處宿鳥不住 清秋風拂拭懂答 春風霜風吹我複 猶未盡日破的燼 非我獨坐禪心目",
            "此心豈得其人生 四十四序實可汗 來往往事妳筋力 世人何人不見漢 秋水準蛀懂干戈 由來還向我一飯 蕭蕭蕭娘的芸閣 白雲中客心無伴",
            "是神其有所從來 來無實堪傷春煙 菩薩妳斷腸斷腸 無事不相如珠簾 匆匆懂至今日夕 客思我雖然無言 煎熬的億萬事不 美人心如天上千",
            "丈夫君其如此生 誰家山實非關路 中峰巒妳函關山 風騷人不為何物 颼颼颼懂驪龍蛇 世人問我心醉舞 淅淅淅的倡狂風 天明君心歸路入",
            "其如花枝上帝鄉 擾實棍罐騙曳履 狐狸妳摑匆匆匆 猶在人不勝春雨 夜夜深衷懂蝴蝶 裴回頭人自我欲 只應知天地僻的 心不惜別離人去"
        ]
    },
    {
        "fortune": 1,
        "key": "你覺得誠信重要嗎",
        "poem": [
            "問訊你姓名姓名 應不覺來相望煙 新安得一片片石 山精誠已十餘年 皇恩信是閒人知 青雲重重到天邊 蜿蜒要地久別離 瓦礫嗎抬舉世間",
            "連天宇宙俏你曾 唯有千萬轉覺梳 千門無人爭得上 今日不願奉誠足 當時見君恩信馬 上望鄉里萬重湖 未已聞道自要路 向東南山后嗎蜍",
            "青山遠別館娃你 從此曲江春日覺 春風雨過此處得 相望遠山雲中誠 上春日高車書信 白雲路入門不重 不見人相逢只要 不回風露盤渦嗎",
            "由來往來儀你奔 欲知何人已覺心 楊柳枝不能得如 鬼神仙人推誠寅 小兒童子不信可 安得仙家山重陰 複何當時不要人 有千萬丈夫嗎金",
            "景物華夷狄你蛾 風月如今始覺人 月明月中誰得知 山中有夢中誠紳 更何處無人信斷 獨往來不出重恩 新安得意不要曾 無他人獨佔嗎沉"
        ]
    },
    {
        "fortune": 0,
        "key": "百萬韓國瑜原味衣",
        "poem": [
            "分明月出門三百 來不同遊人萬戶 彩毫釐罐韓魏公 卻憶故國有幾處 雕鶚瑜憧憧憧憧 秋原野泉聲遠目 味不覺天臺上月 荒涼風清光滿衣",
            "二八百餘生不見 上山萬里一事不 端拱韓魏王事多 衣上國人人歌舞 毫釐瑜邵平明朝 西北原上高風入 獨有味別離別離 天寒衣無奈何處",
            "百家貧居人歸來 一萬古人生春深 煎熬韓愈拭淚痕 秋思鄉國門路塵 一葉落暉瑜懊惱 年不知是秦原珍 使我有青青楓味 衣薄情何處生分",
            "日三百花隨風起 有幾萬乘時人間 雕鶚韓笙歌聲入 依舊國在南山連 朝元瑜鈞天上客 四郊原七十年年 華滋味挾彈琴書 雨濕衣上春風煙",
            "鶯百種桃李太平 與萬山夜猿鳥啼 西韓壽杯酒不見 楚國風送君別離 元瑜伍員外更何 屈原人世情何極 風味浙江湖上月 滿衣寒空山河西"
        ]
    },
    {
        "fortune": 3,
        "key": "南瑤宮兩公里頭香",
        "poem": [
            "南去不獨裴回看 拾瑤嫦娥月寒更 神仙宮中無人知 明日月兩鄉人生 山中人至公不是 白頭上小市里程 何人別離亂峰頭 香魂銷日登高僧",
            "終南至公子不敢 西瑤荻花白雲煙 離宮樹不自從此 此兩如今日已先 三公子方寸步虛 故里餘花枝上天 江頭別離人心如 花香花時出門前",
            "一朝雲山河南風 如何處處士瑤蠻 江湖水東西宮女 神仙家在此兩三 歸去去年三公侯 九折腰鐮癱里寒 捲簾幕下床頭吟 忽如煙火焚香纏",
            "驛路傍人南去來 不知何遜瑤梧桐 夕陽春深宮樹影 路長江分兩兩宮 離群公車公不見 綠楊柳營里煙中 北極目前頭人來 水中有靈香山空",
            "只應有一曲終南 臨水雲低昂瑤治 等閒暇日宮漏長 無因成兩般若是 侍從公山青雲生 千里心向五十指 頭春秋夜半夜夜 人歸路傍人和香"
        ]
    },
    {
        "fortune": -3,
        "key": "我完全沒有動腦袋",
        "poem": [
            "我今來十二十年 完呢靡靡靡不惜 全少年年少人不 沒後堂上望青溪 有如昨日日月下 動三千門外無一 腦倏忽驚風吹笙 袋癱鯊騙菩提攜",
            "來幾千秋聲似我 萬古人生靈芝完 千丈人看五兩全 應無人無事已沒 知君王城南山有 自有歸路長樂動 為我有青雲龍腦 高秋草青冥鴻袋",
            "不使君子不為我 晨雞犬戎幕完拌 令人心獨全勝遊 花如水沒馬長歎 月下有淚滴滴滴 不動搖風吹斷岸 腦甲第一團團團 長在天上頭陀袋",
            "疏籬菊花笑我身 斷蓬萊衣冠完窯 竹林園春色全身 夜啼猿啼鳥沒妖 白雲中心未有餘 不相看春光動搖 花下玉蟾蜍腦拾 與君王城隅袋漂",
            "天明朝天使我有 六十八紘楔完焦 南北歸雲生全家 秋風搖落西沒雕 少年如何事有期 傷心常聞鐘動搖 辛苦心知己腦奔 十五十二毛袋獠"
        ]
    },
    {
        "fortune": 0,
        "key": "那個國家就是中國",
        "poem": [
            "孟郊園花爭那言 今日為大廈個滯 相思不似舊國風 人歸未有一家事 生百姓名不就月 少年年已知是世 自憐君攜手中人 秋風過三楚國士",
            "向人世人那作歸 畫圖書一個人一 白雲雨一國多事 遙遙望仙家月移 樓上客來就東去 相顧我自是北極 蘭蕙草堂中人不 天下三蜀國相依",
            "良工夫婿砍那肯 碧落花開三個瀏 今古來向秦國不 者誰能忘歸家猶 聞道路行欲就東 猿啼猿鳥自是悠 為君不歸心中原 白髮生死鄉國羞",
            "兄弟兄弟那邊城 別離家有個努力 出門十萬國風起 次第三千家有地 南山遠相就葡萄 鶯啼鳥自是今已 水東風雨中無處 真宰相許國有幾",
            "年不那作一言語 兩兩個長不勝事 歸故國無名姓名 君家家家有誰是 蟋蟀就中有長安 向誰是夢來多士 向此中月滿池館 存亡國朝不相識"
        ]
    },
    {
        "fortune": 2,
        "key": "反滲透法三讀通過",
        "poem": [
            "奔反昨日相逢秋 拾滲賈傅岩前程 月透零落日已成 王法無情無數聲 有三歲不知君臣 縫讀易失計未曾 難通山萬事不見 初過山空有餘生",
            "一杯中有餘反成 桃花開襟袖滲董 南山城東風透勾 與君不用心法聳 六十五年二三山 亦可尋常不讀筒 只應有高山通海 雲中夜夜夜過重",
            "反七十六月未知 曾滲絃騙猩血食 風光透鱸魚目前 見我心法駕何之 誰知何為三伏枕 幽棲鳥亦曾讀詩 如何人空山望通 過水綠野花滿池",
            "羽衛霍反砍蝙蝠 風騷雅滲癱營營 應無垠透罐牡丹 為一聽法雲無名 得閒遊三光不相 歷歷歷讀詩人聽 一夜相通海風波 京華陽過門前庭",
            "苦吟哦辣反拭淚 草堂開闢滲諺瞳 悠悠悠揚透荻花 來者誰問法王宮 何處不得三百花 三十日嘗讀古同 丈夫君相通海門 上清洛陽過寒松"
        ]
    },
    {
        "fortune": 0,
        "key": "馬英九到底軟不軟",
        "poem": [
            "波上馬來獻酬恩 宋玉英風何況複 相逢九江漢主人 入夢到明月色不 南澗底清光何人 丹灶軟騙蠵琪樹 日日不可親故山 猩猩軟使君王母",
            "紫微月下馬蕭條 青山上玉英賢侯 天高樓望九轉蓬 只應有夢到江頭 有微雨腳底水邊 河漢皇后軟盒勾 相思不死不相思 髮生羽檄軟行舟",
            "百草綠竹馬如霜 功成白雲英靈異 是非所有九重陽 憶昨日日到長憶 風吹落江底凜凜 萬宇宙擦軟繩系 滿眼前事不須知 翩翩翩騙軟濟濟",
            "年少年年來歸馬 黃金殿春風雲英 南山水邊城臨九 何人行人來不到 春風雲水流水底 三月團團扇鯊軟 此去年三五年不 無心不須知己軟",
            "三月五馬不堪悲 虎溪雲英英髦廚 去不到九天明月 何時得到來何足 孤直到底水不可 春風緊軟驍雄圖 山遠山不可忘卻 此懷柔軟巫山出"
        ]
    },
    {
        "fortune": 2,
        "key": "大師鏈棄台灣市場",
        "poem": [
            "老大小大賢良時 行坐禪師出門人 翩翩翩鏈咸陽春 千年皆棄官路深 參差池台城中天 頹波澄灣沉沉沉 山上金市井上人 去不肖場賈生塵",
            "落日大野花前山 相尋師心自古人 搖盪鏈建章台下 酒莫棄置舔鬼神 姑蘇台衡門不知 黃河灣匹馬出門 都城市人不見人 苦戰場醉吟君身",
            "不出入大道何時 有無勞師在耳目 一毫釐鏈耆舊隱 晴空自棄物外物 河曲池台空相對 元戎裝灣韌併入 千載酒市東堂上 茲晨雞場湛湛露",
            "此生大江城市井 相與師不能忘機 琵琶鏈鐲懊惱人 君不棄官滿床席 成霜台閣上天涯 擁腫灣奈何如泥 今如市中猶有時 吾道場苦吟繞籬",
            "心亦無因知聞大 上春風煙雨師古 不是吾師鏈琵琶 太白麵棄贈君不 華池台下山中人 澄灣叔夜長憶故 市人相憶昔年不 可憐君開元瑜場"
        ]
    },
    {
        "fortune": -1,
        "key": "美軍空襲敘伊復仇",
        "poem": [
            "已三子美少有時 桃李將軍猶聞有 寂寂寞空中天寒 月光輝襲銜杯酒 有淚痕敘纖纖纖 高樓臨伊昔人又 單于穆復回望不 人未報仇二十六",
            "雲深紅兒童子美 臨水滿眼前軍門 太平生長空使君 寂寂曆襲人無根 憧憧敘浙江月明 曾伊州人上路塵 復捨下水西東西 泉脈脈脈呆癱仇",
            "吟苦吟詩書信美 還應無情不及軍 花滿城東西樓空 千萬里同一隻襲 徒自古城頭陀敘 從他日影搖盪伊 無事不回看不復 胡麻姑蘇台前仇",
            "江水連天南美非 終難成空將軍中 夜啼猿聲秋空有 宛宛轉蓬萊襲龍 明月色滿院敘魔 有一朝廷螃伊聰 能幾千山回復見 獨往還有報仇農",
            "一回首陽城中美 新詩成陰雲從軍 至今來江流水空 草綠鬢毛羽檄襲 不知其如絲桐敘 東歸去不來從伊 有意何處問訊復 春風不借問訊仇"
        ]
    },
    {
        "fortune": 3,
        "key": "反滲透法不反交流",
        "poem": [
            "風吹笙反復舊宅 還獨佔滲浮世間 山根柢透騙嫦娥 已聞說法雲天邊 能幾時不相見人 不顧盼反為水連 如可親交遊人盡 一望江流落花前",
            "反蘆花落星月下 災滲恰似君不整 荊棘透八九陌上 疏傅說法紗窗夢 眼前春風不還似 不同遊人寰反正 南國風流水結交 流入東西風自省",
            "不相如何以慰反 遙相思君莫遣滲 酒一杯酒一盞透 有幾時一朝廷法 如有如此時來不 老夫君王孫弘反 卻憶昔年花結交 禦溝水長在江流",
            "陸賈誼摟反楊柳 黃河水準滲阿母 千秋山光透剖竹 江山中聽法雲樹 風搖落盡不見君 花結茅茨反自入 更何如故交遊魚 八十二月流不住",
            "反哺辛苦辛苦相 盾滲徽音塵土木 湖光透簾相如今 幾時聽法王不復 殷勤苦吟不相識 紅妝成龍鍾反哺 日落日正是神交 流年春山月出入"
        ]
    },
    {
        "fortune": 3,
        "key": "佳子公主出訪歐洲",
        "poem": [
            "知何言歸未有佳 自是何所求之子 未得長楊花謝公 何人憶昔日明主 自從此行高步出 萬事空山空相訪 玉指揮毫釐辣歐 一夜寒梅花芳洲",
            "蟋蟀佳色好是非 晴天子有故山邊 江上公一別有餘 不報主嘍羅浮天 高飛出入神仙郎 今為訪舊宮殿前 毫釐歐仲宣父母 折芳洲客無一篇",
            "佳麗天明主人去 子不曾向天子真 公樓頭人間無事 主恩深不可酬恩 出山中無人生涯 訪君莫相送到門 歐渡頭白雲生死 洲去去不到此身",
            "為君獨往往往佳 羅網羅浮生子風 顏色連天公道不 如今作主家人聲 風流出門柳風吹 我訪君看山空城 歐浙江湖邊烽火 花落日西秦吳洲",
            "佳遊三十三百花 夫子不如霜毛衣 分明公與此身外 親故園主家不離 明朝天路出花落 歸來相看來訪遺 哀哀猿吟哦癱歐 洲路向夕陽烏啼"
        ]
    },
    {
        "fortune": 3,
        "key": "海豚騎士普丁",
        "poem": [
            "何時不覺來江海 唯應須憑欄幹豚 上方知音信馬騎 昔年不知天高士 何人自有佳句普 當年年來本姓丁",
            "月色連海內史書 翠羽毛豚颱風至 無停車騎姑蘇武 故交戰士懷何事 千家醞普蹣努力 風旋添丁當春日",
            "銀漢江海西子孫 滔滔滔豚蛹駿骨 休征車騎吹落梅 出眾賓士名不復 擾擾擾普管弦管 青玉漏丁香出穀",
            "海人何況複誰不 豚亞相逢故人獨 騎出門萬方知己 士三萬丈夫子出 普穆穆穆天風起 丁當午時無事無",
            "此時還相見海月 一別來往復豚沐 佳人歸來遊騎省 歸路不得志士不 無所為一朵普諾 丹青草蟲響丁祖"
        ]
    },
    {
        "fortune": 3,
        "key": "貳零貳零新年快樂",
        "poem": [
            "聲聲入秦塞垣貳 有一生羽檄零琴 萬里別墅貳淑景 蜻蜓癱零陵樹陰 故園新雨細柳枝 十年別來自從今 快楔二十五十五 東方寸心自不樂",
            "門前事事蹟貳盾 車馬蕭瑟瑟零除 蕙蘭芳杜鵑貳孔 突兀兀兀擦零蘇 對此心胸中新花 月明年來經年都 累累累累蠵快寸 青山雲連天樂無",
            "風搖盪貳珊珊珊 樂未已零雨晴明 垂釣磯貳等閒居 碌碌碌零估客星 到此時新秋來無 難任他年光一行 蕩漾漾快譬如此 容易為樂不自輕",
            "霜鬢髮新詩魔貳 應是非吾師零琛 空床頭陀貳捨下 春風飄零磊落人 爭得新春來此去 經年何紛紛紛紛 快支公車馬上高 自由來相邀歡樂",
            "貳儘是三千秋聲 零癱拭淚如此會 貳風卷舒卷舒卷 零淑氣不及春水 新柳含風至今夜 年未知誰家山鬼 快意在東風景氣 樂未得幾年來未"
        ]
    },
    {
        "fortune": 3,
        "key": "二零二零新年快樂",
        "poem": [
            "來二峰外無窮通 拾零湖上望雲霧 年二三五十春草 勾零芬芳草樹木 添新秋水頭白雲 少年年深淺深處 災快聰明月上頭 張樂鐘山無人不",
            "封侯門對此二江 相憶昨夜鐘零陵 落日日日逢二百 歸來不顧盼零屏 太平陽春日新詩 無一枝花流年行 憶昨日落帽快拾 天上有所歡樂清",
            "二八十六年二妃 千萬年已凋零杵 年不及第十二千 今日在五丁零附 豈無多暇日新恩 是誰為君去年樹 畢竟不顧盼快意 不羨君子不樂不",
            "幾時有二年無人 蟋蟀擴零淚千古 終南風二八行路 雨中央零美人住 高堂上新豐年三 人知幾年將心苦 麻姑蘇快楔贏得 管弦管樂天寒暑",
            "一萬里心不逢二 洞庭花未已零堆 無由來年二毛衣 飄飄飄零淚空為 時時新婦人盡日 年年華山之子規 快貫珠簾垂楊朱 欲何況是風雅樂"
        ]
    },
    {
        "fortune": -3,
        "key": "黑鷹失事將校殉職",
        "poem": [
            "一旦夕陽秋天黑 無為魚龍盤渦鷹 舊遊人更容易失 東南國有幾多事 十二年無因之將 六十二三年不校 不知音書簽罐殉 至今何年為官職",
            "夕陽春水濱蠵黑 無人去不相續鷹 虛空山青山多失 如此時得幾人事 零落日月落時將 白楊柳絮鐲騙校 何由來客心肝殉 南陌頭白馬蹄職",
            "黑譬如雲垂楊柳 鷹摟蒼蒼蒼崖谷 失卻向江風流鶯 事空將老病身入 將此時一片月明 校浙江中分明主 殉奈何時見此時 職事少年不同宿",
            "雲黑山千里長安 秋鷹下高人不必 腿失卻成絲管弦 中事不見秋日已 飛將出塵埃塵埃 曾校皎潔白石壁 勾殉勸君不相憶 奔職在遠行役役",
            "夕陽和風颼颼黑 水流水清晨鷹初 青青山有失道不 百年少事空林疏 鳥飛將入海棠梨 將校獵時時何如 殉擺落花繁花開 中流蘇武庫述職"
        ]
    },
    {
        "fortune": 3,
        "key": "總統大選倒數",
        "poem": [
            "今如水準總戎馬 樹含毫釐統蹣霖 生死不成大堤下 八十四肢選勝因 東林下絕倒玉杯 光含笑指數君吟",
            "如何人不測總是 如斯文武庫統紙 樹色分明日大河 芳草青苔蘚選秩 知名利如山倒景 秋水碧桃花數尺",
            "心事事總無人情 若問訊統於此中 人傳聞大塊然心 累累累選將相容 相見山倒旭日晚 勸君不數重泉宮",
            "重城西京兆總腿 由來無端拱統呈 聞君今日與大河 唧唧唧螃呢選撐 向東南北山倒影 在其奈何得數聲",
            "仙人不自古墓總 出門望京兆統嫌 農桑田家大如此 子規矩選十年年 事蹟倒唯有佳期 歷數行雲無可憐"
        ]
    },
    {
        "fortune": 0,
        "key": "戰到最後一兵一卒",
        "poem": [
            "十載酒有戰血流 獨自有時到山松 明月寒色最多是 至今年年後至公 不知不見一年少 將何時論兵不同 清秋風流一何處 牡丹鳳凰卒弘農",
            "十年春來去不戰 入夢中有客到身 自傷心情最上清 不歸軒後春深恩 桃花一何處處是 論兵來年年少人 一相憶昔日晚來 日長安得長謠卒",
            "從此時得一一戰 明鏡中心不曾到 相勸我有幾人最 磊磊落花飄然後 徒自然無乃知一 安石榴花春殘兵 奈何用心不得一 未終不知不耐卒",
            "戰死不得如何事 到江曲池上青苔 最高竹林泉脈脈 後庭中夜啼猿哀 一裴回首望春風 兵猶憶昨來歸來 一行處處不是人 卒柏梁園林中開",
            "流水上天生百戰 轉蓬壺中秋月到 知何人今朝廷最 春來不見新雨後 還應有美人同一 無數十二十步兵 櫻桃花影落花一 南山鬼神鬼魅卒"
        ]
    },
    {
        "fortune": -1,
        "key": "美國狙殺伊朗將領",
        "poem": [
            "峽美偕老人歸去 故國山城西山路 盾狙皎潔白楊柳 思殺氣秋夜雨露 聽伊余何當年年 盾朗詠思千古渡 還將斷腸斷蓬山 截領軍夜月不入",
            "雖有美俏煌煌煌 如故國遠樹花落 千里狙呢柿葉落 衣裳殺盡醉客過 鶺鴒伊流日日夕 英髦朗走馬不作 日還將出雲雨露 日一領堅貞心所",
            "子美荊門閉門外 故國風清明月中 痼狙猛虎溪雲外 曾殺砍鐲騙匆匆 臨伊呂低垂楊柳 朗朗瞿塘水上公 上將何如此意氣 腿領軍城頭上東",
            "青雲山共美干戈 來無端憂國不及 幾千官職狙柿葉 欲盡日射殺身騎 浩蕩蕩槳伊何所 工夫子孫朗支頤 老大江漢將白首 彩毫釐引領九疑",
            "南美少時有故園 戰國寶帳下西陵 里狙攜手自有所 愁殺君獨步蒼鷹 臨伊辣磊落梅花 答朗邵平生不行 欲將來還如今夜 簿領廠樟亭亭亭"
        ]
    },
    {
        "fortune": -2,
        "key": "美伊情勢衝擊原油",
        "poem": [
            "美玉關關河漢家 臨伊昔年春至公 是無情人還家家 幽獨佔勢出人從 不獨佔癱衝肌膚 別離離群彥擊蟲 蘭蕙蘭葉下西原 油艱難為客心中",
            "歸來者誰與美少 海上天山臨伊予 梧桐花下有情不 彬彬彬彬彬勢欲 白頭白頭陀衝罔 悠悠悠然癒擊慮 飛鳥飛入九原蛾 三十八紘癱油序",
            "美人有風流水聲 豈伊譬如相知音 不離情無弟兄弟 九重譯勢盡日新 江海水準衝琥珀 馬上青龍鍾擊拼 百萬古渡遼陽原 油壁開千歲寒林",
            "美緬懷君王侯家 從伊優遊騎馬上 離別情人心知何 清景氣勢難盡放 為君子規衝玫瑰 回首一回風擊壤 東風波上路荒原 油偕老僧來心尚",
            "征夫子美罐瀚海 婉娩罐伊捲簾不 如何人情自知音 不相逢勢欲何處 舊隱淪衝拇琥珀 人未央擊石泉入 天子規原上客愁 海水準油雲心目"
        ]
    },
    {
        "fortune": -3,
        "key": "蔡正元強逼翻供",
        "poem": [
            "有古今朝廷蔡家 為君別離心正南 如何時一朝元君 何如有酒莫強潭 從此地無垠逼人 盡日醉舞袖翻翻 雙雙淚沾巾供臼",
            "蔡棍邵平原野花 端正聲猶自無風 雲中元元氣滿頭 年十年強秦王城 干戈矛蛀逼茫茫 別離別有雲翻成 碌碌碌碌碌碌供",
            "君不得到頭陀蔡 不自相逢春日正 入夢中峰巒黎元 太白雲是何須強 家貧居人寰區逼 頭白雲雨中新翻 少年不勞問訊供",
            "明鏡中禁城下蔡 東西風月上花正 別有歸夢中朝元 風吹盡日應須強 塵埃塵心不復逼 焚香濃香積雪翻 才子規啼猿鳥供",
            "杜鵑蔡湛湛露濕 明月正無心未足 樓上元老無因循 在須強把金井梧 菩薩逼人一曲江 山雪翻飛泉水無 肘腋供段成行雲"
        ]
    },
    {
        "fortune": -3,
        "key": "烏克蘭客機墜毀",
        "poem": [
            "烏飛去何曾向日 克淑氣滿庭中峰 蘭香風露草木落 客吟白楊柳陰風 機上帝城西東西 墜葉紅樓月未曾 毀捨下馬不得見",
            "東海上山水中烏 宮商賈誼呆型克 複何如今日樓蘭 搖落日又見南客 秋風涼風生塵機 雲山東西園花墜 終南陌上方寸毀",
            "一日斜日欲棲烏 有鳥雀羅敷克德 銜杯酒樓蘭露重 登樓中客路人得 暫忘機孰能幾回 諾墜旭日登攀折 毀滄海上青草木",
            "只有黃鶯啼烏府 城下淚沾巾克閩 無由來東樓蘭葉 上天上千里客吟 不早晚來無機心 露沾襟帶露墜金 玉關河水闊毀垣",
            "烏颱風波上千里 克十二八十二十 蘭堂上天一片月 客不復還入紫芝 機撕棍淅淅淅瀝 墜淤泥沙鳥不失 毀奔走馬頭白石"
        ]
    },
    {
        "fortune": 3,
        "key": "特斯拉市值創新高",
        "poem": [
            "車馬出塞鴻特協 桃花時平樂斯在 為大夫婿癱拉拾 何殊未衰柳市耐 應無事不相值拾 世亂兵戈矛創汰 山川原草色新月 辛苦相和風高百",
            "特叔夜相逢迎風 道斯在茲夕陽宮 骯髒拉贏得見人 只為小市賣與榮 山客心相值匈奴 海棠梨園蔬創弓 花滿庭前溪上新 高才子有青絲桐",
            "寂寞特地遠夢中 少於斯人少年催 擁腫拉紫芝田家 乳燕市里月光輝 草正值明日夕陽 菩薩創狹斜陽歸 寒更新春欲去不 青樓高望長安危",
            "青山翠微微軀特 白雲山行李斯文 悄悄悄擦拉贏得 春色入市中看春 環堵值洛陽春江 兔創千尺素琴尊 新月明月影斜暉 鳥飛泉石上升高",
            "萬古人知何妨特 草色滿眼睛斯言 何由來儀拉梨花 東風入市橋去年 莫相值等閒心無 滾創辣訟庭樹煙 新雨後來相知君 何如今人何日高"
        ]
    },
    {
        "fortune": 1,
        "key": "花蓮鳳林鎮發年終",
        "poem": [
            "花月滿頭白雲歸 蓮舟夜來無名利 鳳台城池上天涯 林棲鳥不及此地 鎮南有佳氣肅肅 發垂釣台下馬亦 年年來相送君今 終相思歸思量力",
            "終日早梅花紅塵 銀河冰池蓮葉行 忽聞天上鳳管吹 終日出山林風情 人世上山鎮長條 枝紅杏花發清明 取次第幾年年少 唯有長生終日清",
            "十年花白雲中人 鶺鴒蓮船回雁門 上丹鳳台月斜倚 猶在林中有君臣 珍重鎮邵平生塵 遊絲發時見君恩 年來年長安石上 春未終不歸來人",
            "上升天下淚如花 明月清溪水蓮葉 與君恩威鳳歸客 如此中林泉灑血 雲作鎮南陌頭上 素發亂石分明滅 年曾無事不見人 有幾千古人言終",
            "花開三千里別離 折蓮池蓮峰前侶 武威鳳樓下山川 泉聲隔林木落羽 銜杯盤渦鎮南北 青青山雨散發去 十四十五門前年 終日落日看白玉"
        ]
    },
    {
        "fortune": 0,
        "key": "福斯汽車新疆擴產",
        "poem": [
            "福喬木落花月中 斯不可見一望中 汽耆舊隱隱隱幾 車騎出關門開紅 新白雲山僧歸來 疆癱造化功成空 擴莓苔石榴花枝 產菩提劍門臨戎",
            "福庭月清芬芳菲 如斯人如何蕭郎 瑪瑙汽科第一時 落梅香車輪廠昌 山下有時新聲落 不得知君王疆場 長相送君王孫擴 產嘆惜年年年長",
            "福庭草木春風生 斯言是前事可以 汽淵明鏡湖山路 車馬上天高風起 新人少小姑蘇武 疆億萬丈人心已 擴昨夜涼風蕭條 產綠楊花片石壁",
            "曲江上一百福無 安得意何如斯不 天地多事蹟汽滾 見君獨向前車入 春風光景氣新詩 幽獨含毫釐疆祖 相逢人別墅擴滾 能幾時更無產訴",
            "年不還來百福諾 一身未知己斯年 曲江水清淨汽拾 辛苦寒梅香車前 青松桂枝條新句 人自相顧我疆錢 江上方知己擴詹 片片月下無產天"
        ]
    },
    {
        "fortune": 1,
        "key": "回家投票別再哈囉",
        "poem": [
            "知君未回首詩成 寒江漢家山獨立 花落帽投筆時不 峨峨峨票淅淅瀝 芳草長別家白雲 開元戎再到日已 如何妨哈贏得意 湛湛湛囉獅子喜",
            "裴回塘水石橋邊 還家本是一夜靜 知投分萬姓名利 曾票殺人不能令 山別愁人家家家 燼再見少年無定 罔哈旭日不相逢 盾囉邸第幾時命",
            "幾回不容易失意 我家無複何時複 罔投筆下三十月 蛾票嗜酒一聲不 中別有清洛陽春 楔再入夢中無主 諾哈遼海門前有 兔囉倏忽自相顧",
            "相逢春風一回望 豈無奈何有家人 豈不平沙鳥投荒 時不相問訊票珍 江上有佳人別處 千秋夜風期再琛 今夕陽宮殿哈楔 丹青山前程囉噴",
            "裴回廊廟堂有人 豪家人知何人行 欲投林間人世人 鉤票遼海棠花明 人別我欲知心期 已再入洛陽和平 兔哈癱瀘水東流 答囉棠梨花開青"
        ]
    },
    {
        "fortune": 0,
        "key": "蔡英文連任總統",
        "poem": [
            "蔡第三四十二十 紅英俊置酒一聲 入漢文物自可惜 在東閣連江邊城 見蒼蒼生任從今 三十年光輝總更 畫屏風煙波浪統",
            "蔡女夜長江水流 瓊英才不還似龍 不用文明德音書 誰能留連連山公 長江邊一任從今 兵戈甲乙蠵總戎 征戰馬上青娥統",
            "蔡拭淚落葉黃河 代英才不見星辰 胡為文物不顧我 千里道連三春深 如何時一任所為 從此時康樂總呻 見黃金銀蟾蜍統",
            "自此地無風緊蔡 一一貫珠玉英靈 忽忽如斯文園中 日臨水連城春晴 徘徊任白雲中原 腔總是夢中朝廷 統咸陽臺上天臺",
            "夫婿蔡家人何必 在咸英奇才能令 山水文雅篇篇章 五色連天明月影 只自任君還自古 思量總金爐峰頂 規矩統焚香塵埃"
        ]
    },
    {
        "fortune": -1,
        "key": "韓國瑜取消記者會",
        "poem": [
            "多感激韓魏帝力 江南萬國未曾經 南朝廷瑜遼東西 昨夜不取金台星 今日未消時物外 讀書簽記蘇武陵 新秋來者何能為 青天際會有人行",
            "無一聲名利韓章 三十六經邦國一 望三十八卦瑜蛾 欲何由得無取崎 蕭蕭條風煙消卻 五千山根柢記蹄 古今夜來往者雖 有時清明朝會稀",
            "蟾蜍韓公無端拱 何異國有知何物 干戈瑜枕席上有 日看取一家家住 有能消息陰風煙 夜長記騙肅肅肅 前賢者無知音信 美人會得春水木",
            "白雲天宇宙韓信 不為誰是南國春 世人不見說瑜諾 丹青春深不取坤 誰知音信難消盡 萬里無聲長記魂 滄海上下來者是 別離別時不會文",
            "丹砂韓洶洶洶湧 重瞳國多好文章 瑪瑙瑜復還將軍 人自取涼風蕭郎 猶自消諒無奈何 四肢記名已遠方 無勞者如不見君 故人會須知不妨"
        ]
    },
    {
        "fortune": 3,
        "key": "投票率創新高",
        "poem": [
            "殘陽春來投宿昔 彩雲端拱票嫦娥 年長相牽率茂陵 難得知己創短褐 秋風月中新秋光 人不見山高下車",
            "依投分萬里行處 拾票紗窗風起舞 漫率舞袖拂地上 虹創萱草綠水不 中新秋霜鬢髮新 在高峰出門閉戶",
            "生死生別君欲投 無人不堪獨佔票 歌舞腰金絡繹率 坐久別離別墅創 人心亦相逢君新 往往來春深山高",
            "安得無人相投跡 登高歌舞衣票康 年不惜芳菲率拾 自知天子規創璋 心不相逢時新年 高秋色滿天高堂",
            "水石榴投沙上有 淅淅淅票摟瞪目 君王孫率嗜欲何 憧憧憧創殷勤苦 不相逢新秋雨餘 秋風月高風景物"
        ]
    },
    {
        "fortune": 1,
        "key": "陳柏惟當選",
        "poem": [
            "田園廬山雲橫陳 神仙桃花叢竹柏 何以為客至德惟 第一丈夫子不當 香車馬上去時選",
            "春風雨聲猶在陳 悵望鄉路長松柏 天下三月明日惟 終日出雲生何當 區區中無端拱選",
            "陳平如白雲斷腸 柏有時向東風吹 惟昔時清洛陽宮 當今來不為爾為 選黯黯然一尊前",
            "陳平樂以為霖雨 賺柏畢竟無所為 道情惟德不覺來 所思君當年未歸 殘花開時選併入",
            "春寒泉聲長樂陳 焚香飄飄飄飄柏 落花落花不顧惟 從他年年一日當 豈知何曾為文選"
        ]
    },
    {
        "fortune": 3,
        "key": "吳敦義擬請辭主席",
        "poem": [
            "金甲第三吳天際 莫相思量敦乍疑 太白露恩義不得 相思君未擬何其 去不然諾請君看 時人知何辭君一 亦不相公主憂不 殊未開闢席妖姬",
            "吳台月中原上天 彌敦獅子何如日 平明義感神鬼神 空餘亦擬學禪室 子規模呢請牢落 往來相如何辭世 無人未為別後主 席不知人莫相識",
            "吳鄉山花香車馬 敦婚嫁得歸思苦 義感別路長吟罷 擬學仙家貧家住 請長相逢佳人事 辭春早晚來無處 主為君獨自從此 席不敢望白玉露",
            "當年二十三吳娃 來相思無媒敦垂 茫茫茫然不義動 雲中有期終擬為 何處所以自請畔 行人別恨莫辭頹 何時聞道無主今 凡幾萬象床席鮭",
            "東吳越女蘿月滿 滾敦詩不成長年 大義感物已寂寞 亦擬寓直如可憐 畔請問同一片帆 敢辭醉時有幾千 公主賜食夜來何 祖席上頭白雲邊"
        ]
    },
    {
        "fortune": 3,
        "key": "火鍋好吃",
        "poem": [
            "分明燈火雲山水 木蘭蕙鍋參差池 天上人好風簾外 金鳳凰吃丹桂枝",
            "無煙火不相送春 箕踞鍋癱仔細葉 明時好風蕭蕭索 銀盃吃猩猩猩血",
            "校獵火燒盡醉後 琵琶鍋罐捕魚樂 新詩好花落花滿 乾坤吃耆舊隱者",
            "清江湖邊烽火夜 清夜月明主鍋六 江南風煙月好客 自此心胸臆吃酒",
            "火微之為君王孫 鍋梳頭白水綠苔 好天邊城外物外 吃殊未可憐春來"
        ]
    },
    {
        "fortune": -3,
        "key": "范罵狗官是在哈佛",
        "poem": [
            "時一鬥牛羊酪范 渺渺渺彌趟罵笙 無塵埃楔狗喬木 君為郎官如何曾 來皆是吾道在眼 猶在何所思勞生 哈凋零落葉黃雲 樓臺上風光陰佛",
            "行樂毅范悠悠悠 老大廈罵棍騰騰 未鳴雞狗涇渭北 春盡一官舍此聲 自此身是故人生 何時猶在一生能 蒼蒼蠅哈呢蟋蟀 赫赫赫佛性情更",
            "第一隻范採蓮花 有佳句罵旺琪樹 諸侯家狗奈何年 浮雲中官城南楚 向人疑是處不如 如昨日在家無複 野渡瀘哈顛狂歌 便是諸佛聰明主",
            "蒼蒼龍鍾菇范淼 人不獨佔蠵罵黏 七十四鄰里狗佔 十年猶未休官天 不如何日應是夢 向東西日月在咸 誰能幾歲晏哈拾 人知何況是佛前",
            "今日相如此地范 紫微風沙鷗罵沐 此地無家狗碌碌 池上千官在深處 安知是誰與人不 不在何況是無複 哈儘是一年不見 江南山頭陀仿佛"
        ]
    },
    {
        "fortune": 0,
        "key": "防疫人人有責",
        "poem": [
            "防秋風塵滿山遠 疫鱸魚鳥飛回腸 人相思不如絲桐 人歸來千萬里長 有幾萬里無窮巷 責騎白露沾衣裳",
            "淼淼淼防邊一聲 橘柚盒疫屠蘇武 侍從他人多謝家 相思故人不是故 一日已有淚如水 無窮巷責驪龍虎",
            "風煙水流光不防 未得無餘杭疫肘 去不離騷人一枝 七十年人寰宇宙 只應有無由來自 諾責門館娃宮漏",
            "周防芭蕉葉盡日 淼疫妊褒斜陽臺 幾人歸來長安在 行人盡日東西來 各有青天漢主人 魔責堪傷心與白",
            "難再三五色不防 春風煙火燒疫驪 有誰知有人世事 兩三千人何人稀 誰家有淚如此身 罔責譬如水東西"
        ]
    },
    {
        "fortune": 0,
        "key": "中國武漢封城",
        "poem": [
            "洞中舊山水流水 南國來見白首詩 步武夷猶自有餘 入漢武皇華陽時 開封時有詩書生 赤城中有何須知",
            "亦何況我心中峰 年來何在京國步 蓮花月移漢武庫 雲山翠微星漢武 何所思君重封侯 笙歌一望江城不",
            "中見君今朝野水 國人難自有所之 武丘樊川水煙水 漢將一望夫差池 封書未知君去年 城中無情何當時",
            "中水東西東南山 傾國門前後會府 生光武威鳳兮不 不是楚漢地無不 城南歸未封題柱 為君子不到城路",
            "小兒童子在中夜 花枝上玉京國愁 石樓臺上漢武皇 瓊樹秋風入漢收 何由來時節封書 近來唯有孤城頭"
        ]
    },
    {
        "fortune": 3,
        "key": "勤洗手戴口罩",
        "poem": [
            "勤寄一萬物變化 淼洗藥草色不堪 規模手持竿一何 征戰伐戴勝事難 桃李白蘋口中人 牢落花開闢罩斑",
            "何以為君須勤勞 鄉關西風一洗兩 花落時有分手種 唯應是無限戴向 幾千里春江口中 那堪悲辛苦罩降",
            "年少年辛勤寄謝 相逢君一洗心靜 我亦無敵手不見 亦何所欽戴勝景 日登高人口驍雄 赫赫赫蛀罩只應",
            "淚沾衣冠冕型勤 年芳草草木洗依 不淺深入手攜手 白麵罐戴嘍羅衣 美人口銜來相送 拾罩桃李花不移",
            "勤王夢中月明光 一洗心如今古今 不舉手可見故園 桃李膺戴胡為霖 昨夜寒穀口莫相 落花落花發罩閩"
        ]
    },
    {
        "fortune": 3,
        "key": "一九二二主動通報",
        "poem": [
            "還應難忘卻是一 由來人煙霞映九 明月明月清風二 去年少年前年二 相和風煙霞明主 臨水精靈山上動 山重重重門徑通 知何況當時相報",
            "江湖上有餘年一 唯有情難重九不 舊遊八十二章句 尚少年二十萬物 為戀主第幾千古 浪動四十六出土 通州城南去不得 白玉關東山欲報",
            "桃花落花月在一 鏡湖上紫陌上九 少年多謝家有二 是非所從今無二 山月滿江水無主 不顧我欲知名動 人間世人不窮通 獨向誰人言語報",
            "天一從來一朝朝 到九疑是何有幾 與二八九重門下 不二十家家兄弟 明主人來往歲月 月動天子愛此地 徑通神仙家池塘 有報曉煙深知己",
            "三百花前一曲江 戈甲第八九奏明 山川流年二月落 南山千年二重英 年少年無主人不 與君不群動行行 言歸路難通天上 山青鳥聲報時平"
        ]
    },
    {
        "fortune": 3,
        "key": "口罩暫停出口",
        "poem": [
            "口中無他日落花 罩砍肅穆穆清風 暫遊子不忍看山 停奈何處行歌聲 出塵不如此身世 口咸陽春風月生",
            "秋天下山口無事 人不可以罩鐲圍 同一片時暫相憶 相憶君莫停燈微 相送君不出處去 百姓名山口無違",
            "口雲浮名姓名高 盾罩淑氣生百川 行人暫時時聞道 同心未停凰樓船 無乃知不出關西 馨香風入洞口傳",
            "君王宮樹千金口 故鄉人不憚罩拇 南渡江月暫來相 聞君不停億萬古 明朝出長相依舊 峽口不得君子不",
            "夜深夜夢中夏口 山河水流水精罩 不獨坐使君心暫 斜陽城東方寸停 未歸來幾千峰出 春來往往來入口"
        ]
    },
    {
        "fortune": -3,
        "key": "范罵狗官是在哈佛",
        "poem": [
            "一半是非不肖范 清明主人不敢罵 更無事不與白狗 早晚來相送君官 多苦辛苦心同是 閒暇日落日月在 故關山色未央哈 皎潔白雲不復佛",
            "范蘆花落葉滿頭 罵杏花滿城北海 狗幽獨宿昔日日 官路難再三十載 是青草生白髮生 在東流水銀漢代 哈淑氣清明鏡中 佛不見君獨不待",
            "何時不極目極范 交親故人不忍罵 四五侯門無家狗 一日月正蕭郎官 黃金鏡中無處是 翠微雨多暇日在 不及第一隻砍哈 南北客星漢諸佛",
            "雲根柢范零落日 回顧盼罵削成名 我獨佔狗區區中 殊未得官舍此興 處處即是有幾年 方知何在楚江清 男兒孫哈譬如君 相依託佛不知行",
            "春風蕭蕭然諾范 辛苦辛酸癱罵灘 十二三黜狗忡忡 知不得官道泰山 風便是何日斜月 雖在野花落金丹 哈菩提攜歸去不 江上無人作禮佛"
        ]
    },
    {
        "fortune": 0,
        "key": "防疫人人有責",
        "poem": [
            "潔防風落花落葉 懼疫嫁與誰能言 何人少年不可惜 在人知四十三千 上有情不知君門 西責牢落時聞天",
            "防邊楊柳花殘春 疫謁承恩不可能 人到南渡江水流 人空江上將軍城 有千片石榴花發 責寰海上客心更",
            "防仔細風煙霞明 疫鞏樹色如此地 人行雲歸何由來 人家山水中天際 有風多暇日落花 責賦詩人世所以",
            "終不防駿馬入夢 耕耘疫棍妊倖免 有佳人得閒遊子 風俗人得如可見 窗中有無雙雙鬢 峰巒責拭淚滿眼",
            "飄飄然諾防琪樹 子規模蛹疫閉門 行路入秦人間事 不知音信人更深 一寸心知有人間 無纖腰肢責夫人"
        ]
    },
    {
        "fortune": 0,
        "key": "中國武漢封城",
        "poem": [
            "中不如此夜雨聲 憂國人誰知我不 骯髒武陵江湖上 城上河漢武陵路 無計日正封書報 海門館娃宮城入",
            "中路塵埃塵世間 舊國山中有高門 草玄武關頭白鷺 老大河漢月在深 九重來一封忡忡 梧桐江湖邊城根",
            "一種田園林中流 忽憶君不許國三 一杯中行步武侯 一從今日斜漢南 五更無信可封侯 楊柳色連山城山",
            "明主人扶桑田中 如此別君去去國 三五更清談玄武 還鄉國春早知漢 流水清洛水東封 千年年華池邊城",
            "由來山中有時見 風雨中國門不及 在天文武功德音 江山河漢庭花一 穆穆穆封事更誰 繁華陽城分曹溪"
        ]
    },
    {
        "fortune": 3,
        "key": "勤洗手戴口罩",
        "poem": [
            "勤望白楊柳花落 如洗碼洶湧出西 淚垂手無人事無 肅肅穆戴玫瑰奇 獨自是江口笑向 百六十八紘罩昔",
            "誰家山高會須勤 楊柳絲竹葉雨洗 不顧影入手把手 日月上頭吟哦戴 原上臺階前溪口 複何人到蓬萊罩",
            "勤寄遠近來多病 洗心事空碧草木 手無舊遊人知何 戴船中山河漢武 口笑聲聞君別離 罩呢牡丹霞色入",
            "勤為千年四十二 雨洗塵路長在昔 玉纖手自是時來 自樂毅戴角枕席 江南風渡口不知 行路入洞庭罩伊",
            "勤不歸未有佳氣 洗心在江水不惜 手中路塵中流年 戴勝君有長歎息 口無因思一何處 罩癱莓苔色如一"
        ]
    },
    {
        "fortune": 3,
        "key": "一九二二主動通報",
        "poem": [
            "長安得一彈琴聲 能幾重九州客不 不同一二山歸去 眼前有二門前路 十二公主賜金台 向北風動金裝束 故人自通三十餘 自有相報德與故",
            "第一曲水上山中 上九十年來相府 十二子雲泉脈脈 年二十三春草樹 無主思在何如水 欲動行處有時不 未通塞鴻名姓名 難報明朝天南渡",
            "相親故人行一人 洛陽春深入九刊 一片月相逢二人 愁腸斷雲飛二山 誰言歸田地主第 十年六街鼓動寒 長安可能窮通宵 何況當年未報凡",
            "江山一夜深宮樹 十年九江東京都 心無二街鼓瑟瑟 明月二人不是吾 平明主不相依舊 草色動白須知無 君不通禪客從來 然諾報夾岸柳拂",
            "無不堪傷心同一 明月明公子去九 遠近來一相逢二 是非我今日風二 鳴琴尊酒一為主 尋常苦竹枝葉動 幾日長安閒時通 浮雲中人事不報"
        ]
    },
    {
        "fortune": 3,
        "key": "口罩暫停出口",
        "poem": [
            "二三秦川口不似 丹青牛羊罩碌碌 自有恨不暫無事 少年老無停擇木 便是夢中出風流 無一聲入口雲物",
            "谷口分襟一杯酒 滾罩屈宋玉樓前 不暫駐馬長安得 蛾停寸心所願言 初出風吹玉樓上 下口春曲江水煙",
            "江口不自古今如 楔罩次第一言語 不暫留煙塵埃塵 曾停輪車入翠羽 峰出門對此時節 洞口莫相從東去",
            "口不平明主人事 罩磊落盡日到三 暫到明日月落葉 停而今日半夜寒 出門一片片帆影 口月光不得長安",
            "青山水流入洞口 自悲鳴環堵罩耘 歸來幾時暫無窮 歸去莫停恭聞君 空中出山中心無 穀口笑人有因循"
        ]
    }
]