[
    "柯文哲：應避開意識形態的政治 ,https://news.ltn.com.tw/news/politics/breakingnews/3039705",
    "苗博雅：韓國瑜一人動員兩黨 ,https://news.ltn.com.tw/news/politics/breakingnews/3039496",
    "韓國瑜：平常心面對 ,https://news.ltn.com.tw/news/politics/breakingnews/3038738",
    "韓國瑜：人生不是每件事都是政治 ,https://news.ltn.com.tw/news/politics/breakingnews/3038748",
    "挺韓名嘴：韓國瑜就是失敗了 ,https://news.ltn.com.tw/news/entertainment/breakingnews/3038577",
    "美學者：韓國瑜是病徵而非病因 ,https://news.ltn.com.tw/news/politics/breakingnews/3038457",
    "竹市鄭正鈐謝票：選舉結束是承擔責任的開始 ,https://news.ltn.com.tw/news/politics/breakingnews/3038356",
    "法媒：蔡總統連任 ,https://news.ltn.com.tw/news/politics/breakingnews/3038402",
    "法媒：蔡總統連任 ,https://news.ltn.com.tw/news/politics/breakingnews/3038402",
    "蔡英文：感謝僑胞守護台灣 ,https://news.ltn.com.tw/news/politics/breakingnews/3038379",
    "蔡其昌：沒有任何準備、任何規劃 ,https://news.ltn.com.tw/news/politics/breakingnews/3038239",
    "今早謝票：政治求位暫不考慮 ,https://news.ltn.com.tw/news/politics/breakingnews/3037920",
    "柯文哲啟程訪歐：兩岸面對選後情勢都需要智慧 ,https://news.ltn.com.tw/news/politics/breakingnews/3038547",
    "半島電視台：蔡總統連任 ,https://news.ltn.com.tw/news/world/breakingnews/3037820",
    "半島電視台：蔡總統連任 ,https://news.ltn.com.tw/news/world/breakingnews/3037820",
    "紐時：台灣人用選票駁斥中國 ,https://news.ltn.com.tw/news/world/breakingnews/3037675",
    "陳芳明：韓國瑜難逃被罷免命運 ,https://news.ltn.com.tw/news/politics/breakingnews/3037766",
    "準立委蔡壁如放話：目標第1大黨 ,https://news.ltn.com.tw/news/politics/breakingnews/3037513",
    "柯文哲：議題對人民國家有利 ,https://news.ltn.com.tw/news/politics/breakingnews/3037586",
    "罷韓團體：立刻道歉辭職 ,https://news.ltn.com.tw/news/politics/breakingnews/3037538",
    "蔡壁如：2024一定選 ,https://news.ltn.com.tw/news/politics/breakingnews/3037565",
    "柯文哲：民眾黨將是不關鍵少數 ,https://news.ltn.com.tw/news/politics/breakingnews/3037551",
    "學者：蔡英文會加速推動這件事 ,https://news.ltn.com.tw/news/politics/breakingnews/3037393",
    "吳思瑤謹慎：票還沒開一半 ,https://news.ltn.com.tw/news/politics/breakingnews/3037244",
    "外媒：這一票決定台灣未來走向 ,https://news.ltn.com.tw/news/politics/breakingnews/3036554",
    "柯文哲：三黨不過半 ,https://news.ltn.com.tw/news/politics/breakingnews/3036516",
    "柯文哲：民眾黨要成超越藍綠的政治新勢力 ,https://news.ltn.com.tw/news/politics/breakingnews/3036512",
    "韓國瑜：用選票翻轉台灣命運 ,https://news.ltn.com.tw/news/politics/breakingnews/3036490",
    "韓國瑜：用選票翻轉台灣命運 ,https://news.ltn.com.tw/news/politics/breakingnews/3036490",
    "蔡壁如催票：民眾黨若沒150萬票 ,https://news.ltn.com.tw/news/politics/breakingnews/3036421",
    "蔡壁如催票：民眾黨若沒150萬票 ,https://news.ltn.com.tw/news/politics/breakingnews/3036421",
    "韓粉嗆：考慮移民中國 ,https://news.ltn.com.tw/news/politics/breakingnews/3036340",
    "鄭文燦：選票決定台灣與威權中國的距離 ,https://news.ltn.com.tw/news/politics/breakingnews/3036362",
    "柯文哲喊話：政治不困難 ,https://news.ltn.com.tw/news/politics/breakingnews/3036326",
    "柯文哲：藍綠歸隊 ,https://news.ltn.com.tw/news/politics/breakingnews/3036042",
    "大學生：總統要扛得住台灣 ,https://news.ltn.com.tw/news/politics/breakingnews/3036025",
    "民俗專家廖大乙：不想有「恁爸」總統 ,https://news.ltn.com.tw/news/politics/breakingnews/3035964",
    "蔡競辦批：國共聯手介入大選 ,https://news.ltn.com.tw/news/politics/breakingnews/3035874",
    "台南市長黃偉哲催票：香港人和台灣人就差在一張選票 ,https://news.ltn.com.tw/news/politics/breakingnews/3035768",
    "柯：這大概不會發生吧 ,https://news.ltn.com.tw/news/politics/breakingnews/3035698",
    "柯文哲：有這種幕僚還需要敵人嗎 ,https://news.ltn.com.tw/news/politics/breakingnews/3035683",
    "蔡英文：台灣人民需要很堅定的領導者 ,https://news.ltn.com.tw/news/politics/breakingnews/3035451",
    "法界：蔡正元恐違澳洲反干預法 ,https://news.ltn.com.tw/news/politics/paper/1345000",
    "蔡正元：沒親耳聽到 ,https://news.ltn.com.tw/news/politics/paper/1344996"
]