[
    "蔡育輝開「第一槍」,https://udn.com/news/story/7548/4285843",
    "蔡總統須直面六百多萬人民的失望,https://udn.com/news/story/7338/4286084",
    "謝票響遍街頭,https://udn.com/news/story/7325/4283915",
    "綠營謝票,https://udn.com/news/story/7326/4283934",
    "難以拒絕美國的台灣新總統,https://udn.com/news/story/7339/4283914",
    "韓：沒規畫選黨主席,https://udn.com/news/story/12667/4284346",
    "韓流蜻蜓點水,https://udn.com/news/story/7327/4282668",
    "青年返鄉投票,https://udn.com/news/story/7548/4282537",
    "陳亭妃拿高票,https://udn.com/news/story/7326/4282522",
    "年輕選票的江山,https://udn.com/news/story/7339/4282478",
    "讚蔡維護兩岸穩定,https://udn.com/news/story/12702/4282644",
    "蔡英文藉亡國感取勝，但內政恐更形棘手,https://udn.com/news/story/7338/4282683"
]