digraph "CFGrammar"
{
 // LATEX_PDF_SIZE
  edge [fontname="Helvetica",fontsize="10",labelfontname="Helvetica",labelfontsize="10"];
  node [fontname="Helvetica",fontsize="10",shape=record];
  Node1 [label="CFGrammar",height=0.2,width=0.4,color="black", fillcolor="grey75", style="filled", fontcolor="black",tooltip=" "];
  Node2 -> Node1 [dir="back",color="midnightblue",fontsize="10",style="solid"];
  Node2 [label="Grammar",height=0.2,width=0.4,color="black", fillcolor="white", style="filled",URL="$class_grammar.html",tooltip=" "];
  Node3 -> Node2 [dir="back",color="midnightblue",fontsize="10",style="solid"];
  Node3 [label="Mapper",height=0.2,width=0.4,color="black", fillcolor="white", style="filled",URL="$class_mapper.html",tooltip=" "];
  Node4 -> Node2 [dir="back",color="midnightblue",fontsize="10",style="solid"];
  Node4 [label="vector\< Rule \>",height=0.2,width=0.4,color="grey75", fillcolor="white", style="filled",tooltip=" "];
  Node1 -> Node5 [dir="back",color="midnightblue",fontsize="10",style="solid"];
  Node5 [label="GEGrammar",height=0.2,width=0.4,color="black", fillcolor="white", style="filled",URL="$class_g_e_grammar.html",tooltip=" "];
  Node5 -> Node6 [dir="back",color="midnightblue",fontsize="10",style="solid"];
  Node6 [label="GEGrammarSI",height=0.2,width=0.4,color="black", fillcolor="white", style="filled",URL="$class_g_e_grammar_s_i.html",tooltip=" "];
}
