digraph "src/GE_ILLIGALSGA.cpp"
{
 // LATEX_PDF_SIZE
  edge [fontname="Helvetica",fontsize="10",labelfontname="Helvetica",labelfontsize="10"];
  node [fontname="Helvetica",fontsize="10",shape=record];
  Node1 [label="src/GE_ILLIGALSGA.cpp",height=0.2,width=0.4,color="black", fillcolor="grey75", style="filled", fontcolor="black",tooltip=" "];
  Node1 -> Node2 [color="midnightblue",fontsize="10",style="solid"];
  Node2 [label="iostream",height=0.2,width=0.4,color="grey75", fillcolor="white", style="filled",tooltip=" "];
  Node1 -> Node3 [color="midnightblue",fontsize="10",style="solid"];
  Node3 [label="fstream",height=0.2,width=0.4,color="grey75", fillcolor="white", style="filled",tooltip=" "];
  Node1 -> Node4 [color="midnightblue",fontsize="10",style="solid"];
  Node4 [label="cstring",height=0.2,width=0.4,color="grey75", fillcolor="white", style="filled",tooltip=" "];
  Node1 -> Node5 [color="midnightblue",fontsize="10",style="solid"];
  Node5 [label="GEGrammar.h",height=0.2,width=0.4,color="black", fillcolor="white", style="filled",URL="$_g_e_grammar_8h.html",tooltip=" "];
  Node5 -> Node6 [color="midnightblue",fontsize="10",style="solid"];
  Node6 [label="libGEdefs.h",height=0.2,width=0.4,color="black", fillcolor="white", style="filled",URL="$lib_g_edefs_8h.html",tooltip=" "];
  Node5 -> Node7 [color="midnightblue",fontsize="10",style="solid"];
  Node7 [label="stack",height=0.2,width=0.4,color="grey75", fillcolor="white", style="filled",tooltip=" "];
  Node5 -> Node8 [color="midnightblue",fontsize="10",style="solid"];
  Node8 [label="vector",height=0.2,width=0.4,color="grey75", fillcolor="white", style="filled",tooltip=" "];
  Node5 -> Node9 [color="midnightblue",fontsize="10",style="solid"];
  Node9 [label="CFGrammar.h",height=0.2,width=0.4,color="black", fillcolor="white", style="filled",URL="$_c_f_grammar_8h.html",tooltip=" "];
  Node9 -> Node6 [color="midnightblue",fontsize="10",style="solid"];
  Node9 -> Node8 [color="midnightblue",fontsize="10",style="solid"];
  Node9 -> Node10 [color="midnightblue",fontsize="10",style="solid"];
  Node10 [label="string",height=0.2,width=0.4,color="grey75", fillcolor="white", style="filled",tooltip=" "];
  Node9 -> Node11 [color="midnightblue",fontsize="10",style="solid"];
  Node11 [label="limits.h",height=0.2,width=0.4,color="grey75", fillcolor="white", style="filled",tooltip=" "];
  Node9 -> Node12 [color="midnightblue",fontsize="10",style="solid"];
  Node12 [label="Grammar.h",height=0.2,width=0.4,color="black", fillcolor="white", style="filled",URL="$_grammar_8h.html",tooltip=" "];
  Node12 -> Node6 [color="midnightblue",fontsize="10",style="solid"];
  Node12 -> Node8 [color="midnightblue",fontsize="10",style="solid"];
  Node12 -> Node10 [color="midnightblue",fontsize="10",style="solid"];
  Node12 -> Node13 [color="midnightblue",fontsize="10",style="solid"];
  Node13 [label="Mapper.h",height=0.2,width=0.4,color="black", fillcolor="white", style="filled",URL="$_mapper_8h.html",tooltip=" "];
  Node13 -> Node6 [color="midnightblue",fontsize="10",style="solid"];
  Node13 -> Node14 [color="midnightblue",fontsize="10",style="solid"];
  Node14 [label="Genotype.h",height=0.2,width=0.4,color="black", fillcolor="white", style="filled",URL="$_genotype_8h.html",tooltip=" "];
  Node14 -> Node6 [color="midnightblue",fontsize="10",style="solid"];
  Node14 -> Node2 [color="midnightblue",fontsize="10",style="solid"];
  Node14 -> Node8 [color="midnightblue",fontsize="10",style="solid"];
  Node13 -> Node15 [color="midnightblue",fontsize="10",style="solid"];
  Node15 [label="Phenotype.h",height=0.2,width=0.4,color="black", fillcolor="white", style="filled",URL="$_phenotype_8h.html",tooltip=" "];
  Node15 -> Node6 [color="midnightblue",fontsize="10",style="solid"];
  Node15 -> Node2 [color="midnightblue",fontsize="10",style="solid"];
  Node15 -> Node10 [color="midnightblue",fontsize="10",style="solid"];
  Node15 -> Node8 [color="midnightblue",fontsize="10",style="solid"];
  Node15 -> Node16 [color="midnightblue",fontsize="10",style="solid"];
  Node16 [label="Symbol.h",height=0.2,width=0.4,color="black", fillcolor="white", style="filled",URL="$_symbol_8h.html",tooltip=" "];
  Node16 -> Node6 [color="midnightblue",fontsize="10",style="solid"];
  Node16 -> Node2 [color="midnightblue",fontsize="10",style="solid"];
  Node16 -> Node8 [color="midnightblue",fontsize="10",style="solid"];
  Node16 -> Node10 [color="midnightblue",fontsize="10",style="solid"];
  Node16 -> Node17 [color="midnightblue",fontsize="10",style="solid"];
  Node17 [label="sstream",height=0.2,width=0.4,color="grey75", fillcolor="white", style="filled",tooltip=" "];
  Node12 -> Node18 [color="midnightblue",fontsize="10",style="solid"];
  Node18 [label="Rule.h",height=0.2,width=0.4,color="black", fillcolor="white", style="filled",URL="$_rule_8h.html",tooltip=" "];
  Node18 -> Node6 [color="midnightblue",fontsize="10",style="solid"];
  Node18 -> Node8 [color="midnightblue",fontsize="10",style="solid"];
  Node18 -> Node19 [color="midnightblue",fontsize="10",style="solid"];
  Node19 [label="Production.h",height=0.2,width=0.4,color="black", fillcolor="white", style="filled",URL="$_production_8h.html",tooltip=" "];
  Node19 -> Node6 [color="midnightblue",fontsize="10",style="solid"];
  Node19 -> Node8 [color="midnightblue",fontsize="10",style="solid"];
  Node19 -> Node20 [color="midnightblue",fontsize="10",style="solid"];
  Node20 [label="AGLookUp.h",height=0.2,width=0.4,color="black", fillcolor="white", style="filled",URL="$_a_g_look_up_8h.html",tooltip=" "];
  Node20 -> Node6 [color="midnightblue",fontsize="10",style="solid"];
  Node20 -> Node2 [color="midnightblue",fontsize="10",style="solid"];
  Node20 -> Node10 [color="midnightblue",fontsize="10",style="solid"];
  Node20 -> Node21 [color="midnightblue",fontsize="10",style="solid"];
  Node21 [label="AGSymbol.h",height=0.2,width=0.4,color="black", fillcolor="white", style="filled",URL="$_a_g_symbol_8h.html",tooltip=" "];
  Node21 -> Node6 [color="midnightblue",fontsize="10",style="solid"];
  Node21 -> Node16 [color="midnightblue",fontsize="10",style="solid"];
  Node21 -> Node2 [color="midnightblue",fontsize="10",style="solid"];
  Node21 -> Node8 [color="midnightblue",fontsize="10",style="solid"];
  Node21 -> Node10 [color="midnightblue",fontsize="10",style="solid"];
  Node21 -> Node17 [color="midnightblue",fontsize="10",style="solid"];
  Node9 -> Node22 [color="midnightblue",fontsize="10",style="solid"];
  Node22 [label="Tree.h",height=0.2,width=0.4,color="black", fillcolor="white", style="filled",URL="$_tree_8h.html",tooltip=" "];
  Node22 -> Node8 [color="midnightblue",fontsize="10",style="solid"];
  Node5 -> Node21 [color="midnightblue",fontsize="10",style="solid"];
  Node5 -> Node20 [color="midnightblue",fontsize="10",style="solid"];
  Node5 -> Node23 [color="midnightblue",fontsize="10",style="solid"];
  Node23 [label="AGDerivationTree.h",height=0.2,width=0.4,color="black", fillcolor="white", style="filled",URL="$_a_g_derivation_tree_8h.html",tooltip=" "];
  Node23 -> Node22 [color="midnightblue",fontsize="10",style="solid"];
  Node23 -> Node21 [color="midnightblue",fontsize="10",style="solid"];
  Node23 -> Node15 [color="midnightblue",fontsize="10",style="solid"];
  Node5 -> Node24 [color="midnightblue",fontsize="10",style="solid"];
  Node24 [label="AGContext.h",height=0.2,width=0.4,color="black", fillcolor="white", style="filled",URL="$_a_g_context_8h.html",tooltip=" "];
  Node24 -> Node6 [color="midnightblue",fontsize="10",style="solid"];
  Node24 -> Node23 [color="midnightblue",fontsize="10",style="solid"];
}
