digraph "src/Grammar.cpp"
{
 // LATEX_PDF_SIZE
  edge [fontname="Helvetica",fontsize="10",labelfontname="Helvetica",labelfontsize="10"];
  node [fontname="Helvetica",fontsize="10",shape=record];
  Node1 [label="src/Grammar.cpp",height=0.2,width=0.4,color="black", fillcolor="grey75", style="filled", fontcolor="black",tooltip=" "];
  Node1 -> Node2 [color="midnightblue",fontsize="10",style="solid"];
  Node2 [label="iostream",height=0.2,width=0.4,color="grey75", fillcolor="white", style="filled",tooltip=" "];
  Node1 -> Node3 [color="midnightblue",fontsize="10",style="solid"];
  Node3 [label="Grammar.h",height=0.2,width=0.4,color="black", fillcolor="white", style="filled",URL="$_grammar_8h.html",tooltip=" "];
  Node3 -> Node4 [color="midnightblue",fontsize="10",style="solid"];
  Node4 [label="libGEdefs.h",height=0.2,width=0.4,color="black", fillcolor="white", style="filled",URL="$lib_g_edefs_8h.html",tooltip=" "];
  Node3 -> Node5 [color="midnightblue",fontsize="10",style="solid"];
  Node5 [label="vector",height=0.2,width=0.4,color="grey75", fillcolor="white", style="filled",tooltip=" "];
  Node3 -> Node6 [color="midnightblue",fontsize="10",style="solid"];
  Node6 [label="string",height=0.2,width=0.4,color="grey75", fillcolor="white", style="filled",tooltip=" "];
  Node3 -> Node7 [color="midnightblue",fontsize="10",style="solid"];
  Node7 [label="Mapper.h",height=0.2,width=0.4,color="black", fillcolor="white", style="filled",URL="$_mapper_8h.html",tooltip=" "];
  Node7 -> Node4 [color="midnightblue",fontsize="10",style="solid"];
  Node7 -> Node8 [color="midnightblue",fontsize="10",style="solid"];
  Node8 [label="Genotype.h",height=0.2,width=0.4,color="black", fillcolor="white", style="filled",URL="$_genotype_8h.html",tooltip=" "];
  Node8 -> Node4 [color="midnightblue",fontsize="10",style="solid"];
  Node8 -> Node2 [color="midnightblue",fontsize="10",style="solid"];
  Node8 -> Node5 [color="midnightblue",fontsize="10",style="solid"];
  Node7 -> Node9 [color="midnightblue",fontsize="10",style="solid"];
  Node9 [label="Phenotype.h",height=0.2,width=0.4,color="black", fillcolor="white", style="filled",URL="$_phenotype_8h.html",tooltip=" "];
  Node9 -> Node4 [color="midnightblue",fontsize="10",style="solid"];
  Node9 -> Node2 [color="midnightblue",fontsize="10",style="solid"];
  Node9 -> Node6 [color="midnightblue",fontsize="10",style="solid"];
  Node9 -> Node5 [color="midnightblue",fontsize="10",style="solid"];
  Node9 -> Node10 [color="midnightblue",fontsize="10",style="solid"];
  Node10 [label="Symbol.h",height=0.2,width=0.4,color="black", fillcolor="white", style="filled",URL="$_symbol_8h.html",tooltip=" "];
  Node10 -> Node4 [color="midnightblue",fontsize="10",style="solid"];
  Node10 -> Node2 [color="midnightblue",fontsize="10",style="solid"];
  Node10 -> Node5 [color="midnightblue",fontsize="10",style="solid"];
  Node10 -> Node6 [color="midnightblue",fontsize="10",style="solid"];
  Node10 -> Node11 [color="midnightblue",fontsize="10",style="solid"];
  Node11 [label="sstream",height=0.2,width=0.4,color="grey75", fillcolor="white", style="filled",tooltip=" "];
  Node3 -> Node12 [color="midnightblue",fontsize="10",style="solid"];
  Node12 [label="Rule.h",height=0.2,width=0.4,color="black", fillcolor="white", style="filled",URL="$_rule_8h.html",tooltip=" "];
  Node12 -> Node4 [color="midnightblue",fontsize="10",style="solid"];
  Node12 -> Node5 [color="midnightblue",fontsize="10",style="solid"];
  Node12 -> Node13 [color="midnightblue",fontsize="10",style="solid"];
  Node13 [label="Production.h",height=0.2,width=0.4,color="black", fillcolor="white", style="filled",URL="$_production_8h.html",tooltip=" "];
  Node13 -> Node4 [color="midnightblue",fontsize="10",style="solid"];
  Node13 -> Node5 [color="midnightblue",fontsize="10",style="solid"];
  Node13 -> Node14 [color="midnightblue",fontsize="10",style="solid"];
  Node14 [label="AGLookUp.h",height=0.2,width=0.4,color="black", fillcolor="white", style="filled",URL="$_a_g_look_up_8h.html",tooltip=" "];
  Node14 -> Node4 [color="midnightblue",fontsize="10",style="solid"];
  Node14 -> Node2 [color="midnightblue",fontsize="10",style="solid"];
  Node14 -> Node6 [color="midnightblue",fontsize="10",style="solid"];
  Node14 -> Node15 [color="midnightblue",fontsize="10",style="solid"];
  Node15 [label="AGSymbol.h",height=0.2,width=0.4,color="black", fillcolor="white", style="filled",URL="$_a_g_symbol_8h.html",tooltip=" "];
  Node15 -> Node4 [color="midnightblue",fontsize="10",style="solid"];
  Node15 -> Node10 [color="midnightblue",fontsize="10",style="solid"];
  Node15 -> Node2 [color="midnightblue",fontsize="10",style="solid"];
  Node15 -> Node5 [color="midnightblue",fontsize="10",style="solid"];
  Node15 -> Node6 [color="midnightblue",fontsize="10",style="solid"];
  Node15 -> Node11 [color="midnightblue",fontsize="10",style="solid"];
}
