\@ifundefined {etoctocstyle}{\let \etoc@startlocaltoc \@gobble \let \etoc@settocdepth \@gobble \let \etoc@depthtag \@gobble \let \etoc@setlocaltop \@gobble }{}
\contentsline {chapter}{\numberline {1}Hierarchical Index}{1}{chapter.1}% 
\contentsline {section}{\numberline {1.1}Class Hierarchy}{1}{section.1.1}% 
\contentsline {chapter}{\numberline {2}Class Index}{3}{chapter.2}% 
\contentsline {section}{\numberline {2.1}Class List}{3}{section.2.1}% 
\contentsline {chapter}{\numberline {3}File Index}{5}{chapter.3}% 
\contentsline {section}{\numberline {3.1}File List}{5}{section.3.1}% 
\contentsline {chapter}{\numberline {4}Class Documentation}{7}{chapter.4}% 
\contentsline {section}{\numberline {4.1}A\discretionary {\unhbox \voidb@x \hbox {\relax \fontsize {7}{8}\selectfont $\leftarrow \joinrel \rhook $}}{}{}G\discretionary {\unhbox \voidb@x \hbox {\relax \fontsize {7}{8}\selectfont $\leftarrow \joinrel \rhook $}}{}{}Context Class Reference}{7}{section.4.1}% 
\contentsline {subsection}{\numberline {4.1.1}Constructor \& Destructor Documentation}{8}{subsection.4.1.1}% 
\contentsline {subsubsection}{\numberline {4.1.1.1}AGContext()\hspace {0.1cm}{\relax \fontsize {8}{9.5}\selectfont \abovedisplayskip 6\p@ plus2\p@ minus4\p@ \abovedisplayshortskip \z@ plus\p@ \belowdisplayshortskip 3\p@ plus\p@ minus2\p@ \def \leftmargin \leftmargini \parsep 4\p@ plus2\p@ minus\p@ \topsep 8\p@ plus2\p@ minus4\p@ \itemsep 4\p@ plus2\p@ minus\p@ {\leftmargin \leftmargini \topsep 3\p@ plus\p@ minus\p@ \parsep 2\p@ plus\p@ minus\p@ \itemsep \parsep }\belowdisplayskip \abovedisplayskip \ttfamily [1/2]}}{8}{subsubsection.4.1.1.1}% 
\contentsline {subsubsection}{\numberline {4.1.1.2}AGContext()\hspace {0.1cm}{\relax \fontsize {8}{9.5}\selectfont \abovedisplayskip 6\p@ plus2\p@ minus4\p@ \abovedisplayshortskip \z@ plus\p@ \belowdisplayshortskip 3\p@ plus\p@ minus2\p@ \def \leftmargin \leftmargini \parsep 4\p@ plus2\p@ minus\p@ \topsep 8\p@ plus2\p@ minus4\p@ \itemsep 4\p@ plus2\p@ minus\p@ {\leftmargin \leftmargini \topsep 3\p@ plus\p@ minus\p@ \parsep 2\p@ plus\p@ minus\p@ \itemsep \parsep }\belowdisplayskip \abovedisplayskip \ttfamily [2/2]}}{8}{subsubsection.4.1.1.2}% 
\contentsline {subsubsection}{\numberline {4.1.1.3}$\sim $AGContext()}{8}{subsubsection.4.1.1.3}% 
\contentsline {subsection}{\numberline {4.1.2}Member Function Documentation}{8}{subsection.4.1.2}% 
\contentsline {subsubsection}{\numberline {4.1.2.1}getEndIndex()}{8}{subsubsection.4.1.2.1}% 
\contentsline {subsubsection}{\numberline {4.1.2.2}getParent()}{8}{subsubsection.4.1.2.2}% 
\contentsline {subsubsection}{\numberline {4.1.2.3}getStartIndex()}{8}{subsubsection.4.1.2.3}% 
\contentsline {subsubsection}{\numberline {4.1.2.4}setEndIndex()}{8}{subsubsection.4.1.2.4}% 
\contentsline {subsubsection}{\numberline {4.1.2.5}setParent()}{9}{subsubsection.4.1.2.5}% 
\contentsline {subsubsection}{\numberline {4.1.2.6}setStartIndex()}{9}{subsubsection.4.1.2.6}% 
\contentsline {subsection}{\numberline {4.1.3}Member Data Documentation}{9}{subsection.4.1.3}% 
\contentsline {subsubsection}{\numberline {4.1.3.1}endIndex}{9}{subsubsection.4.1.3.1}% 
\contentsline {subsubsection}{\numberline {4.1.3.2}parent}{9}{subsubsection.4.1.3.2}% 
\contentsline {subsubsection}{\numberline {4.1.3.3}startIndex}{9}{subsubsection.4.1.3.3}% 
\contentsline {section}{\numberline {4.2}A\discretionary {\unhbox \voidb@x \hbox {\relax \fontsize {7}{8}\selectfont $\leftarrow \joinrel \rhook $}}{}{}G\discretionary {\unhbox \voidb@x \hbox {\relax \fontsize {7}{8}\selectfont $\leftarrow \joinrel \rhook $}}{}{}Derivation\discretionary {\unhbox \voidb@x \hbox {\relax \fontsize {7}{8}\selectfont $\leftarrow \joinrel \rhook $}}{}{}Tree Class Reference}{9}{section.4.2}% 
\contentsline {subsection}{\numberline {4.2.1}Constructor \& Destructor Documentation}{10}{subsection.4.2.1}% 
\contentsline {subsubsection}{\numberline {4.2.1.1}AGDerivationTree()\hspace {0.1cm}{\relax \fontsize {8}{9.5}\selectfont \abovedisplayskip 6\p@ plus2\p@ minus4\p@ \abovedisplayshortskip \z@ plus\p@ \belowdisplayshortskip 3\p@ plus\p@ minus2\p@ \def \leftmargin \leftmargini \parsep 4\p@ plus2\p@ minus\p@ \topsep 8\p@ plus2\p@ minus4\p@ \itemsep 4\p@ plus2\p@ minus\p@ {\leftmargin \leftmargini \topsep 3\p@ plus\p@ minus\p@ \parsep 2\p@ plus\p@ minus\p@ \itemsep \parsep }\belowdisplayskip \abovedisplayskip \ttfamily [1/2]}}{10}{subsubsection.4.2.1.1}% 
\contentsline {subsubsection}{\numberline {4.2.1.2}AGDerivationTree()\hspace {0.1cm}{\relax \fontsize {8}{9.5}\selectfont \abovedisplayskip 6\p@ plus2\p@ minus4\p@ \abovedisplayshortskip \z@ plus\p@ \belowdisplayshortskip 3\p@ plus\p@ minus2\p@ \def \leftmargin \leftmargini \parsep 4\p@ plus2\p@ minus\p@ \topsep 8\p@ plus2\p@ minus4\p@ \itemsep 4\p@ plus2\p@ minus\p@ {\leftmargin \leftmargini \topsep 3\p@ plus\p@ minus\p@ \parsep 2\p@ plus\p@ minus\p@ \itemsep \parsep }\belowdisplayskip \abovedisplayskip \ttfamily [2/2]}}{10}{subsubsection.4.2.1.2}% 
\contentsline {subsubsection}{\numberline {4.2.1.3}$\sim $AGDerivationTree()}{10}{subsubsection.4.2.1.3}% 
\contentsline {subsection}{\numberline {4.2.2}Member Function Documentation}{10}{subsection.4.2.2}% 
\contentsline {subsubsection}{\numberline {4.2.2.1}clearSubtreeBelow()}{10}{subsubsection.4.2.2.1}% 
\contentsline {subsubsection}{\numberline {4.2.2.2}clearTree()}{10}{subsubsection.4.2.2.2}% 
\contentsline {subsubsection}{\numberline {4.2.2.3}getTree()}{11}{subsubsection.4.2.2.3}% 
\contentsline {subsubsection}{\numberline {4.2.2.4}isRecycling()}{11}{subsubsection.4.2.2.4}% 
\contentsline {subsubsection}{\numberline {4.2.2.5}loadPhenotype()}{11}{subsubsection.4.2.2.5}% 
\contentsline {subsubsection}{\numberline {4.2.2.6}printTree()}{11}{subsubsection.4.2.2.6}% 
\contentsline {subsubsection}{\numberline {4.2.2.7}setTree()}{11}{subsubsection.4.2.2.7}% 
\contentsline {subsubsection}{\numberline {4.2.2.8}traverseTree()}{11}{subsubsection.4.2.2.8}% 
\contentsline {subsection}{\numberline {4.2.3}Member Data Documentation}{11}{subsection.4.2.3}% 
\contentsline {subsubsection}{\numberline {4.2.3.1}recycle}{11}{subsubsection.4.2.3.1}% 
\contentsline {subsubsection}{\numberline {4.2.3.2}tree}{11}{subsubsection.4.2.3.2}% 
\contentsline {section}{\numberline {4.3}A\discretionary {\unhbox \voidb@x \hbox {\relax \fontsize {7}{8}\selectfont $\leftarrow \joinrel \rhook $}}{}{}G\discretionary {\unhbox \voidb@x \hbox {\relax \fontsize {7}{8}\selectfont $\leftarrow \joinrel \rhook $}}{}{}Look\discretionary {\unhbox \voidb@x \hbox {\relax \fontsize {7}{8}\selectfont $\leftarrow \joinrel \rhook $}}{}{}Up Class Reference}{12}{section.4.3}% 
\contentsline {subsection}{\numberline {4.3.1}Constructor \& Destructor Documentation}{12}{subsection.4.3.1}% 
\contentsline {subsubsection}{\numberline {4.3.1.1}$\sim $AGLookUp()}{12}{subsubsection.4.3.1.1}% 
\contentsline {subsection}{\numberline {4.3.2}Member Function Documentation}{12}{subsection.4.3.2}% 
\contentsline {subsubsection}{\numberline {4.3.2.1}findAGSymbol()}{12}{subsubsection.4.3.2.1}% 
\contentsline {section}{\numberline {4.4}A\discretionary {\unhbox \voidb@x \hbox {\relax \fontsize {7}{8}\selectfont $\leftarrow \joinrel \rhook $}}{}{}G\discretionary {\unhbox \voidb@x \hbox {\relax \fontsize {7}{8}\selectfont $\leftarrow \joinrel \rhook $}}{}{}Symbol Class Reference}{12}{section.4.4}% 
\contentsline {subsection}{\numberline {4.4.1}Constructor \& Destructor Documentation}{13}{subsection.4.4.1}% 
\contentsline {subsubsection}{\numberline {4.4.1.1}AGSymbol()\hspace {0.1cm}{\relax \fontsize {8}{9.5}\selectfont \abovedisplayskip 6\p@ plus2\p@ minus4\p@ \abovedisplayshortskip \z@ plus\p@ \belowdisplayshortskip 3\p@ plus\p@ minus2\p@ \def \leftmargin \leftmargini \parsep 4\p@ plus2\p@ minus\p@ \topsep 8\p@ plus2\p@ minus4\p@ \itemsep 4\p@ plus2\p@ minus\p@ {\leftmargin \leftmargini \topsep 3\p@ plus\p@ minus\p@ \parsep 2\p@ plus\p@ minus\p@ \itemsep \parsep }\belowdisplayskip \abovedisplayskip \ttfamily [1/2]}}{13}{subsubsection.4.4.1.1}% 
\contentsline {subsubsection}{\numberline {4.4.1.2}AGSymbol()\hspace {0.1cm}{\relax \fontsize {8}{9.5}\selectfont \abovedisplayskip 6\p@ plus2\p@ minus4\p@ \abovedisplayshortskip \z@ plus\p@ \belowdisplayshortskip 3\p@ plus\p@ minus2\p@ \def \leftmargin \leftmargini \parsep 4\p@ plus2\p@ minus\p@ \topsep 8\p@ plus2\p@ minus4\p@ \itemsep 4\p@ plus2\p@ minus\p@ {\leftmargin \leftmargini \topsep 3\p@ plus\p@ minus\p@ \parsep 2\p@ plus\p@ minus\p@ \itemsep \parsep }\belowdisplayskip \abovedisplayskip \ttfamily [2/2]}}{13}{subsubsection.4.4.1.2}% 
\contentsline {subsubsection}{\numberline {4.4.1.3}$\sim $AGSymbol()}{13}{subsubsection.4.4.1.3}% 
\contentsline {subsection}{\numberline {4.4.2}Member Function Documentation}{13}{subsection.4.4.2}% 
\contentsline {subsubsection}{\numberline {4.4.2.1}getInUse()}{13}{subsubsection.4.4.2.1}% 
\contentsline {subsubsection}{\numberline {4.4.2.2}getValidProductionIndices()}{13}{subsubsection.4.4.2.2}% 
\contentsline {subsubsection}{\numberline {4.4.2.3}operator=()}{13}{subsubsection.4.4.2.3}% 
\contentsline {subsubsection}{\numberline {4.4.2.4}operator==()}{14}{subsubsection.4.4.2.4}% 
\contentsline {subsubsection}{\numberline {4.4.2.5}setInUse()}{14}{subsubsection.4.4.2.5}% 
\contentsline {subsubsection}{\numberline {4.4.2.6}updateInheritedAttributes()}{14}{subsubsection.4.4.2.6}% 
\contentsline {subsubsection}{\numberline {4.4.2.7}updateSynthesisedAttributes()}{14}{subsubsection.4.4.2.7}% 
\contentsline {subsection}{\numberline {4.4.3}Member Data Documentation}{14}{subsection.4.4.3}% 
\contentsline {subsubsection}{\numberline {4.4.3.1}inUse}{14}{subsubsection.4.4.3.1}% 
\contentsline {section}{\numberline {4.5}C\discretionary {\unhbox \voidb@x \hbox {\relax \fontsize {7}{8}\selectfont $\leftarrow \joinrel \rhook $}}{}{}F\discretionary {\unhbox \voidb@x \hbox {\relax \fontsize {7}{8}\selectfont $\leftarrow \joinrel \rhook $}}{}{}Grammar Class Reference}{15}{section.4.5}% 
\contentsline {subsection}{\numberline {4.5.1}Constructor \& Destructor Documentation}{15}{subsection.4.5.1}% 
\contentsline {subsubsection}{\numberline {4.5.1.1}CFGrammar()\hspace {0.1cm}{\relax \fontsize {8}{9.5}\selectfont \abovedisplayskip 6\p@ plus2\p@ minus4\p@ \abovedisplayshortskip \z@ plus\p@ \belowdisplayshortskip 3\p@ plus\p@ minus2\p@ \def \leftmargin \leftmargini \parsep 4\p@ plus2\p@ minus\p@ \topsep 8\p@ plus2\p@ minus4\p@ \itemsep 4\p@ plus2\p@ minus\p@ {\leftmargin \leftmargini \topsep 3\p@ plus\p@ minus\p@ \parsep 2\p@ plus\p@ minus\p@ \itemsep \parsep }\belowdisplayskip \abovedisplayskip \ttfamily [1/4]}}{15}{subsubsection.4.5.1.1}% 
\contentsline {subsubsection}{\numberline {4.5.1.2}CFGrammar()\hspace {0.1cm}{\relax \fontsize {8}{9.5}\selectfont \abovedisplayskip 6\p@ plus2\p@ minus4\p@ \abovedisplayshortskip \z@ plus\p@ \belowdisplayshortskip 3\p@ plus\p@ minus2\p@ \def \leftmargin \leftmargini \parsep 4\p@ plus2\p@ minus\p@ \topsep 8\p@ plus2\p@ minus4\p@ \itemsep 4\p@ plus2\p@ minus\p@ {\leftmargin \leftmargini \topsep 3\p@ plus\p@ minus\p@ \parsep 2\p@ plus\p@ minus\p@ \itemsep \parsep }\belowdisplayskip \abovedisplayskip \ttfamily [2/4]}}{15}{subsubsection.4.5.1.2}% 
\contentsline {subsubsection}{\numberline {4.5.1.3}CFGrammar()\hspace {0.1cm}{\relax \fontsize {8}{9.5}\selectfont \abovedisplayskip 6\p@ plus2\p@ minus4\p@ \abovedisplayshortskip \z@ plus\p@ \belowdisplayshortskip 3\p@ plus\p@ minus2\p@ \def \leftmargin \leftmargini \parsep 4\p@ plus2\p@ minus\p@ \topsep 8\p@ plus2\p@ minus4\p@ \itemsep 4\p@ plus2\p@ minus\p@ {\leftmargin \leftmargini \topsep 3\p@ plus\p@ minus\p@ \parsep 2\p@ plus\p@ minus\p@ \itemsep \parsep }\belowdisplayskip \abovedisplayskip \ttfamily [3/4]}}{16}{subsubsection.4.5.1.3}% 
\contentsline {subsubsection}{\numberline {4.5.1.4}CFGrammar()\hspace {0.1cm}{\relax \fontsize {8}{9.5}\selectfont \abovedisplayskip 6\p@ plus2\p@ minus4\p@ \abovedisplayshortskip \z@ plus\p@ \belowdisplayshortskip 3\p@ plus\p@ minus2\p@ \def \leftmargin \leftmargini \parsep 4\p@ plus2\p@ minus\p@ \topsep 8\p@ plus2\p@ minus4\p@ \itemsep 4\p@ plus2\p@ minus\p@ {\leftmargin \leftmargini \topsep 3\p@ plus\p@ minus\p@ \parsep 2\p@ plus\p@ minus\p@ \itemsep \parsep }\belowdisplayskip \abovedisplayskip \ttfamily [4/4]}}{16}{subsubsection.4.5.1.4}% 
\contentsline {subsubsection}{\numberline {4.5.1.5}$\sim $CFGrammar()}{16}{subsubsection.4.5.1.5}% 
\contentsline {subsection}{\numberline {4.5.2}Member Function Documentation}{16}{subsection.4.5.2}% 
\contentsline {subsubsection}{\numberline {4.5.2.1}addBNFString()\hspace {0.1cm}{\relax \fontsize {8}{9.5}\selectfont \abovedisplayskip 6\p@ plus2\p@ minus4\p@ \abovedisplayshortskip \z@ plus\p@ \belowdisplayshortskip 3\p@ plus\p@ minus2\p@ \def \leftmargin \leftmargini \parsep 4\p@ plus2\p@ minus\p@ \topsep 8\p@ plus2\p@ minus4\p@ \itemsep 4\p@ plus2\p@ minus\p@ {\leftmargin \leftmargini \topsep 3\p@ plus\p@ minus\p@ \parsep 2\p@ plus\p@ minus\p@ \itemsep \parsep }\belowdisplayskip \abovedisplayskip \ttfamily [1/2]}}{16}{subsubsection.4.5.2.1}% 
\contentsline {subsubsection}{\numberline {4.5.2.2}addBNFString()\hspace {0.1cm}{\relax \fontsize {8}{9.5}\selectfont \abovedisplayskip 6\p@ plus2\p@ minus4\p@ \abovedisplayshortskip \z@ plus\p@ \belowdisplayshortskip 3\p@ plus\p@ minus2\p@ \def \leftmargin \leftmargini \parsep 4\p@ plus2\p@ minus\p@ \topsep 8\p@ plus2\p@ minus4\p@ \itemsep 4\p@ plus2\p@ minus\p@ {\leftmargin \leftmargini \topsep 3\p@ plus\p@ minus\p@ \parsep 2\p@ plus\p@ minus\p@ \itemsep \parsep }\belowdisplayskip \abovedisplayskip \ttfamily [2/2]}}{16}{subsubsection.4.5.2.2}% 
\contentsline {subsubsection}{\numberline {4.5.2.3}createSymbol()}{16}{subsubsection.4.5.2.3}% 
\contentsline {subsubsection}{\numberline {4.5.2.4}findRule()}{16}{subsubsection.4.5.2.4}% 
\contentsline {subsubsection}{\numberline {4.5.2.5}genotype2Phenotype()}{17}{subsubsection.4.5.2.5}% 
\contentsline {subsubsection}{\numberline {4.5.2.6}getDerivationTree()}{17}{subsubsection.4.5.2.6}% 
\contentsline {subsubsection}{\numberline {4.5.2.7}outputBNF()}{17}{subsubsection.4.5.2.7}% 
\contentsline {subsubsection}{\numberline {4.5.2.8}phenotype2Genotype()}{17}{subsubsection.4.5.2.8}% 
\contentsline {subsubsection}{\numberline {4.5.2.9}readBNFFile()\hspace {0.1cm}{\relax \fontsize {8}{9.5}\selectfont \abovedisplayskip 6\p@ plus2\p@ minus4\p@ \abovedisplayshortskip \z@ plus\p@ \belowdisplayshortskip 3\p@ plus\p@ minus2\p@ \def \leftmargin \leftmargini \parsep 4\p@ plus2\p@ minus\p@ \topsep 8\p@ plus2\p@ minus4\p@ \itemsep 4\p@ plus2\p@ minus\p@ {\leftmargin \leftmargini \topsep 3\p@ plus\p@ minus\p@ \parsep 2\p@ plus\p@ minus\p@ \itemsep \parsep }\belowdisplayskip \abovedisplayskip \ttfamily [1/2]}}{17}{subsubsection.4.5.2.9}% 
\contentsline {subsubsection}{\numberline {4.5.2.10}readBNFFile()\hspace {0.1cm}{\relax \fontsize {8}{9.5}\selectfont \abovedisplayskip 6\p@ plus2\p@ minus4\p@ \abovedisplayshortskip \z@ plus\p@ \belowdisplayshortskip 3\p@ plus\p@ minus2\p@ \def \leftmargin \leftmargini \parsep 4\p@ plus2\p@ minus\p@ \topsep 8\p@ plus2\p@ minus4\p@ \itemsep 4\p@ plus2\p@ minus\p@ {\leftmargin \leftmargini \topsep 3\p@ plus\p@ minus\p@ \parsep 2\p@ plus\p@ minus\p@ \itemsep \parsep }\belowdisplayskip \abovedisplayskip \ttfamily [2/2]}}{17}{subsubsection.4.5.2.10}% 
\contentsline {subsubsection}{\numberline {4.5.2.11}readBNFString()\hspace {0.1cm}{\relax \fontsize {8}{9.5}\selectfont \abovedisplayskip 6\p@ plus2\p@ minus4\p@ \abovedisplayshortskip \z@ plus\p@ \belowdisplayshortskip 3\p@ plus\p@ minus2\p@ \def \leftmargin \leftmargini \parsep 4\p@ plus2\p@ minus\p@ \topsep 8\p@ plus2\p@ minus4\p@ \itemsep 4\p@ plus2\p@ minus\p@ {\leftmargin \leftmargini \topsep 3\p@ plus\p@ minus\p@ \parsep 2\p@ plus\p@ minus\p@ \itemsep \parsep }\belowdisplayskip \abovedisplayskip \ttfamily [1/2]}}{17}{subsubsection.4.5.2.11}% 
\contentsline {subsubsection}{\numberline {4.5.2.12}readBNFString()\hspace {0.1cm}{\relax \fontsize {8}{9.5}\selectfont \abovedisplayskip 6\p@ plus2\p@ minus4\p@ \abovedisplayshortskip \z@ plus\p@ \belowdisplayshortskip 3\p@ plus\p@ minus2\p@ \def \leftmargin \leftmargini \parsep 4\p@ plus2\p@ minus\p@ \topsep 8\p@ plus2\p@ minus4\p@ \itemsep 4\p@ plus2\p@ minus\p@ {\leftmargin \leftmargini \topsep 3\p@ plus\p@ minus\p@ \parsep 2\p@ plus\p@ minus\p@ \itemsep \parsep }\belowdisplayskip \abovedisplayskip \ttfamily [2/2]}}{17}{subsubsection.4.5.2.12}% 
\contentsline {subsection}{\numberline {4.5.3}Member Data Documentation}{17}{subsection.4.5.3}% 
\contentsline {subsubsection}{\numberline {4.5.3.1}derivationTree}{17}{subsubsection.4.5.3.1}% 
\contentsline {section}{\numberline {4.6}G\discretionary {\unhbox \voidb@x \hbox {\relax \fontsize {7}{8}\selectfont $\leftarrow \joinrel \rhook $}}{}{}E\discretionary {\unhbox \voidb@x \hbox {\relax \fontsize {7}{8}\selectfont $\leftarrow \joinrel \rhook $}}{}{}Grammar Class Reference}{18}{section.4.6}% 
\contentsline {subsection}{\numberline {4.6.1}Constructor \& Destructor Documentation}{19}{subsection.4.6.1}% 
\contentsline {subsubsection}{\numberline {4.6.1.1}GEGrammar()\hspace {0.1cm}{\relax \fontsize {8}{9.5}\selectfont \abovedisplayskip 6\p@ plus2\p@ minus4\p@ \abovedisplayshortskip \z@ plus\p@ \belowdisplayshortskip 3\p@ plus\p@ minus2\p@ \def \leftmargin \leftmargini \parsep 4\p@ plus2\p@ minus\p@ \topsep 8\p@ plus2\p@ minus4\p@ \itemsep 4\p@ plus2\p@ minus\p@ {\leftmargin \leftmargini \topsep 3\p@ plus\p@ minus\p@ \parsep 2\p@ plus\p@ minus\p@ \itemsep \parsep }\belowdisplayskip \abovedisplayskip \ttfamily [1/4]}}{19}{subsubsection.4.6.1.1}% 
\contentsline {subsubsection}{\numberline {4.6.1.2}GEGrammar()\hspace {0.1cm}{\relax \fontsize {8}{9.5}\selectfont \abovedisplayskip 6\p@ plus2\p@ minus4\p@ \abovedisplayshortskip \z@ plus\p@ \belowdisplayshortskip 3\p@ plus\p@ minus2\p@ \def \leftmargin \leftmargini \parsep 4\p@ plus2\p@ minus\p@ \topsep 8\p@ plus2\p@ minus4\p@ \itemsep 4\p@ plus2\p@ minus\p@ {\leftmargin \leftmargini \topsep 3\p@ plus\p@ minus\p@ \parsep 2\p@ plus\p@ minus\p@ \itemsep \parsep }\belowdisplayskip \abovedisplayskip \ttfamily [2/4]}}{19}{subsubsection.4.6.1.2}% 
\contentsline {subsubsection}{\numberline {4.6.1.3}GEGrammar()\hspace {0.1cm}{\relax \fontsize {8}{9.5}\selectfont \abovedisplayskip 6\p@ plus2\p@ minus4\p@ \abovedisplayshortskip \z@ plus\p@ \belowdisplayshortskip 3\p@ plus\p@ minus2\p@ \def \leftmargin \leftmargini \parsep 4\p@ plus2\p@ minus\p@ \topsep 8\p@ plus2\p@ minus4\p@ \itemsep 4\p@ plus2\p@ minus\p@ {\leftmargin \leftmargini \topsep 3\p@ plus\p@ minus\p@ \parsep 2\p@ plus\p@ minus\p@ \itemsep \parsep }\belowdisplayskip \abovedisplayskip \ttfamily [3/4]}}{19}{subsubsection.4.6.1.3}% 
\contentsline {subsubsection}{\numberline {4.6.1.4}GEGrammar()\hspace {0.1cm}{\relax \fontsize {8}{9.5}\selectfont \abovedisplayskip 6\p@ plus2\p@ minus4\p@ \abovedisplayshortskip \z@ plus\p@ \belowdisplayshortskip 3\p@ plus\p@ minus2\p@ \def \leftmargin \leftmargini \parsep 4\p@ plus2\p@ minus\p@ \topsep 8\p@ plus2\p@ minus4\p@ \itemsep 4\p@ plus2\p@ minus\p@ {\leftmargin \leftmargini \topsep 3\p@ plus\p@ minus\p@ \parsep 2\p@ plus\p@ minus\p@ \itemsep \parsep }\belowdisplayskip \abovedisplayskip \ttfamily [4/4]}}{19}{subsubsection.4.6.1.4}% 
\contentsline {subsubsection}{\numberline {4.6.1.5}$\sim $GEGrammar()}{19}{subsubsection.4.6.1.5}% 
\contentsline {subsection}{\numberline {4.6.2}Member Function Documentation}{19}{subsection.4.6.2}% 
\contentsline {subsubsection}{\numberline {4.6.2.1}buildAGTree()}{19}{subsubsection.4.6.2.1}% 
\contentsline {subsubsection}{\numberline {4.6.2.2}buildDTree()}{20}{subsubsection.4.6.2.2}% 
\contentsline {subsubsection}{\numberline {4.6.2.3}chooseProduction()}{20}{subsubsection.4.6.2.3}% 
\contentsline {subsubsection}{\numberline {4.6.2.4}createSymbol()}{20}{subsubsection.4.6.2.4}% 
\contentsline {subsubsection}{\numberline {4.6.2.5}genotype2Phenotype()}{20}{subsubsection.4.6.2.5}% 
\contentsline {subsubsection}{\numberline {4.6.2.6}getAGContext()}{20}{subsubsection.4.6.2.6}% 
\contentsline {subsubsection}{\numberline {4.6.2.7}getAGDerivationTree()}{21}{subsubsection.4.6.2.7}% 
\contentsline {subsubsection}{\numberline {4.6.2.8}getAGInitProductionSet()}{21}{subsubsection.4.6.2.8}% 
\contentsline {subsubsection}{\numberline {4.6.2.9}getAGLookUp()}{21}{subsubsection.4.6.2.9}% 
\contentsline {subsubsection}{\numberline {4.6.2.10}getDerivationTree()}{21}{subsubsection.4.6.2.10}% 
\contentsline {subsubsection}{\numberline {4.6.2.11}getMaxWraps()}{21}{subsubsection.4.6.2.11}% 
\contentsline {subsubsection}{\numberline {4.6.2.12}getProductions()}{21}{subsubsection.4.6.2.12}% 
\contentsline {subsubsection}{\numberline {4.6.2.13}getUseAG()}{21}{subsubsection.4.6.2.13}% 
\contentsline {subsubsection}{\numberline {4.6.2.14}phenotype2Genotype()}{21}{subsubsection.4.6.2.14}% 
\contentsline {subsubsection}{\numberline {4.6.2.15}setMaxWraps()}{22}{subsubsection.4.6.2.15}% 
\contentsline {subsection}{\numberline {4.6.3}Member Data Documentation}{22}{subsection.4.6.3}% 
\contentsline {subsubsection}{\numberline {4.6.3.1}agContext}{22}{subsubsection.4.6.3.1}% 
\contentsline {subsubsection}{\numberline {4.6.3.2}agDtree}{22}{subsubsection.4.6.3.2}% 
\contentsline {subsubsection}{\numberline {4.6.3.3}agLookUp}{22}{subsubsection.4.6.3.3}% 
\contentsline {subsubsection}{\numberline {4.6.3.4}productions}{22}{subsubsection.4.6.3.4}% 
\contentsline {subsubsection}{\numberline {4.6.3.5}useAG}{22}{subsubsection.4.6.3.5}% 
\contentsline {section}{\numberline {4.7}G\discretionary {\unhbox \voidb@x \hbox {\relax \fontsize {7}{8}\selectfont $\leftarrow \joinrel \rhook $}}{}{}E\discretionary {\unhbox \voidb@x \hbox {\relax \fontsize {7}{8}\selectfont $\leftarrow \joinrel \rhook $}}{}{}Grammar\discretionary {\unhbox \voidb@x \hbox {\relax \fontsize {7}{8}\selectfont $\leftarrow \joinrel \rhook $}}{}{}SI Class Reference}{23}{section.4.7}% 
\contentsline {subsection}{\numberline {4.7.1}Constructor \& Destructor Documentation}{23}{subsection.4.7.1}% 
\contentsline {subsubsection}{\numberline {4.7.1.1}GEGrammarSI()\hspace {0.1cm}{\relax \fontsize {8}{9.5}\selectfont \abovedisplayskip 6\p@ plus2\p@ minus4\p@ \abovedisplayshortskip \z@ plus\p@ \belowdisplayshortskip 3\p@ plus\p@ minus2\p@ \def \leftmargin \leftmargini \parsep 4\p@ plus2\p@ minus\p@ \topsep 8\p@ plus2\p@ minus4\p@ \itemsep 4\p@ plus2\p@ minus\p@ {\leftmargin \leftmargini \topsep 3\p@ plus\p@ minus\p@ \parsep 2\p@ plus\p@ minus\p@ \itemsep \parsep }\belowdisplayskip \abovedisplayskip \ttfamily [1/4]}}{23}{subsubsection.4.7.1.1}% 
\contentsline {subsubsection}{\numberline {4.7.1.2}GEGrammarSI()\hspace {0.1cm}{\relax \fontsize {8}{9.5}\selectfont \abovedisplayskip 6\p@ plus2\p@ minus4\p@ \abovedisplayshortskip \z@ plus\p@ \belowdisplayshortskip 3\p@ plus\p@ minus2\p@ \def \leftmargin \leftmargini \parsep 4\p@ plus2\p@ minus\p@ \topsep 8\p@ plus2\p@ minus4\p@ \itemsep 4\p@ plus2\p@ minus\p@ {\leftmargin \leftmargini \topsep 3\p@ plus\p@ minus\p@ \parsep 2\p@ plus\p@ minus\p@ \itemsep \parsep }\belowdisplayskip \abovedisplayskip \ttfamily [2/4]}}{24}{subsubsection.4.7.1.2}% 
\contentsline {subsubsection}{\numberline {4.7.1.3}GEGrammarSI()\hspace {0.1cm}{\relax \fontsize {8}{9.5}\selectfont \abovedisplayskip 6\p@ plus2\p@ minus4\p@ \abovedisplayshortskip \z@ plus\p@ \belowdisplayshortskip 3\p@ plus\p@ minus2\p@ \def \leftmargin \leftmargini \parsep 4\p@ plus2\p@ minus\p@ \topsep 8\p@ plus2\p@ minus4\p@ \itemsep 4\p@ plus2\p@ minus\p@ {\leftmargin \leftmargini \topsep 3\p@ plus\p@ minus\p@ \parsep 2\p@ plus\p@ minus\p@ \itemsep \parsep }\belowdisplayskip \abovedisplayskip \ttfamily [3/4]}}{24}{subsubsection.4.7.1.3}% 
\contentsline {subsubsection}{\numberline {4.7.1.4}GEGrammarSI()\hspace {0.1cm}{\relax \fontsize {8}{9.5}\selectfont \abovedisplayskip 6\p@ plus2\p@ minus4\p@ \abovedisplayshortskip \z@ plus\p@ \belowdisplayshortskip 3\p@ plus\p@ minus2\p@ \def \leftmargin \leftmargini \parsep 4\p@ plus2\p@ minus\p@ \topsep 8\p@ plus2\p@ minus4\p@ \itemsep 4\p@ plus2\p@ minus\p@ {\leftmargin \leftmargini \topsep 3\p@ plus\p@ minus\p@ \parsep 2\p@ plus\p@ minus\p@ \itemsep \parsep }\belowdisplayskip \abovedisplayskip \ttfamily [4/4]}}{24}{subsubsection.4.7.1.4}% 
\contentsline {subsubsection}{\numberline {4.7.1.5}$\sim $GEGrammarSI()}{24}{subsubsection.4.7.1.5}% 
\contentsline {subsection}{\numberline {4.7.2}Member Function Documentation}{24}{subsection.4.7.2}% 
\contentsline {subsubsection}{\numberline {4.7.2.1}getAGInitProductionSet()}{24}{subsubsection.4.7.2.1}% 
\contentsline {subsubsection}{\numberline {4.7.2.2}getFull()}{24}{subsubsection.4.7.2.2}% 
\contentsline {subsubsection}{\numberline {4.7.2.3}getGrow()}{25}{subsubsection.4.7.2.3}% 
\contentsline {subsubsection}{\numberline {4.7.2.4}getMaxDepth()}{25}{subsubsection.4.7.2.4}% 
\contentsline {subsubsection}{\numberline {4.7.2.5}getTailRatio()}{25}{subsubsection.4.7.2.5}% 
\contentsline {subsubsection}{\numberline {4.7.2.6}getTailSize()}{25}{subsubsection.4.7.2.6}% 
\contentsline {subsubsection}{\numberline {4.7.2.7}init()}{25}{subsubsection.4.7.2.7}% 
\contentsline {subsubsection}{\numberline {4.7.2.8}setFull()}{25}{subsubsection.4.7.2.8}% 
\contentsline {subsubsection}{\numberline {4.7.2.9}setGrow()}{25}{subsubsection.4.7.2.9}% 
\contentsline {subsubsection}{\numberline {4.7.2.10}setMaxDepth()}{25}{subsubsection.4.7.2.10}% 
\contentsline {subsubsection}{\numberline {4.7.2.11}setTailRatio()}{25}{subsubsection.4.7.2.11}% 
\contentsline {subsubsection}{\numberline {4.7.2.12}setTailSize()}{25}{subsubsection.4.7.2.12}% 
\contentsline {section}{\numberline {4.8}G\discretionary {\unhbox \voidb@x \hbox {\relax \fontsize {7}{8}\selectfont $\leftarrow \joinrel \rhook $}}{}{}E\discretionary {\unhbox \voidb@x \hbox {\relax \fontsize {7}{8}\selectfont $\leftarrow \joinrel \rhook $}}{}{}List\discretionary {\unhbox \voidb@x \hbox {\relax \fontsize {7}{8}\selectfont $\leftarrow \joinrel \rhook $}}{}{}Genome Class Reference}{26}{section.4.8}% 
\contentsline {subsection}{\numberline {4.8.1}Constructor \& Destructor Documentation}{26}{subsection.4.8.1}% 
\contentsline {subsubsection}{\numberline {4.8.1.1}GEListGenome()\hspace {0.1cm}{\relax \fontsize {8}{9.5}\selectfont \abovedisplayskip 6\p@ plus2\p@ minus4\p@ \abovedisplayshortskip \z@ plus\p@ \belowdisplayshortskip 3\p@ plus\p@ minus2\p@ \def \leftmargin \leftmargini \parsep 4\p@ plus2\p@ minus\p@ \topsep 8\p@ plus2\p@ minus4\p@ \itemsep 4\p@ plus2\p@ minus\p@ {\leftmargin \leftmargini \topsep 3\p@ plus\p@ minus\p@ \parsep 2\p@ plus\p@ minus\p@ \itemsep \parsep }\belowdisplayskip \abovedisplayskip \ttfamily [1/2]}}{26}{subsubsection.4.8.1.1}% 
\contentsline {subsubsection}{\numberline {4.8.1.2}GEListGenome()\hspace {0.1cm}{\relax \fontsize {8}{9.5}\selectfont \abovedisplayskip 6\p@ plus2\p@ minus4\p@ \abovedisplayshortskip \z@ plus\p@ \belowdisplayshortskip 3\p@ plus\p@ minus2\p@ \def \leftmargin \leftmargini \parsep 4\p@ plus2\p@ minus\p@ \topsep 8\p@ plus2\p@ minus4\p@ \itemsep 4\p@ plus2\p@ minus\p@ {\leftmargin \leftmargini \topsep 3\p@ plus\p@ minus\p@ \parsep 2\p@ plus\p@ minus\p@ \itemsep \parsep }\belowdisplayskip \abovedisplayskip \ttfamily [2/2]}}{26}{subsubsection.4.8.1.2}% 
\contentsline {subsubsection}{\numberline {4.8.1.3}$\sim $GEListGenome()}{26}{subsubsection.4.8.1.3}% 
\contentsline {subsection}{\numberline {4.8.2}Member Function Documentation}{26}{subsection.4.8.2}% 
\contentsline {subsubsection}{\numberline {4.8.2.1}clone()}{27}{subsubsection.4.8.2.1}% 
\contentsline {subsubsection}{\numberline {4.8.2.2}copy()}{27}{subsubsection.4.8.2.2}% 
\contentsline {subsubsection}{\numberline {4.8.2.3}effCrossover()}{27}{subsubsection.4.8.2.3}% 
\contentsline {subsubsection}{\numberline {4.8.2.4}equal()}{27}{subsubsection.4.8.2.4}% 
\contentsline {subsubsection}{\numberline {4.8.2.5}getEffectiveSize()}{27}{subsubsection.4.8.2.5}% 
\contentsline {subsubsection}{\numberline {4.8.2.6}getTestFitness()}{27}{subsubsection.4.8.2.6}% 
\contentsline {subsubsection}{\numberline {4.8.2.7}operator=()}{27}{subsubsection.4.8.2.7}% 
\contentsline {subsubsection}{\numberline {4.8.2.8}pointMutator()}{27}{subsubsection.4.8.2.8}% 
\contentsline {subsubsection}{\numberline {4.8.2.9}setEffectiveSize()}{28}{subsubsection.4.8.2.9}% 
\contentsline {subsubsection}{\numberline {4.8.2.10}setTestFitness()}{28}{subsubsection.4.8.2.10}% 
\contentsline {section}{\numberline {4.9}Generic\discretionary {\unhbox \voidb@x \hbox {\relax \fontsize {7}{8}\selectfont $\leftarrow \joinrel \rhook $}}{}{}A\discretionary {\unhbox \voidb@x \hbox {\relax \fontsize {7}{8}\selectfont $\leftarrow \joinrel \rhook $}}{}{}G\discretionary {\unhbox \voidb@x \hbox {\relax \fontsize {7}{8}\selectfont $\leftarrow \joinrel \rhook $}}{}{}Symbol Class Reference}{28}{section.4.9}% 
\contentsline {subsection}{\numberline {4.9.1}Constructor \& Destructor Documentation}{28}{subsection.4.9.1}% 
\contentsline {subsubsection}{\numberline {4.9.1.1}GenericAGSymbol()\hspace {0.1cm}{\relax \fontsize {8}{9.5}\selectfont \abovedisplayskip 6\p@ plus2\p@ minus4\p@ \abovedisplayshortskip \z@ plus\p@ \belowdisplayshortskip 3\p@ plus\p@ minus2\p@ \def \leftmargin \leftmargini \parsep 4\p@ plus2\p@ minus\p@ \topsep 8\p@ plus2\p@ minus4\p@ \itemsep 4\p@ plus2\p@ minus\p@ {\leftmargin \leftmargini \topsep 3\p@ plus\p@ minus\p@ \parsep 2\p@ plus\p@ minus\p@ \itemsep \parsep }\belowdisplayskip \abovedisplayskip \ttfamily [1/2]}}{28}{subsubsection.4.9.1.1}% 
\contentsline {subsubsection}{\numberline {4.9.1.2}GenericAGSymbol()\hspace {0.1cm}{\relax \fontsize {8}{9.5}\selectfont \abovedisplayskip 6\p@ plus2\p@ minus4\p@ \abovedisplayshortskip \z@ plus\p@ \belowdisplayshortskip 3\p@ plus\p@ minus2\p@ \def \leftmargin \leftmargini \parsep 4\p@ plus2\p@ minus\p@ \topsep 8\p@ plus2\p@ minus4\p@ \itemsep 4\p@ plus2\p@ minus\p@ {\leftmargin \leftmargini \topsep 3\p@ plus\p@ minus\p@ \parsep 2\p@ plus\p@ minus\p@ \itemsep \parsep }\belowdisplayskip \abovedisplayskip \ttfamily [2/2]}}{29}{subsubsection.4.9.1.2}% 
\contentsline {subsubsection}{\numberline {4.9.1.3}$\sim $GenericAGSymbol()}{29}{subsubsection.4.9.1.3}% 
\contentsline {subsection}{\numberline {4.9.2}Member Function Documentation}{29}{subsection.4.9.2}% 
\contentsline {subsubsection}{\numberline {4.9.2.1}operator=()}{29}{subsubsection.4.9.2.1}% 
\contentsline {subsubsection}{\numberline {4.9.2.2}updateInheritedAttributes()}{29}{subsubsection.4.9.2.2}% 
\contentsline {subsubsection}{\numberline {4.9.2.3}updateSynthesisedAttributes()}{29}{subsubsection.4.9.2.3}% 
\contentsline {section}{\numberline {4.10}Genotype Class Reference}{30}{section.4.10}% 
\contentsline {subsection}{\numberline {4.10.1}Constructor \& Destructor Documentation}{30}{subsection.4.10.1}% 
\contentsline {subsubsection}{\numberline {4.10.1.1}Genotype()\hspace {0.1cm}{\relax \fontsize {8}{9.5}\selectfont \abovedisplayskip 6\p@ plus2\p@ minus4\p@ \abovedisplayshortskip \z@ plus\p@ \belowdisplayshortskip 3\p@ plus\p@ minus2\p@ \def \leftmargin \leftmargini \parsep 4\p@ plus2\p@ minus\p@ \topsep 8\p@ plus2\p@ minus4\p@ \itemsep 4\p@ plus2\p@ minus\p@ {\leftmargin \leftmargini \topsep 3\p@ plus\p@ minus\p@ \parsep 2\p@ plus\p@ minus\p@ \itemsep \parsep }\belowdisplayskip \abovedisplayskip \ttfamily [1/4]}}{30}{subsubsection.4.10.1.1}% 
\contentsline {subsubsection}{\numberline {4.10.1.2}Genotype()\hspace {0.1cm}{\relax \fontsize {8}{9.5}\selectfont \abovedisplayskip 6\p@ plus2\p@ minus4\p@ \abovedisplayshortskip \z@ plus\p@ \belowdisplayshortskip 3\p@ plus\p@ minus2\p@ \def \leftmargin \leftmargini \parsep 4\p@ plus2\p@ minus\p@ \topsep 8\p@ plus2\p@ minus4\p@ \itemsep 4\p@ plus2\p@ minus\p@ {\leftmargin \leftmargini \topsep 3\p@ plus\p@ minus\p@ \parsep 2\p@ plus\p@ minus\p@ \itemsep \parsep }\belowdisplayskip \abovedisplayskip \ttfamily [2/4]}}{30}{subsubsection.4.10.1.2}% 
\contentsline {subsubsection}{\numberline {4.10.1.3}Genotype()\hspace {0.1cm}{\relax \fontsize {8}{9.5}\selectfont \abovedisplayskip 6\p@ plus2\p@ minus4\p@ \abovedisplayshortskip \z@ plus\p@ \belowdisplayshortskip 3\p@ plus\p@ minus2\p@ \def \leftmargin \leftmargini \parsep 4\p@ plus2\p@ minus\p@ \topsep 8\p@ plus2\p@ minus4\p@ \itemsep 4\p@ plus2\p@ minus\p@ {\leftmargin \leftmargini \topsep 3\p@ plus\p@ minus\p@ \parsep 2\p@ plus\p@ minus\p@ \itemsep \parsep }\belowdisplayskip \abovedisplayskip \ttfamily [3/4]}}{31}{subsubsection.4.10.1.3}% 
\contentsline {subsubsection}{\numberline {4.10.1.4}Genotype()\hspace {0.1cm}{\relax \fontsize {8}{9.5}\selectfont \abovedisplayskip 6\p@ plus2\p@ minus4\p@ \abovedisplayshortskip \z@ plus\p@ \belowdisplayshortskip 3\p@ plus\p@ minus2\p@ \def \leftmargin \leftmargini \parsep 4\p@ plus2\p@ minus\p@ \topsep 8\p@ plus2\p@ minus4\p@ \itemsep 4\p@ plus2\p@ minus\p@ {\leftmargin \leftmargini \topsep 3\p@ plus\p@ minus\p@ \parsep 2\p@ plus\p@ minus\p@ \itemsep \parsep }\belowdisplayskip \abovedisplayskip \ttfamily [4/4]}}{31}{subsubsection.4.10.1.4}% 
\contentsline {subsubsection}{\numberline {4.10.1.5}$\sim $Genotype()}{31}{subsubsection.4.10.1.5}% 
\contentsline {subsection}{\numberline {4.10.2}Member Function Documentation}{31}{subsection.4.10.2}% 
\contentsline {subsubsection}{\numberline {4.10.2.1}getEffectiveSize()}{31}{subsubsection.4.10.2.1}% 
\contentsline {subsubsection}{\numberline {4.10.2.2}getFitness()}{31}{subsubsection.4.10.2.2}% 
\contentsline {subsubsection}{\numberline {4.10.2.3}getMaxCodonValue()}{31}{subsubsection.4.10.2.3}% 
\contentsline {subsubsection}{\numberline {4.10.2.4}getValid()}{31}{subsubsection.4.10.2.4}% 
\contentsline {subsubsection}{\numberline {4.10.2.5}getWraps()}{31}{subsubsection.4.10.2.5}% 
\contentsline {subsubsection}{\numberline {4.10.2.6}setEffectiveSize()}{32}{subsubsection.4.10.2.6}% 
\contentsline {subsubsection}{\numberline {4.10.2.7}setFitness()}{32}{subsubsection.4.10.2.7}% 
\contentsline {subsubsection}{\numberline {4.10.2.8}setMaxCodonValue()}{32}{subsubsection.4.10.2.8}% 
\contentsline {subsubsection}{\numberline {4.10.2.9}setValid()}{32}{subsubsection.4.10.2.9}% 
\contentsline {subsubsection}{\numberline {4.10.2.10}setWraps()}{32}{subsubsection.4.10.2.10}% 
\contentsline {subsection}{\numberline {4.10.3}Friends And Related Function Documentation}{32}{subsection.4.10.3}% 
\contentsline {subsubsection}{\numberline {4.10.3.1}operator$<$$<$}{32}{subsubsection.4.10.3.1}% 
\contentsline {section}{\numberline {4.11}Grammar Class Reference}{33}{section.4.11}% 
\contentsline {subsection}{\numberline {4.11.1}Constructor \& Destructor Documentation}{33}{subsection.4.11.1}% 
\contentsline {subsubsection}{\numberline {4.11.1.1}Grammar()\hspace {0.1cm}{\relax \fontsize {8}{9.5}\selectfont \abovedisplayskip 6\p@ plus2\p@ minus4\p@ \abovedisplayshortskip \z@ plus\p@ \belowdisplayshortskip 3\p@ plus\p@ minus2\p@ \def \leftmargin \leftmargini \parsep 4\p@ plus2\p@ minus\p@ \topsep 8\p@ plus2\p@ minus4\p@ \itemsep 4\p@ plus2\p@ minus\p@ {\leftmargin \leftmargini \topsep 3\p@ plus\p@ minus\p@ \parsep 2\p@ plus\p@ minus\p@ \itemsep \parsep }\belowdisplayskip \abovedisplayskip \ttfamily [1/4]}}{33}{subsubsection.4.11.1.1}% 
\contentsline {subsubsection}{\numberline {4.11.1.2}Grammar()\hspace {0.1cm}{\relax \fontsize {8}{9.5}\selectfont \abovedisplayskip 6\p@ plus2\p@ minus4\p@ \abovedisplayshortskip \z@ plus\p@ \belowdisplayshortskip 3\p@ plus\p@ minus2\p@ \def \leftmargin \leftmargini \parsep 4\p@ plus2\p@ minus\p@ \topsep 8\p@ plus2\p@ minus4\p@ \itemsep 4\p@ plus2\p@ minus\p@ {\leftmargin \leftmargini \topsep 3\p@ plus\p@ minus\p@ \parsep 2\p@ plus\p@ minus\p@ \itemsep \parsep }\belowdisplayskip \abovedisplayskip \ttfamily [2/4]}}{33}{subsubsection.4.11.1.2}% 
\contentsline {subsubsection}{\numberline {4.11.1.3}Grammar()\hspace {0.1cm}{\relax \fontsize {8}{9.5}\selectfont \abovedisplayskip 6\p@ plus2\p@ minus4\p@ \abovedisplayshortskip \z@ plus\p@ \belowdisplayshortskip 3\p@ plus\p@ minus2\p@ \def \leftmargin \leftmargini \parsep 4\p@ plus2\p@ minus\p@ \topsep 8\p@ plus2\p@ minus4\p@ \itemsep 4\p@ plus2\p@ minus\p@ {\leftmargin \leftmargini \topsep 3\p@ plus\p@ minus\p@ \parsep 2\p@ plus\p@ minus\p@ \itemsep \parsep }\belowdisplayskip \abovedisplayskip \ttfamily [3/4]}}{33}{subsubsection.4.11.1.3}% 
\contentsline {subsubsection}{\numberline {4.11.1.4}Grammar()\hspace {0.1cm}{\relax \fontsize {8}{9.5}\selectfont \abovedisplayskip 6\p@ plus2\p@ minus4\p@ \abovedisplayshortskip \z@ plus\p@ \belowdisplayshortskip 3\p@ plus\p@ minus2\p@ \def \leftmargin \leftmargini \parsep 4\p@ plus2\p@ minus\p@ \topsep 8\p@ plus2\p@ minus4\p@ \itemsep 4\p@ plus2\p@ minus\p@ {\leftmargin \leftmargini \topsep 3\p@ plus\p@ minus\p@ \parsep 2\p@ plus\p@ minus\p@ \itemsep \parsep }\belowdisplayskip \abovedisplayskip \ttfamily [4/4]}}{34}{subsubsection.4.11.1.4}% 
\contentsline {subsubsection}{\numberline {4.11.1.5}$\sim $Grammar()}{34}{subsubsection.4.11.1.5}% 
\contentsline {subsection}{\numberline {4.11.2}Member Function Documentation}{34}{subsection.4.11.2}% 
\contentsline {subsubsection}{\numberline {4.11.2.1}genotype2Phenotype()}{34}{subsubsection.4.11.2.1}% 
\contentsline {subsubsection}{\numberline {4.11.2.2}getStartRule()}{34}{subsubsection.4.11.2.2}% 
\contentsline {subsubsection}{\numberline {4.11.2.3}getStartSymbol()}{34}{subsubsection.4.11.2.3}% 
\contentsline {subsubsection}{\numberline {4.11.2.4}getValidGrammar()}{34}{subsubsection.4.11.2.4}% 
\contentsline {subsubsection}{\numberline {4.11.2.5}phenotype2Genotype()}{34}{subsubsection.4.11.2.5}% 
\contentsline {subsubsection}{\numberline {4.11.2.6}setStartSymbol()\hspace {0.1cm}{\relax \fontsize {8}{9.5}\selectfont \abovedisplayskip 6\p@ plus2\p@ minus4\p@ \abovedisplayshortskip \z@ plus\p@ \belowdisplayshortskip 3\p@ plus\p@ minus2\p@ \def \leftmargin \leftmargini \parsep 4\p@ plus2\p@ minus\p@ \topsep 8\p@ plus2\p@ minus4\p@ \itemsep 4\p@ plus2\p@ minus\p@ {\leftmargin \leftmargini \topsep 3\p@ plus\p@ minus\p@ \parsep 2\p@ plus\p@ minus\p@ \itemsep \parsep }\belowdisplayskip \abovedisplayskip \ttfamily [1/3]}}{35}{subsubsection.4.11.2.6}% 
\contentsline {subsubsection}{\numberline {4.11.2.7}setStartSymbol()\hspace {0.1cm}{\relax \fontsize {8}{9.5}\selectfont \abovedisplayskip 6\p@ plus2\p@ minus4\p@ \abovedisplayshortskip \z@ plus\p@ \belowdisplayshortskip 3\p@ plus\p@ minus2\p@ \def \leftmargin \leftmargini \parsep 4\p@ plus2\p@ minus\p@ \topsep 8\p@ plus2\p@ minus4\p@ \itemsep 4\p@ plus2\p@ minus\p@ {\leftmargin \leftmargini \topsep 3\p@ plus\p@ minus\p@ \parsep 2\p@ plus\p@ minus\p@ \itemsep \parsep }\belowdisplayskip \abovedisplayskip \ttfamily [2/3]}}{35}{subsubsection.4.11.2.7}% 
\contentsline {subsubsection}{\numberline {4.11.2.8}setStartSymbol()\hspace {0.1cm}{\relax \fontsize {8}{9.5}\selectfont \abovedisplayskip 6\p@ plus2\p@ minus4\p@ \abovedisplayshortskip \z@ plus\p@ \belowdisplayshortskip 3\p@ plus\p@ minus2\p@ \def \leftmargin \leftmargini \parsep 4\p@ plus2\p@ minus\p@ \topsep 8\p@ plus2\p@ minus4\p@ \itemsep 4\p@ plus2\p@ minus\p@ {\leftmargin \leftmargini \topsep 3\p@ plus\p@ minus\p@ \parsep 2\p@ plus\p@ minus\p@ \itemsep \parsep }\belowdisplayskip \abovedisplayskip \ttfamily [3/3]}}{35}{subsubsection.4.11.2.8}% 
\contentsline {subsubsection}{\numberline {4.11.2.9}setValidGrammar()}{35}{subsubsection.4.11.2.9}% 
\contentsline {section}{\numberline {4.12}individual Struct Reference}{35}{section.4.12}% 
\contentsline {subsection}{\numberline {4.12.1}Member Data Documentation}{36}{subsection.4.12.1}% 
\contentsline {subsubsection}{\numberline {4.12.1.1}chrom}{36}{subsubsection.4.12.1.1}% 
\contentsline {subsubsection}{\numberline {4.12.1.2}fitness}{36}{subsubsection.4.12.1.2}% 
\contentsline {subsubsection}{\numberline {4.12.1.3}parent}{36}{subsubsection.4.12.1.3}% 
\contentsline {subsubsection}{\numberline {4.12.1.4}utility}{36}{subsubsection.4.12.1.4}% 
\contentsline {subsubsection}{\numberline {4.12.1.5}xsite}{36}{subsubsection.4.12.1.5}% 
\contentsline {section}{\numberline {4.13}Initialiser Class Reference}{36}{section.4.13}% 
\contentsline {subsection}{\numberline {4.13.1}Constructor \& Destructor Documentation}{37}{subsection.4.13.1}% 
\contentsline {subsubsection}{\numberline {4.13.1.1}Initialiser()\hspace {0.1cm}{\relax \fontsize {8}{9.5}\selectfont \abovedisplayskip 6\p@ plus2\p@ minus4\p@ \abovedisplayshortskip \z@ plus\p@ \belowdisplayshortskip 3\p@ plus\p@ minus2\p@ \def \leftmargin \leftmargini \parsep 4\p@ plus2\p@ minus\p@ \topsep 8\p@ plus2\p@ minus4\p@ \itemsep 4\p@ plus2\p@ minus\p@ {\leftmargin \leftmargini \topsep 3\p@ plus\p@ minus\p@ \parsep 2\p@ plus\p@ minus\p@ \itemsep \parsep }\belowdisplayskip \abovedisplayskip \ttfamily [1/2]}}{37}{subsubsection.4.13.1.1}% 
\contentsline {subsubsection}{\numberline {4.13.1.2}Initialiser()\hspace {0.1cm}{\relax \fontsize {8}{9.5}\selectfont \abovedisplayskip 6\p@ plus2\p@ minus4\p@ \abovedisplayshortskip \z@ plus\p@ \belowdisplayshortskip 3\p@ plus\p@ minus2\p@ \def \leftmargin \leftmargini \parsep 4\p@ plus2\p@ minus\p@ \topsep 8\p@ plus2\p@ minus4\p@ \itemsep 4\p@ plus2\p@ minus\p@ {\leftmargin \leftmargini \topsep 3\p@ plus\p@ minus\p@ \parsep 2\p@ plus\p@ minus\p@ \itemsep \parsep }\belowdisplayskip \abovedisplayskip \ttfamily [2/2]}}{37}{subsubsection.4.13.1.2}% 
\contentsline {subsubsection}{\numberline {4.13.1.3}$\sim $Initialiser()}{37}{subsubsection.4.13.1.3}% 
\contentsline {subsection}{\numberline {4.13.2}Member Function Documentation}{37}{subsection.4.13.2}% 
\contentsline {subsubsection}{\numberline {4.13.2.1}getIndex()}{37}{subsubsection.4.13.2.1}% 
\contentsline {subsubsection}{\numberline {4.13.2.2}getPopSize()}{37}{subsubsection.4.13.2.2}% 
\contentsline {subsubsection}{\numberline {4.13.2.3}init()}{37}{subsubsection.4.13.2.3}% 
\contentsline {subsubsection}{\numberline {4.13.2.4}setIndex()}{37}{subsubsection.4.13.2.4}% 
\contentsline {subsubsection}{\numberline {4.13.2.5}setPopSize()}{37}{subsubsection.4.13.2.5}% 
\contentsline {section}{\numberline {4.14}Mapper Class Reference}{38}{section.4.14}% 
\contentsline {subsection}{\numberline {4.14.1}Constructor \& Destructor Documentation}{38}{subsection.4.14.1}% 
\contentsline {subsubsection}{\numberline {4.14.1.1}Mapper()\hspace {0.1cm}{\relax \fontsize {8}{9.5}\selectfont \abovedisplayskip 6\p@ plus2\p@ minus4\p@ \abovedisplayshortskip \z@ plus\p@ \belowdisplayshortskip 3\p@ plus\p@ minus2\p@ \def \leftmargin \leftmargini \parsep 4\p@ plus2\p@ minus\p@ \topsep 8\p@ plus2\p@ minus4\p@ \itemsep 4\p@ plus2\p@ minus\p@ {\leftmargin \leftmargini \topsep 3\p@ plus\p@ minus\p@ \parsep 2\p@ plus\p@ minus\p@ \itemsep \parsep }\belowdisplayskip \abovedisplayskip \ttfamily [1/4]}}{38}{subsubsection.4.14.1.1}% 
\contentsline {subsubsection}{\numberline {4.14.1.2}Mapper()\hspace {0.1cm}{\relax \fontsize {8}{9.5}\selectfont \abovedisplayskip 6\p@ plus2\p@ minus4\p@ \abovedisplayshortskip \z@ plus\p@ \belowdisplayshortskip 3\p@ plus\p@ minus2\p@ \def \leftmargin \leftmargini \parsep 4\p@ plus2\p@ minus\p@ \topsep 8\p@ plus2\p@ minus4\p@ \itemsep 4\p@ plus2\p@ minus\p@ {\leftmargin \leftmargini \topsep 3\p@ plus\p@ minus\p@ \parsep 2\p@ plus\p@ minus\p@ \itemsep \parsep }\belowdisplayskip \abovedisplayskip \ttfamily [2/4]}}{38}{subsubsection.4.14.1.2}% 
\contentsline {subsubsection}{\numberline {4.14.1.3}Mapper()\hspace {0.1cm}{\relax \fontsize {8}{9.5}\selectfont \abovedisplayskip 6\p@ plus2\p@ minus4\p@ \abovedisplayshortskip \z@ plus\p@ \belowdisplayshortskip 3\p@ plus\p@ minus2\p@ \def \leftmargin \leftmargini \parsep 4\p@ plus2\p@ minus\p@ \topsep 8\p@ plus2\p@ minus4\p@ \itemsep 4\p@ plus2\p@ minus\p@ {\leftmargin \leftmargini \topsep 3\p@ plus\p@ minus\p@ \parsep 2\p@ plus\p@ minus\p@ \itemsep \parsep }\belowdisplayskip \abovedisplayskip \ttfamily [3/4]}}{39}{subsubsection.4.14.1.3}% 
\contentsline {subsubsection}{\numberline {4.14.1.4}Mapper()\hspace {0.1cm}{\relax \fontsize {8}{9.5}\selectfont \abovedisplayskip 6\p@ plus2\p@ minus4\p@ \abovedisplayshortskip \z@ plus\p@ \belowdisplayshortskip 3\p@ plus\p@ minus2\p@ \def \leftmargin \leftmargini \parsep 4\p@ plus2\p@ minus\p@ \topsep 8\p@ plus2\p@ minus4\p@ \itemsep 4\p@ plus2\p@ minus\p@ {\leftmargin \leftmargini \topsep 3\p@ plus\p@ minus\p@ \parsep 2\p@ plus\p@ minus\p@ \itemsep \parsep }\belowdisplayskip \abovedisplayskip \ttfamily [4/4]}}{39}{subsubsection.4.14.1.4}% 
\contentsline {subsubsection}{\numberline {4.14.1.5}$\sim $Mapper()}{39}{subsubsection.4.14.1.5}% 
\contentsline {subsection}{\numberline {4.14.2}Member Function Documentation}{39}{subsection.4.14.2}% 
\contentsline {subsubsection}{\numberline {4.14.2.1}genotype2Phenotype()}{39}{subsubsection.4.14.2.1}% 
\contentsline {subsubsection}{\numberline {4.14.2.2}getGenotype()}{39}{subsubsection.4.14.2.2}% 
\contentsline {subsubsection}{\numberline {4.14.2.3}getPhenotype()}{39}{subsubsection.4.14.2.3}% 
\contentsline {subsubsection}{\numberline {4.14.2.4}phenotype2Genotype()}{39}{subsubsection.4.14.2.4}% 
\contentsline {subsubsection}{\numberline {4.14.2.5}setGenotype()}{39}{subsubsection.4.14.2.5}% 
\contentsline {subsubsection}{\numberline {4.14.2.6}setGenotypeMaxCodonValue()}{40}{subsubsection.4.14.2.6}% 
\contentsline {subsubsection}{\numberline {4.14.2.7}setPhenotype()}{40}{subsubsection.4.14.2.7}% 
\contentsline {subsection}{\numberline {4.14.3}Member Data Documentation}{40}{subsection.4.14.3}% 
\contentsline {subsubsection}{\numberline {4.14.3.1}genotype}{40}{subsubsection.4.14.3.1}% 
\contentsline {subsubsection}{\numberline {4.14.3.2}phenotype}{40}{subsubsection.4.14.3.2}% 
\contentsline {section}{\numberline {4.15}Phenotype Class Reference}{40}{section.4.15}% 
\contentsline {subsection}{\numberline {4.15.1}Constructor \& Destructor Documentation}{41}{subsection.4.15.1}% 
\contentsline {subsubsection}{\numberline {4.15.1.1}Phenotype()\hspace {0.1cm}{\relax \fontsize {8}{9.5}\selectfont \abovedisplayskip 6\p@ plus2\p@ minus4\p@ \abovedisplayshortskip \z@ plus\p@ \belowdisplayshortskip 3\p@ plus\p@ minus2\p@ \def \leftmargin \leftmargini \parsep 4\p@ plus2\p@ minus\p@ \topsep 8\p@ plus2\p@ minus4\p@ \itemsep 4\p@ plus2\p@ minus\p@ {\leftmargin \leftmargini \topsep 3\p@ plus\p@ minus\p@ \parsep 2\p@ plus\p@ minus\p@ \itemsep \parsep }\belowdisplayskip \abovedisplayskip \ttfamily [1/2]}}{41}{subsubsection.4.15.1.1}% 
\contentsline {subsubsection}{\numberline {4.15.1.2}Phenotype()\hspace {0.1cm}{\relax \fontsize {8}{9.5}\selectfont \abovedisplayskip 6\p@ plus2\p@ minus4\p@ \abovedisplayshortskip \z@ plus\p@ \belowdisplayshortskip 3\p@ plus\p@ minus2\p@ \def \leftmargin \leftmargini \parsep 4\p@ plus2\p@ minus\p@ \topsep 8\p@ plus2\p@ minus4\p@ \itemsep 4\p@ plus2\p@ minus\p@ {\leftmargin \leftmargini \topsep 3\p@ plus\p@ minus\p@ \parsep 2\p@ plus\p@ minus\p@ \itemsep \parsep }\belowdisplayskip \abovedisplayskip \ttfamily [2/2]}}{41}{subsubsection.4.15.1.2}% 
\contentsline {subsubsection}{\numberline {4.15.1.3}$\sim $Phenotype()}{41}{subsubsection.4.15.1.3}% 
\contentsline {subsection}{\numberline {4.15.2}Member Function Documentation}{41}{subsection.4.15.2}% 
\contentsline {subsubsection}{\numberline {4.15.2.1}getFitness()}{41}{subsubsection.4.15.2.1}% 
\contentsline {subsubsection}{\numberline {4.15.2.2}getString()}{41}{subsubsection.4.15.2.2}% 
\contentsline {subsubsection}{\numberline {4.15.2.3}getValid()}{41}{subsubsection.4.15.2.3}% 
\contentsline {subsubsection}{\numberline {4.15.2.4}setFitness()}{42}{subsubsection.4.15.2.4}% 
\contentsline {subsubsection}{\numberline {4.15.2.5}setValid()}{42}{subsubsection.4.15.2.5}% 
\contentsline {subsection}{\numberline {4.15.3}Friends And Related Function Documentation}{42}{subsection.4.15.3}% 
\contentsline {subsubsection}{\numberline {4.15.3.1}operator$<$$<$}{42}{subsubsection.4.15.3.1}% 
\contentsline {section}{\numberline {4.16}Production Class Reference}{42}{section.4.16}% 
\contentsline {subsection}{\numberline {4.16.1}Constructor \& Destructor Documentation}{43}{subsection.4.16.1}% 
\contentsline {subsubsection}{\numberline {4.16.1.1}Production()\hspace {0.1cm}{\relax \fontsize {8}{9.5}\selectfont \abovedisplayskip 6\p@ plus2\p@ minus4\p@ \abovedisplayshortskip \z@ plus\p@ \belowdisplayshortskip 3\p@ plus\p@ minus2\p@ \def \leftmargin \leftmargini \parsep 4\p@ plus2\p@ minus\p@ \topsep 8\p@ plus2\p@ minus4\p@ \itemsep 4\p@ plus2\p@ minus\p@ {\leftmargin \leftmargini \topsep 3\p@ plus\p@ minus\p@ \parsep 2\p@ plus\p@ minus\p@ \itemsep \parsep }\belowdisplayskip \abovedisplayskip \ttfamily [1/2]}}{43}{subsubsection.4.16.1.1}% 
\contentsline {subsubsection}{\numberline {4.16.1.2}Production()\hspace {0.1cm}{\relax \fontsize {8}{9.5}\selectfont \abovedisplayskip 6\p@ plus2\p@ minus4\p@ \abovedisplayshortskip \z@ plus\p@ \belowdisplayshortskip 3\p@ plus\p@ minus2\p@ \def \leftmargin \leftmargini \parsep 4\p@ plus2\p@ minus\p@ \topsep 8\p@ plus2\p@ minus4\p@ \itemsep 4\p@ plus2\p@ minus\p@ {\leftmargin \leftmargini \topsep 3\p@ plus\p@ minus\p@ \parsep 2\p@ plus\p@ minus\p@ \itemsep \parsep }\belowdisplayskip \abovedisplayskip \ttfamily [2/2]}}{43}{subsubsection.4.16.1.2}% 
\contentsline {subsubsection}{\numberline {4.16.1.3}$\sim $Production()}{43}{subsubsection.4.16.1.3}% 
\contentsline {subsection}{\numberline {4.16.2}Member Function Documentation}{43}{subsection.4.16.2}% 
\contentsline {subsubsection}{\numberline {4.16.2.1}clear()}{43}{subsubsection.4.16.2.1}% 
\contentsline {subsubsection}{\numberline {4.16.2.2}getAGLookUp()}{43}{subsubsection.4.16.2.2}% 
\contentsline {subsubsection}{\numberline {4.16.2.3}getMinimumDepth()}{43}{subsubsection.4.16.2.3}% 
\contentsline {subsubsection}{\numberline {4.16.2.4}getRecursive()}{44}{subsubsection.4.16.2.4}% 
\contentsline {subsubsection}{\numberline {4.16.2.5}setAGLookUp()}{44}{subsubsection.4.16.2.5}% 
\contentsline {subsubsection}{\numberline {4.16.2.6}setMinimumDepth()}{44}{subsubsection.4.16.2.6}% 
\contentsline {subsubsection}{\numberline {4.16.2.7}setRecursive()}{44}{subsubsection.4.16.2.7}% 
\contentsline {subsection}{\numberline {4.16.3}Friends And Related Function Documentation}{44}{subsection.4.16.3}% 
\contentsline {subsubsection}{\numberline {4.16.3.1}operator$<$$<$}{44}{subsubsection.4.16.3.1}% 
\contentsline {subsection}{\numberline {4.16.4}Member Data Documentation}{44}{subsection.4.16.4}% 
\contentsline {subsubsection}{\numberline {4.16.4.1}aglookup}{44}{subsubsection.4.16.4.1}% 
\contentsline {section}{\numberline {4.17}Rule Class Reference}{45}{section.4.17}% 
\contentsline {subsection}{\numberline {4.17.1}Constructor \& Destructor Documentation}{45}{subsection.4.17.1}% 
\contentsline {subsubsection}{\numberline {4.17.1.1}Rule()\hspace {0.1cm}{\relax \fontsize {8}{9.5}\selectfont \abovedisplayskip 6\p@ plus2\p@ minus4\p@ \abovedisplayshortskip \z@ plus\p@ \belowdisplayshortskip 3\p@ plus\p@ minus2\p@ \def \leftmargin \leftmargini \parsep 4\p@ plus2\p@ minus\p@ \topsep 8\p@ plus2\p@ minus4\p@ \itemsep 4\p@ plus2\p@ minus\p@ {\leftmargin \leftmargini \topsep 3\p@ plus\p@ minus\p@ \parsep 2\p@ plus\p@ minus\p@ \itemsep \parsep }\belowdisplayskip \abovedisplayskip \ttfamily [1/2]}}{45}{subsubsection.4.17.1.1}% 
\contentsline {subsubsection}{\numberline {4.17.1.2}Rule()\hspace {0.1cm}{\relax \fontsize {8}{9.5}\selectfont \abovedisplayskip 6\p@ plus2\p@ minus4\p@ \abovedisplayshortskip \z@ plus\p@ \belowdisplayshortskip 3\p@ plus\p@ minus2\p@ \def \leftmargin \leftmargini \parsep 4\p@ plus2\p@ minus\p@ \topsep 8\p@ plus2\p@ minus4\p@ \itemsep 4\p@ plus2\p@ minus\p@ {\leftmargin \leftmargini \topsep 3\p@ plus\p@ minus\p@ \parsep 2\p@ plus\p@ minus\p@ \itemsep \parsep }\belowdisplayskip \abovedisplayskip \ttfamily [2/2]}}{45}{subsubsection.4.17.1.2}% 
\contentsline {subsubsection}{\numberline {4.17.1.3}$\sim $Rule()}{45}{subsubsection.4.17.1.3}% 
\contentsline {subsection}{\numberline {4.17.2}Member Function Documentation}{45}{subsection.4.17.2}% 
\contentsline {subsubsection}{\numberline {4.17.2.1}clear()}{46}{subsubsection.4.17.2.1}% 
\contentsline {subsubsection}{\numberline {4.17.2.2}getMinimumDepth()}{46}{subsubsection.4.17.2.2}% 
\contentsline {subsubsection}{\numberline {4.17.2.3}getRecursive()}{46}{subsubsection.4.17.2.3}% 
\contentsline {subsubsection}{\numberline {4.17.2.4}setMinimumDepth()}{46}{subsubsection.4.17.2.4}% 
\contentsline {subsubsection}{\numberline {4.17.2.5}setRecursive()}{46}{subsubsection.4.17.2.5}% 
\contentsline {subsection}{\numberline {4.17.3}Member Data Documentation}{46}{subsection.4.17.3}% 
\contentsline {subsubsection}{\numberline {4.17.3.1}lhs}{46}{subsubsection.4.17.3.1}% 
\contentsline {section}{\numberline {4.18}Symbol Class Reference}{46}{section.4.18}% 
\contentsline {subsection}{\numberline {4.18.1}Constructor \& Destructor Documentation}{47}{subsection.4.18.1}% 
\contentsline {subsubsection}{\numberline {4.18.1.1}Symbol()\hspace {0.1cm}{\relax \fontsize {8}{9.5}\selectfont \abovedisplayskip 6\p@ plus2\p@ minus4\p@ \abovedisplayshortskip \z@ plus\p@ \belowdisplayshortskip 3\p@ plus\p@ minus2\p@ \def \leftmargin \leftmargini \parsep 4\p@ plus2\p@ minus\p@ \topsep 8\p@ plus2\p@ minus4\p@ \itemsep 4\p@ plus2\p@ minus\p@ {\leftmargin \leftmargini \topsep 3\p@ plus\p@ minus\p@ \parsep 2\p@ plus\p@ minus\p@ \itemsep \parsep }\belowdisplayskip \abovedisplayskip \ttfamily [1/2]}}{47}{subsubsection.4.18.1.1}% 
\contentsline {subsubsection}{\numberline {4.18.1.2}Symbol()\hspace {0.1cm}{\relax \fontsize {8}{9.5}\selectfont \abovedisplayskip 6\p@ plus2\p@ minus4\p@ \abovedisplayshortskip \z@ plus\p@ \belowdisplayshortskip 3\p@ plus\p@ minus2\p@ \def \leftmargin \leftmargini \parsep 4\p@ plus2\p@ minus\p@ \topsep 8\p@ plus2\p@ minus4\p@ \itemsep 4\p@ plus2\p@ minus\p@ {\leftmargin \leftmargini \topsep 3\p@ plus\p@ minus\p@ \parsep 2\p@ plus\p@ minus\p@ \itemsep \parsep }\belowdisplayskip \abovedisplayskip \ttfamily [2/2]}}{47}{subsubsection.4.18.1.2}% 
\contentsline {subsubsection}{\numberline {4.18.1.3}$\sim $Symbol()}{47}{subsubsection.4.18.1.3}% 
\contentsline {subsection}{\numberline {4.18.2}Member Function Documentation}{47}{subsection.4.18.2}% 
\contentsline {subsubsection}{\numberline {4.18.2.1}getType()}{47}{subsubsection.4.18.2.1}% 
\contentsline {subsubsection}{\numberline {4.18.2.2}operator=()}{47}{subsubsection.4.18.2.2}% 
\contentsline {subsubsection}{\numberline {4.18.2.3}operator==()}{47}{subsubsection.4.18.2.3}% 
\contentsline {subsubsection}{\numberline {4.18.2.4}setType()}{47}{subsubsection.4.18.2.4}% 
\contentsline {section}{\numberline {4.19}Tree$<$ T $>$ Class Template Reference}{48}{section.4.19}% 
\contentsline {subsection}{\numberline {4.19.1}Constructor \& Destructor Documentation}{48}{subsection.4.19.1}% 
\contentsline {subsubsection}{\numberline {4.19.1.1}Tree()\hspace {0.1cm}{\relax \fontsize {8}{9.5}\selectfont \abovedisplayskip 6\p@ plus2\p@ minus4\p@ \abovedisplayshortskip \z@ plus\p@ \belowdisplayshortskip 3\p@ plus\p@ minus2\p@ \def \leftmargin \leftmargini \parsep 4\p@ plus2\p@ minus\p@ \topsep 8\p@ plus2\p@ minus4\p@ \itemsep 4\p@ plus2\p@ minus\p@ {\leftmargin \leftmargini \topsep 3\p@ plus\p@ minus\p@ \parsep 2\p@ plus\p@ minus\p@ \itemsep \parsep }\belowdisplayskip \abovedisplayskip \ttfamily [1/3]}}{48}{subsubsection.4.19.1.1}% 
\contentsline {subsubsection}{\numberline {4.19.1.2}Tree()\hspace {0.1cm}{\relax \fontsize {8}{9.5}\selectfont \abovedisplayskip 6\p@ plus2\p@ minus4\p@ \abovedisplayshortskip \z@ plus\p@ \belowdisplayshortskip 3\p@ plus\p@ minus2\p@ \def \leftmargin \leftmargini \parsep 4\p@ plus2\p@ minus\p@ \topsep 8\p@ plus2\p@ minus4\p@ \itemsep 4\p@ plus2\p@ minus\p@ {\leftmargin \leftmargini \topsep 3\p@ plus\p@ minus\p@ \parsep 2\p@ plus\p@ minus\p@ \itemsep \parsep }\belowdisplayskip \abovedisplayskip \ttfamily [2/3]}}{48}{subsubsection.4.19.1.2}% 
\contentsline {subsubsection}{\numberline {4.19.1.3}Tree()\hspace {0.1cm}{\relax \fontsize {8}{9.5}\selectfont \abovedisplayskip 6\p@ plus2\p@ minus4\p@ \abovedisplayshortskip \z@ plus\p@ \belowdisplayshortskip 3\p@ plus\p@ minus2\p@ \def \leftmargin \leftmargini \parsep 4\p@ plus2\p@ minus\p@ \topsep 8\p@ plus2\p@ minus4\p@ \itemsep 4\p@ plus2\p@ minus\p@ {\leftmargin \leftmargini \topsep 3\p@ plus\p@ minus\p@ \parsep 2\p@ plus\p@ minus\p@ \itemsep \parsep }\belowdisplayskip \abovedisplayskip \ttfamily [3/3]}}{48}{subsubsection.4.19.1.3}% 
\contentsline {subsubsection}{\numberline {4.19.1.4}$\sim $Tree()}{49}{subsubsection.4.19.1.4}% 
\contentsline {subsection}{\numberline {4.19.2}Member Function Documentation}{49}{subsection.4.19.2}% 
\contentsline {subsubsection}{\numberline {4.19.2.1}getCurrentLevel()}{49}{subsubsection.4.19.2.1}% 
\contentsline {subsubsection}{\numberline {4.19.2.2}getData()}{49}{subsubsection.4.19.2.2}% 
\contentsline {subsubsection}{\numberline {4.19.2.3}getDepth()}{49}{subsubsection.4.19.2.3}% 
\contentsline {subsubsection}{\numberline {4.19.2.4}getValid()}{49}{subsubsection.4.19.2.4}% 
\contentsline {subsubsection}{\numberline {4.19.2.5}setCurrentLevel()}{49}{subsubsection.4.19.2.5}% 
\contentsline {subsubsection}{\numberline {4.19.2.6}setData()}{49}{subsubsection.4.19.2.6}% 
\contentsline {subsubsection}{\numberline {4.19.2.7}setDepth()}{49}{subsubsection.4.19.2.7}% 
\contentsline {subsubsection}{\numberline {4.19.2.8}setValid()}{49}{subsubsection.4.19.2.8}% 
\contentsline {chapter}{\numberline {5}File Documentation}{51}{chapter.5}% 
\contentsline {section}{\numberline {5.1}src/\discretionary {\unhbox \voidb@x \hbox {\relax \fontsize {7}{8}\selectfont $\leftarrow \joinrel \rhook $}}{}{}A\discretionary {\unhbox \voidb@x \hbox {\relax \fontsize {7}{8}\selectfont $\leftarrow \joinrel \rhook $}}{}{}G\discretionary {\unhbox \voidb@x \hbox {\relax \fontsize {7}{8}\selectfont $\leftarrow \joinrel \rhook $}}{}{}Context.cpp File Reference}{51}{section.5.1}% 
\contentsline {section}{\numberline {5.2}src/\discretionary {\unhbox \voidb@x \hbox {\relax \fontsize {7}{8}\selectfont $\leftarrow \joinrel \rhook $}}{}{}A\discretionary {\unhbox \voidb@x \hbox {\relax \fontsize {7}{8}\selectfont $\leftarrow \joinrel \rhook $}}{}{}G\discretionary {\unhbox \voidb@x \hbox {\relax \fontsize {7}{8}\selectfont $\leftarrow \joinrel \rhook $}}{}{}Context.h File Reference}{51}{section.5.2}% 
\contentsline {section}{\numberline {5.3}src/\discretionary {\unhbox \voidb@x \hbox {\relax \fontsize {7}{8}\selectfont $\leftarrow \joinrel \rhook $}}{}{}A\discretionary {\unhbox \voidb@x \hbox {\relax \fontsize {7}{8}\selectfont $\leftarrow \joinrel \rhook $}}{}{}G\discretionary {\unhbox \voidb@x \hbox {\relax \fontsize {7}{8}\selectfont $\leftarrow \joinrel \rhook $}}{}{}Derivation\discretionary {\unhbox \voidb@x \hbox {\relax \fontsize {7}{8}\selectfont $\leftarrow \joinrel \rhook $}}{}{}Tree.cpp File Reference}{51}{section.5.3}% 
\contentsline {subsection}{\numberline {5.3.1}Macro Definition Documentation}{52}{subsection.5.3.1}% 
\contentsline {subsubsection}{\numberline {5.3.1.1}\_AGDERIVATIONTREE\_CPP\_}{52}{subsubsection.5.3.1.1}% 
\contentsline {section}{\numberline {5.4}src/\discretionary {\unhbox \voidb@x \hbox {\relax \fontsize {7}{8}\selectfont $\leftarrow \joinrel \rhook $}}{}{}A\discretionary {\unhbox \voidb@x \hbox {\relax \fontsize {7}{8}\selectfont $\leftarrow \joinrel \rhook $}}{}{}G\discretionary {\unhbox \voidb@x \hbox {\relax \fontsize {7}{8}\selectfont $\leftarrow \joinrel \rhook $}}{}{}Derivation\discretionary {\unhbox \voidb@x \hbox {\relax \fontsize {7}{8}\selectfont $\leftarrow \joinrel \rhook $}}{}{}Tree.h File Reference}{52}{section.5.4}% 
\contentsline {subsection}{\numberline {5.4.1}Typedef Documentation}{52}{subsection.5.4.1}% 
\contentsline {subsubsection}{\numberline {5.4.1.1}AGTree}{52}{subsubsection.5.4.1.1}% 
\contentsline {subsection}{\numberline {5.4.2}Enumeration Type Documentation}{52}{subsection.5.4.2}% 
\contentsline {subsubsection}{\numberline {5.4.2.1}TraversalReason}{52}{subsubsection.5.4.2.1}% 
\contentsline {section}{\numberline {5.5}src/\discretionary {\unhbox \voidb@x \hbox {\relax \fontsize {7}{8}\selectfont $\leftarrow \joinrel \rhook $}}{}{}A\discretionary {\unhbox \voidb@x \hbox {\relax \fontsize {7}{8}\selectfont $\leftarrow \joinrel \rhook $}}{}{}G\discretionary {\unhbox \voidb@x \hbox {\relax \fontsize {7}{8}\selectfont $\leftarrow \joinrel \rhook $}}{}{}Look\discretionary {\unhbox \voidb@x \hbox {\relax \fontsize {7}{8}\selectfont $\leftarrow \joinrel \rhook $}}{}{}Up.h File Reference}{53}{section.5.5}% 
\contentsline {section}{\numberline {5.6}src/\discretionary {\unhbox \voidb@x \hbox {\relax \fontsize {7}{8}\selectfont $\leftarrow \joinrel \rhook $}}{}{}A\discretionary {\unhbox \voidb@x \hbox {\relax \fontsize {7}{8}\selectfont $\leftarrow \joinrel \rhook $}}{}{}G\discretionary {\unhbox \voidb@x \hbox {\relax \fontsize {7}{8}\selectfont $\leftarrow \joinrel \rhook $}}{}{}Symbol.cpp File Reference}{53}{section.5.6}% 
\contentsline {subsection}{\numberline {5.6.1}Macro Definition Documentation}{53}{subsection.5.6.1}% 
\contentsline {subsubsection}{\numberline {5.6.1.1}\_AGSYMBOL\_CPP\_}{53}{subsubsection.5.6.1.1}% 
\contentsline {section}{\numberline {5.7}src/\discretionary {\unhbox \voidb@x \hbox {\relax \fontsize {7}{8}\selectfont $\leftarrow \joinrel \rhook $}}{}{}A\discretionary {\unhbox \voidb@x \hbox {\relax \fontsize {7}{8}\selectfont $\leftarrow \joinrel \rhook $}}{}{}G\discretionary {\unhbox \voidb@x \hbox {\relax \fontsize {7}{8}\selectfont $\leftarrow \joinrel \rhook $}}{}{}Symbol.h File Reference}{53}{section.5.7}% 
\contentsline {subsection}{\numberline {5.7.1}Enumeration Type Documentation}{53}{subsection.5.7.1}% 
\contentsline {subsubsection}{\numberline {5.7.1.1}AGMapState}{53}{subsubsection.5.7.1.1}% 
\contentsline {section}{\numberline {5.8}src/\discretionary {\unhbox \voidb@x \hbox {\relax \fontsize {7}{8}\selectfont $\leftarrow \joinrel \rhook $}}{}{}C\discretionary {\unhbox \voidb@x \hbox {\relax \fontsize {7}{8}\selectfont $\leftarrow \joinrel \rhook $}}{}{}F\discretionary {\unhbox \voidb@x \hbox {\relax \fontsize {7}{8}\selectfont $\leftarrow \joinrel \rhook $}}{}{}Grammar.cpp File Reference}{54}{section.5.8}% 
\contentsline {subsection}{\numberline {5.8.1}Macro Definition Documentation}{54}{subsection.5.8.1}% 
\contentsline {subsubsection}{\numberline {5.8.1.1}\_CFGRAMMAR\_CPP\_}{54}{subsubsection.5.8.1.1}% 
\contentsline {subsubsection}{\numberline {5.8.1.2}ERROR\_IN\_GRAMMAR}{54}{subsubsection.5.8.1.2}% 
\contentsline {subsubsection}{\numberline {5.8.1.3}LHS\_READ}{54}{subsubsection.5.8.1.3}% 
\contentsline {subsubsection}{\numberline {5.8.1.4}PRODUCTION}{55}{subsubsection.5.8.1.4}% 
\contentsline {subsubsection}{\numberline {5.8.1.5}START}{55}{subsubsection.5.8.1.5}% 
\contentsline {subsubsection}{\numberline {5.8.1.6}START\_OF\_LINE}{55}{subsubsection.5.8.1.6}% 
\contentsline {subsubsection}{\numberline {5.8.1.7}START\_RULE}{55}{subsubsection.5.8.1.7}% 
\contentsline {section}{\numberline {5.9}src/\discretionary {\unhbox \voidb@x \hbox {\relax \fontsize {7}{8}\selectfont $\leftarrow \joinrel \rhook $}}{}{}C\discretionary {\unhbox \voidb@x \hbox {\relax \fontsize {7}{8}\selectfont $\leftarrow \joinrel \rhook $}}{}{}F\discretionary {\unhbox \voidb@x \hbox {\relax \fontsize {7}{8}\selectfont $\leftarrow \joinrel \rhook $}}{}{}Grammar.h File Reference}{55}{section.5.9}% 
\contentsline {subsection}{\numberline {5.9.1}Typedef Documentation}{55}{subsection.5.9.1}% 
\contentsline {subsubsection}{\numberline {5.9.1.1}DerivationTree}{55}{subsubsection.5.9.1.1}% 
\contentsline {section}{\numberline {5.10}src/ge.h File Reference}{55}{section.5.10}% 
\contentsline {section}{\numberline {5.11}src/\discretionary {\unhbox \voidb@x \hbox {\relax \fontsize {7}{8}\selectfont $\leftarrow \joinrel \rhook $}}{}{}G\discretionary {\unhbox \voidb@x \hbox {\relax \fontsize {7}{8}\selectfont $\leftarrow \joinrel \rhook $}}{}{}E\discretionary {\unhbox \voidb@x \hbox {\relax \fontsize {7}{8}\selectfont $\leftarrow \joinrel \rhook $}}{}{}\_\discretionary {\unhbox \voidb@x \hbox {\relax \fontsize {7}{8}\selectfont $\leftarrow \joinrel \rhook $}}{}{}\discretionary {\unhbox \voidb@x \hbox {\relax \fontsize {7}{8}\selectfont $\leftarrow \joinrel \rhook $}}{}{}I\discretionary {\unhbox \voidb@x \hbox {\relax \fontsize {7}{8}\selectfont $\leftarrow \joinrel \rhook $}}{}{}L\discretionary {\unhbox \voidb@x \hbox {\relax \fontsize {7}{8}\selectfont $\leftarrow \joinrel \rhook $}}{}{}L\discretionary {\unhbox \voidb@x \hbox {\relax \fontsize {7}{8}\selectfont $\leftarrow \joinrel \rhook $}}{}{}I\discretionary {\unhbox \voidb@x \hbox {\relax \fontsize {7}{8}\selectfont $\leftarrow \joinrel \rhook $}}{}{}G\discretionary {\unhbox \voidb@x \hbox {\relax \fontsize {7}{8}\selectfont $\leftarrow \joinrel \rhook $}}{}{}A\discretionary {\unhbox \voidb@x \hbox {\relax \fontsize {7}{8}\selectfont $\leftarrow \joinrel \rhook $}}{}{}L\discretionary {\unhbox \voidb@x \hbox {\relax \fontsize {7}{8}\selectfont $\leftarrow \joinrel \rhook $}}{}{}S\discretionary {\unhbox \voidb@x \hbox {\relax \fontsize {7}{8}\selectfont $\leftarrow \joinrel \rhook $}}{}{}GA.cpp File Reference}{55}{section.5.11}% 
\contentsline {subsection}{\numberline {5.11.1}Macro Definition Documentation}{56}{subsection.5.11.1}% 
\contentsline {subsubsection}{\numberline {5.11.1.1}\_GE\_ILLIGALSGA\_CPP\_}{56}{subsubsection.5.11.1.1}% 
\contentsline {subsubsection}{\numberline {5.11.1.2}BITS\_PER\_BYTE}{56}{subsubsection.5.11.1.2}% 
\contentsline {subsubsection}{\numberline {5.11.1.3}UINTSIZE}{56}{subsubsection.5.11.1.3}% 
\contentsline {subsection}{\numberline {5.11.2}Function Documentation}{56}{subsection.5.11.2}% 
\contentsline {subsubsection}{\numberline {5.11.2.1}GE\_ILLIGALSGA\_getGenotype()}{56}{subsubsection.5.11.2.1}% 
\contentsline {subsubsection}{\numberline {5.11.2.2}GE\_ILLIGALSGA\_getPhenotype()}{57}{subsubsection.5.11.2.2}% 
\contentsline {subsubsection}{\numberline {5.11.2.3}GE\_ILLIGALSGA\_Mapper()}{57}{subsubsection.5.11.2.3}% 
\contentsline {subsubsection}{\numberline {5.11.2.4}GE\_ILLIGALSGA\_outputBNF()}{57}{subsubsection.5.11.2.4}% 
\contentsline {subsubsection}{\numberline {5.11.2.5}GE\_ILLIGALSGA\_readBNFFile()}{57}{subsubsection.5.11.2.5}% 
\contentsline {subsubsection}{\numberline {5.11.2.6}GE\_ILLIGALSGA\_readBNFString()}{57}{subsubsection.5.11.2.6}% 
\contentsline {subsubsection}{\numberline {5.11.2.7}GE\_ILLIGALSGA\_setMaxWraps()}{57}{subsubsection.5.11.2.7}% 
\contentsline {subsubsection}{\numberline {5.11.2.8}GE\_ILLIGALSGA\_translate()}{57}{subsubsection.5.11.2.8}% 
\contentsline {subsubsection}{\numberline {5.11.2.9}GE\_ILLIGALSGA\_validPhenotype()}{57}{subsubsection.5.11.2.9}% 
\contentsline {section}{\numberline {5.12}src/\discretionary {\unhbox \voidb@x \hbox {\relax \fontsize {7}{8}\selectfont $\leftarrow \joinrel \rhook $}}{}{}G\discretionary {\unhbox \voidb@x \hbox {\relax \fontsize {7}{8}\selectfont $\leftarrow \joinrel \rhook $}}{}{}E\discretionary {\unhbox \voidb@x \hbox {\relax \fontsize {7}{8}\selectfont $\leftarrow \joinrel \rhook $}}{}{}\_\discretionary {\unhbox \voidb@x \hbox {\relax \fontsize {7}{8}\selectfont $\leftarrow \joinrel \rhook $}}{}{}\discretionary {\unhbox \voidb@x \hbox {\relax \fontsize {7}{8}\selectfont $\leftarrow \joinrel \rhook $}}{}{}I\discretionary {\unhbox \voidb@x \hbox {\relax \fontsize {7}{8}\selectfont $\leftarrow \joinrel \rhook $}}{}{}L\discretionary {\unhbox \voidb@x \hbox {\relax \fontsize {7}{8}\selectfont $\leftarrow \joinrel \rhook $}}{}{}L\discretionary {\unhbox \voidb@x \hbox {\relax \fontsize {7}{8}\selectfont $\leftarrow \joinrel \rhook $}}{}{}I\discretionary {\unhbox \voidb@x \hbox {\relax \fontsize {7}{8}\selectfont $\leftarrow \joinrel \rhook $}}{}{}G\discretionary {\unhbox \voidb@x \hbox {\relax \fontsize {7}{8}\selectfont $\leftarrow \joinrel \rhook $}}{}{}A\discretionary {\unhbox \voidb@x \hbox {\relax \fontsize {7}{8}\selectfont $\leftarrow \joinrel \rhook $}}{}{}L\discretionary {\unhbox \voidb@x \hbox {\relax \fontsize {7}{8}\selectfont $\leftarrow \joinrel \rhook $}}{}{}S\discretionary {\unhbox \voidb@x \hbox {\relax \fontsize {7}{8}\selectfont $\leftarrow \joinrel \rhook $}}{}{}GA.h File Reference}{57}{section.5.12}% 
\contentsline {subsection}{\numberline {5.12.1}Function Documentation}{58}{subsection.5.12.1}% 
\contentsline {subsubsection}{\numberline {5.12.1.1}GE\_ILLIGALSGA\_getGenotype()}{58}{subsubsection.5.12.1.1}% 
\contentsline {subsubsection}{\numberline {5.12.1.2}GE\_ILLIGALSGA\_getPhenotype()}{58}{subsubsection.5.12.1.2}% 
\contentsline {subsubsection}{\numberline {5.12.1.3}GE\_ILLIGALSGA\_Mapper()}{58}{subsubsection.5.12.1.3}% 
\contentsline {subsubsection}{\numberline {5.12.1.4}GE\_ILLIGALSGA\_outputBNF()}{58}{subsubsection.5.12.1.4}% 
\contentsline {subsubsection}{\numberline {5.12.1.5}GE\_ILLIGALSGA\_readBNFFile()}{58}{subsubsection.5.12.1.5}% 
\contentsline {subsubsection}{\numberline {5.12.1.6}GE\_ILLIGALSGA\_readBNFString()}{58}{subsubsection.5.12.1.6}% 
\contentsline {subsubsection}{\numberline {5.12.1.7}GE\_ILLIGALSGA\_setMaxWraps()}{59}{subsubsection.5.12.1.7}% 
\contentsline {subsubsection}{\numberline {5.12.1.8}GE\_ILLIGALSGA\_validPhenotype()}{59}{subsubsection.5.12.1.8}% 
\contentsline {section}{\numberline {5.13}src/\discretionary {\unhbox \voidb@x \hbox {\relax \fontsize {7}{8}\selectfont $\leftarrow \joinrel \rhook $}}{}{}G\discretionary {\unhbox \voidb@x \hbox {\relax \fontsize {7}{8}\selectfont $\leftarrow \joinrel \rhook $}}{}{}E\discretionary {\unhbox \voidb@x \hbox {\relax \fontsize {7}{8}\selectfont $\leftarrow \joinrel \rhook $}}{}{}Grammar.cpp File Reference}{59}{section.5.13}% 
\contentsline {subsection}{\numberline {5.13.1}Macro Definition Documentation}{59}{subsection.5.13.1}% 
\contentsline {subsubsection}{\numberline {5.13.1.1}\_GEGRAMMAR\_CPP\_}{59}{subsubsection.5.13.1.1}% 
\contentsline {section}{\numberline {5.14}src/\discretionary {\unhbox \voidb@x \hbox {\relax \fontsize {7}{8}\selectfont $\leftarrow \joinrel \rhook $}}{}{}G\discretionary {\unhbox \voidb@x \hbox {\relax \fontsize {7}{8}\selectfont $\leftarrow \joinrel \rhook $}}{}{}E\discretionary {\unhbox \voidb@x \hbox {\relax \fontsize {7}{8}\selectfont $\leftarrow \joinrel \rhook $}}{}{}Grammar.h File Reference}{59}{section.5.14}% 
\contentsline {section}{\numberline {5.15}src/\discretionary {\unhbox \voidb@x \hbox {\relax \fontsize {7}{8}\selectfont $\leftarrow \joinrel \rhook $}}{}{}G\discretionary {\unhbox \voidb@x \hbox {\relax \fontsize {7}{8}\selectfont $\leftarrow \joinrel \rhook $}}{}{}E\discretionary {\unhbox \voidb@x \hbox {\relax \fontsize {7}{8}\selectfont $\leftarrow \joinrel \rhook $}}{}{}Grammar\discretionary {\unhbox \voidb@x \hbox {\relax \fontsize {7}{8}\selectfont $\leftarrow \joinrel \rhook $}}{}{}SI.cpp File Reference}{60}{section.5.15}% 
\contentsline {subsection}{\numberline {5.15.1}Macro Definition Documentation}{60}{subsection.5.15.1}% 
\contentsline {subsubsection}{\numberline {5.15.1.1}\_GEGRAMMARSI\_CPP\_}{60}{subsubsection.5.15.1.1}% 
\contentsline {section}{\numberline {5.16}src/\discretionary {\unhbox \voidb@x \hbox {\relax \fontsize {7}{8}\selectfont $\leftarrow \joinrel \rhook $}}{}{}G\discretionary {\unhbox \voidb@x \hbox {\relax \fontsize {7}{8}\selectfont $\leftarrow \joinrel \rhook $}}{}{}E\discretionary {\unhbox \voidb@x \hbox {\relax \fontsize {7}{8}\selectfont $\leftarrow \joinrel \rhook $}}{}{}Grammar\discretionary {\unhbox \voidb@x \hbox {\relax \fontsize {7}{8}\selectfont $\leftarrow \joinrel \rhook $}}{}{}SI.h File Reference}{60}{section.5.16}% 
\contentsline {section}{\numberline {5.17}src/\discretionary {\unhbox \voidb@x \hbox {\relax \fontsize {7}{8}\selectfont $\leftarrow \joinrel \rhook $}}{}{}G\discretionary {\unhbox \voidb@x \hbox {\relax \fontsize {7}{8}\selectfont $\leftarrow \joinrel \rhook $}}{}{}E\discretionary {\unhbox \voidb@x \hbox {\relax \fontsize {7}{8}\selectfont $\leftarrow \joinrel \rhook $}}{}{}List\discretionary {\unhbox \voidb@x \hbox {\relax \fontsize {7}{8}\selectfont $\leftarrow \joinrel \rhook $}}{}{}Genome.cpp File Reference}{60}{section.5.17}% 
\contentsline {subsection}{\numberline {5.17.1}Macro Definition Documentation}{60}{subsection.5.17.1}% 
\contentsline {subsubsection}{\numberline {5.17.1.1}\_GELISTGENOME\_CPP}{60}{subsubsection.5.17.1.1}% 
\contentsline {section}{\numberline {5.18}src/\discretionary {\unhbox \voidb@x \hbox {\relax \fontsize {7}{8}\selectfont $\leftarrow \joinrel \rhook $}}{}{}G\discretionary {\unhbox \voidb@x \hbox {\relax \fontsize {7}{8}\selectfont $\leftarrow \joinrel \rhook $}}{}{}E\discretionary {\unhbox \voidb@x \hbox {\relax \fontsize {7}{8}\selectfont $\leftarrow \joinrel \rhook $}}{}{}List\discretionary {\unhbox \voidb@x \hbox {\relax \fontsize {7}{8}\selectfont $\leftarrow \joinrel \rhook $}}{}{}Genome.h File Reference}{60}{section.5.18}% 
\contentsline {section}{\numberline {5.19}src/\discretionary {\unhbox \voidb@x \hbox {\relax \fontsize {7}{8}\selectfont $\leftarrow \joinrel \rhook $}}{}{}Generic\discretionary {\unhbox \voidb@x \hbox {\relax \fontsize {7}{8}\selectfont $\leftarrow \joinrel \rhook $}}{}{}A\discretionary {\unhbox \voidb@x \hbox {\relax \fontsize {7}{8}\selectfont $\leftarrow \joinrel \rhook $}}{}{}G\discretionary {\unhbox \voidb@x \hbox {\relax \fontsize {7}{8}\selectfont $\leftarrow \joinrel \rhook $}}{}{}Symbol.cpp File Reference}{61}{section.5.19}% 
\contentsline {subsection}{\numberline {5.19.1}Macro Definition Documentation}{61}{subsection.5.19.1}% 
\contentsline {subsubsection}{\numberline {5.19.1.1}\_GENERICAGSYMBOL\_CPP\_}{61}{subsubsection.5.19.1.1}% 
\contentsline {section}{\numberline {5.20}src/\discretionary {\unhbox \voidb@x \hbox {\relax \fontsize {7}{8}\selectfont $\leftarrow \joinrel \rhook $}}{}{}Generic\discretionary {\unhbox \voidb@x \hbox {\relax \fontsize {7}{8}\selectfont $\leftarrow \joinrel \rhook $}}{}{}A\discretionary {\unhbox \voidb@x \hbox {\relax \fontsize {7}{8}\selectfont $\leftarrow \joinrel \rhook $}}{}{}G\discretionary {\unhbox \voidb@x \hbox {\relax \fontsize {7}{8}\selectfont $\leftarrow \joinrel \rhook $}}{}{}Symbol.h File Reference}{61}{section.5.20}% 
\contentsline {section}{\numberline {5.21}src/\discretionary {\unhbox \voidb@x \hbox {\relax \fontsize {7}{8}\selectfont $\leftarrow \joinrel \rhook $}}{}{}Genotype.cpp File Reference}{61}{section.5.21}% 
\contentsline {subsection}{\numberline {5.21.1}Macro Definition Documentation}{62}{subsection.5.21.1}% 
\contentsline {subsubsection}{\numberline {5.21.1.1}\_GENOTYPE\_CPP\_}{62}{subsubsection.5.21.1.1}% 
\contentsline {subsection}{\numberline {5.21.2}Function Documentation}{62}{subsection.5.21.2}% 
\contentsline {subsubsection}{\numberline {5.21.2.1}operator$<$$<$()}{62}{subsubsection.5.21.2.1}% 
\contentsline {section}{\numberline {5.22}src/\discretionary {\unhbox \voidb@x \hbox {\relax \fontsize {7}{8}\selectfont $\leftarrow \joinrel \rhook $}}{}{}Genotype.h File Reference}{62}{section.5.22}% 
\contentsline {subsection}{\numberline {5.22.1}Macro Definition Documentation}{63}{subsection.5.22.1}% 
\contentsline {subsubsection}{\numberline {5.22.1.1}MAX\_GENOTYPE\_LENGTH}{63}{subsubsection.5.22.1.1}% 
\contentsline {subsubsection}{\numberline {5.22.1.2}MIN\_GENOTYPE\_FITNESS}{63}{subsubsection.5.22.1.2}% 
\contentsline {subsubsection}{\numberline {5.22.1.3}STANDARD\_MAXCODONVALUE}{63}{subsubsection.5.22.1.3}% 
\contentsline {subsection}{\numberline {5.22.2}Typedef Documentation}{63}{subsection.5.22.2}% 
\contentsline {subsubsection}{\numberline {5.22.2.1}CodonType}{63}{subsubsection.5.22.2.1}% 
\contentsline {subsubsection}{\numberline {5.22.2.2}FitnessType}{63}{subsubsection.5.22.2.2}% 
\contentsline {section}{\numberline {5.23}src/\discretionary {\unhbox \voidb@x \hbox {\relax \fontsize {7}{8}\selectfont $\leftarrow \joinrel \rhook $}}{}{}Grammar.cpp File Reference}{63}{section.5.23}% 
\contentsline {subsection}{\numberline {5.23.1}Macro Definition Documentation}{64}{subsection.5.23.1}% 
\contentsline {subsubsection}{\numberline {5.23.1.1}\_GRAMMAR\_CPP\_}{64}{subsubsection.5.23.1.1}% 
\contentsline {section}{\numberline {5.24}src/\discretionary {\unhbox \voidb@x \hbox {\relax \fontsize {7}{8}\selectfont $\leftarrow \joinrel \rhook $}}{}{}Grammar.h File Reference}{64}{section.5.24}% 
\contentsline {section}{\numberline {5.25}src/\discretionary {\unhbox \voidb@x \hbox {\relax \fontsize {7}{8}\selectfont $\leftarrow \joinrel \rhook $}}{}{}Init\discretionary {\unhbox \voidb@x \hbox {\relax \fontsize {7}{8}\selectfont $\leftarrow \joinrel \rhook $}}{}{}Func.cpp File Reference}{64}{section.5.25}% 
\contentsline {subsection}{\numberline {5.25.1}Macro Definition Documentation}{65}{subsection.5.25.1}% 
\contentsline {subsubsection}{\numberline {5.25.1.1}\_INITFUNC\_CPP\_}{65}{subsubsection.5.25.1.1}% 
\contentsline {subsection}{\numberline {5.25.2}Function Documentation}{65}{subsection.5.25.2}% 
\contentsline {subsubsection}{\numberline {5.25.2.1}initFuncRandom()}{65}{subsubsection.5.25.2.1}% 
\contentsline {subsubsection}{\numberline {5.25.2.2}initFuncSI()}{65}{subsubsection.5.25.2.2}% 
\contentsline {subsection}{\numberline {5.25.3}Variable Documentation}{65}{subsection.5.25.3}% 
\contentsline {subsubsection}{\numberline {5.25.3.1}mapper}{65}{subsubsection.5.25.3.1}% 
\contentsline {subsubsection}{\numberline {5.25.3.2}maxSize}{65}{subsubsection.5.25.3.2}% 
\contentsline {subsubsection}{\numberline {5.25.3.3}minSize}{65}{subsubsection.5.25.3.3}% 
\contentsline {section}{\numberline {5.26}src/\discretionary {\unhbox \voidb@x \hbox {\relax \fontsize {7}{8}\selectfont $\leftarrow \joinrel \rhook $}}{}{}Init\discretionary {\unhbox \voidb@x \hbox {\relax \fontsize {7}{8}\selectfont $\leftarrow \joinrel \rhook $}}{}{}Func.h File Reference}{65}{section.5.26}% 
\contentsline {subsection}{\numberline {5.26.1}Function Documentation}{66}{subsection.5.26.1}% 
\contentsline {subsubsection}{\numberline {5.26.1.1}initFuncRandom()}{66}{subsubsection.5.26.1.1}% 
\contentsline {subsubsection}{\numberline {5.26.1.2}initFuncSI()}{66}{subsubsection.5.26.1.2}% 
\contentsline {section}{\numberline {5.27}src/\discretionary {\unhbox \voidb@x \hbox {\relax \fontsize {7}{8}\selectfont $\leftarrow \joinrel \rhook $}}{}{}Initialiser.cpp File Reference}{66}{section.5.27}% 
\contentsline {subsection}{\numberline {5.27.1}Macro Definition Documentation}{66}{subsection.5.27.1}% 
\contentsline {subsubsection}{\numberline {5.27.1.1}\_INITIALIZER\_CPP\_}{66}{subsubsection.5.27.1.1}% 
\contentsline {section}{\numberline {5.28}src/\discretionary {\unhbox \voidb@x \hbox {\relax \fontsize {7}{8}\selectfont $\leftarrow \joinrel \rhook $}}{}{}Initialiser.h File Reference}{66}{section.5.28}% 
\contentsline {section}{\numberline {5.29}src/lib\discretionary {\unhbox \voidb@x \hbox {\relax \fontsize {7}{8}\selectfont $\leftarrow \joinrel \rhook $}}{}{}G\discretionary {\unhbox \voidb@x \hbox {\relax \fontsize {7}{8}\selectfont $\leftarrow \joinrel \rhook $}}{}{}Edefs.h File Reference}{67}{section.5.29}% 
\contentsline {subsection}{\numberline {5.29.1}Macro Definition Documentation}{67}{subsection.5.29.1}% 
\contentsline {subsubsection}{\numberline {5.29.1.1}\_\_EXTENSIONS\_\_}{67}{subsubsection.5.29.1.1}% 
\contentsline {subsubsection}{\numberline {5.29.1.2}\_ALL\_SOURCE}{67}{subsubsection.5.29.1.2}% 
\contentsline {subsubsection}{\numberline {5.29.1.3}\_GNU\_SOURCE}{67}{subsubsection.5.29.1.3}% 
\contentsline {subsubsection}{\numberline {5.29.1.4}\_POSIX\_PTHREAD\_SEMANTICS}{68}{subsubsection.5.29.1.4}% 
\contentsline {subsubsection}{\numberline {5.29.1.5}\_TANDEM\_SOURCE}{68}{subsubsection.5.29.1.5}% 
\contentsline {subsubsection}{\numberline {5.29.1.6}GALIB\_INCLUDEPATH}{68}{subsubsection.5.29.1.6}% 
\contentsline {subsubsection}{\numberline {5.29.1.7}GE\_ILLIGALSGA}{68}{subsubsection.5.29.1.7}% 
\contentsline {subsubsection}{\numberline {5.29.1.8}HAVE\_DLFCN\_H}{68}{subsubsection.5.29.1.8}% 
\contentsline {subsubsection}{\numberline {5.29.1.9}HAVE\_INTTYPES\_H}{68}{subsubsection.5.29.1.9}% 
\contentsline {subsubsection}{\numberline {5.29.1.10}HAVE\_MALLOC}{68}{subsubsection.5.29.1.10}% 
\contentsline {subsubsection}{\numberline {5.29.1.11}HAVE\_MEMORY\_H}{68}{subsubsection.5.29.1.11}% 
\contentsline {subsubsection}{\numberline {5.29.1.12}HAVE\_STDINT\_H}{68}{subsubsection.5.29.1.12}% 
\contentsline {subsubsection}{\numberline {5.29.1.13}HAVE\_STDLIB\_H}{69}{subsubsection.5.29.1.13}% 
\contentsline {subsubsection}{\numberline {5.29.1.14}HAVE\_STRING\_H}{69}{subsubsection.5.29.1.14}% 
\contentsline {subsubsection}{\numberline {5.29.1.15}HAVE\_STRINGS\_H}{69}{subsubsection.5.29.1.15}% 
\contentsline {subsubsection}{\numberline {5.29.1.16}HAVE\_SYS\_STAT\_H}{69}{subsubsection.5.29.1.16}% 
\contentsline {subsubsection}{\numberline {5.29.1.17}HAVE\_SYS\_TYPES\_H}{69}{subsubsection.5.29.1.17}% 
\contentsline {subsubsection}{\numberline {5.29.1.18}HAVE\_UNISTD\_H}{69}{subsubsection.5.29.1.18}% 
\contentsline {subsubsection}{\numberline {5.29.1.19}libGEVersion}{69}{subsubsection.5.29.1.19}% 
\contentsline {subsubsection}{\numberline {5.29.1.20}LT\_OBJDIR}{69}{subsubsection.5.29.1.20}% 
\contentsline {subsubsection}{\numberline {5.29.1.21}PACKAGE\_BUGREPORT}{69}{subsubsection.5.29.1.21}% 
\contentsline {subsubsection}{\numberline {5.29.1.22}PACKAGE\_NAME}{70}{subsubsection.5.29.1.22}% 
\contentsline {subsubsection}{\numberline {5.29.1.23}PACKAGE\_STRING}{70}{subsubsection.5.29.1.23}% 
\contentsline {subsubsection}{\numberline {5.29.1.24}PACKAGE\_TARNAME}{70}{subsubsection.5.29.1.24}% 
\contentsline {subsubsection}{\numberline {5.29.1.25}PACKAGE\_URL}{70}{subsubsection.5.29.1.25}% 
\contentsline {subsubsection}{\numberline {5.29.1.26}PACKAGE\_VERSION}{70}{subsubsection.5.29.1.26}% 
\contentsline {subsubsection}{\numberline {5.29.1.27}STDC\_HEADERS}{70}{subsubsection.5.29.1.27}% 
\contentsline {section}{\numberline {5.30}src/\discretionary {\unhbox \voidb@x \hbox {\relax \fontsize {7}{8}\selectfont $\leftarrow \joinrel \rhook $}}{}{}Mapper.cpp File Reference}{70}{section.5.30}% 
\contentsline {subsection}{\numberline {5.30.1}Macro Definition Documentation}{71}{subsection.5.30.1}% 
\contentsline {subsubsection}{\numberline {5.30.1.1}\_MAPPER\_CPP\_}{71}{subsubsection.5.30.1.1}% 
\contentsline {section}{\numberline {5.31}src/\discretionary {\unhbox \voidb@x \hbox {\relax \fontsize {7}{8}\selectfont $\leftarrow \joinrel \rhook $}}{}{}Mapper.h File Reference}{71}{section.5.31}% 
\contentsline {section}{\numberline {5.32}src/\discretionary {\unhbox \voidb@x \hbox {\relax \fontsize {7}{8}\selectfont $\leftarrow \joinrel \rhook $}}{}{}Phenotype.cpp File Reference}{71}{section.5.32}% 
\contentsline {subsection}{\numberline {5.32.1}Macro Definition Documentation}{71}{subsection.5.32.1}% 
\contentsline {subsubsection}{\numberline {5.32.1.1}\_PHENOTYPE\_CPP\_}{71}{subsubsection.5.32.1.1}% 
\contentsline {subsection}{\numberline {5.32.2}Function Documentation}{71}{subsection.5.32.2}% 
\contentsline {subsubsection}{\numberline {5.32.2.1}operator$<$$<$()}{72}{subsubsection.5.32.2.1}% 
\contentsline {section}{\numberline {5.33}src/\discretionary {\unhbox \voidb@x \hbox {\relax \fontsize {7}{8}\selectfont $\leftarrow \joinrel \rhook $}}{}{}Phenotype.h File Reference}{72}{section.5.33}% 
\contentsline {subsection}{\numberline {5.33.1}Macro Definition Documentation}{72}{subsection.5.33.1}% 
\contentsline {subsubsection}{\numberline {5.33.1.1}MIN\_PHENOTYPE\_FITNESS}{72}{subsubsection.5.33.1.1}% 
\contentsline {subsection}{\numberline {5.33.2}Typedef Documentation}{72}{subsection.5.33.2}% 
\contentsline {subsubsection}{\numberline {5.33.2.1}FitnessType}{72}{subsubsection.5.33.2.1}% 
\contentsline {section}{\numberline {5.34}src/\discretionary {\unhbox \voidb@x \hbox {\relax \fontsize {7}{8}\selectfont $\leftarrow \joinrel \rhook $}}{}{}Production.cpp File Reference}{72}{section.5.34}% 
\contentsline {subsection}{\numberline {5.34.1}Macro Definition Documentation}{73}{subsection.5.34.1}% 
\contentsline {subsubsection}{\numberline {5.34.1.1}\_PRODUCTION\_CPP\_}{73}{subsubsection.5.34.1.1}% 
\contentsline {subsection}{\numberline {5.34.2}Function Documentation}{73}{subsection.5.34.2}% 
\contentsline {subsubsection}{\numberline {5.34.2.1}operator$<$$<$()}{73}{subsubsection.5.34.2.1}% 
\contentsline {section}{\numberline {5.35}src/\discretionary {\unhbox \voidb@x \hbox {\relax \fontsize {7}{8}\selectfont $\leftarrow \joinrel \rhook $}}{}{}Production.h File Reference}{73}{section.5.35}% 
\contentsline {section}{\numberline {5.36}src/\discretionary {\unhbox \voidb@x \hbox {\relax \fontsize {7}{8}\selectfont $\leftarrow \joinrel \rhook $}}{}{}Rule.cpp File Reference}{73}{section.5.36}% 
\contentsline {subsection}{\numberline {5.36.1}Macro Definition Documentation}{74}{subsection.5.36.1}% 
\contentsline {subsubsection}{\numberline {5.36.1.1}\_RULE\_CPP\_}{74}{subsubsection.5.36.1.1}% 
\contentsline {section}{\numberline {5.37}src/\discretionary {\unhbox \voidb@x \hbox {\relax \fontsize {7}{8}\selectfont $\leftarrow \joinrel \rhook $}}{}{}Rule.h File Reference}{74}{section.5.37}% 
\contentsline {section}{\numberline {5.38}src/\discretionary {\unhbox \voidb@x \hbox {\relax \fontsize {7}{8}\selectfont $\leftarrow \joinrel \rhook $}}{}{}Symbol.cpp File Reference}{74}{section.5.38}% 
\contentsline {subsection}{\numberline {5.38.1}Macro Definition Documentation}{74}{subsection.5.38.1}% 
\contentsline {subsubsection}{\numberline {5.38.1.1}\_SYMBOL\_CPP\_}{74}{subsubsection.5.38.1.1}% 
\contentsline {section}{\numberline {5.39}src/\discretionary {\unhbox \voidb@x \hbox {\relax \fontsize {7}{8}\selectfont $\leftarrow \joinrel \rhook $}}{}{}Symbol.h File Reference}{74}{section.5.39}% 
\contentsline {subsection}{\numberline {5.39.1}Enumeration Type Documentation}{75}{subsection.5.39.1}% 
\contentsline {subsubsection}{\numberline {5.39.1.1}SymbolType}{75}{subsubsection.5.39.1.1}% 
\contentsline {section}{\numberline {5.40}src/\discretionary {\unhbox \voidb@x \hbox {\relax \fontsize {7}{8}\selectfont $\leftarrow \joinrel \rhook $}}{}{}Tree.h File Reference}{75}{section.5.40}% 
