digraph "src/Symbol.h"
{
 // LATEX_PDF_SIZE
  edge [fontname="Helvetica",fontsize="10",labelfontname="Helvetica",labelfontsize="10"];
  node [fontname="Helvetica",fontsize="10",shape=record];
  Node1 [label="src/Symbol.h",height=0.2,width=0.4,color="black", fillcolor="grey75", style="filled", fontcolor="black",tooltip=" "];
  Node1 -> Node2 [dir="back",color="midnightblue",fontsize="10",style="solid"];
  Node2 [label="src/AGSymbol.h",height=0.2,width=0.4,color="black", fillcolor="white", style="filled",URL="$_a_g_symbol_8h.html",tooltip=" "];
  Node2 -> Node3 [dir="back",color="midnightblue",fontsize="10",style="solid"];
  Node3 [label="src/AGDerivationTree.h",height=0.2,width=0.4,color="black", fillcolor="white", style="filled",URL="$_a_g_derivation_tree_8h.html",tooltip=" "];
  Node3 -> Node4 [dir="back",color="midnightblue",fontsize="10",style="solid"];
  Node4 [label="src/AGContext.h",height=0.2,width=0.4,color="black", fillcolor="white", style="filled",URL="$_a_g_context_8h.html",tooltip=" "];
  Node4 -> Node5 [dir="back",color="midnightblue",fontsize="10",style="solid"];
  Node5 [label="src/AGContext.cpp",height=0.2,width=0.4,color="black", fillcolor="white", style="filled",URL="$_a_g_context_8cpp.html",tooltip=" "];
  Node4 -> Node6 [dir="back",color="midnightblue",fontsize="10",style="solid"];
  Node6 [label="src/GEGrammar.h",height=0.2,width=0.4,color="black", fillcolor="white", style="filled",URL="$_g_e_grammar_8h.html",tooltip=" "];
  Node6 -> Node7 [dir="back",color="midnightblue",fontsize="10",style="solid"];
  Node7 [label="src/GE_ILLIGALSGA.cpp",height=0.2,width=0.4,color="black", fillcolor="white", style="filled",URL="$_g_e___i_l_l_i_g_a_l_s_g_a_8cpp.html",tooltip=" "];
  Node6 -> Node8 [dir="back",color="midnightblue",fontsize="10",style="solid"];
  Node8 [label="src/GEGrammar.cpp",height=0.2,width=0.4,color="black", fillcolor="white", style="filled",URL="$_g_e_grammar_8cpp.html",tooltip=" "];
  Node6 -> Node9 [dir="back",color="midnightblue",fontsize="10",style="solid"];
  Node9 [label="src/GEGrammarSI.h",height=0.2,width=0.4,color="black", fillcolor="white", style="filled",URL="$_g_e_grammar_s_i_8h.html",tooltip=" "];
  Node9 -> Node10 [dir="back",color="midnightblue",fontsize="10",style="solid"];
  Node10 [label="src/GEGrammarSI.cpp",height=0.2,width=0.4,color="black", fillcolor="white", style="filled",URL="$_g_e_grammar_s_i_8cpp.html",tooltip=" "];
  Node9 -> Node11 [dir="back",color="midnightblue",fontsize="10",style="solid"];
  Node11 [label="src/InitFunc.cpp",height=0.2,width=0.4,color="black", fillcolor="white", style="filled",URL="$_init_func_8cpp.html",tooltip=" "];
  Node3 -> Node12 [dir="back",color="midnightblue",fontsize="10",style="solid"];
  Node12 [label="src/AGDerivationTree.cpp",height=0.2,width=0.4,color="black", fillcolor="white", style="filled",URL="$_a_g_derivation_tree_8cpp.html",tooltip=" "];
  Node3 -> Node6 [dir="back",color="midnightblue",fontsize="10",style="solid"];
  Node2 -> Node13 [dir="back",color="midnightblue",fontsize="10",style="solid"];
  Node13 [label="src/AGLookUp.h",height=0.2,width=0.4,color="black", fillcolor="white", style="filled",URL="$_a_g_look_up_8h.html",tooltip=" "];
  Node13 -> Node14 [dir="back",color="midnightblue",fontsize="10",style="solid"];
  Node14 [label="src/Production.h",height=0.2,width=0.4,color="black", fillcolor="white", style="filled",URL="$_production_8h.html",tooltip=" "];
  Node14 -> Node15 [dir="back",color="midnightblue",fontsize="10",style="solid"];
  Node15 [label="src/Rule.h",height=0.2,width=0.4,color="black", fillcolor="white", style="filled",URL="$_rule_8h.html",tooltip=" "];
  Node15 -> Node16 [dir="back",color="midnightblue",fontsize="10",style="solid"];
  Node16 [label="src/Grammar.h",height=0.2,width=0.4,color="black", fillcolor="white", style="filled",URL="$_grammar_8h.html",tooltip=" "];
  Node16 -> Node17 [dir="back",color="midnightblue",fontsize="10",style="solid"];
  Node17 [label="src/CFGrammar.h",height=0.2,width=0.4,color="black", fillcolor="white", style="filled",URL="$_c_f_grammar_8h.html",tooltip=" "];
  Node17 -> Node18 [dir="back",color="midnightblue",fontsize="10",style="solid"];
  Node18 [label="src/CFGrammar.cpp",height=0.2,width=0.4,color="black", fillcolor="white", style="filled",URL="$_c_f_grammar_8cpp.html",tooltip=" "];
  Node17 -> Node6 [dir="back",color="midnightblue",fontsize="10",style="solid"];
  Node16 -> Node19 [dir="back",color="midnightblue",fontsize="10",style="solid"];
  Node19 [label="src/Grammar.cpp",height=0.2,width=0.4,color="black", fillcolor="white", style="filled",URL="$_grammar_8cpp.html",tooltip=" "];
  Node15 -> Node20 [dir="back",color="midnightblue",fontsize="10",style="solid"];
  Node20 [label="src/Rule.cpp",height=0.2,width=0.4,color="black", fillcolor="white", style="filled",URL="$_rule_8cpp.html",tooltip=" "];
  Node14 -> Node21 [dir="back",color="midnightblue",fontsize="10",style="solid"];
  Node21 [label="src/Production.cpp",height=0.2,width=0.4,color="black", fillcolor="white", style="filled",URL="$_production_8cpp.html",tooltip=" "];
  Node13 -> Node6 [dir="back",color="midnightblue",fontsize="10",style="solid"];
  Node2 -> Node22 [dir="back",color="midnightblue",fontsize="10",style="solid"];
  Node22 [label="src/AGSymbol.cpp",height=0.2,width=0.4,color="black", fillcolor="white", style="filled",URL="$_a_g_symbol_8cpp.html",tooltip=" "];
  Node2 -> Node6 [dir="back",color="midnightblue",fontsize="10",style="solid"];
  Node2 -> Node23 [dir="back",color="midnightblue",fontsize="10",style="solid"];
  Node23 [label="src/GenericAGSymbol.h",height=0.2,width=0.4,color="black", fillcolor="white", style="filled",URL="$_generic_a_g_symbol_8h.html",tooltip=" "];
  Node23 -> Node24 [dir="back",color="midnightblue",fontsize="10",style="solid"];
  Node24 [label="src/GenericAGSymbol.cpp",height=0.2,width=0.4,color="black", fillcolor="white", style="filled",URL="$_generic_a_g_symbol_8cpp.html",tooltip=" "];
  Node1 -> Node25 [dir="back",color="midnightblue",fontsize="10",style="solid"];
  Node25 [label="src/Phenotype.h",height=0.2,width=0.4,color="black", fillcolor="white", style="filled",URL="$_phenotype_8h.html",tooltip=" "];
  Node25 -> Node3 [dir="back",color="midnightblue",fontsize="10",style="solid"];
  Node25 -> Node26 [dir="back",color="midnightblue",fontsize="10",style="solid"];
  Node26 [label="src/Mapper.h",height=0.2,width=0.4,color="black", fillcolor="white", style="filled",URL="$_mapper_8h.html",tooltip=" "];
  Node26 -> Node16 [dir="back",color="midnightblue",fontsize="10",style="solid"];
  Node26 -> Node27 [dir="back",color="midnightblue",fontsize="10",style="solid"];
  Node27 [label="src/Mapper.cpp",height=0.2,width=0.4,color="black", fillcolor="white", style="filled",URL="$_mapper_8cpp.html",tooltip=" "];
  Node25 -> Node28 [dir="back",color="midnightblue",fontsize="10",style="solid"];
  Node28 [label="src/Phenotype.cpp",height=0.2,width=0.4,color="black", fillcolor="white", style="filled",URL="$_phenotype_8cpp.html",tooltip=" "];
  Node1 -> Node29 [dir="back",color="midnightblue",fontsize="10",style="solid"];
  Node29 [label="src/Symbol.cpp",height=0.2,width=0.4,color="black", fillcolor="white", style="filled",URL="$_symbol_8cpp.html",tooltip=" "];
}
