digraph "src/Mapper.cpp"
{
 // LATEX_PDF_SIZE
  edge [fontname="Helvetica",fontsize="10",labelfontname="Helvetica",labelfontsize="10"];
  node [fontname="Helvetica",fontsize="10",shape=record];
  Node1 [label="src/Mapper.cpp",height=0.2,width=0.4,color="black", fillcolor="grey75", style="filled", fontcolor="black",tooltip=" "];
  Node1 -> Node2 [color="midnightblue",fontsize="10",style="solid"];
  Node2 [label="iostream",height=0.2,width=0.4,color="grey75", fillcolor="white", style="filled",tooltip=" "];
  Node1 -> Node3 [color="midnightblue",fontsize="10",style="solid"];
  Node3 [label="Mapper.h",height=0.2,width=0.4,color="black", fillcolor="white", style="filled",URL="$_mapper_8h.html",tooltip=" "];
  Node3 -> Node4 [color="midnightblue",fontsize="10",style="solid"];
  Node4 [label="libGEdefs.h",height=0.2,width=0.4,color="black", fillcolor="white", style="filled",URL="$lib_g_edefs_8h.html",tooltip=" "];
  Node3 -> Node5 [color="midnightblue",fontsize="10",style="solid"];
  Node5 [label="Genotype.h",height=0.2,width=0.4,color="black", fillcolor="white", style="filled",URL="$_genotype_8h.html",tooltip=" "];
  Node5 -> Node4 [color="midnightblue",fontsize="10",style="solid"];
  Node5 -> Node2 [color="midnightblue",fontsize="10",style="solid"];
  Node5 -> Node6 [color="midnightblue",fontsize="10",style="solid"];
  Node6 [label="vector",height=0.2,width=0.4,color="grey75", fillcolor="white", style="filled",tooltip=" "];
  Node3 -> Node7 [color="midnightblue",fontsize="10",style="solid"];
  Node7 [label="Phenotype.h",height=0.2,width=0.4,color="black", fillcolor="white", style="filled",URL="$_phenotype_8h.html",tooltip=" "];
  Node7 -> Node4 [color="midnightblue",fontsize="10",style="solid"];
  Node7 -> Node2 [color="midnightblue",fontsize="10",style="solid"];
  Node7 -> Node8 [color="midnightblue",fontsize="10",style="solid"];
  Node8 [label="string",height=0.2,width=0.4,color="grey75", fillcolor="white", style="filled",tooltip=" "];
  Node7 -> Node6 [color="midnightblue",fontsize="10",style="solid"];
  Node7 -> Node9 [color="midnightblue",fontsize="10",style="solid"];
  Node9 [label="Symbol.h",height=0.2,width=0.4,color="black", fillcolor="white", style="filled",URL="$_symbol_8h.html",tooltip=" "];
  Node9 -> Node4 [color="midnightblue",fontsize="10",style="solid"];
  Node9 -> Node2 [color="midnightblue",fontsize="10",style="solid"];
  Node9 -> Node6 [color="midnightblue",fontsize="10",style="solid"];
  Node9 -> Node8 [color="midnightblue",fontsize="10",style="solid"];
  Node9 -> Node10 [color="midnightblue",fontsize="10",style="solid"];
  Node10 [label="sstream",height=0.2,width=0.4,color="grey75", fillcolor="white", style="filled",tooltip=" "];
}
