digraph "src/GEListGenome.h"
{
 // LATEX_PDF_SIZE
  edge [fontname="Helvetica",fontsize="10",labelfontname="Helvetica",labelfontsize="10"];
  node [fontname="Helvetica",fontsize="10",shape=record];
  Node1 [label="src/GEListGenome.h",height=0.2,width=0.4,color="black", fillcolor="grey75", style="filled", fontcolor="black",tooltip=" "];
  Node1 -> Node2 [dir="back",color="midnightblue",fontsize="10",style="solid"];
  Node2 [label="src/GEListGenome.cpp",height=0.2,width=0.4,color="black", fillcolor="white", style="filled",URL="$_g_e_list_genome_8cpp.html",tooltip=" "];
}
