digraph "src/AGLookUp.h"
{
 // LATEX_PDF_SIZE
  edge [fontname="Helvetica",fontsize="10",labelfontname="Helvetica",labelfontsize="10"];
  node [fontname="Helvetica",fontsize="10",shape=record];
  Node1 [label="src/AGLookUp.h",height=0.2,width=0.4,color="black", fillcolor="grey75", style="filled", fontcolor="black",tooltip=" "];
  Node1 -> Node2 [dir="back",color="midnightblue",fontsize="10",style="solid",fontname="Helvetica"];
  Node2 [label="src/Production.h",height=0.2,width=0.4,color="black", fillcolor="white", style="filled",URL="$_production_8h.html",tooltip=" "];
  Node2 -> Node3 [dir="back",color="midnightblue",fontsize="10",style="solid",fontname="Helvetica"];
  Node3 [label="src/Rule.h",height=0.2,width=0.4,color="black", fillcolor="white", style="filled",URL="$_rule_8h.html",tooltip=" "];
  Node3 -> Node4 [dir="back",color="midnightblue",fontsize="10",style="solid",fontname="Helvetica"];
  Node4 [label="src/Grammar.h",height=0.2,width=0.4,color="black", fillcolor="white", style="filled",URL="$_grammar_8h.html",tooltip=" "];
  Node4 -> Node5 [dir="back",color="midnightblue",fontsize="10",style="solid",fontname="Helvetica"];
  Node5 [label="src/CFGrammar.h",height=0.2,width=0.4,color="black", fillcolor="white", style="filled",URL="$_c_f_grammar_8h.html",tooltip=" "];
  Node5 -> Node6 [dir="back",color="midnightblue",fontsize="10",style="solid",fontname="Helvetica"];
  Node6 [label="src/CFGrammar.cpp",height=0.2,width=0.4,color="black", fillcolor="white", style="filled",URL="$_c_f_grammar_8cpp.html",tooltip=" "];
  Node5 -> Node7 [dir="back",color="midnightblue",fontsize="10",style="solid",fontname="Helvetica"];
  Node7 [label="src/GEGrammar.h",height=0.2,width=0.4,color="black", fillcolor="white", style="filled",URL="$_g_e_grammar_8h.html",tooltip=" "];
  Node7 -> Node8 [dir="back",color="midnightblue",fontsize="10",style="solid",fontname="Helvetica"];
  Node8 [label="src/GE_ILLIGALSGA.cpp",height=0.2,width=0.4,color="black", fillcolor="white", style="filled",URL="$_g_e___i_l_l_i_g_a_l_s_g_a_8cpp.html",tooltip=" "];
  Node7 -> Node9 [dir="back",color="midnightblue",fontsize="10",style="solid",fontname="Helvetica"];
  Node9 [label="src/GEGrammar.cpp",height=0.2,width=0.4,color="black", fillcolor="white", style="filled",URL="$_g_e_grammar_8cpp.html",tooltip=" "];
  Node7 -> Node10 [dir="back",color="midnightblue",fontsize="10",style="solid",fontname="Helvetica"];
  Node10 [label="src/GEGrammarSI.h",height=0.2,width=0.4,color="black", fillcolor="white", style="filled",URL="$_g_e_grammar_s_i_8h.html",tooltip=" "];
  Node10 -> Node11 [dir="back",color="midnightblue",fontsize="10",style="solid",fontname="Helvetica"];
  Node11 [label="src/GEGrammarSI.cpp",height=0.2,width=0.4,color="black", fillcolor="white", style="filled",URL="$_g_e_grammar_s_i_8cpp.html",tooltip=" "];
  Node10 -> Node12 [dir="back",color="midnightblue",fontsize="10",style="solid",fontname="Helvetica"];
  Node12 [label="src/InitFunc.cpp",height=0.2,width=0.4,color="black", fillcolor="white", style="filled",URL="$_init_func_8cpp.html",tooltip=" "];
  Node4 -> Node13 [dir="back",color="midnightblue",fontsize="10",style="solid",fontname="Helvetica"];
  Node13 [label="src/Grammar.cpp",height=0.2,width=0.4,color="black", fillcolor="white", style="filled",URL="$_grammar_8cpp.html",tooltip=" "];
  Node3 -> Node14 [dir="back",color="midnightblue",fontsize="10",style="solid",fontname="Helvetica"];
  Node14 [label="src/Rule.cpp",height=0.2,width=0.4,color="black", fillcolor="white", style="filled",URL="$_rule_8cpp.html",tooltip=" "];
  Node2 -> Node15 [dir="back",color="midnightblue",fontsize="10",style="solid",fontname="Helvetica"];
  Node15 [label="src/Production.cpp",height=0.2,width=0.4,color="black", fillcolor="white", style="filled",URL="$_production_8cpp.html",tooltip=" "];
  Node1 -> Node7 [dir="back",color="midnightblue",fontsize="10",style="solid",fontname="Helvetica"];
}
