PROGRESSIVE(0.5, 0.3, 0.011),
GEICO(0.4,0.23, 0.016),
FARMERS(0.12, 0.5, 0.012),
STATEFARM(0.45, 0.76, 0.045),
GENERAL(0.213,0.345, 0.031),
BAJAJ_ALLIANZ_CAR_INSURANCE(0.732,0.32547, 0.008),
BHARTI_AXA_CAR_INSURANCE(0.128,0.435, 0.037),
CHOLAMANDALAM_CAR_INSURANCE(0.52,0.453, 0.030),
DIGIT_CAR_INSURANCE(0.63,0.725345, 0.012),
EDELWEISS_CAR_INSURANCE(0.31,0.455, 0.024),
FUTURE_GENERALI_CAR_INSURANCE(0.213,0.73645, 0.010),
HDFC_ERGO_CAR_INSURANCE(0.51,0.42, 0.041),
IFFCO_TOKIO_CAR_INSURANCE(0.367,0.37, 0.027),
KOTAK_MAHINDRA_CAR_INSURANCE(0.2123,0.21376, 0.034),
LIBERTY_CAR_INSURANCE(0.123,0.129, 0.034),
NATIONAL_CAR_INSURANCE(0.213,0.38, 0.035),
NEW_INDIA_ASSURANCE_CAR_INSURANCE(0.213,0.21398, 0.047),
ORIENTAL_CAR_INSURANCE(0.73,0.238, 0.025),
UNIVERSAL_SOMPO_CAR_INSURANCE(0.213,0.237, 0.025),
RELIANCE_CAR_INSURANCE(0.97,0.894, 0.004),
ROYAL_SUNDARAM_CAR_INSURANCE(0.834,0.852, 0.043),
SBI_CAR_INSURANCE(0.57,0.35, 0.028),
SHRIRAM_CAR_INSURANCE(0.134,0.18, 0.009),
TATA_AIG_CAR_INSURANCE(0.53,0.923, 0.014),
UNITED_INDIA_CAR_INSURANCE(0.643,0.25, 0.016),
RAHEJA_QBE_CAR_INSURANC(0.643,0.85, 0.032)