{
  "cli": {
    "version": ">= 10.1.0"
  },
  "build": {
    "development": {
      "developmentClient": true,
      "distribution": "internal"
    },
    "preview": {
      "distribution": "internal"
    },
    "production": {
      "android" : {
        "buildType": "apk"
      }
    }
  },
  "submit": {
    "production": {}
  }
}
