i,j,weight
PHO11,PHO2,0.965
MCM2,TAH11,0.903
MCM2,ORC2,0.903
CDC4,FAR1,0.902
CDC53,FAR1,0.880
CDC6,TAH11,0.873
CDC14,SIC1,0.863
CDC28,FAR1,0.849
CDC53,SIC1,0.847
CLN3,PCL2,0.834
CDC6,ORC2,0.831
CDC4,SIC1,0.831
CDC28,SIC1,0.830
FOB1,SPO12,0.826
PCL2,PHO85,0.820
FAR1,FUS3,0.818
CDC4,CDC6,0.808
MCM2,DBF4,0.803
CLN3,MCM1,0.794
CLB1,SIC1,0.785
CDC53,CDC6,0.780
SIC1,SWI5,0.763
PHO81,PHO80,0.760
FAR1,CLN1,0.756
MCM2,CDC7,0.744
PHO81,PHO85,0.738
MAD1,MAD2,0.738
CDC53,GRR1,0.734
CLN3,PHO85,0.725
CHK1,RAD9,0.714
SIC1,CLN1,0.701
CDC20,MAD2,0.701
FOB1,NET1,0.697
CDC27,MAD2,0.680
MEC1,RAD9,0.671
CDC15,DBF2,0.666
CDC20,BUB3,0.660
PHO11,PHO4,0.655
CDC14,DBF2,0.654
CDH1,CDC20,0.642
CLB6,SIC1,0.632
CDC27,CDC20,0.627
CDC28,CDC6,0.614
MEC1,CHK1,0.573
CLN3,SWI6,0.562
DBF2,MOB1,0.561
MAD1,CDC20,0.560
CDC20,CLB6,0.537
MEC1,RAD24,0.527
CDC28,SWI5,0.514
ESP1,Cohesin,0.500
CDC20,BUB1,0.499
CDC5,SWE1,0.495
MAD2,BUB3,0.474
CLN1,GRR1,0.463
CAK1,CLB1,0.461
CDC15,TEM1,0.453
MEC1,DDC1,0.449
CDC27,CDC5,0.443
MAD1,MPS1,0.434
CDC27,CDH1,0.427
SWI4,SWI6,0.427
CDH1,CDC5,0.415
CDC28,PCL2,0.410
CDC20,MAD3,0.403
CDC53,CLN1,0.397
CLB1,SWE1,0.394
CDC28,CLB1,0.393
CDC55,NET1,0.391
DDC1,RAD24,0.387
MCM1,YHP1,0.385
CLN3,CDC28,0.380
CDC27,CLB1,0.375
PHO80,PHO85,0.369
CDC55,TPD3,0.366
CDH1,CLB1,0.366
CDC7,DBF4,0.365
CDC28,PHO85,0.361
CDC14,SWI5,0.354
BUB2,TEM1,0.340
CLN3,YHP1,0.339
CDC27,BUB3,0.333
HSL7,SWE1,0.332
CLN3,WHI5,0.326
CDC14,MOB1,0.323
LTE1,TEM1,0.322
LCD1,RAD9,0.317
MCM2,CDC45,0.314
CDC53,SWE1,0.310
CHK1,LCD1,0.305
CDC14,CDH1,0.299
SWI4,WHI5,0.297
MEC1,MRC1,0.288
PHO4,PHO85,0.285
MEC1,MEC3,0.284
SWI6,CLN1,0.281
PHO2,PHO4,0.271
MEC3,RAD24,0.268
CDC5,BUB2,0.262
CLB1,SWI5,0.259
MAD2,MAD3,0.255
CDC28,CLB3,0.254
PHO4,PHO80,0.248
CDC55,SLK19,0.246
MRC1,LCD1,0.233
RAD53,RAD9,0.227
CDC53,CDC4,0.222
SWI6,YHP1,0.222
MEC1,LCD1,0.221
HSL7,HSL1,0.219
MBP1,CLB6,0.217
MBP1,SWI6,0.217
SWI4,CLN1,0.216
CDC20,PDS1,0.216
SWI4,YHP1,0.216
CLN1,WHI5,0.215
MEC1,RAD53,0.212
CDC28,CAK1,0.211
BUB3,MAD3,0.211
CDC14,NET1,0.208
CLB6,CDC6,0.203
MET30,SWE1,0.202
MEC3,DDC1,0.200
CLB6,SWI6,0.196
CDC27,CLB6,0.196
BFA1,CDC5,0.192
CDC28,CLN1,0.190
CDC28,SWI6,0.181
BFA1,TEM1,0.178
LCD1,RAD53,0.176
KCC4,SWE1,0.174
CDC28,CKS1,0.174
SWI6,WHI5,0.170
CDC53,MET30,0.169
GIN4,SWE1,0.166
MRC1,RAD53,0.165
CDC28,SWE1,0.165
MBP1,WHI5,0.149
BUB1,BUB3,0.145
SLK19,TPD3,0.145
RAD17,RAD24,0.139
RAD17,DDC1,0.136
CDC28,MIH1,0.136
CDC28,CLB6,0.135
CDC27,MAD3,0.128
CDC28,WHI5,0.119
NET1,TPD3,0.117
HSL1,SWE1,0.117
MEC1,RAD17,0.116
DUN1,TUP1,0.116
DUN1,RFX1,0.114
BFA1,BUB2,0.099
ESP1,SLK19,0.099
CHK1,PDS1,0.096
DUN1,RAD53,0.095
CYC8,DUN1,0.090
CDC27,PDS1,0.074
MEC3,RAD17,0.049
ESP1,PDS1,0.047
