i,j,weight
SWI6,WHI5,0.959
MEC1,MEC3,0.937
MEC3,RAD24,0.917
FOB1,NET1,0.910
MBP1,WHI5,0.904
BFA1,BUB2,0.903
BUB3,MAD3,0.862
SWI6,YHP1,0.859
ESP1,PDS1,0.845
CDC27,PDS1,0.844
CDC27,MAD3,0.840
BUB2,TEM1,0.837
CDC55,SLK19,0.837
MBP1,SWI6,0.832
LTE1,TEM1,0.822
ESP1,SLK19,0.814
CDC5,SWE1,0.805
CDC28,MIH1,0.801
MAD2,MAD3,0.795
MAD1,MPS1,0.795
MCM1,YHP1,0.787
CLN1,WHI5,0.786
BFA1,TEM1,0.783
CHK1,PDS1,0.781
CDC28,WHI5,0.771
SWI6,CLN1,0.758
CDC27,BUB3,0.752
HSL7,SWE1,0.749
CDC28,SWI6,0.748
CDC14,NET1,0.748
CDC14,CDH1,0.745
SLK19,TPD3,0.737
CLB1,SWE1,0.736
HSL7,HSL1,0.719
PHO2,PHO4,0.716
CDC28,CLB3,0.715
CLN1,GRR1,0.703
CDC28,PHO85,0.689
CDC28,CLB1,0.681
BFA1,CDC5,0.678
MEC3,DDC1,0.672
MEC1,RAD9,0.670
PHO4,PHO85,0.666
CHK1,RAD9,0.664
CDC53,CLN1,0.659
PHO4,PHO80,0.653
MET30,SWE1,0.651
MEC1,RAD24,0.650
DUN1,TUP1,0.643
CDC55,NET1,0.629
CDC5,BUB2,0.628
CDC7,DBF4,0.627
BUB1,BUB3,0.625
CLN3,WHI5,0.620
MEC1,CHK1,0.608
MAD2,BUB3,0.606
CDC27,CDH1,0.603
CHK1,LCD1,0.597
CDC28,SWI5,0.596
PHO11,PHO4,0.590
CDC27,MAD2,0.589
CDC28,CKS1,0.588
MEC3,RAD17,0.578
CDC27,CLB1,0.577
CDC27,CDC5,0.577
CYC8,DUN1,0.563
CLN3,YHP1,0.561
CDC55,TPD3,0.553
MEC1,LCD1,0.548
CDC53,SWE1,0.539
NET1,TPD3,0.535
CAK1,CLB1,0.532
LCD1,RAD9,0.521
PHO11,PHO2,0.519
CDC14,SWI5,0.511
CDH1,CLB1,0.502
PCL2,PHO85,0.502
ESP1,Cohesin,0.500
CDC15,TEM1,0.500
CDC14,MOB1,0.474
MAD1,MAD2,0.473
CDH1,CDC5,0.472
CDC28,CLN1,0.471
CDC28,PCL2,0.470
CLN3,SWI6,0.468
CDC28,CAK1,0.453
DUN1,RFX1,0.451
CDC28,SWE1,0.431
MEC1,DDC1,0.408
CDC6,TAH11,0.407
CDC53,GRR1,0.400
CDC28,CDC6,0.396
RAD17,RAD24,0.392
CDC6,ORC2,0.389
CLB1,SWI5,0.380
DDC1,RAD24,0.380
MEC1,RAD17,0.362
HSL1,SWE1,0.353
CDC4,CDC6,0.349
PHO81,PHO85,0.347
CDC53,MET30,0.335
CDC20,PDS1,0.308
MRC1,LCD1,0.306
PHO81,PHO80,0.302
GIN4,SWE1,0.300
SWI4,WHI5,0.299
MEC1,MRC1,0.296
RAD17,DDC1,0.287
LCD1,RAD53,0.280
CLN3,MCM1,0.279
CLN3,PHO85,0.274
MEC1,RAD53,0.274
RAD53,RAD9,0.265
SWI4,SWI6,0.263
CDC20,BUB1,0.258
MBP1,CLB6,0.254
CLB6,SWI6,0.251
SWI4,YHP1,0.248
CLN3,PCL2,0.244
CDC53,CDC4,0.234
DUN1,RAD53,0.209
PHO80,PHO85,0.198
CDC27,CLB6,0.193
SWI4,CLN1,0.185
SIC1,CLN1,0.184
MRC1,RAD53,0.183
CDC53,CDC6,0.183
CDC20,MAD3,0.180
CDC20,BUB3,0.171
CDC27,CDC20,0.165
CDC28,CLB6,0.163
KCC4,SWE1,0.162
CDH1,CDC20,0.155
CLB1,SIC1,0.154
CLN3,CDC28,0.136
FAR1,CLN1,0.135
CDC20,MAD2,0.133
CDC14,DBF2,0.131
MAD1,CDC20,0.128
CDC14,SIC1,0.100
DBF2,MOB1,0.099
SIC1,SWI5,0.096
CDC20,CLB6,0.096
CLB6,CDC6,0.087
FOB1,SPO12,0.082
MCM2,TAH11,0.079
CLB6,SIC1,0.076
MCM2,CDC45,0.074
MCM2,DBF4,0.074
MCM2,CDC7,0.072
CDC28,SIC1,0.072
MCM2,ORC2,0.069
CDC15,DBF2,0.050
CDC28,FAR1,0.041
CDC53,FAR1,0.026
CDC4,FAR1,0.023
CDC53,SIC1,0.021
FAR1,FUS3,0.018
CDC4,SIC1,0.015
