i,j,weight
Cohesin,ESP1,1.000
SLK19,TPD3,0.949
CDC28,PHO85,0.944
CHK1,RAD9,0.939
CDC53,CLN1,0.939
CDC53,SWE1,0.938
BUB3,CDC27,0.935
CHK1,LCD1,0.932
MEC1,RAD9,0.924
LCD1,MEC1,0.920
CLN1,GRR1,0.912
MEC1,RAD24,0.908
LCD1,RAD9,0.908
CHK1,MEC1,0.903
CAK1,CDC28,0.900
FOB1,NET1,0.898
CYC8,DUN1,0.897
DUN1,RFX1,0.897
CDC7,DBF4,0.892
RAD17,RAD24,0.891
BUB3,MAD2,0.889
MEC1,RAD17,0.883
MEC1,MRC1,0.864
DDC1,RAD24,0.858
CLN1,SWI6,0.855
CDC28,PCL2,0.853
DDC1,MEC1,0.850
LCD1,MRC1,0.848
CDC7,MCM2,0.846
CLN1,WHI5,0.845
MEC1,RAD53,0.841
CDC28,CLN1,0.840
CDC28,SWE1,0.838
CDC55,SLK19,0.837
MET30,SWE1,0.836
DUN1,TUP1,0.834
RAD53,RAD9,0.831
KCC4,SWE1,0.827
LCD1,RAD53,0.826
SWI4,SWI6,0.825
CDC28,MIH1,0.820
BUB1,BUB3,0.818
CLB6,MBP1,0.818
CLB6,SWI6,0.813
SWI4,WHI5,0.811
CLN1,SWI4,0.811
CDC28,CLB6,0.806
DDC1,RAD17,0.802
GIN4,SWE1,0.801
CDC28,CKS1,0.798
HSL1,SWE1,0.795
BUB3,MAD3,0.795
CDC27,CLB6,0.790
CDC28,CDC6,0.787
CHK1,PDS1,0.786
CDC45,MCM2,0.784
MRC1,RAD53,0.779
DBF4,MCM2,0.779
MCM2,ORC2,0.776
DUN1,RAD53,0.772
MCM2,TAH11,0.766
SWI4,YHP1,0.759
CDC28,SWI6,0.756
HSL7,SWE1,0.748
PCL2,PHO85,0.745
CDC28,CLN3,0.740
HSL1,HSL7,0.728
CDC28,WHI5,0.721
CDC27,PDS1,0.710
CDC28,CLB3,0.707
CDC4,CDC6,0.701
MEC3,RAD17,0.696
CDC6,TAH11,0.694
ESP1,SLK19,0.688
CDC27,MAD2,0.685
CDC6,ORC2,0.681
PHO4,PHO80,0.679
MEC1,MEC3,0.677
MEC3,RAD24,0.671
DDC1,MEC3,0.660
PHO2,PHO4,0.631
NET1,TPD3,0.630
CLN3,PCL2,0.624
CDC20,CLB6,0.623
CDC55,TPD3,0.621
CDC27,CDH1,0.615
PHO80,PHO81,0.614
MAD1,MAD2,0.607
CDC6,CLB6,0.607
CLN3,YHP1,0.578
ESP1,PDS1,0.577
SWI6,YHP1,0.573
MAD2,MAD3,0.563
PHO4,PHO85,0.562
CDC53,CDC6,0.558
PHO80,PHO85,0.554
CLN3,WHI5,0.542
CDC27,MAD3,0.532
SWI6,WHI5,0.530
CDC53,GRR1,0.517
MCM1,YHP1,0.512
CDC55,NET1,0.496
CLN3,SWI6,0.490
LTE1,TEM1,0.489
CDC4,CDC53,0.487
MBP1,WHI5,0.484
MBP1,SWI6,0.481
CLB6,SIC1,0.459
PHO81,PHO85,0.455
PHO11,PHO2,0.452
CDC15,TEM1,0.451
CDC53,MET30,0.443
CDC14,CDH1,0.441
CLN3,PHO85,0.437
MAD1,MPS1,0.418
CDC14,NET1,0.413
CLN1,SIC1,0.373
CDC20,PDS1,0.372
PHO11,PHO4,0.358
BUB2,TEM1,0.355
BUB1,CDC20,0.336
CLN3,MCM1,0.317
BFA1,BUB2,0.306
BFA1,TEM1,0.294
BUB3,CDC20,0.294
CDC28,SIC1,0.281
CDC5,SWE1,0.268
CLN1,FAR1,0.266
CDC15,DBF2,0.239
CDC14,DBF2,0.216
CDC4,SIC1,0.186
CDC28,FAR1,0.183
CDC14,SIC1,0.171
FOB1,SPO12,0.163
CDC20,CDC27,0.160
CDC53,SIC1,0.144
CDC20,MAD2,0.141
CDC20,CDH1,0.137
CDC20,MAD1,0.130
CDC4,FAR1,0.129
CDC20,MAD3,0.127
CDC14,MOB1,0.123
CDC27,CDC5,0.108
CDC53,FAR1,0.099
CLB1,SWE1,0.097
CDC5,CDH1,0.087
CDC28,SWI5,0.086
BUB2,CDC5,0.081
BFA1,CDC5,0.077
CDC28,CLB1,0.073
DBF2,MOB1,0.062
FAR1,FUS3,0.057
CAK1,CLB1,0.046
CDC27,CLB1,0.038
CDC14,SWI5,0.034
CDH1,CLB1,0.032
CLB1,SIC1,0.017
SIC1,SWI5,0.015
CLB1,SWI5,0.003
