BUB2-CDC14,CDC14-NET1,CDC14-TEM1,CDC15-TEM1,CDC20-CDH1,CDC20-PDS1,CDC28-CDC6,CDC28-CLB1,CDC28-CLB6,CDC28-CLN1,CDC28-CLN3,CLB1-ESP1,MBP1-SWI6,SWI4-SWI6
0.09645748800000001,0.00826737756621672,0.47159687815860724,0.6471092240192735,0.295167317633234,0.01629173235267737,3.4967557e-05,0.47290108,0.094314486,0.06716869,0.12109799,0.1185308728649284,0.0033763731,0.0033763731
0.09695879800000001,0.00859027607898964,0.44780468850905014,0.6086210955271194,0.4031413749985844,0.012132018859937059,6.821342e-05,0.18167478,0.056609143,0.061120536,0.066852331,0.0535340783546352,0.0039811372,0.0039811372
0.07929980800000001,0.009147522297099201,0.3186235596414304,0.51167772844788,0.3995706602547378,0.006926457183403059,0.00010336837,0.018354021,0.0086620273,0.056555208,0.067282498,0.006789628654744951,0.027669184,0.027669184
0.07158064800000001,0.00935889879324732,0.249945700379964,0.42479838456328894,0.33802597666422,0.00437248307176326,0.00010283447,0.0034101214,0.00091329537,0.05867378,0.067714624,0.001498135965698988,0.068744645,0.068744645
0.066949176,0.00956123510006196,0.2017739070957708,0.34765783959897273,0.2771661547456317,0.0028742171285593802,9.7851465e-05,0.001181604,0.00051673834,0.067111716,0.068148956,0.00058455135028812,0.10612861,0.10612861
0.061613202000000006,0.009841990917630689,0.158563208096853,0.27933574939237105,0.22363099840285358,0.001966447012529844,9.3476941e-05,0.00052824756,0.00039067527,0.083260663,0.0685855,0.000284344251400704,0.1777142,0.1777142
0.054773324000000005,0.0101946972534979,0.118760917816562,0.21941580407186298,0.1785190660945704,0.0015188387609356409,9.0131609e-05,0.00026931148,0.00044842649,0.14635199,0.069024257,0.00015263465392413879,0.83292621,0.83292621
0.046455512000000004,0.010565099290198238,0.083576729587718,0.16789959477649952,0.1413307641018999,0.001187656962714575,8.79582e-05,0.00015681137,0.00043664209,0.29426336,0.069465235,9.011509107573041e-05,0.96075529,0.96075529
0.037414068,0.010955054241291,0.054981424591838406,0.1249090227971296,0.11118873425655439,0.0009256488275023321,8.6102526e-05,0.00010289755,0.00042468871,0.43470591,0.069908433,5.9463616428898495e-05,0.97733152,0.97733152
0.028533160000000002,0.0112128224029766,0.033797022983068005,0.09046240984274961,0.08703872289773724,0.0007250951685673289,8.4474108e-05,7.4064868e-05,0.00042575304,0.56243426,0.070353858,4.283907224968448e-05,0.98363638,0.98363638
0.020948424,0.0114833593819308,0.0198752687085372,0.0642586670919771,0.06785630465029598,0.000570300841625935,8.3018429e-05,5.786476e-05,0.00043736666,0.67790973,0.070801511,3.3386460300297195e-05,0.98693389,0.98693389
0.0151400774,0.01152808491055816,0.011585025227651818,0.0454858071530766,0.05272821367397046,0.0004502022454489824,8.1727092e-05,4.8259579e-05,0.00045796353,0.78218192,0.0712514,2.770716833317515e-05,0.98895276,0.98895276
0.011339587800000002,0.01162836287687358,0.007167985909929901,0.032833250287761004,0.04087831364818032,0.00035672397546592557,8.0632242e-05,4.2504085e-05,0.00048608604,0.87636632,0.071703516,2.423684893999915e-05,0.99031156,0.99031156
0.0088951402,0.01162466467266914,0.0048274041502222595,0.0247286471160076,0.0316595555536524,0.00028385791422386197,7.9778722e-05,3.9131068e-05,0.00052110013,0.96152568,0.072157882,2.212957609992328e-05,0.99128598,0.99128598
0.007377290000000001,0.011641262919991499,0.00358982247491855,0.019701485133703622,0.0245357634479094,0.0002270567750754249,7.920315e-05,3.7371075e-05,0.00056329562,1.0386375,0.072614484,2.0936028121028998e-05,0.99201739,0.99201739
0.0063928864000000005,0.0116147366550208,0.002897665293174032,0.016623638688977004,0.019064827726041938,0.00018281181979372299,7.8933583e-05,3.6784961e-05,0.0006134616,1.1085879,0.073073335,2.0395412062360142e-05,0.9925856,0.9925856
0.0057698146,0.011619407272511281,0.0025050730483683853,0.01474239616997615,0.014885996176394101,0.0001484171715381696,7.8994395e-05,3.7116828e-05,0.00067370076,1.1721736,0.073534429,2.035170203860332e-05,0.99303925,0.99303925
0.005356885400000001,0.011607025012187518,0.002268611129048322,0.01359107715269442,0.01170856822693166,0.0001217404628028827,7.9411868e-05,3.8224734e-05,0.00074570777,1.2301081,0.073997781,2.071349713598352e-05,0.99340945,0.99340945
0.005087040000000001,0.011598930399168001,0.0021243828519648,0.012886635570879778,0.009300900781950179,0.00010112051388613979,8.0218299e-05,4.0051116e-05,0.00083275035,1.2830294,0.074463382,2.1436128267183e-05,0.99371719,0.99371719
0.0049109214000000005,0.011594204155102799,0.002035013514842385,0.012456854813497651,0.007480698172713215,8.52501052051968e-05,8.1455742e-05,4.2599338e-05,0.00093885954,1.3315059,0.074931242,2.2507200058789118e-05,0.99397713,0.99397713
0.0047967114000000005,0.01159221100136658,0.001979267696521596,0.01219590025712916,0.0061059452016925956,7.31025335541728e-05,8.3181076e-05,4.5936431e-05,0.0010696651,1.3760442,0.075401358,2.394627882982977e-05,0.99419963,0.99419963
0.0047232524,0.011591660091580839,0.0019444516860209317,0.012038375549223318,0.005067027202860032,6.3874002569091e-05,8.5472348e-05,5.0195187e-05,0.0012339416,1.4170955,0.075873733,2.580383275376382e-05,0.9943924,0.9943924
0.0046768126,0.01159225217086026,0.00192291265644088,0.0119438514816296,0.0042799775092184885,5.6931464636030606e-05,8.8439316e-05,5.5578566e-05,0.0014430415,1.4550611,0.076348379,2.8160965771696317e-05,0.99456131,0.99456131
0.0046482458,0.011593588901681929,0.00190986240263698,0.011887460270460202,0.003680907688692713,5.1781405122138e-05,9.2238093e-05,6.2396088e-05,0.0017144107,1.4902978,0.076825283,3.114473839806072e-05,0.99471074,0.99471074
0.0046315044,0.011595388100796,0.001902278743571394,0.01185399673231465,0.0032214629261247403,4.8039015495894504e-05,9.7096265e-05,7.1095514e-05,0.0020751357,1.523123,0.07730446,3.493924054230204e-05,0.99484426,0.99484426
0.0046225992,0.01159747872868776,0.0018982398754382758,0.01183423619813823,0.0028651895304366358,4.54041377335754e-05,0.00010335632,8.2285238e-05,0.002564,1.5538189,0.077785902,3.979027839336998e-05,0.99496454,0.99496454
0.004618888000000001,0.011599756848722801,0.00189650943134004,0.011822618978275048,0.002584663655549104,4.36503861188728e-05,0.00011153502,9.7374927e-05,0.0032707155,1.5826362,0.078269616,4.6302623976615635e-05,0.99507385,0.99507385
0.0046186096,0.01160214637727376,0.0018962832810291042,0.011815816498342601,0.002359209103867005,4.2595521283289003e-05,0.0001225075,0.00011765452,0.0043185782,1.6097977,0.078755602,5.49745992091592e-05,0.99517417,0.99517417
0.0046205714000000005,0.011604609659614011,0.001897027985549676,0.01181184810955464,0.002173050347643532,4.2106767802178796e-05,0.00013774044,0.00014590796,0.0059616985,1.6355016,0.079243869,6.69399442456404e-05,0.99526739,0.99526739
0.0046239528,0.011607121457793001,0.0018983833582405802,0.011809540552292651,0.002013702281315151,4.2083928796746595e-05,0.0001599407,0.00018616139,0.0087154387,1.6599241,0.079734407,8.37840465012765e-05,0.99535549,0.99535549
0.0046281709999999995,0.01160966860486625,0.001900097385895835,0.011808204191726882,0.00187027023016938,4.2460668211559995e-05,0.00019432198,0.00024608738,0.013818495,1.6832219,0.080227219,0.00010853636892210419,0.99544191,0.99544191
0.0046327892,0.011612238780204141,0.0019019837303183601,0.011807430690245,0.0017308194456160549,4.3193488649843494e-05,0.00025184514,0.00033358575,0.023949591,1.7055354,0.08072231,0.00014399679573098248,0.99553305,0.99553305
0.0046374538,0.01161483137382904,0.0019038935799702839,0.01180698628950828,0.00157868514292502,4.427963227017e-05,0.0003520544,0.00045540795,0.044147518,1.7269911,0.081219681,0.00019207343536009651,0.99564004,0.99564004
0.0046418302000000005,0.0116174380114842,0.0019056873742958102,0.0118067308753404,0.00139136944377431,4.5750196843065e-05,0.00051364844,0.00059914612,0.076797657,1.7477028,0.081719339,0.0002462861664306728,0.99576682,0.99576682
0.0046455358,0.011620059872436202,0.001907207139336997,0.011806584939876739,0.0011520755901670138,4.7702193206364e-05,0.00072027958,0.00076745538,0.11551524,1.767771,0.08222127,0.0003063218180419404,0.99589574,0.99589574
0.0046480644000000005,0.01162269047664648,0.0019082443633640102,0.011806503114251252,0.0008597522314996499,5.026237447950001e-05,0.0009165986,0.00098305079,0.15308714,1.7872798,0.082725488,0.0003789586181895039,0.99600977,0.99600977
0.0046487424,0.01162532372939328,0.001908522388156992,0.011806456762224608,0.0005284259025415649,5.36469724335321e-05,0.0010443093,0.0012877128,0.18583204,1.8063016,0.083231986,0.000476042337514656,0.9961006,0.9961006
0.022944676,0.011599953763997639,0.000247415791230696,0.0012807200733188399,9.96224533522195e-06,2.8237554732302495e-06,0.0010575131,0.0017500053,0.21165912,1.8248566,0.083741225,0.000614286037903509,0.99616247,0.99616247
0.021125428,0.011505340103802601,0.00021104338273973322,0.0008053824951365708,1.2716007881941922e-06,2.8193116232730404e-06,0.00097603584,0.002427476,0.23237997,1.8430915,0.08425229,0.00080253822755504,0.99619746,0.99619746
0.019215727,0.011437156129913358,0.00019196355817768568,0.000576404645880833,7.48793532465342e-07,3.1652937154220204e-06,0.00080977706,0.0033845727,0.24825272,1.8610052,0.084765635,0.001049111430645855,0.99620366,0.99620366
0.017848797,0.011392831793829298,0.00017830803806232268,0.00043916623415995396,7.057038515710561e-07,3.59222046063864e-06,0.0006055297,0.0046685324,0.26071644,1.8786412,0.085281268,0.001352601567326464,0.99618167,0.99618167
0.016974879,0.011372537803998778,0.00016957766794228887,0.0003569015580427661,6.917523397241599e-07,4.132823233968e-06,0.0004120894,0.0063072797,0.27101427,1.8960379,0.08579918,0.00170269809034072,0.99613267,0.99613267
0.016422553,0.01135832359814327,0.0001640599758854623,0.00030760813039901137,6.96861118498512e-07,4.8188155260959995e-06,0.00026200089,0.0082757622,0.28000757,1.9132301,0.08631938,0.002074459076507826,0.99606007,0.99606007
0.016077453,0.011349798683506707,0.00016061245480405227,0.00027806221539666706,7.164826351497349e-07,5.693333382817349e-06,0.00016343743,0.010435677,0.28822583,1.9302499,0.086841859,0.0024201974407856704,0.99597394,0.99597394
0.015860189,0.01134484362710102,0.0001584420050207099,0.00026035396492097787,7.46924602429824e-07,6.793942857654e-06,0.00010654642,0.012663819,0.29597247,1.9471283,0.087366618,0.00270688801865706,0.99588293,0.99588293
0.015720164,0.011342010921888157,0.00015704316659873236,0.00024973997557480086,7.849293791955891e-07,8.162263814267931e-06,7.6081778e-05,0.01487392,0.30342075,1.9638945,0.087893657,0.0029190057588256,0.99579298,0.99579298
0.015626028,0.0113404077777738,0.0001561027555743348,0.00024337853495078827,8.2780580649863e-07,9.83659140090713e-06,6.001383e-05,0.017045651,0.31067243,1.9805756,0.088422976,0.00305918332588302,0.99570572,0.99570572
0.015558754,0.01133957792212954,0.00015543069375680138,0.00023956534287064189,8.737657835831999e-07,1.1875863461166719e-05,5.1204479e-05,0.019199656,0.31779036,1.9971954,0.088954583,0.0031396919061787995,0.99561995,0.99561995
0.015506902,0.01133918901876294,0.0001549126964716282,0.00023727988913862028,9.21813111381666e-07,1.433444578787713e-05,4.6006091e-05,0.021373739,0.32481435,2.0137749,0.089488462,0.00317314849800085,0.99553323,0.99553323
0.015463736,0.01133904560450104,0.00015448147162375759,0.00023590994156267998,9.71710670583464e-07,1.730832258021376e-05,4.2632513e-05,0.023604508,0.33177081,2.0303321,0.090024613,0.00317267271452188,0.99544311,0.99544311
0.015425445,0.011339046556786199,0.00015409894763149948,0.0002350885903941162,1.023601046486298e-06,2.088020406365264e-05,4.0215287e-05,0.025923509,0.33867693,2.0468829,0.090563044,0.00314669895722091,0.99534756,0.99534756
0.015389958,0.01133912036934768,0.00015374443537239778,0.00023459610736232438,1.078007124230764e-06,2.517351447036988e-05,3.8320879e-05,0.028357612,0.34554455,2.0634403,0.091103747,0.0031042879353116,0.99524468,0.99524468
0.015356255,0.01133922960711815,0.00015340774512897048,0.00023430067548478007,1.135585766478594e-06,3.030688587667587e-05,3.6726909e-05,0.03092977,0.35238153,2.0800159,0.091646723,0.0030511610025721796,0.9951328,0.9951328
0.015323944,0.01133936243154144,0.0001530849608529304,0.00023412334443083597,1.19721125390022e-06,3.6449235941904e-05,3.5315396e-05,0.033661671,0.35919347,2.0966196,0.092191972,0.0029951822615107227,0.99501038,0.99501038
0.015292978,0.0113394992640009,0.0001527756130180798,0.00023401687187306819,1.263835607243491e-06,4.37552155847084e-05,3.4023618e-05,0.03657604,0.36598411,2.11326,0.092739485,0.0029399153439269997,0.99487555,0.99487555
0.015263462,0.01133964368075494,0.0001524807505659242,0.000233952816511799,1.336586220600126e-06,5.2424978312167996e-05,3.2815216e-05,0.039696194,0.37275615,2.1299438,0.093289271,0.00288960028629872,0.99472636,0.99472636
0.015235575,0.01133979413697675,0.0001522021616919825,0.0002339142054744775,1.416786073320278e-06,6.26789437836282e-05,3.1669279e-05,0.043049917,0.3795113,2.1466768,0.093841314,0.002845976458773252,0.99456042,0.99456042
0.01520949,0.0113399598448101,0.000151941574652259,0.00023389087901337898,1.5061065678226749e-06,7.482255623911249e-05,3.0571686e-05,0.04666964,0.38625067,2.1634631,0.094395623,0.00281314499943832,0.99437475,0.99437475
0.015185339,0.01134014056245902,0.0001517003081160749,0.000233876693328257,1.6065729746058801e-06,8.9200697983586e-05,2.9513854e-05,0.050595582,0.3929745,2.180306,0.094952188,0.0027909066427750677,0.9941656,0.9941656
0.015163191,0.01134034190339184,0.0001514790513878481,0.00023386802207847818,1.7208443147001751e-06,0.0001062890604143935,2.8488079e-05,0.054877173,0.39968237,2.1972067,0.095511004,0.0027805250526486422,0.99392796,0.99392796
0.01514306,0.011340565401603801,0.000151277944326446,0.0002338626674818406,1.8524768676978597e-06,0.00012672822693313079,2.7488075e-05,0.059578277,0.40637302,2.214165,0.096072085,0.0027831358783465487,0.99365526,0.99365526
0.01512492,0.0113408168701968,0.00015109672719397198,0.0002338593208589421,2.0063997845807203e-06,0.000151414313918658,2.6507947e-05,0.064783245,0.41304398,2.2311785,0.096635409,0.002800472076380055,0.99333823,0.99333823
0.015108696,0.011341096682829118,0.00015093465074649359,0.00023385717302633558,2.1896663582046933e-06,0.0001816203896039784,2.5542409e-05,0.070607312,0.41969118,2.2482419,0.097200975,0.0028324529906917123,0.99296361,0.99296361
0.015094287,0.01134140725333395,0.0001507907060021817,0.00023385576444774248,2.4130012278408398e-06,0.00021931642614749,2.4583534e-05,0.077214517,0.42630827,2.2653456,0.097768791,0.002883472824341254,0.99251145,0.99251145
0.01508157,0.011341744826076,0.000150663664200987,0.0002338548353852662,2.693563551138288e-06,0.00026762388042951123,2.3624736e-05,0.084854245,0.43288505,2.282474,0.09833885,0.0029553447143145796,0.99194944,0.99194944
0.01507041,0.0113421129377292,0.000150552176703831,0.0002338541760506056,3.0614197647558e-06,0.00033204927888305,2.265267e-05,0.093933649,0.43940482,2.2996006,0.098911136,0.003055021819886661,0.99122065,0.99122065
0.015060652,0.01134250790372444,0.0001504546950732532,0.00023385369653448876,3.5756839229155997e-06,0.000423450490614964,2.1647969e-05,0.10520817,0.445838,2.316678,0.099485658,0.00319499305859466,0.99021018,0.99021018
0.015052122,0.01134292661850276,0.0001503694810633302,0.00023385334688732029,4.3780610040592805e-06,0.00056804221469196,2.0568477e-05,0.12037335,0.45212519,2.333611,0.10006241,0.0034027039871853,0.98862922,0.98862922
0.015044591,0.011343366156844819,0.0001502942469825881,0.00023385308714942368,5.920586144979099e-06,0.000852539305672068,1.9292229e-05,0.14465109,0.45811582,2.350147,0.10064138,0.0037687381970001902,0.98539513,0.98539513
0.015037639,0.01134381245384153,0.0001502247970650049,0.0002338528573812844,9.3709556158368e-06,0.0015470207219217599,1.7564182e-05,0.1904214,0.46338257,2.3652651,0.10122257,0.0044448869651394,0.97526443,0.97526443
0.015030748,0.01134425203359728,0.0001501559565324868,0.00023385267756274058,1.3811790940605839e-05,0.00264265294820904,1.580207e-05,0.25024098,0.46756819,2.3747084,0.10180598,0.00517736551028862,0.93448681,0.93448681
0.015023909,0.01134468905132009,0.00015008763547576188,0.00023385250773411587,1.7864431546748152e-05,0.0038282270050092253,1.4273614e-05,0.31380379,0.46833286,2.2959518,0.1023916,0.00588061053592451,0.12533739,0.12533739
0.015017826,0.01134515237540472,0.0001500268667978766,0.00023385237786516756,2.177298695132477e-05,0.004899576591039043,1.3013718e-05,0.37934935,0.4629733,2.0525298,0.10297943,0.00669264700836595,0.028972706,0.028972706
0.015013143,0.011345661115530748,0.00014998008400673128,0.0002338522479962193,2.5189509128610797e-05,0.005927158769153448,1.2392035e-05,0.44495994,0.45761296,1.8265953,0.10356946,0.007428005502381,0.015587145,0.015587145
0.015009881,0.011346211007181719,0.00014994749689062708,0.0002338521381071092,2.8142279204784e-05,0.0069176865579376,1.1834431e-05,0.51120818,0.45266002,1.6237894,0.10416167,0.00810293899682988,0.010333811,0.010333811
0.015007895,0.0113467985565935,0.0001499276569112945,0.0002338520382079182,3.07036583021376e-05,0.00788237877546522,1.1196184e-05,0.57864672,0.44819653,1.4428061,0.10475608,0.0087362287980768,0.0075489795,0.0075489795
0.015007033,0.01134742048381561,0.0001499190456010303,0.00023385198825832268,3.29510651480813e-05,0.00883510449039669,1.0458085e-05,0.64761943,0.44421333,1.2816522,0.10535267,0.00933937290482326,0.0058375029,0.0058375029
0.015007163,0.01134807434721197,0.0001499203442905133,0.0002338519482986463,3.4958011661437495e-05,0.0097905192762806,9.643757e-06,0.71830583,0.44065863,1.1383115,0.10595144,0.00991978627296008,0.0046890029,0.0046890029
0.015008177,0.011348756915009658,0.00014993047406848068,0.00023385192831880812,3.67954486656954e-05,0.01076452912495026,8.7904909e-06,0.79076856,0.43746188,1.0108956,0.10655238,0.01048571288395824,0.0038721326,0.0038721326
0.015009981,0.011349467063667809,0.0001499484958825371,0.00023385192831880812,3.85255660559889e-05,0.0117723560189739,7.9399142e-06,0.86497575,0.43454599,0.89768106,0.1071555,0.011036022324948751,0.0032666845,0.0032666845
0.015012499,0.01135020152032489,0.0001499736504988309,0.0002338519482986463,4.02044262456616e-05,0.012829433014824091,7.1144295e-06,0.94083524,0.43183678,0.7971127,0.10776077,0.01157328767238872,0.0028038905,0.0028038905
0.015015667,0.011350960579997049,0.0001500052985625397,0.00023385198825832268,4.1884992701464495e-05,0.013952252354397298,6.3363805e-06,1.0182168,0.42926767,0.7077955,0.1083682,0.0121022316383616,0.0024415322,0.0024415322
0.01501943,0.0113517434693884,0.000150042890628113,0.00023385201822807998,4.361292250253041e-05,0.01515698548486104,5.6236363e-06,1.0969572,0.42677945,0.62848234,0.10897776,0.0126188767680444,0.0021522809,0.0021522809
0.015023739,0.01135254670149123,0.00015008593718951487,0.0002338520781675946,4.5429235259151395e-05,0.016460187468190828,4.9746186e-06,1.1768844,0.42432418,0.55806059,0.10958947,0.013127116885034401,0.0019176541,0.0019176541
0.015028556,0.01135337027072252,0.0001501340586298196,0.0002338521480970283,4.73700555123664e-05,0.01787868829560704,4.3929435e-06,1.2578188,0.42186236,0.49553886,0.11020332,0.013625749809391999,0.0017247333,0.0017247333
0.0030835072,0.0114377943274144,0.0054707655663065605,0.0329212551327075,0.00021169950093837,0.0820101330819825,3.878793e-06,1.3365858,0.41834077,0.44080767,0.11081988,0.014501255559040799,0.0015678556,0.0015678556
0.0047539986,0.01222533502207407,0.02166609737067399,0.3969790408605198,0.000603478702852908,0.1893379328406924,3.5796977e-06,1.3909358,0.40722492,0.39145321,0.11143797,0.0160931285969358,0.0014565516,0.0014565516
0.008178316,0.0126704842380164,0.039980253073656394,0.5946043256085042,0.0012287824285042279,0.252721047374692,3.5686683e-06,1.4191539,0.38959408,0.34765333,0.11205818,0.0179937872184204,0.0013813369,0.0013813369
0.010477021400000001,0.01278413642298301,0.05122390990642915,0.635080570285678,0.00191027236638678,0.2804596355334796,3.6130202e-06,1.4264498,0.36788225,0.30878949,0.11268048,0.020277514546325603,0.0013312448,0.0013312448
0.0116150052,0.01279945058202234,0.05678771348592438,0.6443006022621608,0.002500221990602142,0.2819642976037695,3.6298138e-06,1.4192967,0.34409735,0.27431017,0.11330488,0.0230668797556077,0.0012979684,0.0012979684
0.012513196400000003,0.01279215246168538,0.06117912129357467,0.6464042841987339,0.00308670099310701,0.26558945309949,3.6580611e-06,1.4022993,0.31962532,0.24372412,0.11393138,0.0265675180089219,0.0012767042,0.0012767042
0.013551344000000002,0.012770840113408802,0.0662547994744936,0.646883784475877,0.0037581603073540107,0.23805175709707738,3.7189955e-06,1.3784108,0.29536292,0.21659452,0.11455995,0.0310666446649728,0.0012647788,0.0012647788
0.014922350600000002,0.01272554407242299,0.0729578812766534,0.6469937614242431,0.004602238461421283,0.2044800131813072,3.826085e-06,1.3495913,0.27188015,0.19253337,0.1151906,0.036895298357495096,0.001260623,0.001260623
0.0168577536,0.01265660416716288,0.08242039198166784,0.6470202802722888,0.00576031239590196,0.16880884176415858,3.9982683e-06,1.3170257,0.24951872,0.17119619,0.1158233,0.0447601931074712,0.0012634431,0.0012634431
0.0196844742,0.01250831803322736,0.09624070430813672,0.6470284451830992,0.00749949514438496,0.13390001002708718,4.2712268e-06,1.2810795,0.22845228,0.15227737,0.11645806,0.0552133132677135,0.0012732735,0.0012732735
0.024058002000000002,0.0123164796890988,0.1176236171310363,0.6470335103613026,0.01041426453088131,0.10227351193337521,4.7100184e-06,1.2410764,0.20871894,0.13550612,0.11709487,0.06980707869146201,0.0012913403,0.0012913403
0.030772322000000005,0.01195133010822562,0.1504510566239443,0.6470396315998264,0.015970055165615997,0.075544470999264,5.4363472e-06,1.1946441,0.19023804,0.12064316,0.11773371,0.08897750710950271,0.0013211624,0.0013211624
0.04065244800000001,0.01140241183712976,0.1987566539811312,0.6470484321024964,0.02742474694394714,0.0547956792589578,6.6509706e-06,1.1365193,0.17280263,0.10747833,0.11837457,0.1123885467331375,0.001371078,0.001371078
0.053582502000000004,0.01062640597739967,0.2619738621757113,0.6470607332495618,0.051511870605492005,0.0398849759077392,8.6837481e-06,1.0568266,0.15606406,0.095830046,0.11901746,0.13652159996662,0.0014601519,0.0014601519
0.068161226,0.00980529499594344,0.3332516952241519,0.6470757136607734,0.09733258630693711,0.029643952777892526,1.2139283e-05,0.93982524,0.13941878,0.085548423,0.11966235,0.15412587897535562,0.0016332549,0.0016332549
0.082252722,0.00904018651931529,0.4021473886532043,0.6470915643439157,0.17101573919682062,0.02250770556552531,1.8385761e-05,0.76772022,0.12166099,0.076528035,0.12030925,0.154889166597462,0.0020053205,0.0020053205
0.09420662,0.0083937090409166,0.460592006023153,0.6471063100750561,0.27074117564685357,0.01728707128701696,3.0759722e-05,0.53245878,0.10010746,0.068756714,0.12095813,0.1286711560940904,0.0029621124,0.0029621124
