BUB2-TEM1,CDC14-CDH1,CDC14-NET1,CDC14-SIC1,CDC14-SWI5,CDC15-TEM1,CDC20-CDH1,CDC20-CLB6,CDC20-PDS1,CDC28-CDC6,CDC28-CLB1,CDC28-CLB6,CDC28-CLN1,CDC28-CLN3,CDC6-CLB6,CDH1-CLB1,CLB1-SIC1,CLB1-SWI5,CDC28-SWI5,CLB6-MBP1,CLB6-SIC1,CLB6-SWI6,CDC28-SWI6,CLN1-SIC1,CDC28-SIC1,CLN1-SWI4,CLN1-SWI6,CLN3-MCM1,CLN3-SWI6,ESP1-PDS1,LTE1-TEM1,MBP1-SWI6,SIC1-SWI5,SWI4-SWI6
1.0,1.0,0.7410374734025015,0.0559796937457825,1.0,1.0,1.0,1.0,1.0,0.6761666156324483,1.0,1.0,1.0,,0.6761666156324483,1.0,1.0,1.0,1.0,1.0,0.49568179689871644,1.0,,0.05794810944418303,0.05794810944418303,0.33984444965689187,0.33984444965689187,,,1.0,1.0,0.033116605114166135,0.04045367155090581,0.033116605114166135
0.8690386745754297,0.8833745316929213,0.7809639295260834,0.22876595603507274,0.7770994487815479,0.8375331357780816,0.9562998645208305,0.0874967598269524,0.5781385420763538,1.0,0.08579303459669138,0.0982406268342508,0.8869204493607693,,1.0,0.09211816498639662,0.9803662863721827,0.0810358151219384,0.0810358151219384,0.3078885649258176,0.7965829806532618,0.3078885649258176,,0.2552896402986311,0.2552896402986311,0.9446420724832708,0.9446420724832708,,,0.8156168984844959,0.8690386745754297,0.10378826308812568,0.18979823557802872,0.10378826308812568
0.7546638309746223,0.8116525282117155,0.7961995305550372,0.5245729360980228,0.6662742080249038,0.6935915893433398,0.8053095731435823,0.009440771159079642,0.3636251994692758,0.9785662815970796,0.018026033686280786,0.012594492310264717,0.7866278554139228,,0.9785662815970796,0.019365835348745936,0.7544028071256308,0.01589714337261414,0.01589714337261414,0.047111958954661685,0.7877782386187296,0.047111958954661685,,0.5653922696862738,0.5653922696862738,1.0,1.0,,,0.7208710002148232,0.7546638309746223,0.123878605220534,0.44250494690633196,0.123878605220534
0.6503639856371678,0.7624761781769954,0.8132014486325934,0.7697247270174304,0.5828485748503518,0.5660266578644177,0.6592163497675075,0.004480563511395107,0.236978987375775,0.9347117269727494,0.0064390842342151025,0.007302281867591827,0.6976763132509834,,0.9347117269727494,0.006917959759351363,0.5466391353325556,0.005288195358772295,0.005288195358772295,0.027985098995401095,0.7534617061444843,0.027985098995401095,,0.7832958320069828,0.7832958320069828,0.9086621013754375,0.9086621013754375,,,0.6459917492915047,0.6503639856371678,0.12691532445832296,0.6436857483822158,0.12691532445832296
0.5542191077029103,0.7014018024884322,0.8367957792437819,0.9319091789062165,0.4988470040115649,0.45321003167959995,0.5314754643591385,0.0026131007841721276,0.1587615633438192,0.8967613538847711,0.0028126887386784017,0.005282399460012781,0.6187834092622295,,0.8967613538847711,0.0030218992023406093,0.3846120454326576,0.0021492179777188587,0.0021492179777188587,0.02024249895091865,0.7254515431869114,0.02024249895091865,,0.9143499086507915,0.9143499086507915,0.8058453939641245,0.8058453939641245,,,0.5855615218903664,0.5542191077029103,0.12690498879459475,0.7882268555672021,0.12690498879459475
0.46581616335393455,0.6226873011887225,0.8646367300052926,1.0,0.41198849378802926,0.3545554992948365,0.4241431164460536,0.001670747078572387,0.10849294371290213,0.8653346097954155,0.001406043394786048,0.004232077448408661,0.5488116161088828,,0.8653346097954155,0.0015106158739485512,0.26659108930393666,0.0009994685252329067,0.0009994685252329067,0.016137007562252753,0.7036101882503853,0.016137007562252753,,0.9802060056016806,0.9802060056016806,0.711169089669218,0.711169089669218,,,0.5358449314418253,0.46581616335393455,0.12627436848169743,0.8863048664750375,0.12627436848169743
0.38550719494090985,0.5305689722632766,0.8976446138670261,0.9801208757532869,0.3266443151254073,0.2700940988205204,0.33592828002940733,0.0011311235100913847,0.07531417100303676,0.8394479699689213,0.0008033876584914845,0.0036175037891240805,0.4867522010598459,,0.8394479699689213,0.0008631190215141563,0.18380599595511365,0.0005313784567000723,0.0005313784567000723,0.013722776036974924,0.6867922645299993,0.013722776036974924,,1.0,1.0,0.6275106287116963,0.6275106287116963,,,0.4949294138777406,0.38550719494090985,0.125625785507934,0.9486140124984547,0.125625785507934
0.3141266117587101,0.4315943243910096,0.9275378212210352,0.8885264900284078,0.24735242937327317,0.20000217789874591,0.2645297282156224,0.0007897086472373193,0.05280210744028554,0.8179854229100368,0.0005063754877394047,0.003207157436631234,0.4317104676376805,,0.8179854229100368,0.0005440020625530973,0.127019024623338,0.00031177479441243304,0.00031177479441243304,0.01211973490805036,0.6739408281161015,0.01211973490805036,,0.988379796920331,0.988379796920331,0.5544285700047686,0.5544285700047686,,,0.4597933211014628,0.3141266117587101,0.12514648344169454,0.9840525246251274,0.12514648344169454
0.25277316740084516,0.3339620217013467,0.9489257187453982,0.749806536257979,0.17827279551889058,0.1442853795014571,0.20742109284708574,0.0005642707039201044,0.03732056223134723,0.7999594401622468,0.00035130525081485017,0.002922367146795793,0.38289283631181587,,0.7999594401622468,0.0003773851728827682,0.08858314969602951,0.0002014525765967347,0.0002014525765967347,0.011019621014210725,0.6641808863291784,0.011019621014210725,,0.9559569326848202,0.9559569326848202,0.4906697723116581,0.4906697723116581,,,0.42938250164257,0.25277316740084516,0.12487562968790927,0.9994658135164535,0.12487562968790927
0.2024850997115346,0.24887325785533895,0.9713543341906172,0.5999560904848326,0.12381960775301053,0.10229816753069107,0.1621729453138972,0.00041048727117326935,0.02656554032220998,0.7845803554688072,0.00026613107897811855,0.002718825691875999,0.3395954730565098,,0.7845803554688072,0.0002858615008678386,0.06278166808106819,0.0001422220258382146,0.0001422220258382146,0.010247138806690896,0.6568379712448449,0.010247138806690896,,0.9102736141539949,0.9102736141539949,0.4349740293700618,0.4349740293700618,,,0.4028456507658993,0.2024850997115346,0.12481508116729505,1.0,0.12481508116729505
0.16375058381932991,0.18265422917221896,0.9819974687002849,0.46730160116638286,0.08475494918286156,0.07252183150832346,0.12660112653677494,0.0003023632683897977,0.019017312470881093,0.7712731729337652,0.00021590766901130061,0.0025650721025668407,0.3011941592656892,,0.7712731729337652,0.00023188688416443074,0.0455557129909173,0.00010759981399060682,0.00010759981399060682,0.009678416910655224,0.6514140846449147,0.009678416910655224,,0.8567043112604601,0.8567043112604601,0.3862170798273104,0.3862170798273104,,,0.37913657113624777,0.16375058381932991,0.124954113624993,0.9895700232490363,0.124954113624993
0.1360208182143068,0.1371916847426219,0.9877142074733007,0.3691760973930316,0.059416310430947,0.052638536404058425,0.09881956970983648,0.00022493105076948206,0.013692191321252392,0.7596404976074269,0.00018480239815870547,0.00244430812342222,0.26713524977073594,,0.7596404976074269,0.00019845274034122604,0.03409841550116961,8.594784478452538e-05,8.594784478452538e-05,0.009246619827722962,0.6475336537278183,0.009246619827722962,,0.7990891524766951,0.7990891524766951,0.34343015939859106,0.34343015939859106,,,0.3577928989507722,0.1360208182143068,0.1252774372188369,0.9712031821385136,0.1252774372188369
0.11760911722534559,0.10785209111295789,0.9892089707168015,0.30312573950306154,0.043629613681967494,0.03998783976267277,0.07724287935273978,0.00016876394258148812,0.009916813816805667,0.7493955268266557,0.0001648117595427038,0.002345917431503464,0.2369277036358224,,0.7493955268266557,0.000176961874554201,0.026500216103104,7.158672718872275e-05,7.158672718872275e-05,0.008909275824738964,0.6448918208872798,0.008909275824738964,,0.7401340054452694,0.7401340054452694,0.30579171091632235,0.30579171091632235,,,0.3383390477949124,0.11760911722534559,0.12576954558540326,0.9472344778314258,0.12576954558540326
0.10617398600966595,0.08917382059328262,0.9880398751486404,0.26030157397970566,0.0337219190487732,0.03216638678797256,0.06056487336217488,0.00012769760164743973,0.007230852586406364,0.7403093298919379,0.00015147450305847863,0.0022636125043864696,0.21013601915147,,0.7403093298919379,0.00016262214815280962,0.021475588234998032,6.149709498888228e-05,6.149709498888228e-05,0.008640896323463352,0.6432296955158447,0.008640896323463352,,0.6816929952512979,0.6816929952512979,0.2726072439371401,0.2726072439371401,,,0.3204599495648079,0.10617398600966595,0.12641613828429787,0.91943719278867,0.12641613828429787
0.09942593344132722,0.07721586782455876,0.9858759533815179,0.23302023135186162,0.027319218153335274,0.027381818523436505,0.04772596906999985,9.753127327915964e-05,0.0053140530082319256,0.7321913147630996,0.00014229426190857342,0.0021937532889473475,0.18637393509778571,,0.7321913147630996,0.00015275169344710235,0.018164090878737636,5.404403206416504e-05,5.404403206416504e-05,0.008426444414765324,0.6423316733628491,0.008426444414765324,,0.6249994672368964,0.6249994672368964,0.24328869664626585,0.24328869664626585,,,0.30389804994494607,0.09942593344132722,0.1272044735413963,0.8891468621933206,0.1272044735413963
0.09557979138174527,0.06955640375392279,0.9846758716629127,0.21617673242293586,0.02304466539032377,0.02445688296274111,0.03787736100874537,7.530644292203381e-05,0.003942742956596979,0.7248843470664066,0.0001358104995605853,0.0021341272228004573,0.16529885230119748,,0.7248843470664066,0.0001457811028190363,0.01599215149767169,4.82985973021587e-05,4.82985973021587e-05,0.008256626504663385,0.6420259740774136,0.008256626504663385,,0.5708451355543555,0.5708451355543555,0.21733634207808641,0.21733634207808641,,,0.28848807908234814,0.09557979138174527,0.12812330802438818,0.8573700531602039,0.12812330802438818
0.09343475256631306,0.0646184671572022,0.984158954840618,0.20616167305140679,0.02006633084304264,0.02266645675141913,0.030345931487349466,5.889006928093732e-05,0.0029589201603638093,0.718261782301557,0.00013111331589831717,0.002082997959875407,0.14660692184581062,,0.718261782301557,0.00014073238679980317,0.014578114896382924,4.370240827572995e-05,4.370240827572995e-05,0.008124201951374092,0.6421800650200687,0.008124201951374092,,0.5197108210220202,0.5197108210220202,0.19432403637981635,0.19432403637981635,,,0.2740828493219502,0.09343475256631306,0.12916286673054952,0.8248681320680527,0.12916286673054952
0.09225365108829388,0.06141842923852867,0.9837329316802946,0.20059810552889365,0.017894410204815723,0.021571266917653195,0.024602193088118222,4.6734898075947806e-05,0.0022507341574455656,0.7122225195200053,0.00012762384878254365,0.0020389318323273046,0.13002866507592145,,0.7122225195200053,0.00013698312408782457,0.013668144238083877,3.991036963913451e-05,3.991036963913451e-05,0.008023247760814313,0.642692965910438,0.008023247760814313,,0.4718578759306616,0.4718578759306616,0.17388686701133632,0.17388686701133632,,,0.2605515386168957,0.09225365108829388,0.1303146694829534,0.7922179699730175,0.1303146694829534
0.09160794804336816,0.059372014289428295,0.983543977379309,0.19803722761882242,0.01624652262709499,0.020903517915951294,0.02023237720652615,3.771801532334021e-05,0.001739164486875779,0.706686493639357,0.00012498328372902433,0.002000930079225832,0.11532508247858632,,0.706686493639357,0.00013414729640758436,0.013093401842044067,3.6707986288373305e-05,3.6707986288373305e-05,0.007949643057371832,0.6434883880811442,0.007949643057371832,,0.42739316790414006,0.42739316790414006,0.15571113541758322,0.15571113541758322,,,0.24782067647306597,0.09160794804336816,0.13157140904764328,0.7598556619652903,0.13157140904764328
0.09125640464339224,0.05808794940604891,0.9834451285121576,0.19746081911352417,0.014945153949507593,0.020498452984329656,0.01691504203604596,3.101536900876482e-05,0.0013677767325017973,0.701590485068968,0.00012294813218813265,0.001968038916698416,0.10228416868912053,,0.701590485068968,0.00013196286817995854,0.012741652933717085,3.395205719489014e-05,3.395205719489014e-05,0.007899516380711395,0.6445088710154272,0.007899516380711395,,0.38631526817464273,0.38631526817464273,0.1395260897303375,0.1395260897303375,,,0.2357948954595677,0.09125640464339224,0.13292682494905905,0.7281088065578951,0.13292682494905905
0.09106538728923441,0.057317263434448144,0.9834754684999415,0.1982043457380676,0.013881425030390098,0.020254149454489355,0.014401543805972031,2.6025397805530635e-05,0.0010967148891594725,0.6968848626037829,0.00012136547703445729,0.0019396412131845167,0.09071791484411337,,0.6968848626037829,0.00013026514998000646,0.012538218203062423,3.1548364404871414e-05,3.1548364404871414e-05,0.007870383339587934,0.6457112132317057,0.007870383339587934,,0.3485480157321038,0.3485480157321038,0.12509723864208616,0.12509723864208616,,,0.2244436717627325,0.09106538728923441,0.1343755615123915,0.6972201163228211,0.1343755615123915
0.0909617681741656,0.05688957025742922,0.9835637086906367,0.19979674846808407,0.012984834744292552,0.020107717282561027,0.012500473314998406,2.2303508173103905e-05,0.000897332066097985,0.6925301676625728,0.00012012361328458933,0.001915072698078528,0.08045957146613396,,0.6925301676625728,0.00012893384368468586,0.01243348160220989,2.942867463431861e-05,2.942867463431861e-05,0.007859603919901205,0.647063063129332,0.007859603919901205,,0.31396466562346914,0.31396466562346914,0.1122207824023265,0.1122207824023265,,,0.21369283553156332,0.0909617681741656,0.13591306462165828,0.6673659548160248,0.13591306462165828
0.09090557703299201,0.05669325357261045,0.9836954830760074,0.20192430958462018,0.012210477689239895,0.020020442704400367,0.011064871939071498,1.9522934690097965e-05,0.000749346681309862,0.6884952290860887,0.00011914772609709375,0.0018938430828441305,0.0713612347142417,,0.6884952290860887,0.00012788836669878038,0.01239442365067269,2.7544336404838393e-05,2.7544336404838393e-05,0.007865260740034973,0.6485400685961442,0.007865260740034973,,0.2824058032389479,0.2824058032389479,0.10071906130493889,0.10071906130493889,,,0.20350471145093832,0.09090557703299201,0.13753554157006673,0.6386699593362442,0.13753554157006673
0.09087512002059792,0.05665379655280519,0.9838579108983035,0.20437517373247102,0.011528977146140033,0.019968702565841042,0.00998233180158275,1.744242626131022e-05,0.0006382773938084213,0.6847552686025326,0.00011838552948107686,0.0018755451031189773,0.0632917391423686,,0.6847552686025326,0.00012707240190885748,0.012399103507682231,2.5859075766384795e-05,2.5859075766384795e-05,0.007885788042096973,0.6501241017020026,0.007885788042096973,,0.25369243772422856,0.25369243772422856,0.09043671902214907,0.09043671902214907,,,0.1938409167108044,0.09087512002059792,0.1392398018953812,0.6112143503662123,0.1392398018953812
0.09085861039488209,0.05672133635423344,0.9840386800308398,0.20700732153292914,0.01092072006178171,0.019938176994928336,0.009167088182948386,1.5883655260277767e-05,0.000553833512402172,0.6812902582754528,0.00011779976575440475,0.001859855175032274,0.05613473589496367,,0.6812902582754528,0.0001264458298105491,0.012432949314090763,2.4344974908857845e-05,2.4344974908857845e-05,0.007919979220885194,0.6518015682675358,0.007919979220885194,,0.22763538536555986,0.22763538536555986,0.08123754298949533,0.08123754298949533,,,0.18467965829234648,0.09085861039488209,0.14102325164426027,0.5850482250129017,0.14102325164426027
0.09084965804674212,0.056862650821478296,0.984230172029331,0.20972732340111228,0.010372323223242016,0.01992024919949723,0.008553884895119948,1.471417602878481e-05,0.000488618045572433,0.6780840245662333,0.00011736143327594262,0.0018464603509187258,0.04978704216210407,,0.6780840245662333,0.00012597745943601665,0.012486286345337458,2.297956407652495e-05,2.297956407652495e-05,0.007966678339406534,0.6535625096015082,0.007966678339406534,,0.20404240452497244,0.20404240452497244,0.07300183943013741,0.07300183943013741,,,0.1759827640594644,0.09084965804674212,0.14288383744954822,0.5601949128028292,0.14288383744954822
0.09084481125519478,0.057055565961611224,0.9844285242829317,0.21247470476961208,0.009874369579724469,0.019909766196748523,0.008093153358623066,1.3835919353295004e-05,0.0004373952829084641,0.6751233990599936,0.00011704930319830725,0.001835121171378631,0.0441571454210812,,0.6751233990599936,0.0001256444548427169,0.012552696523793656,2.174476340476131e-05,2.174476340476131e-05,0.008025040241610834,0.6553994354666907,0.008025040241610834,,0.18272309979047113,0.18272309979047113,0.06562414300396424,0.06562414300396424,,,0.16773250580965937,0.09084481125519478,0.14481991317612294,0.5366572369193557,0.14481991317612294
0.0908421903811533,0.05728508554529064,0.984629463788461,0.2152105481278473,0.009419967504933914,0.019903661289175072,0.007747335614260752,1.3175829090008883e-05,0.00039637432677623217,0.6723973225280782,0.00011684626448516608,0.0018256047594915538,0.039163871659698285,,0.6723973225280782,0.00012542843668123232,0.012627928255782855,2.0625469727154878e-05,2.0625469727154878e-05,0.008094249943563336,0.6573069279955503,0.008094249943563336,,0.16349238767429536,0.16349238767429536,0.05901136380940473,0.05901136380940473,,,0.15989249465215272,0.0908421903811533,0.14683029154185803,0.5144220849715688,0.14683029154185803
0.09084076433360605,0.05754132792287789,0.9848352794599473,0.21791169154866943,0.009003939523193963,0.019900120799330324,0.007488005050864343,1.267980065838438e-05,0.0003629088727466824,0.6698966769397724,0.00011673950768131708,0.0018177481940697886,0.0347352344392122,,0.6698966769397724,0.00012531564160586197,0.01270916658025898,1.9609113989196193e-05,1.9609113989196193e-05,0.008173801186835278,0.6592809202509704,0.008173801186835278,,0.14617296763415275,0.14617296763415275,0.05308120387468255,0.05308120387468255,,,0.1524577394642582,0.09084076433360605,0.14891421543931066,0.49346416021416095,0.14891421543931066
0.09083998990902645,0.057817142240544565,0.9850400769272548,0.2205628618264804,0.008622141094516363,0.019898079095333816,0.007293708822275254,1.230729133960028e-05,0.00033502763647784065,0.6676136041764873,0.00011671802700086139,0.0018113706017094484,0.030807386637412323,,0.6676136041764873,0.00012529426496750803,0.012794557087628132,1.868485347112164e-05,1.868485347112164e-05,0.008263101629263735,0.6613185689134361,0.008263101629263735,,0.1305968295964753,0.1305968295964753,0.04776071500576733,0.04776071500576733,,,0.14538956464087963,0.09083998990902645,0.15107116865886058,0.47374889071162807,0.15107116865886058
0.09083957725135763,0.05810798842529613,0.9852470334138063,0.22315701292613424,0.008271264344702206,0.01989690809300145,0.007148249101029593,1.2028237789738142e-05,0.000311374963350026,0.6655412353839694,0.00011677311038074983,0.0018063462396834355,0.027323700925005506,,0.6655412353839694,0.00012535495944762548,0.012882872033741615,1.7843398723803813e-05,1.7843398723803813e-05,0.008361811292149636,0.6634178299049879,0.008361811292149636,,0.11660620121320232,0.11660620121320232,0.042985211445261844,0.042985211445261844,,,0.13868131857826513,0.09083957725135763,0.15330106516557115,0.4552348781144113,0.15330106516557115
0.0908393471366254,0.05841042636213176,0.9854532880799609,0.2256899684567285,0.007948488038798735,0.019896243361969383,0.0070394337396821926,1.1820104346901806e-05,0.00029093714863787356,0.6636735976454763,0.00011689739340518607,0.0018025498478511073,0.024233949857059286,,0.6636735976454763,0.00012548982850467286,0.012973309001600306,1.7076649889119103e-05,1.7076649889119103e-05,0.008469591923879522,0.665577316930539,0.008469591923879522,,0.10405394167702478,0.10405394167702478,0.03869720415983203,0.03869720415983203,,,0.13230839959803645,0.0908393471366254,0.15560409136847184,0.4378757064332562,0.15560409136847184
0.09083922322869267,0.0587223888841849,0.9856628994363669,0.22816183631808648,0.0076514428550419206,0.01989587170139478,0.006958088188191063,1.1666083798621767e-05,0.0002730073086221452,0.6620053993300814,0.00011708443050877357,0.0017998800058427707,0.021493582514424753,,0.6620053993300814,0.00012569197130039516,0.01306534157545203,1.637748317152599e-05,1.637748317152599e-05,0.008586214905371498,0.6677960397793132,0.008586214905371498,,0.09280368918922913,0.09280368918922913,0.03484553943584428,0.03484553943584428,,,0.12626121217116612,0.09083922322869267,0.15798069178140225,0.4216218584251278,0.15798069178140225
0.09083915684944299,0.05904203666579336,0.9858721199107456,0.23057280103517896,0.007377995331709386,0.01989567175784765,0.006897319444300531,1.1553548168597902e-05,0.0002570445230636466,0.6605318714370735,0.00011732890597179253,0.001798240524525922,0.01906309769513896,,0.6605318714370735,0.00012595568172693808,0.013158627060739402,1.57396405046783e-05,1.57396405046783e-05,0.008711480267283085,0.6700734679812517,0.008711480267283085,,0.08272975041078681,0.08272975041078681,0.03138468915843709,0.03138468915843709,,,0.12051710048970996,0.09083915684944299,0.1604316263796365,0.40642152449500685,0.1604316263796365
0.09083912365981817,0.05936821579284832,0.9860809129960231,0.23292502933942202,0.007126281541799902,0.019895569018938346,0.006851951910541305,1.1473042901197973e-05,0.00024266736455774842,0.6592486929344968,0.00011762615747925166,0.0017975504838035395,0.016907450821693197,,0.6592486929344968,0.00012627596470741721,0.013252946082611117,1.5157573197203027e-05,1.5157573197203027e-05,0.008845260480479051,0.6724092266708463,0.008845260480479051,,0.07371669112435368,0.07371669112435368,0.02827403848484052,0.02827403848484052,,,0.11506295336044643,0.09083912365981817,0.1629578702257905,0.39222216867953513,0.1629578702257905
0.09083909932075994,0.059700178189317984,0.9862903320972389,0.23522163038528,0.006894635417524654,0.019895520796034624,0.006818103416744821,1.1417462205788704e-05,0.0002295903191188588,0.6581516921133141,0.00011797197193191086,0.0017977386925215643,0.01499556398820012,,0.6581516921133141,0.0001266483121356207,0.013348157704260219,1.4626320471790591e-05,1.4626320471790591e-05,0.008987479154351937,0.6748031673164808,0.008987479154351937,,0.06565892285037477,0.06565892285037477,0.02547735368086873,0.02547735368086873,,,0.1098843274369937,0.09083909932075994,0.16556065648729018,0.37897090406578515,0.16556065648729018
0.09083909157651415,0.06003741776231952,0.9865013171061053,0.23746618716274395,0.006681549410281247,0.01989550664733124,0.006792866223510226,1.1381449355415904e-05,0.00021760724393755183,0.6572372945561624,0.0001183626739281712,0.0017987410825020347,0.013299871255966116,,0.6572372945561624,0.00012706879549734078,0.01344417216236323,1.4141454900368192e-05,1.4141454900368192e-05,0.009138099409985077,0.6772554455227054,0.009138099409985077,,0.05846017489404819,0.05846017489404819,0.022962271244122028,0.022962271244122028,,,0.10497098896894093,0.09083909157651415,0.1682414620972154,0.3666153720031996,0.1682414620972154
0.09083908272594753,0.06037942334856272,0.9867119482804212,0.23966186151818322,0.006485632044121435,0.01989551024335928,0.0067740615499763375,1.1360960104003278e-05,0.0002065492918427861,0.6565019631764083,0.0001187951325703744,0.001800501075308794,0.011795927549447036,,0.6565019631764083,0.00012753404523906366,0.013540936605617542,1.3699019378571014e-05,1.3699019378571014e-05,0.009297128241189851,0.6797661108000592,0.009297128241189851,,0.052032932877921975,0.052032932877921975,0.02069987458955067,0.02069987458955067,,,0.10030637612012934,0.09083908272594753,0.17100202209345627,0.3551041234588896,0.17100202209345627
0.09083908272594753,0.060726005601591436,0.9869234284804895,0.24181264307029113,0.006305632649886289,0.019895526846775896,0.006760060161484817,1.1352930629735692e-05,0.0001962962054005444,0.6559424315352086,0.00011926637350574506,0.001802968115184662,0.010462049735530448,,0.6559424315352086,0.0001280408761560316,0.013638419574914459,1.3295436134998495e-05,1.3295436134998495e-05,0.009464605482849628,0.6823354814305773,0.009464605482849628,,0.046297809727870516,0.046297809727870516,0.018664288163713887,0.018664288163713887,,,0.09587989422633578,0.09083908272594753,0.17384422924461998,0.3443871291004968,0.17384422924461998
0.09083908272594753,0.06107696882165737,0.9871350591556972,0.2439220830020057,0.0061403922007014335,0.019895550368282774,0.006749643622902252,1.1355032287314724e-05,0.00018675118938733684,0.6555556478454149,0.0001197738647909595,0.0018060973601961032,0.009279005058284079,,0.6555556478454149,0.00012858659335177923,0.013736604292062676,1.2927493458910103e-05,1.2927493458910103e-05,0.009640611721755935,0.6849638756962951,0.009640611721755935,,0.041182948521890875,0.041182948521890875,0.01683236061704787,0.01683236061704787,,,0.09167975840879815,0.09083908272594753,0.17677027744159227,0.3344159332814758,0.17677027744159227
0.09083908272594753,0.061432106589482255,0.9873450286344724,0.24599345278035328,0.005988837062408404,0.019895576657025755,0.006741900062309498,1.1365489753117025e-05,0.000177836391912285,0.6553386256486564,0.00012031539437875912,0.0018098488135776048,0.008229739266473636,,0.6553386256486564,0.00012916880809871303,0.013835482787421324,1.2592290712380261e-05,1.2592290712380261e-05,0.009825259208779474,0.6876516543168523,0.009825259208779474,,0.03662346431799527,0.03662346431799527,0.015183363059568593,0.015183363059568593,,,0.08769426781001413,0.09083908272594753,0.17978254698428833,0.3251438634088454,0.17978254698428833
0.09083908272594753,0.06179186089396188,0.9875613934743679,0.24803226023216088,0.00585003530961882,0.01989560571300484,0.006736150795742342,1.1382938326224243e-05,0.00016949743072939953,0.6552886491343517,0.0001208883622628277,0.001814185663634267,0.007299123897822597,,0.6552886491343517,0.00012978474334036076,0.013935053383171274,1.2287141384102864e-05,1.2287141384102864e-05,0.010018686711505374,0.6903992487412299,0.010018686711505374,,0.03256083504221441,0.03256083504221441,0.013698719802283437,0.013698719802283437,,,0.08391661398855783,0.09083908272594753,0.18288364759912124,0.31652632282508036,0.18288364759912124
0.09083908272594753,0.06215566214865515,0.9877744200898038,0.25003964531656614,0.005723027902222167,0.019895636152601974,0.006731888101046583,1.1406337898934111e-05,0.00016167541224439266,0.6554030678206965,0.00012149150927780263,0.0018190770055294177,0.006473742183263845,,0.6554030678206965,0.00013043305514744326,0.01403531859604122,1.2009718635055224e-05,1.2009718635055224e-05,0.010221078251796795,0.69320712578308,0.010221078251796795,,0.028942368553593206,0.028942368553593206,0.01236178569014394,0.01236178569014394,,,0.0803329207152387,0.09083908272594753,0.18607646145647022,0.3085206571953837,0.18607646145647022
0.09083908272594753,0.0625236522894099,0.9879860133388876,0.25201941816972173,0.00560699205153777,0.01989566797581716,0.006728732872646034,1.1434875749916894e-05,0.00015432974256598578,0.6556793712161223,0.00012212297049768748,0.0018244937875583768,0.005741693954679347,,0.6556793712161223,0.00013111174144066993,0.014136283459488554,1.1757830280263842e-05,1.1757830280263842e-05,0.01043263778518241,0.6960758724959338,0.01043263778518241,,0.02572069414684418,0.02572069414684418,0.01115763015391518,0.01115763015391518,,,0.07693476689094869,0.09083908272594753,0.18936405713574408,0.3010864042624745,0.18936405713574408
0.09083908272594753,0.0628963604796346,0.9882038966799839,0.2539766706460575,0.0055011982522053336,0.0198956984154143,0.006726403122902269,1.1467915953358596e-05,0.00014742899657424366,0.6561152448153916,0.00012278078570829615,0.00183040944816258,0.0050924253797774285,,0.6561152448153916,0.00013181870698435213,0.014237954684789798,1.1529456314170783e-05,1.1529456314170783e-05,0.01065359758456691,0.699006005203982,0.01065359758456691,,0.02285327137183614,0.02285327137183614,0.010072862247718271,0.010072862247718271,,,0.07371568899922079,0.09083908272594753,0.19274976132116164,0.29418518288857426,0.19274976132116164
0.09083908272594753,0.06327335516087453,0.9884198912036918,0.2559124562868013,0.005404888090921553,0.01989573162224753,0.00672468737306045,1.1504969878043497e-05,0.0001409359856913106,0.6567083927786317,0.00012346397480253565,0.0018368019427926958,0.004516576014664808,,0.6567083927786317,0.00013255288901599217,0.01434033856376669,1.132283137883596e-05,1.132283137883596e-05,0.010884232234275091,0.7019981180336904,0.010884232234275091,,0.020301941948578837,0.020301941948578837,0.009095466421101888,0.009095466421101888,,,0.07066438217154795,0.09083908272594753,0.19623717314090797,0.2877807336054489,0.19623717314090797
0.09083908272594753,0.06365484447619742,0.9886358034263915,0.25783008324566703,0.005317411684033657,0.019895764829080776,0.006723429507061114,1.1545645421706484e-05,0.0001348257870246252,0.6574566965869354,0.0001241712241646493,0.0018436503464999714,0.004005843480621247,,0.6574566965869354,0.00013331289577499884,0.014443442227150537,1.113630165087298e-05,1.113630165087298e-05,0.011124841346937383,0.7050527768197882,0.011124841346937383,,0.01803250480277569,0.01803250480277569,0.008214656812387457,0.008214656812387457,,,0.06777418978723616,0.09083908272594753,0.19983017850629037,0.2818387968535476,0.19983017850629037
0.09083908272594753,0.06404092869136917,0.9888517476404637,0.25973238175082813,0.005238158311253344,0.01989579803591401,0.006722511795601356,1.158963416591301e-05,0.00012907306306733773,0.6583580563867606,0.00012490133588596782,0.0018509365333371013,0.00355286453904534,,0.6583580563867606,0.00013409743056766983,0.014547273225127423,1.096835390740397e-05,1.096835390740397e-05,0.011375755033310125,0.7081705969075435,0.011375755033310125,,0.016014347666571064,0.016014347666571064,0.00742074545231699,0.00742074545231699,,,0.06503712859635925,0.09083908272594753,0.20353284973764577,0.27632720696703555,0.20353284973764577
0.09083908272594753,0.06443177256799913,0.9890686147359841,0.26162215230024555,0.00516656600960749,0.0198958298591292,0.006721848434840646,1.1636687053974438e-05,0.00012365629786189594,0.6594105683108955,0.0001256532209586101,0.0018586437865092337,0.003151107966953363,,0.6594105683108955,0.0001349053430269424,0.014651842044066913,1.0817603365821601e-05,1.0817603365821601e-05,0.011637338139736064,0.7113524270490503,0.011637338139736064,,0.014220078603544108,0.014220078603544108,0.006705033538506128,0.006705033538506128,,,0.062446280094659454,0.09083908272594753,0.20734964631252611,0.27121569223945097,0.20734964631252611
0.09083908272594753,0.064827431869891,0.9892855217721197,0.2635016702783946,0.005102106954543662,0.019895865833198544,0.006721374275439856,1.1686607319441386e-05,0.00011855516686002697,0.6606124124862706,0.00012642594011327862,0.0018667577828503405,0.002794782144855957,,0.6606124124862706,0.0001357356072814326,0.014757152878516836,1.0682786066240157e-05,1.0682786066240157e-05,0.011909990481633206,0.7145988330790378,0.011909990481633206,,0.01262521745416864,0.01262521745416864,0.006059706435736333,0.006059706435736333,,,0.059994645134665125,0.09083908272594753,0.21128528581329348,0.26647588850535564,0.21128528581329348
0.09083908272594753,0.06522788448593854,0.9895001950826208,0.26537269951169046,0.005044284277976383,0.019895900423649828,0.006721040106179154,1.1739229645961212e-05,0.0001137508983829693,0.6619618716993219,0.00012721874465705508,0.0018752654732226383,0.0024787492345540603,,0.6619618716993219,0.00013658743578127378,0.014863216634301537,1.0562750276365563e-05,1.0562750276365563e-05,0.012194145389690823,0.717910593020259,0.012194145389690823,,0.011207892107621811,0.011207892107621811,0.0054777396340454625,0.0054777396340454625,,,0.057675503746095674,0.09083908272594753,0.21534481562290061,0.2620812354660875,0.21534481562290061
0.09083908272594753,0.06563384565107525,0.9897221525997684,0.26723985819086393,0.004992694137359288,0.01989593501410112,0.006720811614657196,1.1794430773228385e-05,0.00010922915107335564,0.6634572567345336,0.00012803046390646728,0.001884156317937918,0.0021984531497890635,,0.6634572567345336,0.00013745957177686735,0.014970039183787972,1.04563977826742e-05,1.04563977826742e-05,0.012490280824396904,0.7212884141661251,0.012490280824396904,,0.00994857818172383,0.00994857818172383,0.004952821410252429,0.004952821410252429,,,0.055483933183905786,0.09083908272594753,0.2195336416032031,0.25800685909169746,0.2195336416032031
0.09083908272594753,0.06604478643293954,0.9899410625588749,0.26910264089262953,0.004946869500158947,0.01989597098817046,0.006720660850422563,1.1852096688939247e-05,0.00010497167344946664,0.6650970743627201,0.00012886074393395384,0.0018934194877560963,0.0019498528907807165,,0.6650970743627201,0.00013835162709047936,0.015077628496617014,1.0362777765148645e-05,1.0362777765148645e-05,0.012798901047212655,0.7247332867274129,0.012798901047212655,,0.008829856723489468,0.008829856723489468,0.004479276449006504,0.004479276449006504,,,0.05341269569005234,0.09083908272594753,0.22385749941664726,0.2542295522734642,0.22385749941664726
0.09083908272594753,0.0664609233476587,0.9901581307323944,0.2709633090918398,0.0049064317487838545,0.019896008345857856,0.006720568806288732,1.191214143229943e-05,0.00010096489783849831,0.6668798313546958,0.0001297089245284868,0.0019030465663693722,0.0017293644609854481,,0.6668798313546958,0.00013926290955943864,0.015185992961884312,1.0280988082518345e-05,1.0280988082518345e-05,0.013120563149696585,0.7282459179975336,0.013120563149696585,,0.007836190875650092,0.007836190875650092,0.004052003126388933,0.004052003126388933,,,0.051456650952969266,0.09083908272594753,0.22832258357867508,0.25072760135688765,0.22832258357867508
0.09083908272594753,0.06688263127384193,0.9903774494815119,0.2728248566677672,0.004871042709665452,0.019896042936309147,0.006720520176556494,1.197449760867644e-05,9.719625432137942e-05,0.668804305129065,0.00013057424338454939,0.0019130306817466056,0.0015338086075042411,,0.668804305129065,0.00014019258414748218,0.015295140129775954,1.0210185394243482e-05,1.0210185394243482e-05,0.013455866044803035,0.7318272274579225,0.013455866044803035,,0.006953733337803974,0.006953733337803974,0.0036664103619330505,0.0036664103619330505,,,0.04961092696419612,0.09083908272594753,0.2329354184053192,0.24748087567142296,0.2329354184053192
0.09083908272594753,0.06730987695382919,0.9905962282308015,0.2746883091562215,0.0048403591424328735,0.019896080293996542,0.006720504169612383,1.2039103304532896e-05,9.365280984876065e-05,0.6708691984429725,0.0001314562444800913,0.0019233650776774055,0.0013603661782111247,,0.6708691984429725,0.00014114017810091536,0.01540507629211368,1.0149612246416456e-05,1.0149612246416456e-05,0.013805456303293643,0.7354782053193558,0.013805456303293643,,0.006170145408596548,0.006170145408596548,0.0033183718196499352,0.0033183718196499352,,,0.047870283253756786,0.09083908272594753,0.23770310177885687,0.2444705082364443,0.23770310177885687
0.09083908272594753,0.06774298192527417,0.990817515408574,0.276556187822371,0.0048140881057756576,0.019896117651683934,0.006720512649267334,1.2105919026161311e-05,9.032359986507943e-05,0.6730733073803878,0.0001323543696985735,0.0019340455267044137,0.0012065364826588036,,0.6730733073803878,0.00014210508388879124,0.015515808999083577,1.0098557439852662e-05,1.0098557439852662e-05,0.014170033827791204,0.7391997003339275,0.014170033827791204,,0.005474438906990573,0.005474438906990573,0.003004172275722726,0.003004172275722726,,,0.04623030176673917,0.09083908272594753,0.24263307572131224,0.2416789822375263,0.24263307572131224
0.09083908272594753,0.06818172790956527,0.9910356661248764,0.2784286216361675,0.004791921568012525,0.019896156392989375,0.006720539736369349,1.2174897986368432e-05,8.71971031232704e-05,0.6754157266711172,0.00013326831956282867,0.0019450662570936106,0.0010701018597686946,,0.6754157266711172,0.00014308698861544106,0.015627347059236078,1.0056383841690566e-05,1.0056383841690566e-05,0.014550342852064647,0.7429929856297783,0.014550342852064647,,0.0048568307402663815,0.0048568307402663815,0.0027204711661167045,0.0027204711661167045,,,0.04468614405751994,0.09083908272594753,0.24773344185589058,0.23909001660738632,0.24773344185589058
0.09083908272594753,0.06862680319518379,0.9912593233187037,0.2803094226603437,0.004773635961124117,0.019896193750676774,0.00672058043603422,1.22460314229464e-05,8.426444030885996e-05,0.6778953830566831,0.0001341974610870259,0.00195642711441733,0.0009490951113695585,,0.6778953830566831,0.0001440852042249282,0.015739696344938138,1.0022473440847966e-05,1.0022473440847966e-05,0.014947216104836016,0.7468589099590025,0.014947216104836016,,0.004308613173685281,0.004308613173685281,0.002464260173796946,0.002464260173796946,,,0.043234200478508227,0.09083908272594753,0.2530127749979491,0.23668844453944626,0.2530127749979491
0.09083908272594753,0.06907776947688626,0.9914795208377388,0.28219769997799626,0.004758947518581983,0.01989623249198222,0.00672063176882241,1.231927975851377e-05,8.151517624825194e-05,0.6805115299224931,0.0001351416377262822,0.0019681226937072597,0.0008417718245366876,,0.6805115299224931,0.00014509957138186453,0.015852862728556717,9.996287523529334e-06,9.996287523529334e-06,0.015361504499389923,0.7507987464497408,0.015361504499389923,,0.0038220402342587297,0.0038220402342587297,0.0022328325255317467,0.0022328325255317467,,,0.0418699528500596,0.09083908272594753,0.25848026654655804,0.23446018501968977,0.25848026654655804
0.09083908272594753,0.06953492944367476,0.9916985452219471,0.28409550228882974,0.004747644458821183,0.01989627123328766,0.006720691559925316,1.2394636933844475e-05,7.894106752034084e-05,0.6832634206539542,0.00013610051597193407,0.0019801526088942343,0.0007465846249306851,,0.6832634206539542,0.00014612973220936348,0.01596685501864225,9.977316708932347e-06,9.977316708932347e-06,0.015794165120496393,0.754813697500793,0.015794165120496393,,0.0033902205494113296,0.0033902205494113296,0.0020237517393741724,0.0020237517393741724,,,0.040589906774663086,0.09083908272594753,0.26414586787606165,0.2323922115948186,0.26414586787606165
0.09083908272594753,0.06999872633494875,0.9919211649225592,0.28600537569481593,0.004739538739095319,0.01989631274182921,0.006720757701766991,1.247210768400534e-05,7.653430303397493e-05,0.6861503646325681,0.00013707363980193125,0.001992518211220332,0.0006621611235560969,,0.6861503646325681,0.00014717519875557202,0.016081679926471255,9.965074972911612e-06,9.965074972911612e-06,0.01624623317817756,0.7589049655109588,0.01624623317817756,,0.003007025955671606,0.003007025955671606,0.0018348232866047163,0.0018348232866047163,,,0.03939072087887473,0.09083908272594753,0.27002016128367334,0.23047233165448539,0.27002016128367334
0.09083908272594753,0.07046879697072474,0.9921396315691173,0.2879265524874801,0.004734405521511714,0.01989635425037076,0.006720828206289978,1.2551670220216354e-05,7.428668780295044e-05,0.6891718298954376,0.00013806094115328114,0.0020052164121322313,0.0005872842236306565,,0.6891718298954376,0.00014823588630035167,0.016197343743865476,9.959142609999772e-06,9.959142609999772e-06,0.01671878818548408,0.7630739650670614,0.01671878818548408,,0.0026670089462538264,0.0026670089462538264,0.0016640717999981541,0.0016640717999981541,,,0.03826876794266869,0.09083908272594753,0.27611458941597344,0.2286893457848361,0.27611458941597344
0.09083908272594753,0.07094603122824172,0.9923650229299751,0.2898632954206903,0.004732116688245648,0.01989639575891231,0.0067209028194520435,1.2633366889426969e-05,7.219202651656359e-05,0.6923274711333134,0.00013906195039133497,0.0020182541608749056,0.0005208743278033336,,0.6923274711333134,0.00014931130102732168,0.016313854440465778,9.959098304766007e-06,9.959098304766007e-06,0.017213070805250745,0.7673220400265829,0.017213070805250745,,0.0023653270018726595,0.0023653270018726595,0.001509717304925814,0.001509717304925814,,,0.03722139277659797,0.09083908272594753,0.28244136923397256,0.22703280347000107,0.28244136923397256
0.09083908272594753,0.07142988356845742,0.9925870353354742,0.29181390922095835,0.004732462461052697,0.019896435883835807,0.0067209808163111815,1.2717177180175524e-05,7.024295453623798e-05,0.6956168870408518,0.00014007664029089576,0.0020316283688950327,0.0004619740893877181,,0.6956168870408518,0.00015040141389151526,0.016431217049729552,9.964583585645857e-06,9.964583585645857e-06,0.01773033769553909,0.7716508171643702,0.01773033769553909,,0.002097677018165751,0.002097677018165751,0.0013701576451652152,0.0013701576451652152,,,0.036245270701521344,0.09083908272594753,0.28901377879623386,0.22549302472326724,0.28901377879623386
0.09083908272594753,0.07192072291361208,0.9928085605373095,0.29378044800010206,0.00473530530350773,0.019896477392377352,0.006721060908881529,1.2803125834528957e-05,6.843373107432854e-05,0.6990400029565939,0.0001411048066629858,0.002045343475988013,0.00040973425169834856,,0.6990400029565939,0.00015150601493788465,0.016549438702388106,9.97525062297313e-06,9.97525062297313e-06,0.01827200319219079,0.7760617110672464,0.01827200319219079,,0.0018602355321977848,0.0018602355321977848,0.0012439483955471457,0.0012439483955471457,,,0.03533787601215062,0.09083908272594753,0.2958460138673118,0.22406103899630989,0.2958460138673118
0.09083908272594753,0.0724185643945328,0.9930278243079386,0.29576342062011673,0.004740498447023096,0.019896521668155,0.006721143323864486,1.2891231736917574e-05,6.675858013795142e-05,0.7025965575654316,0.00014214629976902143,0.002059402184638003,0.00036340167891832267,,0.7025965575654316,0.00015262492697082738,0.016668527368082314,9.990783928559102e-06,9.990783928559102e-06,0.018839585294204878,0.7805564899687405,0.018839585294204878,,0.0016496056757749874,0.0016496056757749874,0.0011297888397667983,0.0011297888397667983,,,0.034496602236906856,0.09083908272594753,0.302953503379187,0.22272855152345727,0.302953503379187
0.09083908272594753,0.0729237387859226,0.9932473541866874,0.29776462586879854,0.004747924151447571,0.019896564560314602,0.0067212276053744075,1.2981528685303564e-05,6.521239033967037e-05,0.7062867468536962,0.00014320092903262338,0.002073810092847897,0.0003223083677920976,,0.7062867468536962,0.00015375795153450885,0.01678848766081477,1.0010884023800586e-05,1.0010884023800586e-05,0.0194347498552797,0.7851369928317228,0.0194347498552797,,0.001462770722184708,0.001462770722184708,0.0010265065707688959,0.0010265065707688959,,,0.033719150725831495,0.09083908272594753,0.31035288075295364,0.22148786931847503,0.31035288075295364
0.09083908272594753,0.07343658144557468,0.9934695333987513,0.2997857500244421,0.0047574756750795675,0.019896610219710308,0.006721313257673827,1.3074065682684977e-05,6.379044713172922e-05,0.710110636150164,0.0001442685447152081,0.002088575308070164,0.0002858618539291068,,0.710110636150164,0.00015490493884891973,0.01690932671131679,1.003527756898102e-05,1.003527756898102e-05,0.020059326523539638,0.7898049878897223,0.020059326523539638,,0.0012970511606967491,0.0012970511606967491,0.0009330450128339557,0.0009330450128339557,,,0.03300339178804905,0.09083908272594753,0.31806217030784917,0.22033186543413177,0.31806217030784917
0.09083908272594753,0.0739568567131357,0.9936888078306423,0.30182621422292316,0.004769018612038714,0.01989665449548796,0.006721400198505257,1.316885632979237e-05,6.248807938358239e-05,0.7140685614314021,0.0001453491127852792,0.00210369976065063,0.0002535367215357135,,0.7140685614314021,0.00015606583401486828,0.017031052489229242,1.0063716877627349e-05,1.0063716877627349e-05,0.020715239899501095,0.7945625262936327,0.020715239899501095,,0.0011500681807571323,0.0011500681807571323,0.0008484519677442475,0.0008484519677442475,,,0.03234717885862092,0.09083908272594753,0.32610091631365934,0.21925394441556925,0.32610091631365934
0.09083908272594753,0.07448521776211911,0.9939119824717829,0.30388893744607964,0.004782483129074099,0.01989670015488366,0.006721488751834941,1.326598197265644e-05,6.130159423544009e-05,0.7181609520008011,0.00014644246308535535,0.002119196576940911,0.00022486689474223904,,0.7181609520008011,0.00015724047318152159,0.017153669189099947,1.0095961759820476e-05,1.0095961759820476e-05,0.021404696338753474,0.79941180065303,0.021404696338753474,,0.0010197093280434185,0.0010197093280434185,0.0007718688795687213,0.0007718688795687213,,,0.03174884506118616,0.09083908272594753,0.33449038373890366,0.21824797053366365,0.33449038373890366
0.09083908272594753,0.07502151593060957,0.9941346308925769,0.30597362930882316,0.0047977584455332414,0.019896745814279363,0.006721577868712879,1.3365473663295193e-05,6.0227044714151535e-05,0.722388395817353,0.00014754858200283794,0.0021350707758401545,0.00019943903235832716,,0.722388395817353,0.00015842882309247133,0.017277183941660217,1.0131803051151969e-05,1.0131803051151969e-05,0.02213000974808782,0.8043550743068314,0.02213000974808782,,0.0009040995022818751,0.0009040995022818751,0.0007025215792227078,0.0007025215792227078,,,0.031206560831459288,0.09083908272594753,0.3432536299466163,0.21730836443213777,0.3432536299466163
0.09083908272594753,0.07556562808188096,0.9943524867981246,0.30807991642501886,0.004814739670366801,0.01989679285729312,0.006721668907074107,1.3467367520599884e-05,5.9261052509755876e-05,0.7267515088380969,0.0001486674763440263,0.0021513279553512553,0.00017688655096944684,,0.7267515088380969,0.00015963091178643275,0.017401601360912653,1.0171043410929455e-05,1.0171043410929455e-05,0.022893716231981522,0.8093947520526362,0.022893716231981522,,0.0008015741141765375,0.0008015741141765375,0.000639712254217214,0.000639712254217214,,,0.030718764358346085,0.09083908272594753,0.3524158918515608,0.21642981133788206,0.3524158918515608
0.09083908272594753,0.07611813984021117,0.9945713815901435,0.31021041926374276,0.0048333764528423915,0.019896841283924924,0.006721760120367362,1.3571761535362478e-05,5.84008867060012e-05,0.7312512523293209,0.00014979902359553375,0.002167984137344569,0.00015688430702531827,,0.7312512523293209,0.00016084659526534025,0.01752693109431726,1.0213493757301062e-05,1.0213493757301062e-05,0.023698695945758196,0.8145334508760678,0.023698695945758196,,0.0007106558920658126,0.0007106558920658126,0.0005828113943198915,0.0005828113943198915,,,0.030284216482819606,0.09083908272594753,0.36200465761601114,0.21560750548508895,0.36200465761601114
0.09083908272594753,0.07667918962428083,0.9947908758509688,0.3123658424831733,0.004853595228757521,0.019896888326938682,0.006721852542571335,1.3678726635697949e-05,5.764392360995282e-05,0.7358886995495021,0.0001509432305636596,0.002185050324791302,0.00013914388887900398,,0.7358886995495021,0.00016207588259818274,0.0176531764975123,1.025898596907064e-05,1.025898596907064e-05,0.024548046600183407,0.8197739292214313,0.024548046600183407,,0.0006300335372632761,0.0006300335372632761,0.0005312510650652929,0.0005312510650652929,,,0.02990169475998144,0.09083908272594753,0.37204999645034187,0.21483695996825905,0.37204999645034187
0.09083908272594753,0.07724889910917904,0.9950100734430515,0.31454677586431756,0.00487532667240619,0.019896938137188538,0.006721946577368943,1.378834633409476e-05,5.698790728827828e-05,0.7406650077512593,0.00015210007002320675,0.002202539837077654,0.00012340955249253043,,0.7406650077512593,0.00016331875453441606,0.017780344281774288,1.0307360872035865e-05,1.0307360872035865e-05,0.025445200206521787,0.8251192991797378,0.025445200206521787,,0.000558543645674809,0.000558543645674809,0.0004845192753531969,0.0004845192753531969,,,0.02957015896349292,0.09083908272594753,0.3825849744485558,0.21411400632495675,0.3825849744485558
0.09083908272594753,0.07782741735808676,0.9952286479568222,0.31675396313345905,0.004898511172765591,0.019896986563820343,0.0067220406924135764,1.3900707483559573e-05,5.643094482346549e-05,0.745581548838907,0.00015326956239307304,0.002220466765728154,0.00010945445445514478,,0.745581548838907,0.00016457521363394856,0.017908441577834534,1.0358477129427894e-05,1.0358477129427894e-05,0.026393935496346013,0.8305726021126573,0.026393935496346013,,0.0004951538300108556,0.0004951538300108556,0.000442153936342614,0.000442153936342614,,,0.02928874093025482,0.09083908272594753,0.3936458553364696,0.21343486729386624,0.3936458553364696
0.09083908272594753,0.07841496931109662,0.9954469144687168,0.31898829495415115,0.004923095024249325,0.019897039141306302,0.006722135695050146,1.401591411553928e-05,5.597154798131939e-05,0.7506400026952786,0.0001544517144795577,0.0022388477117169037,9.707738920702106e-05,,0.7506400026952786,0.0001658452870724993,0.01803747048296695,1.0412196991911366e-05,1.0412196991911366e-05,0.027398443850999942,0.8361373744872477,0.027398443850999942,,0.00043894793748753007,0.00043894793748753007,0.0004037379864381878,0.0004037379864381878,,,0.029056759382607416,0.09083908272594753,0.4052725163072411,0.21279589200679133,0.4052725163072411
0.09083908272594753,0.07901167654564804,0.9956642452690632,0.3212503525959271,0.0049490263563494,0.019897090335174214,0.0067222319066553545,1.413407783356792e-05,5.5608547377794004e-05,0.7558422078588092,0.00015564656031415698,0.0022577002411909197,8.609991706050246e-05,,0.7558422078588092,0.00016712900176206076,0.018167440644631532,1.0468399998485566e-05,1.0468399998485566e-05,0.02846337885409198,0.841817435687932,0.02846337885409198,,0.00038911333473419843,0.00038911333473419843,0.0003688952715462726,0.0003688952715462726,,,0.028873680254521757,0.09083908272594753,0.4175091363008628,0.21219387051145588,0.4175091363008628
0.09083908272594753,0.07961781051796667,0.9958815458084254,0.3235411980714438,0.004976264747707509,0.019897141529042123,0.006722328911164935,1.4255328280703556e-05,5.5341223090535856e-05,0.7611901428581694,0.0001568541407346665,0.0022770452018851216,7.636377420858556e-05,,0.7611901428581694,0.00016842640341705226,0.0182983566768309,1.052697089325643e-05,1.052697089325643e-05,0.029593927086432784,0.8476166050991328,0.029593927086432784,,0.0003449289800251309,0.0003449289800251309,0.00033728615442413397,0.00033728615442413397,,,0.02873919747022542,0.09083908272594753,0.4304044541089719,0.21162569912339582,0.4304044541089719
0.09083908272594753,0.08023344542332456,0.9960973520588696,0.32586110010277064,0.005004762712052051,0.019897195490146135,0.006722426815709295,1.4379797832240248e-05,5.516914481422077e-05,0.7666861035332323,0.00015807451019148025,0.0022969036345690114,6.772858924127638e-05,,0.7666861035332323,0.00016973754732563752,0.018430221935203297,1.0587805910720188e-05,1.0587805910720188e-05,0.030795853572199612,0.8535394093986847,0.030795853572199612,,0.000305755260448039,0.000305755260448039,0.00030860409311348245,0.00030860409311348245,,,0.028653130470328504,0.09083908272594753,0.44401258570674923,0.21108856485747107,0.44401258570674923
0.09083908272594753,0.08085891691522241,0.9963134908809121,0.3282113790309021,0.005034492233973544,0.019897249451250147,0.0067225252042161215,1.450765357979378e-05,5.509248497999459e-05,0.7723328150272613,0.00015930772313499234,0.002317302371049569,6.0069869388873416e-05,,0.7723328150272613,0.00017106249380800223,0.018563043969934825,1.0650807968445639e-05,1.0650807968445639e-05,0.03207566513285596,0.8595905874524452,0.03207566513285596,,0.00027102485682611643,0.00027102485682611643,0.00028257246092001123,0.00028257246092001123,,,0.028615603280079432,0.09083908272594753,0.45839384158481744,0.2105798598355502,0.45839384158481744
0.09083908272594753,0.08149421167389455,0.9965271467366708,0.330591827675098,0.005065406778749487,0.019897304795972213,0.006722625205437906,1.4639041048067392e-05,5.5111548228924275e-05,0.7781330584796146,0.00016055386804709305,0.0023382643824421227,5.327719519060337e-05,,0.7781330584796146,0.0001724013484081083,0.018696825297754172,1.0715889398212645e-05,1.0715889398212645e-05,0.03344056407754479,0.8657751610436369,0.03344056407754479,,0.00024023448111532505,0.00024023448111532505,0.0002589414136856915,0.0002589414136856915,,,0.02862679007623711,0.09083908272594753,0.47361537201126636,0.21009712575549477,0.47361537201126636
0.09083908272594753,0.0821398569293931,0.9967426493215149,0.3330044865792952,0.0050974971941623,0.01989736014069428,0.006722725932334139,1.4774198645901285e-05,5.522763647512876e-05,0.7840900163349941,0.00016181302660337352,0.0023598278895940253,4.7252629718767224e-05,,0.7840900163349941,0.00017375418881986833,0.01883157514666656,1.0782968501449636e-05,1.0782968501449636e-05,0.03489884712406946,0.8720987885195529,0.03489884712406946,,0.00021293776007400315,0.00021293776007400315,0.0002374853998992268,0.0002374853998992268,,,0.028687371359269985,0.09083908272594753,0.4897523858599229,0.20963810539826516,0.4897523858599229
0.09083908272594753,0.0827955089045449,0.9969528066219479,0.3354478033325918,0.005130703762177412,0.019897415485416344,0.006722826901543212,1.4913255987140872e-05,5.5441677732035545e-05,0.7902073750029515,0.00016308531451092112,0.0023820137402401956,4.1909322435384654e-05,,0.7902073750029515,0.0001751211394746743,0.01896729393612677,1.0851973748665315e-05,1.0851973748665315e-05,0.03645957786500261,0.878567552603533,0.03645957786500261,,0.00018873884119352782,0.00018873884119352782,0.0002180008538399791,0.0002180008538399791,,,0.02879781993341344,0.09083908272594753,0.506889369438621,0.20920073024606675,0.506889369438621
0.09083908272594753,0.08346221094263319,0.9971687604321819,0.3379258047974146,0.00516505458912887,0.01989747359737451,0.006722928596441666,1.505658532098353e-05,5.575665894790568e-05,0.7964889888813221,0.0001643708270579254,0.0024048811959974897,3.7170231054369144e-05,,0.7964889888813221,0.00017650230288018647,0.019103987538501756,1.0922835846149933e-05,1.0922835846149933e-05,0.03813358377761293,0.8851883140416699,0.03813358377761293,,0.000167286587338609,0.000167286587338609,0.00020030391489580992,0.00020030391489580992,,,0.02895965857706093,0.09083908272594753,0.5251215060656566,0.20878303177643173,0.5251215060656566
0.09083908272594753,0.08413941521517802,0.9973807045727596,0.3404359880420348,0.005200481844862994,0.019897531709332675,0.006723031500414589,1.5204341412768928e-05,5.6174381762265193e-05,0.8029393469903453,0.00016566970037037158,0.002428454772257896,3.2967036503662246e-05,,0.8029393469903453,0.00017789782539791567,0.019241661406703692,1.0995493715477801e-05,1.0995493715477801e-05,0.039932545385711865,0.8919682872267621,0.039932545385711865,,0.00014826962515197766,0.00014826962515197766,0.00018422860550994322,0.00018422860550994322,,,0.0291737758944589,0.09083908272594753,0.5445562963944293,0.20838315102748964,0.5445562963944293
0.09083908272594753,0.08482748182940358,0.9975905878736936,0.34297954015714066,0.00523697636273104,0.019897591204908895,0.006723135371789171,1.5356839375411187e-05,5.669845338060871e-05,0.8095634703131572,0.00016698210460574102,0.0024527848510474703,2.9239140644493175e-05,,0.8095634703131572,0.0001793078899354848,0.01938031805746128,1.1069893400016247e-05,1.1069893400016247e-05,0.04187018888062662,0.8989156060330432,0.04187018888062662,,0.00013141183087773907,0.00013141183087773907,0.00016962515227541476,0.00016962515227541476,,,0.029441980368689478,0.09083908272594753,0.5653159960699814,0.2079993809463566,0.5653159960699814
0.09083908272594753,0.08552671412901945,0.9977996190318056,0.34555738825417026,0.005274528084462567,0.019897650700485114,0.006723240372610367,1.551443782773455e-05,5.733308499273002e-05,0.8163666504806845,0.00016830817589001893,0.0024779287636372415,2.5932789658865777e-05,,0.8163666504806845,0.00018073265371281564,0.019519962943686686,1.1145984824690504e-05,1.1145984824690504e-05,0.04396228773925473,0.9060392530868407,0.04396228773925473,,0.00011646831679170592,0.00011646831679170592,0.00015635828072012138,0.00015635828072012138,,,0.02976637727004475,0.09083908272594753,0.5875397809415723,0.20763017413305565,0.5875397809415723
0.09083908272594753,0.08623716393873054,0.9980059327204409,0.34816941794601164,0.005313113627036322,0.01989771296329744,0.006723345453757309,1.5677488133809922e-05,5.80830771048196e-05,0.823355149722824,0.00016964810479958443,0.002503942683090744,2.3000321572733573e-05,,0.823355149722824,0.00018217229995068016,0.019660596065379916,1.1223724031835957e-05,1.1223724031835957e-05,0.04622690160871127,0.9133491304959175,0.04622690160871127,,0.00010322197074276996,0.00010322197074276996,0.00014430603418934677,0.00014430603418934677,,,0.030149355339255182,0.09083908272594753,0.6113870163902719,0.20727402370191753,0.6113870163902719
0.09083908272594753,0.0869588554795085,0.9982071384418539,0.35081519226422686,0.005352709163503288,0.01989777522610976,0.00672345142268504,1.5846367603527276e-05,5.895406855962204e-05,0.8305358182284647,0.0001710020819108168,0.0025308868361977443,2.0399455157737454e-05,,0.8305358182284647,0.0001836270552863382,0.01980222329490792,1.1303072195216787e-05,1.1303072195216787e-05,0.04868490547112302,0.9208564842255181,0.04868490547112302,,9.148021380152985e-05,9.148021380152985e-05,0.00013335839306918842,0.00013335839306918842,,,0.030593705117944764,0.09083908272594753,0.6370410428661758,0.20692948592381857,0.6370410428661758
0.09083908272594753,0.08769309687905671,0.998417661864843,0.3534996002046108,0.005393372707877886,0.01989783610530403,0.006723558197021629,1.6021874692252674e-05,5.995526923683422e-05,0.8379161874723112,0.00017237031141269368,0.00255888843274817,1.8092692240855908e-05,,0.8379161874723112,0.00018509711721988195,0.019944845051725488,1.1383994588506811e-05,1.1383994588506811e-05,0.051361798520324214,0.9285736211810047,0.051361798520324214,,8.107233052407497e-05,8.107233052407497e-05,0.00012341622237345662,0.00012341622237345662,,,0.031104038363952854,0.09083908272594753,0.664713778757518,0.20659525777641477,0.664713778757518
0.09083908272594753,0.08843865836482266,0.9986192576190571,0.3562170557049483,0.005435005489038658,0.019897902518970507,0.006723666584250078,1.6204213984896388e-05,6.10924437621135e-05,0.8455049555143694,0.00017375305875088617,0.0025879800955864785,1.6046776718011487e-05,,0.8455049555143694,0.00018658279314285063,0.020088464691470877,1.1466461880372866e-05,1.1466461880372866e-05,0.05428527880312893,0.9365144750425862,0.05428527880312893,,7.184693714563745e-05,7.184693714563745e-05,0.00011439028234713678,0.00011439028234713678,,,0.031683148424518734,0.09083908272594753,0.6946514560531176,0.20627001225625077,0.6946514560531176
0.09083908272594753,0.08919633048671044,0.998819495083824,0.35897014683575357,0.005477637711304897,0.01989796616540088,0.006723775455569695,1.6394180562927304e-05,6.23769903337046e-05,0.8533117630155689,0.0001751506029836638,0.002618289034502596,1.4232214562743763e-05,,0.8533117630155689,0.00018808437190296205,0.020233080536324954,1.155045328458059e-05,1.155045328458059e-05,0.05748983045704159,0.9446946062653182,0.05748983045704159,,6.366982483113523e-05,6.366982483113523e-05,0.00010620038835448531,0.00010620038835448531,,,0.032336703969321964,0.09083908272594753,0.7271420336860903,0.20595257966113534,0.7271420336860903
0.09083908272594753,0.0899664918134064,0.9990207598140097,0.3617597541710955,0.005521273411285082,0.01989803257906736,0.00672388447452869,1.6592624439287075e-05,6.382122109231604e-05,0.8613475478796938,0.00017656322997559534,0.0026499509528080827,1.2622841343602389e-05,,0.8613475478796938,0.00018960215120115,0.020378694264106854,1.1635946840303129e-05,1.1635946840303129e-05,0.06101625677132933,0.9531319093725149,0.06101625677132933,,5.642198181834421e-05,5.642198181834421e-05,9.877454328086539e-05,9.877454328086539e-05,,,0.033070793311721886,0.09083908272594753,0.7625240304540158,0.2056417773758158,0.7625240304540158
0.09083908272594753,0.09074889839759052,0.9992180350200235,0.3645840154653876,0.0055658800797651715,0.01989810037635189,0.0067239946353835935,1.6800298369036812e-05,6.543825042384857e-05,0.8696247319070319,0.00017799128004164364,0.002683085724978727,1.1195456253748304e-05,,0.8696247319070319,0.00019113650412435487,0.020525304616452224,1.1722928648244026e-05,1.1722928648244026e-05,0.0649125769104647,0.961846612955748,0.0649125769104647,,4.999789555761114e-05,4.999789555761114e-05,9.204840768814308e-05,9.204840768814308e-05,,,0.03389185200050822,0.09083908272594753,0.8011984695359824,0.20533642447968703,0.8011984695359824
0.09083908272594753,0.09154421164429014,0.9994173678877822,0.3674446286847172,0.005611482732480089,0.01989816817363642,0.006724106005441274,1.7018457438298326e-05,6.724661921758115e-05,0.8781573701172922,0.00017943512752826793,0.0027178937209112568,9.929478209121706e-06,,0.8781573701172922,0.00019268783476910798,0.020672910754451507,1.1811390782054623e-05,1.1811390782054623e-05,0.06923819045380687,0.9708618455095781,0.06923819045380687,,4.430400870198848e-05,4.430400870198848e-05,8.596463968402836e-05,8.596463968402836e-05,,,0.03480904570183517,0.09083908272594753,0.8436436621625417,0.2050353952588033,0.8436436621625417
0.09083908272594753,0.09235178054265332,0.9996089729201885,0.370337952378034,0.0056580264126963814,0.01989823873815705,0.006724217134520519,1.724798200601143e-05,6.926351966338523e-05,0.8869617573739624,0.00018089523526381758,0.0027545160488855447,8.806657577788747e-06,,0.8869617573739624,0.00019425664037410703,0.020821507225192524,1.1901332011359852e-05,1.1901332011359852e-05,0.07406303671917143,0.9802042719956228,0.07406303671917143,,3.925740219898398e-05,3.925740219898398e-05,8.047250112389321e-05,8.047250112389321e-05,,,0.03583074788872884,0.09083908272594753,0.8904345798156216,0.20473757853078214,0.8904345798156216
0.09083908272594753,0.09317297870389973,0.9998081671859846,0.37326822312458563,0.005705581345486253,0.019898309302677684,0.006724330197923545,1.74910224256133e-05,7.151836667843974e-05,0.8960565777072268,0.0001823720796892407,0.0027932951522511044,7.810803234681782e-06,,0.8960565777072268,0.0001958434328049498,0.02097109193140136,1.1992754255490423e-05,1.1992754255490423e-05,0.07947778959481451,0.9899049425946523,0.07947778959481451,,3.4784531046125535e-05,3.4784531046125535e-05,7.552745162271891e-05,7.552745162271891e-05,,,0.03697151271989587,0.09083908272594753,0.9422686933878466,0.20444180733364586,0.9422686933878466
0.09083908272594753,0.09400665544103427,1.0,0.3762294520422427,0.0057540643970044325,0.019898381250816364,0.0067244429379167275,1.7748756536850544e-05,7.403500961517685e-05,0.9054634176114996,0.00018386621211477705,0.002834419625795126,6.92756126291603e-06,,0.9054634176114996,0.00019744878062437032,0.021121653547798887,1.2085665567958305e-05,1.2085665567958305e-05,0.08558907581328921,1.0,0.08558907581328921,,3.082022776280944e-05,3.082022776280944e-05,7.109102025234514e-05,7.109102025234514e-05,,,0.03824286165118139,0.09083908272594753,1.0,0.20414689759082974,1.0
