i,j,weight
Cohesin,ESP1,1.000
CDC27,MAD2,0.883
MCM2,TAH11,0.874
CDC53,GRR1,0.863
MCM2,ORC2,0.861
CLN3,PHO85,0.842
PHO80,PHO81,0.840
CDC27,CDH1,0.801
CDC55,TPD3,0.794
CHK1,MEC1,0.791
CDC6,TAH11,0.783
CDC53,CDC6,0.779
CDC4,CDC6,0.764
DBF4,MCM2,0.764
PHO81,PHO85,0.763
CHK1,RAD9,0.752
CDC6,ORC2,0.746
CDC7,MCM2,0.745
PHO11,PHO2,0.741
PHO80,PHO85,0.737
MAD1,MAD2,0.729
CLN3,PCL2,0.721
CLN3,MCM1,0.716
FOB1,NET1,0.715
MEC1,RAD24,0.711
CDC28,PHO85,0.710
CDC28,CLN3,0.706
PCL2,PHO85,0.701
CLN3,SWI6,0.700
PHO4,PHO80,0.686
NET1,TPD3,0.682
CDC15,DBF2,0.682
PHO4,PHO85,0.681
MEC1,RAD9,0.678
CDC4,FAR1,0.676
CDC53,FAR1,0.671
CHK1,LCD1,0.669
FOB1,SPO12,0.659
CDC53,SIC1,0.654
CDC15,TEM1,0.642
CDC4,CDC53,0.642
CDC14,SIC1,0.638
CDC4,SIC1,0.635
DDC1,MEC1,0.633
CDC20,MAD2,0.631
CDC53,MET30,0.626
DDC1,RAD24,0.625
CDC28,FAR1,0.623
CDC55,NET1,0.617
CDC28,SIC1,0.616
CDC14,DBF2,0.609
CDC20,CDH1,0.603
CAK1,CDC28,0.602
CDC20,CDC27,0.600
CLN3,WHI5,0.600
LCD1,MEC1,0.593
MAD2,MAD3,0.593
PHO2,PHO4,0.590
FAR1,FUS3,0.586
BUB3,CDC20,0.585
BUB3,MAD2,0.574
CDC28,CDC6,0.565
PHO11,PHO4,0.561
CDC7,DBF4,0.561
CDC14,CDH1,0.541
BUB1,CDC20,0.539
LCD1,RAD9,0.535
CDC53,SWE1,0.529
CLB1,SIC1,0.526
BUB3,CDC27,0.520
CLN1,FAR1,0.520
SIC1,SWI5,0.514
MEC1,MEC3,0.508
MEC3,RAD24,0.494
CDC27,MAD3,0.487
CLN1,SIC1,0.486
CDC28,MIH1,0.478
CDC20,CLB6,0.476
CDC20,MAD1,0.476
DDC1,MEC3,0.462
CDC28,CKS1,0.461
SWI4,SWI6,0.456
CLB6,SIC1,0.454
MAD1,MPS1,0.453
DBF2,MOB1,0.433
SLK19,TPD3,0.427
LTE1,TEM1,0.425
CDC55,SLK19,0.425
CDC14,NET1,0.422
MBP1,SWI6,0.415
CDC20,MAD3,0.410
CDC20,PDS1,0.407
MEC1,RAD17,0.390
RAD17,RAD24,0.385
CDC28,PCL2,0.384
MEC1,MRC1,0.384
CDC28,SWI6,0.381
CLN3,YHP1,0.380
CDC5,SWE1,0.374
CDC28,SWI5,0.368
CLN1,GRR1,0.366
CDC27,CDC5,0.365
MET30,SWE1,0.363
BUB3,MAD3,0.359
HSL7,SWE1,0.356
BUB2,TEM1,0.355
CDC53,CLN1,0.352
SWI4,WHI5,0.345
CDC45,MCM2,0.343
CDC5,CDH1,0.339
DDC1,RAD17,0.333
CDC28,CLB3,0.330
MCM1,YHP1,0.328
CAK1,CLB1,0.322
MEC1,RAD53,0.322
MBP1,WHI5,0.318
LCD1,MRC1,0.315
CDC14,MOB1,0.314
SWI6,WHI5,0.300
HSL1,HSL7,0.297
RAD53,RAD9,0.296
MEC3,RAD17,0.289
CDC28,WHI5,0.278
CDC28,CLB1,0.272
CLB1,SWE1,0.270
LCD1,RAD53,0.269
CDC27,CLB1,0.262
CDH1,CLB1,0.256
CDC14,SWI5,0.254
DUN1,TUP1,0.249
BFA1,TEM1,0.249
CYC8,DUN1,0.245
DUN1,RFX1,0.242
CHK1,PDS1,0.231
CLN1,SWI6,0.227
CDC27,PDS1,0.225
SWI4,YHP1,0.221
SWI6,YHP1,0.220
CDC28,SWE1,0.216
CLB6,MBP1,0.208
BUB2,CDC5,0.201
CDC27,CLB6,0.200
CDC6,CLB6,0.187
BUB1,BUB3,0.187
KCC4,SWE1,0.185
MRC1,RAD53,0.183
CLB6,SWI6,0.181
CLN1,SWI4,0.177
CLN1,WHI5,0.174
CLB1,SWI5,0.173
ESP1,SLK19,0.167
CDC28,CLN1,0.156
BFA1,CDC5,0.156
GIN4,SWE1,0.154
HSL1,SWE1,0.140
DUN1,RAD53,0.132
BFA1,BUB2,0.129
CDC28,CLB6,0.128
ESP1,PDS1,0.096
