i,j,weight
Cohesin,ESP1,1.000
CAK1,CLB1,0.980
CDC27,CDC5,0.950
FOB1,NET1,0.950
CDC15,TEM1,0.946
CLB1,SWI5,0.943
MAD1,MAD2,0.936
MAD1,MPS1,0.918
CDC55,NET1,0.916
CDC27,MAD2,0.908
CDC28,SWI5,0.907
CLN3,SWI6,0.905
CDC20,CDH1,0.903
CDC5,CDH1,0.902
CDC27,CDH1,0.902
CDC14,SWI5,0.899
MAD2,MAD3,0.898
BUB3,CDC20,0.898
CHK1,MEC1,0.890
CDC20,MAD3,0.890
CDC20,CDC27,0.889
CDC55,TPD3,0.884
BUB1,CDC20,0.881
CDC27,CLB1,0.871
CDC20,MAD1,0.865
CDH1,CLB1,0.864
CDC14,DBF2,0.864
CDC20,MAD2,0.863
CDC14,MOB1,0.857
CLN3,WHI5,0.849
NET1,TPD3,0.838
PHO4,PHO85,0.831
PHO11,PHO2,0.827
PHO80,PHO81,0.827
CDC14,CDH1,0.824
PHO4,PHO80,0.816
DBF2,MOB1,0.814
PHO11,PHO4,0.811
CDC53,GRR1,0.810
MEC1,MEC3,0.809
MEC1,RAD24,0.805
CDC20,PDS1,0.804
BUB2,TEM1,0.800
CDC27,MAD3,0.799
LTE1,TEM1,0.798
CDC28,CLB1,0.789
CHK1,RAD9,0.786
CDC15,DBF2,0.780
BUB2,CDC5,0.780
PHO2,PHO4,0.777
MEC1,RAD9,0.773
CLN3,PHO85,0.773
CDC14,NET1,0.763
MBP1,SWI6,0.747
CLN3,MCM1,0.746
CDC5,SWE1,0.741
FOB1,SPO12,0.740
PHO81,PHO85,0.739
MEC3,RAD24,0.722
MCM2,ORC2,0.696
BFA1,CDC5,0.686
CLB1,SWE1,0.667
CHK1,LCD1,0.651
CDC28,CLN3,0.651
LCD1,MEC1,0.642
PHO80,PHO85,0.641
MBP1,WHI5,0.640
CDC28,PHO85,0.633
CLN3,YHP1,0.629
DDC1,MEC1,0.627
BUB3,MAD3,0.622
CDC4,CDC53,0.621
MCM1,YHP1,0.617
BFA1,TEM1,0.616
BUB3,MAD2,0.614
BUB3,CDC27,0.611
MCM2,TAH11,0.592
DDC1,MEC3,0.586
SWI6,WHI5,0.582
CDC53,MET30,0.576
DDC1,RAD24,0.565
CDC28,MIH1,0.551
LCD1,RAD9,0.539
SWI6,YHP1,0.532
CDC55,SLK19,0.528
CAK1,CDC28,0.526
CDC6,ORC2,0.514
DBF4,MCM2,0.500
CDC4,CDC6,0.481
CDC28,SWI6,0.476
CDC53,CDC6,0.472
CDC6,TAH11,0.467
CDC28,CKS1,0.456
CDC7,DBF4,0.450
SLK19,TPD3,0.437
BFA1,BUB2,0.431
CDC53,SWE1,0.429
CDC28,CLB3,0.417
CDC7,MCM2,0.415
HSL7,SWE1,0.403
CLB1,SIC1,0.389
CDC28,WHI5,0.389
MEC1,RAD17,0.379
MEC3,RAD17,0.363
CDC4,FAR1,0.359
CDC53,FAR1,0.356
RAD17,RAD24,0.344
HSL1,HSL7,0.340
CLN3,PCL2,0.336
ESP1,SLK19,0.335
CDC27,PDS1,0.330
SIC1,SWI5,0.325
DUN1,TUP1,0.320
CHK1,PDS1,0.318
CDC53,CLN1,0.314
CDC28,CDC6,0.311
PCL2,PHO85,0.308
MET30,SWE1,0.303
CLN1,GRR1,0.294
CYC8,DUN1,0.278
CDC28,FAR1,0.277
CDC14,SIC1,0.269
DUN1,RFX1,0.265
CLN1,SWI6,0.261
ESP1,PDS1,0.257
DDC1,RAD17,0.255
BUB1,BUB3,0.235
CLN1,WHI5,0.229
CDC53,SIC1,0.218
CDC4,SIC1,0.212
MEC1,MRC1,0.205
SWI4,SWI6,0.196
CLN1,FAR1,0.173
CDC28,SIC1,0.172
FAR1,FUS3,0.170
CDC28,SWE1,0.164
CDC28,PCL2,0.161
SWI4,WHI5,0.160
MEC1,RAD53,0.158
CDC20,CLB6,0.157
LCD1,MRC1,0.143
RAD53,RAD9,0.132
CDC28,CLN1,0.125
SWI4,YHP1,0.111
LCD1,RAD53,0.110
CLN1,SIC1,0.101
CDC45,MCM2,0.100
HSL1,SWE1,0.087
GIN4,SWE1,0.073
CLB6,MBP1,0.063
CLB6,SWI6,0.053
DUN1,RAD53,0.052
CDC27,CLB6,0.048
CLN1,SWI4,0.041
MRC1,RAD53,0.035
KCC4,SWE1,0.033
CLB6,SIC1,0.026
CDC28,CLB6,0.026
CDC6,CLB6,0.021
