<?xml version="1.0" encoding="UTF-8" standalone="no"?>
<svg
   xmlns:dc="http://purl.org/dc/elements/1.1/"
   xmlns:cc="http://creativecommons.org/ns#"
   xmlns:rdf="http://www.w3.org/1999/02/22-rdf-syntax-ns#"
   xmlns:svg="http://www.w3.org/2000/svg"
   xmlns="http://www.w3.org/2000/svg"
   xmlns:sodipodi="http://sodipodi.sourceforge.net/DTD/sodipodi-0.dtd"
   xmlns:inkscape="http://www.inkscape.org/namespaces/inkscape"
   sodipodi:docname="phasik_logo_small.svg"
   width="147.03206"
   height="58.023621"
   viewBox="0 0 77.80447 30.704166"
   version="1.1"
   id="svg8"
   inkscape:version="1.0.2 (1.0.2+r75+1)"
   inkscape:export-filename="/home/maxime/Nextcloud/WORK/SCIENCE/HON/cell_cycle/docs/phasik_logo.png"
   inkscape:export-xdpi="96"
   inkscape:export-ydpi="96">
  <defs
     id="defs2">
    <inkscape:path-effect
       effect="skeletal"
       id="path-effect1024"
       is_visible="true"
       lpeversion="1"
       pattern="M 3.5702214,3.8502386 A 0.17244483,0.17244483 0 1 0 3.7426662,4.0226835 0.17244483,0.17244483 0 0 0 3.5702214,3.8502386 Z"
       copytype="repeated"
       prop_scale="1.5"
       scale_y_rel="false"
       spacing="0.5"
       normal_offset="0"
       tang_offset="0"
       prop_units="false"
       vertical_pattern="false"
       hide_knot="false"
       fuse_tolerance="0" />
  </defs>
  <sodipodi:namedview
     id="base"
     pagecolor="#ffffff"
     bordercolor="#666666"
     borderopacity="1.0"
     inkscape:pageopacity="0.0"
     inkscape:pageshadow="2"
     inkscape:zoom="2.8"
     inkscape:cx="52.136302"
     inkscape:cy="3.2800659"
     inkscape:document-units="mm"
     inkscape:current-layer="layer1"
     inkscape:document-rotation="0"
     showgrid="false"
     units="px"
     inkscape:window-width="1533"
     inkscape:window-height="845"
     inkscape:window-x="67"
     inkscape:window-y="27"
     inkscape:window-maximized="1"
     scale-x="2"
     lock-margins="true"
     fit-margin-top="0.3"
     fit-margin-left="0.3"
     fit-margin-right="0.3"
     fit-margin-bottom="0.3">
    <inkscape:grid
       type="xygrid"
       id="grid864"
       originx="64.921045"
       originy="-29.722667" />
  </sodipodi:namedview>
  <metadata
     id="metadata5">
    <rdf:RDF>
      <cc:Work
         rdf:about="">
        <dc:format>image/svg+xml</dc:format>
        <dc:type
           rdf:resource="http://purl.org/dc/dcmitype/StillImage" />
        <dc:title />
      </cc:Work>
    </rdf:RDF>
  </metadata>
  <g
     inkscape:label="Layer 1"
     inkscape:groupmode="layer"
     id="layer1"
     transform="translate(71.431149,-22.520935)">
    <text
       xml:space="preserve"
       style="font-size:2.81951px;line-height:1.25;font-family:Arial;-inkscape-font-specification:'Arial, Normal';letter-spacing:0px;word-spacing:0px;stroke-width:0.105731"
       x="-28.768972"
       y="38.530861"
       id="text839"><tspan
         sodipodi:role="line"
         id="tspan837"
         x="-28.768972"
         y="38.530861"
         style="stroke-width:0.105731" /></text>
    <g
       aria-label="Phasik"
       id="text835"
       style="font-size:28.1951px;line-height:1.25;font-family:Arial;-inkscape-font-specification:'Arial, Normal';letter-spacing:0px;word-spacing:0px;stroke-width:1.05731">
      <path
         d="m -71.029992,22.679672 h 5.837267 q 2.367948,0 3.634524,0.371713 1.280344,0.371712 1.913633,1.073836 0.647055,0.702124 0.86733,1.707126 0.234041,0.991234 0.234041,3.083839 v 1.941166 q 0,2.133907 -0.440549,3.111374 -0.440548,0.977467 -1.624522,1.500618 -1.170207,0.523151 -3.070072,0.523151 h -1.555687 v 8.976175 h -5.795965 z m 5.795965,3.813497 v 5.672062 q 0.247809,0.01377 0.426782,0.01377 0.798494,0 1.101371,-0.38548 0.316644,-0.399247 0.316644,-1.63829 v -1.831029 q 0,-1.142673 -0.357946,-1.486851 -0.357945,-0.344179 -1.486851,-0.344179 z"
         style="font-style:normal;font-variant:normal;font-weight:normal;font-stretch:normal;font-size:28.1951px;font-family:Impact;-inkscape-font-specification:'Impact, Normal';font-variant-ligatures:normal;font-variant-caps:normal;font-variant-numeric:normal;font-variant-east-asian:normal;stroke-width:1.05731"
         id="path859" />
      <path
         d="m -51.480654,22.679672 v 5.011238 q 0.715891,-0.660822 1.541919,-0.991234 0.839796,-0.330411 1.789728,-0.330411 1.459317,0 2.478085,0.743426 1.032536,0.743425 1.25281,1.720892 0.234041,0.9637 0.234041,3.538155 V 44.96867 h -5.561924 V 32.110162 q 0,-1.596988 -0.165205,-2.051304 -0.151439,-0.454315 -0.702125,-0.454315 -0.509384,0 -0.688357,0.468082 -0.178972,0.468083 -0.178972,1.858564 V 44.96867 h -5.561925 V 22.679672 Z"
         style="font-style:normal;font-variant:normal;font-weight:normal;font-stretch:normal;font-size:28.1951px;font-family:Impact;-inkscape-font-specification:'Impact, Normal';font-variant-ligatures:normal;font-variant-caps:normal;font-variant-numeric:normal;font-variant-east-asian:normal;stroke-width:1.05731"
         id="path861" />
      <path
         d="m -37.314269,33.775986 h -5.217746 V 32.55071 q 0,-2.120139 0.48185,-3.262811 0.495617,-1.15644 1.968701,-2.037537 1.473084,-0.881097 3.827265,-0.881097 2.822263,0 4.254046,1.005001 1.431782,0.991234 1.720892,2.450551 0.28911,1.44555 0.28911,5.974938 v 9.168915 h -5.410486 v -1.624523 q -0.509384,0.977467 -1.321645,1.473084 -0.798494,0.48185 -1.913632,0.48185 -1.459317,0 -2.684592,-0.812261 -1.211509,-0.826028 -1.211509,-3.593223 v -1.500618 q 0,-2.051304 0.647056,-2.79473 0.647055,-0.743425 3.207743,-1.734659 2.739661,-1.073837 2.932401,-1.44555 0.19274,-0.371713 0.19274,-1.514385 0,-1.431783 -0.220274,-1.858564 -0.206508,-0.440548 -0.702125,-0.440548 -0.564452,0 -0.702124,0.371712 -0.137671,0.357946 -0.137671,1.886099 z m 1.762194,2.505619 q -1.335413,0.977467 -1.555687,1.63829 -0.206507,0.660822 -0.206507,1.899865 0,1.418015 0.178973,1.831029 0.19274,0.413015 0.743425,0.413015 0.523152,0 0.67459,-0.316645 0.165206,-0.330411 0.165206,-1.707125 z"
         style="font-style:normal;font-variant:normal;font-weight:normal;font-stretch:normal;font-size:28.1951px;font-family:Impact;-inkscape-font-specification:'Impact, Normal';font-variant-ligatures:normal;font-variant-caps:normal;font-variant-numeric:normal;font-variant-east-asian:normal;stroke-width:1.05731"
         id="path863" />
      <path
         d="m -16.718629,32.536943 h -4.928636 v -0.991234 q 0,-1.266576 -0.151438,-1.596988 -0.137672,-0.344178 -0.715892,-0.344178 -0.468082,0 -0.702124,0.316644 -0.234041,0.302877 -0.234041,0.922398 0,0.839796 0.110137,1.239043 0.123904,0.38548 0.702124,0.853562 0.591987,0.468083 2.409249,1.362947 2.423017,1.183974 3.18021,2.230277 0.757192,1.046302 0.757192,3.042537 0,2.230277 -0.57822,3.372949 -0.578219,1.128906 -1.941166,1.748427 -1.34918,0.605754 -3.262812,0.605754 -2.12014,0 -3.634525,-0.660822 -1.500618,-0.660823 -2.065071,-1.789729 -0.564452,-1.128905 -0.564452,-3.41425 v -0.881097 h 4.928635 v 1.15644 q 0,1.473084 0.178973,1.913632 0.19274,0.440549 0.743426,0.440549 0.591987,0 0.826028,-0.28911 0.234041,-0.302877 0.234041,-1.25281 0,-1.307878 -0.302877,-1.63829 -0.316644,-0.330411 -3.235277,-1.954933 -2.450551,-1.376714 -2.98747,-2.491852 -0.536918,-1.128906 -0.536918,-2.670825 0,-2.188976 0.57822,-3.221511 0.57822,-1.046303 1.954934,-1.610755 1.390481,-0.564453 3.22151,-0.564453 1.817262,0 3.083839,0.468083 1.280344,0.454315 1.954934,1.211508 0.688357,0.757193 0.826028,1.404248 0.151439,0.647056 0.151439,2.02377 z"
         style="font-style:normal;font-variant:normal;font-weight:normal;font-stretch:normal;font-size:28.1951px;font-family:Impact;-inkscape-font-specification:'Impact, Normal';font-variant-ligatures:normal;font-variant-caps:normal;font-variant-numeric:normal;font-variant-east-asian:normal;stroke-width:1.05731"
         id="path865" />
      <path
         d="m -9.0778665,22.679672 v 2.904866 h -5.7271295 v -2.904866 z m 0,4.020004 V 44.96867 H -14.804996 V 26.699676 Z"
         style="font-style:normal;font-variant:normal;font-weight:normal;font-stretch:normal;font-size:28.1951px;font-family:Impact;-inkscape-font-specification:'Impact, Normal';font-variant-ligatures:normal;font-variant-caps:normal;font-variant-numeric:normal;font-variant-east-asian:normal;stroke-width:1.05731"
         id="path867" />
      <path
         d="M 4.8820132,26.699676 2.6242024,33.982493 5.556603,44.96867 H 0.20118594 L -1.5334736,37.011264 V 44.96867 H -7.0953978 V 22.679672 h 5.5619242 v 9.361654 l 1.73465954,-5.34165 z"
         style="font-style:normal;font-variant:normal;font-weight:normal;font-stretch:normal;font-size:28.1951px;font-family:Impact;-inkscape-font-specification:'Impact, Normal';font-variant-ligatures:normal;font-variant-caps:normal;font-variant-numeric:normal;font-variant-east-asian:normal;stroke-width:1.05731"
         id="path869" />
    </g>
    <path
       d="m -68.278126,47.555949 a 2.5161292,2.5161292 0 1 0 2.516129,2.516129 2.5161292,2.5161292 0 0 0 -2.516129,-2.516129 z"
       style="font-variation-settings:normal;vector-effect:none;fill:#e6e6e6;fill-opacity:1;stroke:#000000;stroke-width:0.95333;stroke-linecap:butt;stroke-linejoin:round;stroke-miterlimit:4;stroke-dasharray:none;stroke-dashoffset:0;stroke-opacity:1;stop-color:#000000"
       id="path2523" />
    <path
       d="m -59.34061,47.555949 a 2.5161292,2.5161292 0 1 0 2.516131,2.516129 2.5161292,2.5161292 0 0 0 -2.516131,-2.516129 z"
       style="fill:#e6e6e6;fill-opacity:1;stroke:#000000;stroke-width:0.95333;stroke-linejoin:round;stroke-opacity:1;stop-color:#000000"
       id="path9925" />
    <path
       d="m -50.403132,47.555949 a 2.5161292,2.5161292 0 1 0 2.516128,2.516129 2.5161292,2.5161292 0 0 0 -2.516128,-2.516129 z"
       style="font-variation-settings:normal;vector-effect:none;fill:#666666;fill-opacity:1;stroke:#000000;stroke-width:0.95333;stroke-linecap:butt;stroke-linejoin:round;stroke-miterlimit:4;stroke-dasharray:none;stroke-dashoffset:0;stroke-opacity:1;stop-color:#000000"
       id="path7455" />
    <path
       d="m -41.465636,47.555949 a 2.5161292,2.5161292 0 1 0 2.516128,2.516129 2.5161292,2.5161292 0 0 0 -2.516128,-2.516129 z"
       style="font-variation-settings:normal;vector-effect:none;fill:#666666;fill-opacity:1;stroke:#000000;stroke-width:0.95333;stroke-linecap:butt;stroke-linejoin:round;stroke-miterlimit:4;stroke-dasharray:none;stroke-dashoffset:0;stroke-opacity:1;stop-color:#000000"
       id="path1990" />
    <path
       d="m -32.528137,47.555949 a 2.5161292,2.5161292 0 1 0 2.516133,2.516129 2.5161292,2.5161292 0 0 0 -2.516133,-2.516129 z"
       style="font-variation-settings:normal;vector-effect:none;fill:#666666;fill-opacity:1;stroke:#000000;stroke-width:0.95333;stroke-linecap:butt;stroke-linejoin:round;stroke-miterlimit:4;stroke-dasharray:none;stroke-dashoffset:0;stroke-opacity:1;stop-color:#000000"
       id="path3037" />
    <path
       d="m -23.590661,47.555949 a 2.5161292,2.5161292 0 1 0 2.516132,2.516129 2.5161292,2.5161292 0 0 0 -2.516132,-2.516129 z"
       style="font-variation-settings:normal;vector-effect:none;fill:#666666;fill-opacity:1;stroke:#000000;stroke-width:0.95333;stroke-linecap:butt;stroke-linejoin:round;stroke-miterlimit:4;stroke-dasharray:none;stroke-dashoffset:0;stroke-opacity:1;stop-color:#000000"
       id="path9695" />
    <path
       d="m -14.653142,47.555949 a 2.5161292,2.5161292 0 1 0 2.516129,2.516129 2.5161292,2.5161292 0 0 0 -2.516129,-2.516129 z"
       style="fill:#0b0b0b;fill-opacity:1;stroke:#000000;stroke-width:0.95333;stroke-linejoin:round;stroke-opacity:1;stop-color:#000000"
       id="path1179" />
    <path
       d="m -5.715662,47.555949 a 2.5161292,2.5161292 0 1 0 2.5161285,2.516129 2.5161292,2.5161292 0 0 0 -2.5161285,-2.516129 z"
       style="font-variation-settings:normal;vector-effect:none;fill:#0b0b0b;fill-opacity:1;stroke:#000000;stroke-width:0.95333;stroke-linecap:butt;stroke-linejoin:round;stroke-miterlimit:4;stroke-dasharray:none;stroke-dashoffset:0;stroke-opacity:1;stop-color:#000000"
       id="path7018" />
    <path
       d="M 3.2217737,47.555949 A 2.5161292,2.5161292 0 1 0 5.7379062,50.072078 2.5161292,2.5161292 0 0 0 3.2217737,47.555949 Z"
       style="font-variation-settings:normal;vector-effect:none;fill:#0b0b0b;fill-opacity:1;stroke:#000000;stroke-width:0.95333;stroke-linecap:butt;stroke-linejoin:round;stroke-miterlimit:4;stroke-dasharray:none;stroke-dashoffset:0;stroke-opacity:1;stop-color:#000000"
       id="path5093" />
    <text
       xml:space="preserve"
       style="font-size:14.1111px;line-height:1.25;font-family:Arial;-inkscape-font-specification:'Arial, Normal';letter-spacing:0px;word-spacing:0px;stroke-width:0.529167"
       x="-1.1402652"
       y="-7.3293457"
       id="text874"><tspan
         sodipodi:role="line"
         id="tspan872"
         x="-1.1402652"
         y="-7.3293457"
         style="stroke-width:0.529167" /></text>
  </g>
</svg>
