{
  "configuration": {
    "schedulerName": "StreamZipperScheduler",
    "schedulerId": "SZS_001",
    "authToken" : "297FB883685022FDB00E632F4809A817F371D086DB46285B0B673AA252CDEC3562AD682052E1B798EBF8122068F3C77030F92D2B6F4C50E3E593C46E0C9E48BF",
    "useAuthentication": true,
    "cleanupConfig": {
        "removeOlderThanDays": 10,
        "cronSchedule": "0 45 2 ? * * *",
        "jobName": "SnapshotCleanupJob",
        "groupName": "SnapshotCleanupGroup",
        "triggerName": "SnapshotCleanupTrigger",
        "targetPath" : "./backup/snapshots/"
    },
    "schedulerConfig": {
        "userAgent": "Mozilla/5.0 (Windows NT 10.0; Win64; x64) AppleWebKit/537.36 (KHTML, like Gecko) Chrome/94.0.4606.71 Safari/537.36",
        "startDelay": 0,
        "cronSchedule": "0 44 23 ? * *",
        "jobName": "SnapshotJob",
        "groupName": "SnapshotGroup",
        "triggerName": "SnapshotTrigger",
        "url": "https://api.itscope.com/2.1/t/f2cSdzSDAsJXyTc_lxmXkYBWQ_Gf7Z_RtzWz2tUh3fJ3W11GEaSKWj9X7GfRBhKcoBJQ-3J78FjxSGjl4B_ryzChHv0YfaqeDgjeNLsQ2UdruoM1ArGahQdeLRc-dvh5zWha6qaUSNB2NZsu2GMBPuX8CX8ROr-YlsEqTXC6V1w",
        "storeLocation": "./backup/snapshots/",
        "targetPath": "./data/snapshots/",
        "timeoutSec": 3600
    }
  }
}