INDEX VERSION 1.130+C:\FSD54\SpringBoot\student\StudentWorkspace\.metadata\.plugins\org.eclipse.jdt.core
17329349.index
865004563.index
3370153111.index
188748570.index
2106708057.index
3938695825.index
952894866.index
4259073463.index
2561485817.index
3040837599.index
542153213.index
418840389.index
1388925996.index
1628951137.index
117813440.index
3582436116.index
4138326577.index
414170412.index
3946246110.index
2885606711.index
3318700080.index
3363513505.index
2397248522.index
895354549.index
1629021028.index
3644761064.index
514687458.index
3348520720.index
2910925888.index
1169391566.index
3185462400.index
4135958314.index
889755161.index
3986281119.index
1524955856.index
674573568.index
2985044951.index
2066830214.index
1996001250.index
128204876.index
2205283528.index
1961815414.index
4190436215.index
4063834676.index
455130246.index
3634562630.index
1095342690.index
3296446474.index
1956904976.index
1797527762.index
2153076569.index
2387313008.index
2332080259.index
3085164031.index
1333218124.index
1114361613.index
1035306073.index
821426067.index
3711629279.index
2079157312.index
2697112296.index
1985501957.index
524050775.index
3838981285.index
4218314831.index
4030100022.index
1946725198.index
2186899505.index
3439657490.index
3653546749.index
1035900006.index
2507423472.index
526627441.index
3215249790.index
3379987827.index
653637691.index
3858847829.index
2622445891.index
4278222559.index
4259402252.index
3878782342.index
103378668.index
425281213.index
1175326838.index
1321599121.index
411227453.index
1405638156.index
768079429.index
93982298.index
1642600094.index
2051115726.index
2587697485.index
923556618.index
266106667.index
1871364349.index
1750403865.index
1545722165.index
2328292450.index
3133734466.index
2706049289.index
2955405930.index
1927467513.index
