{
	"info": {
		"_postman_id": "192fe787-2dee-48a7-9bc8-cdf1ce14b812",
		"name": "Sprint3",
		"schema": "https://schema.getpostman.com/json/collection/v2.1.0/collection.json"
	},
	"item": [
		{
			"name": "project list by cloud",
			"request": {
				"auth": {
					"type": "bearer",
					"bearer": [
						{
							"key": "token",
							"value": "eyJhbGciOiJIUzI1NiIsInR5cCI6IkpXVCJ9.eyJlbWFpbCI6Imxha3NobWkuc3VyYW1wYWxseUByaWwuY29tIiwiaWF0IjoxNTQ3NTI5MTMwLCJleHAiOjE1NDgxMzM5MzB9.6kBJPAphXbVZ7NSt5ZK9bsXufeLvwt6irFpcOZ94PTg",
							"type": "string"
						}
					]
				},
				"method": "GET",
				"header": [],
				"body": {
					"mode": "raw",
					"raw": ""
				},
				"url": {
					"raw": "url/project/v1/projects",
					"host": [
						"url"
					],
					"path": [
						"project",
						"v1",
						"projects"
					]
				}
			},
			"response": []
		},
		{
			"name": "stack list by project",
			"request": {
				"auth": {
					"type": "bearer",
					"bearer": [
						{
							"key": "token",
							"value": "eyJhbGciOiJIUzI1NiIsInR5cCI6IkpXVCJ9.eyJlbWFpbCI6Imxha3NobWkuc3VyYW1wYWxseUByaWwuY29tIiwiaWF0IjoxNTQ3NTI5MTMwLCJleHAiOjE1NDgxMzM5MzB9.6kBJPAphXbVZ7NSt5ZK9bsXufeLvwt6irFpcOZ94PTg",
							"type": "string"
						}
					]
				},
				"method": "POST",
				"header": [
					{
						"key": "Content-Type",
						"name": "Content-Type",
						"value": "application/json",
						"type": "text"
					}
				],
				"body": {
					"mode": "raw",
					"raw": "{\r\n\"project_id\":\"3ffb104879514c22b4ef60c48e4a6d12\"\r\n}\r\n"
				},
				"url": {
					"raw": "http://localhost:3000/jio/launchpad/project/v1/project/stack/list/cloud/JPE3",
					"protocol": "http",
					"host": [
						"localhost"
					],
					"port": "3000",
					"path": [
						"jio",
						"launchpad",
						"project",
						"v1",
						"project",
						"stack",
						"list",
						"cloud",
						"JPE3"
					]
				}
			},
			"response": []
		},
		{
			"name": "server list for a project in the cloud",
			"request": {
				"auth": {
					"type": "bearer",
					"bearer": [
						{
							"key": "token",
							"value": "eyJhbGciOiJIUzI1NiIsInR5cCI6IkpXVCJ9.eyJlbWFpbCI6Imxha3NobWkuc3VyYW1wYWxseUByaWwuY29tIiwiaWF0IjoxNTQ3NTI5MTMwLCJleHAiOjE1NDgxMzM5MzB9.6kBJPAphXbVZ7NSt5ZK9bsXufeLvwt6irFpcOZ94PTg",
							"type": "string"
						}
					]
				},
				"method": "POST",
				"header": [
					{
						"key": "Content-Type",
						"name": "Content-Type",
						"value": "application/json",
						"type": "text"
					}
				],
				"body": {
					"mode": "raw",
					"raw": "{\n\t\"project_id\":\"3ffb104879514c22b4ef60c48e4a6d12\"\n}"
				},
				"url": {
					"raw": "http://localhost:3000/jio/launchpad/project/v1/project/server/list/cloud/JPE3",
					"protocol": "http",
					"host": [
						"localhost"
					],
					"port": "3000",
					"path": [
						"jio",
						"launchpad",
						"project",
						"v1",
						"project",
						"server",
						"list",
						"cloud",
						"JPE3"
					]
				}
			},
			"response": []
		},
		{
			"name": "delete sg rule for a sg",
			"request": {
				"auth": {
					"type": "bearer",
					"bearer": [
						{
							"key": "token",
							"value": "eyJhbGciOiJIUzI1NiIsInR5cCI6IkpXVCJ9.eyJlbWFpbCI6Imxha3NobWkuc3VyYW1wYWxseUByaWwuY29tIiwiaWF0IjoxNTQ3NTI5MTMwLCJleHAiOjE1NDgxMzM5MzB9.6kBJPAphXbVZ7NSt5ZK9bsXufeLvwt6irFpcOZ94PTg",
							"type": "string"
						}
					]
				},
				"method": "POST",
				"header": [
					{
						"key": "Content-Type",
						"name": "Content-Type",
						"value": "application/json",
						"type": "text"
					}
				],
				"body": {
					"mode": "raw",
					"raw": "{\n\t\"rule_id\":\"26dd682b-56c0-4966-b3bf-1703da297e2a\",\n\t\"project_id\":\"3ffb104879514c22b4ef60c48e4a6d12\"\n}"
				},
				"url": {
					"raw": "http://localhost:3000/jio/launchpad/project/v1/project/sgrule/delete/cloud/JPE3",
					"protocol": "http",
					"host": [
						"localhost"
					],
					"port": "3000",
					"path": [
						"jio",
						"launchpad",
						"project",
						"v1",
						"project",
						"sgrule",
						"delete",
						"cloud",
						"JPE3"
					]
				}
			},
			"response": []
		},
		{
			"name": "server start by project",
			"request": {
				"auth": {
					"type": "bearer",
					"bearer": [
						{
							"key": "token",
							"value": "eyJhbGciOiJIUzI1NiIsInR5cCI6IkpXVCJ9.eyJlbWFpbCI6Imxha3NobWkuc3VyYW1wYWxseUByaWwuY29tIiwiaWF0IjoxNTQ4MjE3OTE5LCJleHAiOjE1NDgyMjE1MTl9.aKGu08_7gSpfF1hFd_3wiVyFaTaX_0OlJo4fcr2ZHek",
							"type": "string"
						}
					]
				},
				"method": "POST",
				"header": [
					{
						"key": "Content-Type",
						"name": "Content-Type",
						"value": "application/json",
						"type": "text"
					}
				],
				"body": {
					"mode": "raw",
					"raw": "{\n\t\"server_id\":\"37f4649d-9575-457b-a4fc-fa9aed85cd8b\",\n\t\"project_id\":\"3daf5dfb66ca4a7797583d0d43e33bd6\"\n\t\n}"
				},
				"url": {
					"raw": "http://localhost:3000/jio/launchpad/project/v1/project/server/start/cloud/JPE3",
					"protocol": "http",
					"host": [
						"localhost"
					],
					"port": "3000",
					"path": [
						"jio",
						"launchpad",
						"project",
						"v1",
						"project",
						"server",
						"start",
						"cloud",
						"JPE3"
					]
				}
			},
			"response": []
		},
		{
			"name": "List all the stack resources by project",
			"request": {
				"auth": {
					"type": "bearer",
					"bearer": [
						{
							"key": "token",
							"value": "eyJhbGciOiJIUzI1NiIsInR5cCI6IkpXVCJ9.eyJlbWFpbCI6Imxha3NobWkuc3VyYW1wYWxseUByaWwuY29tIiwiaWF0IjoxNTQ3NTI5MTMwLCJleHAiOjE1NDgxMzM5MzB9.6kBJPAphXbVZ7NSt5ZK9bsXufeLvwt6irFpcOZ94PTg",
							"type": "string"
						}
					]
				},
				"method": "POST",
				"header": [
					{
						"key": "Content-Type",
						"name": "Content-Type",
						"value": "application/json",
						"type": "text"
					}
				],
				"body": {
					"mode": "raw",
					"raw": "{\r\n\"project_id\":\"3ffb104879514c22b4ef60c48e4a6d12\",\r\n\"stack_id\":\"badfb71d-95c0-4956-8e42-4ac68568c952\",\r\n\"stack_name\":\"chetenkumar_none_1547214788328_stack\"\r\n}\r\n"
				},
				"url": {
					"raw": "http://localhost:3000/jio/launchpad/project/v1/project/stack/res/cloud/JPE3",
					"protocol": "http",
					"host": [
						"localhost"
					],
					"port": "3000",
					"path": [
						"jio",
						"launchpad",
						"project",
						"v1",
						"project",
						"stack",
						"res",
						"cloud",
						"JPE3"
					]
				}
			},
			"response": []
		},
		{
			"name": "sg rule list for a sg group by project",
			"request": {
				"auth": {
					"type": "bearer",
					"bearer": [
						{
							"key": "token",
							"value": "eyJhbGciOiJIUzI1NiIsInR5cCI6IkpXVCJ9.eyJlbWFpbCI6Imxha3NobWkuc3VyYW1wYWxseUByaWwuY29tIiwiaWF0IjoxNTQ3NTI5MTMwLCJleHAiOjE1NDgxMzM5MzB9.6kBJPAphXbVZ7NSt5ZK9bsXufeLvwt6irFpcOZ94PTg",
							"type": "string"
						}
					]
				},
				"method": "POST",
				"header": [
					{
						"key": "Content-Type",
						"name": "Content-Type",
						"value": "application/json",
						"type": "text"
					}
				],
				"body": {
					"mode": "raw",
					"raw": "{\n\t\"project_id\":\"3ffb104879514c22b4ef60c48e4a6d12\",\n\t\"sg_id\":\"c85a7170-79c8-4d89-b7bf-122371d06874\"\n}"
				},
				"url": {
					"raw": "http://localhost:3000/jio/launchpad/project/v1/project/sgrules/list/cloud/JPE3",
					"protocol": "http",
					"host": [
						"localhost"
					],
					"port": "3000",
					"path": [
						"jio",
						"launchpad",
						"project",
						"v1",
						"project",
						"sgrules",
						"list",
						"cloud",
						"JPE3"
					]
				}
			},
			"response": []
		},
		{
			"name": "show server info for the selected server id of a project",
			"request": {
				"auth": {
					"type": "bearer",
					"bearer": [
						{
							"key": "token",
							"value": "eyJhbGciOiJIUzI1NiIsInR5cCI6IkpXVCJ9.eyJlbWFpbCI6Imxha3NobWkuc3VyYW1wYWxseUByaWwuY29tIiwiaWF0IjoxNTQ3NTI5MTMwLCJleHAiOjE1NDgxMzM5MzB9.6kBJPAphXbVZ7NSt5ZK9bsXufeLvwt6irFpcOZ94PTg",
							"type": "string"
						}
					]
				},
				"method": "POST",
				"header": [
					{
						"key": "Content-Type",
						"name": "Content-Type",
						"value": "application/json",
						"type": "text"
					}
				],
				"body": {
					"mode": "raw",
					"raw": "{\n\t\"server_id\":\"a363df79-3e63-4ddd-b34b-f9a4dae53671\",\n\t\"project_id\":\"3ffb104879514c22b4ef60c48e4a6d12\"\n}"
				},
				"url": {
					"raw": "http://localhost:3000/jio/launchpad/project/v1/project/server/info/cloud/JPE3",
					"protocol": "http",
					"host": [
						"localhost"
					],
					"port": "3000",
					"path": [
						"jio",
						"launchpad",
						"project",
						"v1",
						"project",
						"server",
						"info",
						"cloud",
						"JPE3"
					]
				}
			},
			"response": []
		},
		{
			"name": "detach and delete volume ",
			"request": {
				"auth": {
					"type": "bearer",
					"bearer": [
						{
							"key": "token",
							"value": "eyJhbGciOiJIUzI1NiIsInR5cCI6IkpXVCJ9.eyJlbWFpbCI6Imxha3NobWkuc3VyYW1wYWxseUByaWwuY29tIiwiaWF0IjoxNTQ3NTI5MTMwLCJleHAiOjE1NDgxMzM5MzB9.6kBJPAphXbVZ7NSt5ZK9bsXufeLvwt6irFpcOZ94PTg",
							"type": "string"
						}
					]
				},
				"method": "POST",
				"header": [
					{
						"key": "Content-Type",
						"name": "Content-Type",
						"value": "application/json",
						"type": "text"
					}
				],
				"body": {
					"mode": "raw",
					"raw": "{\r\n\"project_id\":\"3ffb104879514c22b4ef60c48e4a6d12\",\r\n\"server_id\":\"771cb069-b57e-4488-94b7-a940704117e2\",\r\n\"volume_id\": \"dc3421b9-d809-4aa6-8b95-76f367f954d6\"\r\n}\r\n"
				},
				"url": {
					"raw": "http://localhost:3000/jio/launchpad/project/v1/project/volume/delete/cloud/JPE3",
					"protocol": "http",
					"host": [
						"localhost"
					],
					"port": "3000",
					"path": [
						"jio",
						"launchpad",
						"project",
						"v1",
						"project",
						"volume",
						"delete",
						"cloud",
						"JPE3"
					]
				}
			},
			"response": []
		},
		{
			"name": "server stop by project",
			"request": {
				"auth": {
					"type": "bearer",
					"bearer": [
						{
							"key": "token",
							"value": "eyJhbGciOiJIUzI1NiIsInR5cCI6IkpXVCJ9.eyJlbWFpbCI6Imxha3NobWkuc3VyYW1wYWxseUByaWwuY29tIiwiaWF0IjoxNTQ3NTI5MTMwLCJleHAiOjE1NDgxMzM5MzB9.6kBJPAphXbVZ7NSt5ZK9bsXufeLvwt6irFpcOZ94PTg",
							"type": "string"
						}
					]
				},
				"method": "POST",
				"header": [
					{
						"key": "Content-Type",
						"name": "Content-Type",
						"value": "application/json",
						"type": "text"
					}
				],
				"body": {
					"mode": "raw",
					"raw": "{\n\t\"server_id\":\"37f4649d-9575-457b-a4fc-fa9aed85cd8b\",\n\t\"project_id\":\"3daf5dfb66ca4a7797583d0d43e33bd6\"\n}"
				},
				"url": {
					"raw": "http://localhost:3000/jio/launchpad/project/v1/project/server/stop/cloud/JPE3",
					"protocol": "http",
					"host": [
						"localhost"
					],
					"port": "3000",
					"path": [
						"jio",
						"launchpad",
						"project",
						"v1",
						"project",
						"server",
						"stop",
						"cloud",
						"JPE3"
					]
				}
			},
			"response": []
		},
		{
			"name": "create and attach volume to server",
			"request": {
				"auth": {
					"type": "bearer",
					"bearer": [
						{
							"key": "token",
							"value": "eyJhbGciOiJIUzI1NiIsInR5cCI6IkpXVCJ9.eyJlbWFpbCI6Imxha3NobWkuc3VyYW1wYWxseUByaWwuY29tIiwiaWF0IjoxNTQ3NTI5MTMwLCJleHAiOjE1NDgxMzM5MzB9.6kBJPAphXbVZ7NSt5ZK9bsXufeLvwt6irFpcOZ94PTg",
							"type": "string"
						}
					]
				},
				"method": "POST",
				"header": [
					{
						"key": "Content-Type",
						"name": "Content-Type",
						"value": "application/json",
						"type": "text"
					}
				],
				"body": {
					"mode": "raw",
					"raw": "{\r\n        \"project_id\":\"3ffb104879514c22b4ef60c48e4a6d12\",\r\n        \"server_id\":\"771cb069-b57e-4488-94b7-a940704117e2\",\r\n        \"vol_name\": \"test-api-volume\",\r\n        \"vol_size\":\"2\"\r\n     }\r\n"
				},
				"url": {
					"raw": "http://localhost:3000/jio/launchpad/project/v1/project/volume/create/attach/cloud/JPE3",
					"protocol": "http",
					"host": [
						"localhost"
					],
					"port": "3000",
					"path": [
						"jio",
						"launchpad",
						"project",
						"v1",
						"project",
						"volume",
						"create",
						"attach",
						"cloud",
						"JPE3"
					]
				}
			},
			"response": []
		},
		{
			"name": "volume list by project and server",
			"request": {
				"auth": {
					"type": "bearer",
					"bearer": [
						{
							"key": "token",
							"value": "eyJhbGciOiJIUzI1NiIsInR5cCI6IkpXVCJ9.eyJlbWFpbCI6Imxha3NobWkuc3VyYW1wYWxseUByaWwuY29tIiwiaWF0IjoxNTQ3NTI5MTMwLCJleHAiOjE1NDgxMzM5MzB9.6kBJPAphXbVZ7NSt5ZK9bsXufeLvwt6irFpcOZ94PTg",
							"type": "string"
						}
					]
				},
				"method": "POST",
				"header": [
					{
						"key": "Content-Type",
						"name": "Content-Type",
						"value": "application/json",
						"type": "text"
					}
				],
				"body": {
					"mode": "raw",
					"raw": "{\r\n\"project_id\":\"3ffb104879514c22b4ef60c48e4a6d12\",\r\n\"server_id\":\"a363df79-3e63-4ddd-b34b-f9a4dae53671\"\r\n}\r\n"
				},
				"url": {
					"raw": "http://localhost:3000/jio/launchpad/project/v1/project/volume/list/cloud/JPE3",
					"protocol": "http",
					"host": [
						"localhost"
					],
					"port": "3000",
					"path": [
						"jio",
						"launchpad",
						"project",
						"v1",
						"project",
						"volume",
						"list",
						"cloud",
						"JPE3"
					]
				}
			},
			"response": []
		},
		{
			"name": "Volume info by project",
			"request": {
				"auth": {
					"type": "bearer",
					"bearer": [
						{
							"key": "token",
							"value": "eyJhbGciOiJIUzI1NiIsInR5cCI6IkpXVCJ9.eyJlbWFpbCI6Imxha3NobWkuc3VyYW1wYWxseUByaWwuY29tIiwiaWF0IjoxNTQ3NTI5MTMwLCJleHAiOjE1NDgxMzM5MzB9.6kBJPAphXbVZ7NSt5ZK9bsXufeLvwt6irFpcOZ94PTg",
							"type": "string"
						}
					]
				},
				"method": "POST",
				"header": [
					{
						"key": "Content-Type",
						"name": "Content-Type",
						"value": "application/json",
						"type": "text"
					}
				],
				"body": {
					"mode": "raw",
					"raw": "{\n\t\"volume_id\":\"bacd8b72-47f2-44ec-9f28-2c98780cff2d\",\n\t\"project_id\": \"3ffb104879514c22b4ef60c48e4a6d12\"\n}"
				},
				"url": {
					"raw": "http://localhost:3000/jio/launchpad/project/v1/project/volume/info/cloud/JPE3",
					"protocol": "http",
					"host": [
						"localhost"
					],
					"port": "3000",
					"path": [
						"jio",
						"launchpad",
						"project",
						"v1",
						"project",
						"volume",
						"info",
						"cloud",
						"JPE3"
					]
				}
			},
			"response": []
		},
		{
			"name": "sgrule add for sg for project",
			"request": {
				"auth": {
					"type": "bearer",
					"bearer": [
						{
							"key": "token",
							"value": "eyJhbGciOiJIUzI1NiIsInR5cCI6IkpXVCJ9.eyJlbWFpbCI6Imxha3NobWkuc3VyYW1wYWxseUByaWwuY29tIiwiaWF0IjoxNTQ3NTI5MTMwLCJleHAiOjE1NDgxMzM5MzB9.6kBJPAphXbVZ7NSt5ZK9bsXufeLvwt6irFpcOZ94PTg",
							"type": "string"
						}
					]
				},
				"method": "POST",
				"header": [
					{
						"key": "Content-Type",
						"name": "Content-Type",
						"value": "application/json",
						"type": "text"
					}
				],
				"body": {
					"mode": "raw",
					"raw": "{\n                \"port_no\":\"22\",\n                \"port_type\":\"IPv6\",\n                \"port_protocol\":\"tcp\",\n                \"sg_id\": \"c85a7170-79c8-4d89-b7bf-122371d06874\",\n                \"project_id\" : \"3ffb104879514c22b4ef60c48e4a6d12\"\n}"
				},
				"url": {
					"raw": "http://localhost:3000/jio/launchpad/project/v1/project/sgrule/add/cloud/JPE3",
					"protocol": "http",
					"host": [
						"localhost"
					],
					"port": "3000",
					"path": [
						"jio",
						"launchpad",
						"project",
						"v1",
						"project",
						"sgrule",
						"add",
						"cloud",
						"JPE3"
					]
				}
			},
			"response": []
		},
		{
			"name": "search security group in DB and show if exists",
			"request": {
				"auth": {
					"type": "bearer",
					"bearer": [
						{
							"key": "token",
							"value": "eyJhbGciOiJIUzI1NiIsInR5cCI6IkpXVCJ9.eyJlbWFpbCI6Imxha3NobWkuc3VyYW1wYWxseUByaWwuY29tIiwiaWF0IjoxNTQ3NjEyNzE4LCJleHAiOjE1NDgyMTc1MTh9.V_-BHtweXDQuHHFGPerU1ToXQJh5By6S7rtnzqT_AyE",
							"type": "string"
						}
					]
				},
				"method": "POST",
				"header": [
					{
						"key": "Content-Type",
						"name": "Content-Type",
						"value": "application/json",
						"type": "text"
					}
				],
				"body": {
					"mode": "raw",
					"raw": "{\n\t\"server_id\":\"90e9b89c-bab9-40de-ad15-3f26bd1b166d\",\n\t\"project_id\":\"3ffb104879514c22b4ef60c48e4a6d12\"\n}"
				},
				"url": {
					"raw": "http://localhost:3000/jio/launchpad/project/v1/project/sg/search/cloud/JPE3",
					"protocol": "http",
					"host": [
						"localhost"
					],
					"port": "3000",
					"path": [
						"jio",
						"launchpad",
						"project",
						"v1",
						"project",
						"sg",
						"search",
						"cloud",
						"JPE3"
					]
				}
			},
			"response": []
		},
		{
			"name": "volume create attach",
			"request": {
				"auth": {
					"type": "bearer",
					"bearer": [
						{
							"key": "token",
							"value": "eyJhbGciOiJIUzI1NiIsInR5cCI6IkpXVCJ9.eyJlbWFpbCI6Imxha3NobWkuc3VyYW1wYWxseUByaWwuY29tIiwiaWF0IjoxNTQ4MjE3OTE5LCJleHAiOjE1NDgyMjE1MTl9.aKGu08_7gSpfF1hFd_3wiVyFaTaX_0OlJo4fcr2ZHek",
							"type": "string"
						}
					]
				},
				"method": "POST",
				"header": [
					{
						"key": "Content-Type",
						"name": "Content-Type",
						"value": "application/json",
						"type": "text"
					}
				],
				"body": {
					"mode": "raw",
					"raw": "     {\r\n        \"project_id\":\"3ffb104879514c22b4ef60c48e4a6d12\",\r\n        \"server_id\":\"7fa7780c-a01d-4df3-809f-776f77483e5c\",\r\n        \"vol_name\": \"test-volume\",\r\n        \"vol_size\":\"2\"\r\n     }\r\n"
				},
				"url": {
					"raw": "http://localhost:3000/jio/launchpad/project/v1/project/volume/create/attach/cloud/JPE3",
					"protocol": "http",
					"host": [
						"localhost"
					],
					"port": "3000",
					"path": [
						"jio",
						"launchpad",
						"project",
						"v1",
						"project",
						"volume",
						"create",
						"attach",
						"cloud",
						"JPE3"
					]
				}
			},
			"response": []
		}
	]
}