[
  { "name": "news", "displayName": "Noticias" },
  { "name": "about", "displayName": "Acerca de" },
  { "name": "projects", "displayName": "Proyectos" },
  { "name": "users", "displayName": "Integrantes" },
  { "name": "events", "displayName": "Calendario" }
]
