[
  {
    "name": "Juan Hincapié Zea",
    "date": "01/01/2004",
    "profession": "Director General"
  },
  {
    "name": "John H. Osorio Rios",
    "date": "01/01/2004",
    "profession": "Director Científico"
  },
  {
    "name": "Alejandro E. Rendon",
    "date": "01/01/2015",
    "profession": "Director de Infraestructura"
  }
]