lz_202104261811_000010_000100_raw.root
lz_202104211719_000010_000101_raw.root
lz_202104211725_000010_000102_raw.root
lz_202104212223_000010_000103_raw.root
lz_202104211800_000010_000104_raw.root
lz_202104261745_000010_000105_raw.root
lz_202104262037_000010_000106_raw.root
lz_202104261624_000010_000107_raw.root
lz_202104262034_000010_000108_raw.root
lz_202104220413_000010_000109_raw.root
lz_202104262053_000010_000110_raw.root
lz_202104261750_000010_000111_raw.root
lz_202104270036_000010_000112_raw.root
lz_202104261847_000010_000118_raw.root
lz_202104211924_000010_000119_raw.root
lz_202104261701_000010_000120_raw.root
lz_202104261717_000010_000122_raw.root
lz_202104211926_000010_000123_raw.root
lz_202104261739_000010_000124_raw.root
lz_202104211930_000010_000128_raw.root
lz_202104211905_000010_000132_raw.root
lz_202104211914_000010_000135_raw.root
lz_202104211918_000010_000137_raw.root
lz_202104211729_000010_000138_raw.root
lz_202104211457_000010_000139_raw.root
lz_202104211420_000010_000140_raw.root
lz_202104211755_000010_000141_raw.root
lz_202104211649_000010_000142_raw.root
lz_202104211819_000010_000143_raw.root
lz_202104211746_000010_000144_raw.root
lz_202104211613_000010_000145_raw.root
lz_202104211635_000010_000148_raw.root
lz_202104211636_000010_000150_raw.root
lz_202104211545_000010_000152_raw.root
lz_202104211519_000010_000154_raw.root
lz_202104211748_000010_000155_raw.root
lz_202104211731_000010_000156_raw.root
lz_202104211624_000010_000157_raw.root
lz_202104211716_000010_000158_raw.root
lz_202104211707_000010_000160_raw.root
lz_202104211538_000010_000162_raw.root
lz_202104211734_000010_000166_raw.root
lz_202104211636_000010_000169_raw.root
lz_202104211430_000010_000177_raw.root
lz_202104211919_000010_000183_raw.root
lz_202104211919_000010_000185_raw.root
lz_202104211657_000010_000187_raw.root
lz_202104211835_000010_000196_raw.root
lz_202104211715_000010_000202_raw.root
lz_202104211703_000010_000204_raw.root
lz_202104211745_000010_000210_raw.root
lz_202104211749_000010_000219_raw.root
lz_202104212201_000010_000231_raw.root
lz_202104211443_000010_000244_raw.root
lz_202104211657_000010_000245_raw.root
lz_202104211725_000010_000250_raw.root
lz_202106091454_000010_000315_raw.root
lz_202106091511_000010_000316_raw.root
lz_202106091508_000010_000318_raw.root
lz_202106091445_000010_000319_raw.root
lz_202106091420_000010_000320_raw.root
lz_202106091440_000010_000321_raw.root
lz_202106091244_000010_000322_raw.root
lz_202106091514_000010_000323_raw.root
lz_202106091706_000010_000324_raw.root
lz_202106091340_000010_000325_raw.root
lz_202106091220_000010_000326_raw.root
lz_202106091200_000010_000327_raw.root
lz_202106091319_000010_000328_raw.root
lz_202106091509_000010_000331_raw.root
lz_202106091252_000010_000332_raw.root
lz_202106091300_000010_000333_raw.root
lz_202106091555_000010_000334_raw.root
lz_202106091748_000010_000335_raw.root
lz_202106091152_000010_000336_raw.root
lz_202106091249_000010_000337_raw.root
lz_202106091348_000010_000338_raw.root
lz_202106091447_000010_000339_raw.root
lz_202106091130_000010_000341_raw.root
lz_202106091346_000010_000342_raw.root
lz_202106091447_000010_000346_raw.root
lz_202106091408_000010_000347_raw.root
lz_202106091355_000010_000348_raw.root
lz_202106091413_000010_000350_raw.root
lz_202106091244_000010_000351_raw.root
lz_202106091252_000010_000352_raw.root
lz_202106091348_000010_000353_raw.root
lz_202106091550_000010_000361_raw.root
lz_202106091340_000010_000362_raw.root
lz_202106091327_000010_000363_raw.root
lz_202106091422_000010_000364_raw.root
lz_202106091549_000010_000365_raw.root
lz_202106091138_000010_000367_raw.root
lz_202106091925_000010_000368_raw.root
lz_202106091157_000010_000369_raw.root
lz_202106091303_000010_000370_raw.root
lz_202106091102_000010_000373_raw.root
lz_202106091230_000010_000374_raw.root
lz_202106091512_000010_000376_raw.root
lz_202106091508_000010_000378_raw.root
lz_202106091319_000010_000379_raw.root
lz_202106091135_000010_000380_raw.root
lz_202106091627_000010_000381_raw.root
lz_202106091445_000010_000382_raw.root
lz_202106091542_000010_000383_raw.root
lz_202106091158_000010_000384_raw.root
lz_202106091400_000010_000385_raw.root
lz_202106091310_000010_000386_raw.root
lz_202106091307_000010_000387_raw.root
lz_202106091312_000010_000393_raw.root
lz_202106091527_000010_000395_raw.root
lz_202106091048_000010_000397_raw.root
lz_202106091256_000010_000399_raw.root
lz_202106091616_000010_000400_raw.root
lz_202106091404_000010_000401_raw.root
lz_202106091259_000010_000402_raw.root
lz_202106091340_000010_000403_raw.root
lz_202106091500_000010_000404_raw.root
lz_202106091233_000010_000407_raw.root
lz_202106091317_000010_000408_raw.root
lz_202106091545_000010_000412_raw.root
lz_202106091338_000010_000413_raw.root
lz_202106091121_000010_000414_raw.root
lz_202106091222_000010_000415_raw.root
lz_202106091419_000010_000416_raw.root
lz_202106091402_000010_000417_raw.root
lz_202106091140_000010_000418_raw.root
lz_202106091336_000010_000419_raw.root
lz_202106091308_000010_000420_raw.root
lz_202106091258_000010_000424_raw.root
lz_202106091203_000010_000426_raw.root
lz_202106091341_000010_000428_raw.root
lz_202106091449_000010_000429_raw.root
lz_202106091622_000010_000431_raw.root
lz_202106091230_000010_000432_raw.root
lz_202106091706_000010_000433_raw.root
lz_202106091651_000010_000435_raw.root
lz_202106091444_000010_000436_raw.root
lz_202106091353_000010_000437_raw.root
lz_202106091310_000010_000439_raw.root
lz_202106091226_000010_000441_raw.root
lz_202106091226_000010_000442_raw.root
lz_202106091417_000010_000443_raw.root
lz_202106091524_000010_000445_raw.root
lz_202106091132_000010_000446_raw.root
lz_202106091303_000010_000447_raw.root
lz_202106091156_000010_000448_raw.root
lz_202106091455_000010_000449_raw.root
lz_202106091329_000010_000450_raw.root
lz_202106091223_000010_000451_raw.root
lz_202106091425_000010_000452_raw.root
lz_202106091405_000010_000456_raw.root
lz_202106091101_000010_000459_raw.root
lz_202106091824_000010_000460_raw.root
lz_202106091258_000010_000461_raw.root
lz_202106091215_000010_000462_raw.root
lz_202106091253_000010_000463_raw.root
lz_202106091251_000010_000468_raw.root
lz_202106091505_000010_000469_raw.root
lz_202106091657_000010_000471_raw.root
lz_202106091528_000010_000472_raw.root
lz_202106091357_000010_000474_raw.root
lz_202106091206_000010_000475_raw.root
lz_202106091329_000010_000476_raw.root
lz_202106091133_000010_000477_raw.root
lz_202106091122_000010_000479_raw.root
lz_202106091903_000010_000480_raw.root
lz_202106091256_000010_000483_raw.root
lz_202106091412_000010_000484_raw.root
lz_202106091515_000010_000485_raw.root
lz_202106091314_000010_000486_raw.root
lz_202106091117_000010_000487_raw.root
lz_202106091544_000010_000488_raw.root
lz_202106091327_000010_000490_raw.root
lz_202106091512_000010_000492_raw.root
lz_202106091402_000010_000494_raw.root
lz_202106091430_000010_000495_raw.root
lz_202106091217_000010_000498_raw.root
lz_202106091635_000010_000499_raw.root
lz_202106091539_000010_000500_raw.root
lz_202106091352_000010_000501_raw.root
lz_202106091313_000010_000502_raw.root
lz_202106091507_000010_000503_raw.root
lz_202106091219_000010_000504_raw.root
lz_202106091517_000010_000506_raw.root
lz_202106091321_000010_000507_raw.root
lz_202106091328_000010_000508_raw.root
lz_202106091020_000010_000509_raw.root
lz_202106091253_000010_000511_raw.root
lz_202106091430_000010_000512_raw.root
lz_202106091456_000010_000514_raw.root
lz_202106091310_000010_000515_raw.root
lz_202106091447_000010_000516_raw.root
lz_202106091449_000010_000517_raw.root
lz_202106091430_000010_000518_raw.root
lz_202106091452_000010_000519_raw.root
lz_202106091443_000010_000521_raw.root
lz_202106091302_000010_000523_raw.root
lz_202106091317_000010_000524_raw.root
lz_202106091339_000010_000525_raw.root
lz_202106091306_000010_000526_raw.root
lz_202106091256_000010_000529_raw.root
lz_202106091235_000010_000530_raw.root
lz_202106091151_000010_000531_raw.root
lz_202106091241_000010_000532_raw.root
lz_202106091429_000010_000533_raw.root
lz_202106091259_000010_000534_raw.root
lz_202106091345_000010_000535_raw.root
lz_202106091538_000010_000537_raw.root
lz_202106091430_000010_000538_raw.root
lz_202106091503_000010_000539_raw.root
lz_202106091112_000010_000540_raw.root
lz_202106091604_000010_000542_raw.root
lz_202106091857_000010_000543_raw.root
lz_202106091406_000010_000545_raw.root
lz_202106091227_000010_000546_raw.root
lz_202106091424_000010_000547_raw.root
lz_202106091254_000010_000548_raw.root
lz_202106091216_000010_000549_raw.root
lz_202106091610_000010_000550_raw.root
lz_202106091328_000010_000552_raw.root
lz_202106091248_000010_000554_raw.root
lz_202106091928_000010_000555_raw.root
lz_202106091303_000010_000556_raw.root
lz_202106091218_000010_000557_raw.root
lz_202106091555_000010_000559_raw.root
lz_202106091727_000010_000560_raw.root
lz_202106091330_000010_000561_raw.root
lz_202106091607_000010_000562_raw.root
lz_202106091134_000010_000563_raw.root
lz_202106091657_000010_000564_raw.root
lz_202106091435_000010_000565_raw.root
lz_202106091558_000010_000567_raw.root
lz_202106091149_000010_000568_raw.root
lz_202106091219_000010_000569_raw.root
lz_202106091437_000010_000570_raw.root
lz_202106091238_000010_000572_raw.root
lz_202106091410_000010_000573_raw.root
lz_202106091328_000010_000575_raw.root
lz_202106091312_000010_000576_raw.root
lz_202106091124_000010_000577_raw.root
lz_202106091519_000010_000578_raw.root
lz_202106091330_000010_000579_raw.root
lz_202106091152_000010_000580_raw.root
lz_202106091323_000010_000582_raw.root
lz_202106091413_000010_000583_raw.root
lz_202106091357_000010_000584_raw.root
lz_202106091241_000010_000585_raw.root
lz_202106091640_000010_000586_raw.root
lz_202106091420_000010_000588_raw.root
lz_202106091629_000010_000589_raw.root
lz_202106091231_000010_000590_raw.root
lz_202106091403_000010_000591_raw.root
lz_202106091452_000010_000592_raw.root
lz_202106091345_000010_000593_raw.root
lz_202106091156_000010_000596_raw.root
lz_202106091249_000010_000597_raw.root
lz_202106091233_000010_000598_raw.root
lz_202106091926_000010_000600_raw.root
lz_202106091402_000010_000602_raw.root
lz_202106091420_000010_000603_raw.root
lz_202106091557_000010_000604_raw.root
lz_202106091518_000010_000605_raw.root
lz_202106091221_000010_000606_raw.root
lz_202106091218_000010_000607_raw.root
lz_202106091213_000010_000608_raw.root
lz_202106091308_000010_000610_raw.root
lz_202106091646_000010_000611_raw.root
lz_202106091915_000010_000612_raw.root
lz_202106091534_000010_000613_raw.root
lz_202106091444_000010_000614_raw.root
lz_202106091412_000010_000615_raw.root
lz_202106091428_000010_000617_raw.root
lz_202106091409_000010_000618_raw.root
lz_202106091423_000010_000619_raw.root
lz_202106091406_000010_000620_raw.root
lz_202106091302_000010_000621_raw.root
lz_202106091643_000010_000622_raw.root
lz_202106091255_000010_000625_raw.root
lz_202106091249_000010_000626_raw.root
lz_202106091130_000010_000627_raw.root
lz_202106091530_000010_000630_raw.root
lz_202106091048_000010_000631_raw.root
lz_202106091232_000010_000632_raw.root
lz_202106091428_000010_000633_raw.root
lz_202106091328_000010_000634_raw.root
lz_202106091513_000010_000636_raw.root
lz_202106091340_000010_000638_raw.root
lz_202106091108_000010_000639_raw.root
lz_202106091324_000010_000640_raw.root
lz_202106091422_000010_000642_raw.root
lz_202106091337_000010_000643_raw.root
lz_202106091154_000010_000644_raw.root
lz_202106091218_000010_000645_raw.root
lz_202106091632_000010_000646_raw.root
lz_202106091226_000010_000647_raw.root
lz_202106091303_000010_000648_raw.root
lz_202106091338_000010_000649_raw.root
lz_202106091206_000010_000650_raw.root
lz_202106091436_000010_000651_raw.root
lz_202106091254_000010_000653_raw.root
lz_202106091421_000010_000654_raw.root
lz_202106091543_000010_000655_raw.root
lz_202106091410_000010_000659_raw.root
lz_202106091050_000010_000660_raw.root
lz_202106091453_000010_000661_raw.root
lz_202106091402_000010_000662_raw.root
lz_202106091256_000010_000663_raw.root
lz_202106091459_000010_000665_raw.root
lz_202106091311_000010_000666_raw.root
lz_202106091232_000010_000668_raw.root
lz_202106091227_000010_000669_raw.root
lz_202106091428_000010_000670_raw.root
lz_202106091507_000010_000671_raw.root
lz_202106091642_000010_000672_raw.root
lz_202106091330_000010_000673_raw.root
lz_202106091535_000010_000674_raw.root
lz_202106091132_000010_000675_raw.root
lz_202106091240_000010_000676_raw.root
lz_202106091329_000010_000677_raw.root
lz_202106091340_000010_000679_raw.root
lz_202106091115_000010_000680_raw.root
lz_202106091101_000010_000681_raw.root
lz_202106091948_000010_000684_raw.root
lz_202106091513_000010_000685_raw.root
lz_202106091341_000010_000686_raw.root
lz_202106091257_000010_000687_raw.root
lz_202106091426_000010_000688_raw.root
lz_202106091503_000010_000689_raw.root
lz_202106091309_000010_000690_raw.root
lz_202106091154_000010_000693_raw.root
lz_202106091610_000010_000695_raw.root
lz_202106091406_000010_000696_raw.root
lz_202106091336_000010_000697_raw.root
lz_202106091409_000010_000698_raw.root
lz_202106091246_000010_000699_raw.root
lz_202106091238_000010_000700_raw.root