10 11 13 17 30 31 32 41 42 43 47 54 55 58 6 60 63 67 81 88 9 91 92 93 95 98
1 18 2 21 25 26 27 28 35 45 47 48 49 50 56 57 6 61 64 66 72 75 79 82 83 84 85 9 91 96 98 99
1 14 16 26 27 30 31 39 4 40 42 47 51 54 56 58 63 65 66 67 72 73 74 75 76 77 78 83 85 88 89 91 92 93 95
10 13 15 21 23 29 34 38 39 40 42 43 49 51 54 55 58 59 6 60 62 64 66 69 72 78 8 81 86 88 89 9 93 94 95 97
1 10 14 16 18 19 2 23 24 25 26 28 37 4 42 47 48 53 56 58 6 61 62 66 68 71 72 74 76 77 79 8 84 86 87 91 92 98
10 11 14 15 18 22 24 26 32 33 38 40 41 43 46 47 48 5 55 6 62 7 71 73 75 77 78 86 87 92 93
12 14 16 17 19 21 22 25 26 28 36 40 44 5 52 54 55 58 59 6 63 67 68 69 7 73 74 75 78 81 84 87 93 95 98
1 10 14 17 19 26 3 30 32 36 4 42 44 46 48 5 50 58 59 61 63 65 7 70 73 76 77 8 81 87 88 9 90 91 94 98
10 12 14 16 22 24 25 28 29 3 33 34 4 41 42 44 49 52 53 55 59 6 60 64 68 7 74 75 78 8 80 81 83 84 85 86 87 88 89 90 91 94 98
15 2 21 22 23 25 34 35 37 39 40 49 57 61 62 63 69 7 70 72 78 84 90 92 94 95 97 98 99
10 11 12 16 19 2 22 23 24 26 30 34 36 38 46 47 56 57 58 62 65 66 67 70 71 74 75 8 82 85 87 89 96 98
1 12 14 16 17 21 32 34 38 39 4 40 49 53 56 62 64 68 69 72 73 78 79 81 84 85 86 87 91 93 97
18 20 21 23 29 35 39 4 43 46 48 5 50 53 55 56 57 58 60 61 62 64 68 81 83 84 86 89 90 91 93 95 99
1 11 14 18 20 26 29 3 4 44 48 51 53 54 57 6 60 65 66 68 69 72 76 78 82 84 89 94 96
11 12 16 22 27 28 29 30 31 35 37 38 39 41 43 48 50 53 64 65 69 72 75 76 78 82 85 9
12 13 15 16 17 18 19 22 24 27 3 30 31 33 35 4 40 44 48 51 52 53 54 55 56 58 60 61 65 68 73 77 82 83 9 90 91 92 94 96 98
0 12 14 2 21 22 27 29 31 32 33 34 35 36 37 41 42 45 50 54 55 60 61 62 66 80 81 82 84 85 87 88 9 92 93 95 97
0 1 10 12 19 20 25 26 28 30 32 35 37 38 42 47 5 55 6 61 65 67 68 69 7 77 78 8 85 89 9 92 94 97
0 1 11 12 2 21 22 25 33 34 35 36 39 42 5 51 53 54 59 61 63 67 73 8 82 90 95 96
1 12 2 21 25 29 3 31 33 34 35 41 43 44 46 48 50 54 56 6 65 72 73 78 79 83 91 94 95 96
1 10 11 13 14 15 16 22 25 38 39 43 49 51 55 56 59 6 60 61 62 69 76 79 83 85 87 9 93 99
11 15 19 22 23 24 26 42 43 47 51 53 54 56 58 6 60 61 63 64 66 7 71 82 86 87 88 89 92 93 94
0 13 14 18 21 25 27 29 31 32 35 43 45 51 52 55 60 62 66 69 7 71 75 76 78 80 81 83 89 9 90 92 99
0 14 19 23 27 3 30 31 32 39 4 41 42 43 50 52 54 56 6 69 72 82 84 85 89 9 91 94
1 10 13 14 16 18 24 25 32 34 36 39 40 42 44 45 47 58 6 60 61 65 66 67 69 74 76 81 83 84 88 9 93 97
12 13 16 20 22 24 27 31 33 35 40 47 49 5 50 51 59 6 60 61 67 68 69 74 77 80 83 84 85 86 90 91 95
0 1 16 22 26 28 30 33 34 35 36 38 4 40 41 45 46 47 48 5 57 59 6 61 67 68 72 75 79 80 81 83 84 88 9 91 95 99
0 15 16 17 18 2 28 31 33 35 36 38 40 41 44 47 5 52 54 57 60 65 67 69 72 73 74 76 77 78 8 80 82 84 89 91 93 95
0 1 10 11 14 15 17 19 24 26 29 31 38 41 44 46 5 55 61 62 64 66 69 70 74 78 79 8 80 82 88 92 98 99
1 10 12 16 20 21 28 32 35 40 42 45 46 47 48 50 51 54 64 77 80 82 83 87 88 9 92 98
0 10 12 17 2 20 22 23 24 25 28 3 39 42 47 48 49 5 54 57 58 59 61 63 65 66 68 69 7 70 75 77 80 81 85 86 87 88 92 95
14 18 21 23 24 25 26 31 32 34 38 39 42 48 52 54 55 59 60 61 64 65 66 7 75 77 80 84 85 86 87 88 9 92 94 97 98 99
0 1 12 13 14 21 22 24 26 27 28 30 31 36 37 4 41 43 49 57 59 6 73 77 8 82 83 85 86 87 88 91
11 12 15 19 20 22 23 25 26 28 29 3 35 36 39 4 40 48 50 57 63 64 67 68 69 70 73 78 81 84 87 94 95 97 98
14 15 2 20 23 27 3 30 35 36 40 42 43 45 48 51 54 55 56 59 6 62 63 67 70 71 72 8 83 87 90
10 14 16 17 18 22 29 3 31 41 45 47 5 51 54 55 57 60 65 67 71 75 76 78 8 86 89 94 97
13 15 16 2 23 25 27 29 30 32 34 35 39 40 43 46 49 56 57 60 64 67 69 7 76 78 81 86 88 90 91 93 94 96
10 14 18 19 22 24 25 26 30 31 33 35 47 49 50 51 53 55 61 66 67 78 82 84 85 9 91 97 99
10 14 22 23 27 28 30 44 46 49 51 53 54 6 61 64 68 7 72 73 74 77 78 8 86 87 89 90 94 95 96 97 99
10 12 14 15 17 18 22 25 27 29 3 35 42 44 47 48 50 53 57 59 6 62 66 76 84 86 89 99
10 14 15 16 27 32 34 35 36 39 41 46 5 51 54 55 57 60 66 68 70 71 72 76 78 79 8 83 84 85 86 88 99
10 17 19 20 24 29 31 35 40 42 44 50 55 60 63 64 66 67 69 71 74 78 86 89 92 99
1 12 16 2 20 25 26 28 29 3 32 33 34 36 38 39 40 45 46 48 51 55 57 59 6 62 64 66 67 68 7 78 79 81 87 9 95 97
0 16 2 20 23 27 31 33 35 38 4 43 44 51 53 55 6 60 62 64 66 68 69 7 71 72 74 76 78 79 85 88 89 92 96 99
1 10 12 16 2 23 27 3 33 37 38 41 42 43 47 49 5 51 53 55 58 61 67 7 75 80 81 82 85 87 91 98 99
11 19 20 22 24 26 31 32 38 39 4 40 41 44 46 47 50 51 54 60 62 64 65 71 73 81 82 83 86 89 90 91 94 97 98
0 1 11 13 19 2 20 25 30 31 36 38 42 43 5 50 56 6 60 66 67 68 7 70 72 74 75 84 85 88 9 90 92 93 94 95 96 97 98 99
12 15 20 23 26 27 31 32 34 37 39 4 43 5 56 57 60 61 66 67 68 78 79 81 9 91 93 98 99
1 15 2 21 23 26 29 30 31 41 44 45 46 48 51 54 55 60 61 69 7 72 74 75 77 8 86 87 89 93 96 97 98 99
11 12 18 22 23 26 33 34 38 40 41 43 47 48 49 5 57 58 59 60 62 73 80 81 82 86 88 91 93
10 14 16 33 34 35 36 37 40 41 45 47 49 51 54 58 6 62 63 64 67 68 70 71 72 73 77 8 83 85 87 88 89 9 91 98
12 13 17 21 23 25 33 36 38 4 42 43 47 49 5 50 55 57 58 59 62 66 68 74 76 78 82 86 88 90 91 93 94 95 96
15 20 21 23 27 30 36 4 43 54 55 6 60 68 7 71 72 73 78 80 81 83 85 89 91 92 96 97 98
10 15 16 3 34 35 38 40 43 46 48 49 50 51 54 62 67 7 70 73 74 80 82 83 88 89 9 91 96 97 99
1 10 11 13 16 17 19 20 23 24 25 35 36 39 40 42 46 5 52 53 56 57 59 75 78 8 82 89 90 91 94 98
0 10 16 18 2 22 26 29 30 35 36 37 40 41 42 52 53 54 55 58 6 63 66 67 69 70 74 77 8 81 87 89 95 96
10 15 16 17 21 23 24 25 26 29 30 4 40 41 43 54 56 63 72 73 76 77 8 81 84 86 9 90 94 96 98
12 13 16 24 25 3 30 31 34 35 36 40 43 44 45 51 53 56 64 68 69 7 70 71 73 74 82 83 87 88 9 90 92 93 95 96 98
10 17 21 23 28 33 39 40 41 42 43 44 52 53 56 58 6 60 7 71 72 74 77 78 84 88 93 98 99
1 11 12 21 22 27 31 35 47 48 50 52 58 61 66 67 68 69 70 72 73 74 80 81 83 84 87 9 90 91 94 96 98
11 12 15 16 22 28 3 39 40 42 45 49 50 53 54 6 64 7 70 71 73 78 80 88 96 97
1 14 16 18 2 22 25 26 28 32 33 4 43 47 50 51 55 56 60 64 65 66 67 68 7 73 74 75 82 84 88 89 93 95
11 12 16 17 18 20 23 24 25 30 35 36 37 40 41 43 44 50 55 57 58 6 61 62 66 69 7 70 71 72 79 80 82 86 87 91 92 93 99
1 10 12 14 17 2 20 21 24 27 28 46 48 50 59 61 65 66 7 70 72 74 76 77 78 81 82 84 86 89 95
11 2 22 25 26 27 31 36 38 4 40 41 42 45 46 49 5 51 53 55 58 6 64 65 66 72 75 77 80 82 86 87 89 91 96
14 15 16 17 18 2 21 23 31 36 37 38 41 42 48 50 51 52 55 59 6 60 62 68 69 7 74 79 81 85 89 92 95 96 98 99
14 20 23 26 28 30 31 36 37 38 39 40 46 49 50 52 55 6 60 62 63 69 7 74 76 78 82 89 90 91 96 98 99
16 18 20 22 23 24 32 33 34 35 40 43 49 54 56 58 59 60 62 64 71 74 75 81 82 85 86 90 91 92 94 97 99
12 15 18 2 24 35 38 39 4 40 42 43 47 48 49 50 54 58 61 65 66 68 7 78 79 80 88
10 11 13 14 16 18 2 25 27 3 31 34 36 38 39 4 41 44 48 52 55 56 6 62 63 70 71 78 80 81 82 86 94 97 99
10 11 12 15 26 27 29 31 35 38 40 46 5 50 52 53 55 57 64 67 7 70 74 76 79 80 81 84 85 88 9 90 91 92
0 1 15 18 19 20 23 24 26 27 28 30 31 36 37 42 48 49 54 55 59 60 61 69 70 73 74 77 78 81 82 84 88 89 90 91 92 97 99
10 12 13 14 16 20 25 39 40 41 47 5 54 55 56 57 6 61 67 68 7 71 74 76 77 78 80 91 92 93 94 98 99
1 12 16 17 18 22 3 33 34 37 42 44 45 47 48 5 51 53 54 58 62 70 71 72 73 80 84 87 88 89 9 90
10 14 15 2 21 23 24 30 32 35 36 4 41 42 5 55 6 60 64 67 68 70 71 76 88 90 91 93 94 96 98
11 13 14 17 2 20 21 24 28 30 31 32 34 36 42 44 45 47 51 56 58 63 65 66 67 68 7 70 72 80 81 87 9 91 92 98
10 16 17 2 21 26 30 32 33 34 35 38 40 41 44 48 56 6 62 63 67 69 77 78 86 91 94 98
0 10 12 14 16 18 24 26 32 34 36 37 38 39 40 43 45 47 56 62 68 69 7 73 75 77 78 82 84 85 86 91 94 98
0 10 14 18 19 2 20 22 27 32 38 44 46 49 5 54 55 59 60 66 68 72 74 75 83 86 94 96 98
10 13 15 19 23 24 25 27 30 32 37 44 47 50 51 54 57 58 59 61 66 77 79 81 83 84 89 9 92 93 99
11 14 16 17 21 26 28 3 32 34 37 40 46 47 49 51 53 62 63 64 71 76 83 84 87 89 96 97
1 10 22 24 26 28 30 31 32 34 35 37 43 5 53 55 61 64 72 75 78 82 84 86 91 92 96 97
12 13 17 2 21 22 23 24 26 29 33 34 37 43 44 5 51 52 55 59 65 66 68 69 74 75 76 85 86 87 88 9 98
0 11 13 15 2 23 24 27 30 32 35 4 44 46 47 54 55 60 62 63 65 67 71 74 77 83 88 9 95
10 2 22 30 31 43 46 47 49 5 57 59 63 65 67 68 73 88 89 91 92 96
0 1 14 15 17 19 22 23 26 27 29 34 35 37 38 39 40 42 44 47 50 52 53 54 58 59 64 65 70 71 73 74 79 80 81 85 86 88 91 93 95 96 99
0 13 18 2 20 21 22 28 3 31 32 33 35 38 45 47 50 51 52 53 54 55 59 60 62 66 71 72 78 8 83 84 86 95 98 99
10 14 15 16 22 24 25 26 27 28 3 30 31 35 4 42 45 49 5 50 52 53 59 63 66 68 69 7 71 74 75 79 84 89 91 95 99
10 13 20 24 28 3 37 39 41 44 46 47 49 51 56 57 58 62 65 68 7 70 71 72 74 76 77 78 8 84 92 95 96
0 18 21 24 25 27 28 38 39 4 41 43 44 47 48 5 53 54 57 6 62 65 69 7 77 85 88 94 96 98
0 1 10 13 2 23 26 27 3 32 34 36 39 47 48 49 52 53 57 59 61 64 69 70 71 72 81 88 95 96 97 98
0 13 2 23 24 25 27 33 34 35 36 43 45 47 51 53 54 6 72 77 8 81 82 84 85 87 88 91 93 99
0 1 12 18 2 20 21 24 26 27 28 30 33 35 41 42 49 50 51 55 56 58 59 61 64 65 68 74 84 85 89 91 92 95 98
1 15 23 26 28 32 40 43 44 46 47 49 5 51 52 54 55 57 6 63 64 65 66 72 73 80 81 82 83 84 86 93 94
1 10 12 14 16 18 19 20 22 23 28 31 36 37 38 39 44 49 50 55 57 59 60 61 64 66 67 70 74 77 79 86 87 88 89 95 96 98
1 10 11 12 14 16 23 26 33 34 38 42 43 44 45 51 54 59 62 64 65 66 71 74 78 82 83 85 87 89 92 93 94 95 98 99
12 15 18 21 22 23 25 26 3 33 36 39 43 45 46 47 48 54 55 56 59 60 66 69 7 70 74 82 86 87 92 96 97
0 1 11 15 17 19 20 24 25 27 3 30 32 4 40 43 46 50 53 55 56 57 58 59 60 61 64 66 69 86 92 96 97
12 20 29 3 33 34 38 4 40 43 44 45 48 50 56 57 58 61 62 66 69 77 83 88 9 90 95 96 98
10 11 15 17 19 2 21 25 28 3 30 31 33 34 35 36 41 45 50 51 54 7 72 75 77 78 88 9 92 95 98 99
0 13 18 19 23 25 3 32 34 37 39 4 5 50 54 56 58 60 61 62 64 65 76 77 78 79 80 83 85 88 91
14 17 25 26 28 31 35 37 39 42 45 47 5 54 58 6 61 65 66 68 7 71 74 75 76 80 82 86 87 88 9 93 94 96 98 99
1 10 15 17 18 27 29 3 30 31 32 33 36 4 41 42 44 45 47 48 52 53 54 58 61 73 74 76 80 85 86 88 9 97 98
3 32 38 39 4 47 51 54 55 56 60 64 67 69 74 79 8 80 81 82 83 84 90 95 96 97 98
13 17 2 21 22 25 27 3 31 33 34 35 38 40 41 45 47 49 5 52 53 58 6 61 62 65 69 73 78 79 8 80 86 87 9 93 96 98
1 10 14 19 21 23 30 32 37 4 46 51 53 57 59 60 61 64 67 72 75 77 8 82 90 97 98
0 1 12 13 14 18 19 23 3 31 33 34 35 37 40 42 43 5 53 55 58 59 61 64 65 7 71 72 74 76 87 88 9 93
1 10 15 16 24 25 28 3 31 38 4 46 49 5 50 51 54 55 57 6 61 67 71 73 76 78 80 85 88 89 92 95 96 99
0 10 11 14 19 21 22 24 28 3 32 37 38 43 44 47 54 55 56 58 60 62 68 70 72 77 81 84 9 97 99
1 10 12 13 17 18 19 20 23 26 27 36 4 43 46 47 49 53 57 64 66 67 69 70 72 73 75 76 79 80 82 85 86 88 91 95 97
1 11 16 21 25 28 29 30 32 38 42 44 45 48 60 64 65 66 7 70 76 78 81 87 89 93 95 97 98
0 11 12 13 14 15 19 20 22 23 27 35 42 46 5 52 53 55 57 60 62 63 64 69 71 72 73 77 8 80 83 90 94 99
1 15 19 24 25 27 28 29 31 32 34 35 36 4 41 42 44 45 48 50 51 59 6 60 64 66 67 69 75 76 80 82 85 86 88 89 9 90 92 98
11 13 14 15 3 30 33 39 4 40 45 47 50 51 52 53 58 59 6 62 65 7 77 8 80 85 87
1 12 15 17 18 20 26 29 32 34 35 37 43 44 45 46 47 49 53 56 6 64 66 67 7 73 75 77 80 84 85 87 94 97 98
1 12 13 14 18 19 20 21 22 25 31 32 4 48 5 53 56 62 65 69 70 73 75 77 78 79 81 82 84 85 86 89 91 92 93 95 98 99
13 20 22 25 26 27 29 31 35 36 39 4 40 46 47 49 5 50 52 53 58 59 61 63 64 65 67 70 71 72 75 76 8 81 85 86 88 89 91 97
0 17 18 19 2 23 24 30 32 33 34 36 38 43 44 5 50 53 58 62 63 64 77 81 85 98
0 1 14 17 23 25 27 28 3 30 33 34 35 37 4 41 44 45 48 51 57 62 63 68 69 71 73 74 76 8 80 82 86 89 92 93 94 95 97 99
0 1 10 11 12 13 17 18 2 20 21 24 25 26 31 36 4 47 55 58 59 60 61 65 66 68 69 7 70 72 77 80 81 83 87 89 90 93 94 95
13 15 16 17 20 23 25 26 31 33 39 43 47 49 5 50 59 60 61 67 69 78 79 86 90 92 95 96
11 16 2 23 29 32 33 36 37 4 41 42 46 47 50 55 57 58 6 61 64 67 68 7 71 75 76 8 83 85 88 9 92 99
10 16 23 24 27 28 3 33 40 46 49 51 54 55 59 60 62 67 7 70 72 75 86 87 89 95
1 12 13 17 21 23 26 29 30 31 32 39 4 43 47 48 53 54 57 62 63 64 70 72 74 79 85 9 90 93 99
0 1 13 14 17 18 21 23 28 32 35 39 4 44 47 48 5 52 54 55 57 59 66 7 78 82 87 9 92 98
16 17 2 20 22 25 26 27 28 30 32 33 34 39 44 48 49 50 56 6 66 68 69 7 72 75 76 78 87 93
0 14 16 18 2 20 22 25 26 27 31 34 42 53 54 56 59 62 63 64 67 7 73 82 84 85 87 88 89 94 96 98
1 11 18 2 27 37 41 45 48 50 55 56 58 60 68 71 75 77 79 8 80 82 89 95 96 98
14 15 16 17 2 20 22 27 28 32 36 37 38 39 50 56 57 58 59 60 61 66 67 68 72 76 79 80 82 83 85 87 92 97
1 11 15 16 17 2 22 23 24 29 30 38 39 44 45 47 49 5 50 52 54 55 58 59 6 60 64 67 69 78 81 82 86 87 9 90 97 98 99
10 13 15 20 27 28 3 30 31 39 40 41 42 43 45 47 5 51 56 57 58 67 70 76 78 82 84 95 96 97 98
1 11 15 18 28 39 41 42 44 49 51 52 57 58 59 64 65 66 70 71 75 76 77 79 8 81 82 84 86 89 91 93 95
11 13 16 19 2 21 22 30 31 35 37 39 41 43 48 49 5 51 53 56 6 65 66 71 76 77 85 89 91 93
0 12 17 18 2 20 23 27 29 35 37 4 42 44 46 48 58 60 64 66 72 77 82 87 88 89 90 92 99
20 29 30 31 33 39 41 42 43 48 50 56 57 6 63 64 68 7 72 74 78 8 80 82 84 85 86 87 88 91 92 99
10 11 13 15 21 23 25 31 36 39 40 41 44 46 49 52 58 6 63 67 7 72 73 79 80 9
1 15 18 21 27 28 3 31 33 45 46 50 56 57 61 63 66 67 69 72 73 75 77 78 79 80 82 83 87 9 90 93 96 98
13 14 15 19 20 26 27 3 30 46 47 48 53 57 58 59 62 66 7 73 76 77 80 82 84 88 92 93
1 11 13 19 2 20 26 27 31 33 36 39 4 41 42 43 46 47 49 53 54 58 6 60 63 65 69 71 75 83 85 91 93 98
0 10 18 19 2 22 24 26 3 33 39 42 43 44 47 48 5 51 53 57 58 59 64 65 68 71 72 76 77 78 80 83 88 89 9 90 95 99
0 1 11 2 23 24 31 39 42 44 45 47 48 53 55 56 58 66 7 73 74 77 80 82 83 90 92 98 99
0 1 10 14 29 3 30 31 35 51 52 54 56 57 61 62 63 65 69 71 72 75 76 79 8 80 81 82 83 84 89 9 93 97
1 15 2 23 26 32 36 38 4 48 5 51 57 60 64 66 67 7 70 71 74 81 85 91 93 96 99
18 19 2 20 24 29 36 40 43 44 46 47 48 5 52 59 6 61 73 76 78 8 80 87 89 97
1 10 11 12 15 18 21 23 24 26 3 35 37 4 40 49 54 57 58 64 65 68 70 71 77 81 82 86 87 88 89 90 94 96 97
12 13 16 20 22 23 25 28 31 32 37 38 42 46 49 52 54 57 58 60 64 65 67 71 73 83 85 88 89 90 92 94 95 96 98
1 11 12 14 15 2 26 30 33 34 36 38 40 43 47 50 55 61 67 68 69 7 79 82 88 89 9 91 92 95 98
10 13 16 19 25 28 30 31 32 33 34 35 36 44 45 46 48 52 54 56 59 60 62 66 75 90 95
16 2 20 23 24 26 27 3 37 4 42 44 47 48 49 50 6 65 66 67 70 71 76 80 87 90 92 96 97
11 13 14 15 19 21 22 23 28 29 30 31 34 37 38 39 44 5 55 58 6 62 66 69 71 72 77 8 83 87 9 93 94 95 97
10 12 17 22 25 29 31 33 37 38 47 48 5 50 52 54 55 56 57 59 60 61 63 64 67 71 72 74 8 81 83 84 87 88 89 94 99
1 12 14 15 16 19 2 20 25 27 29 33 34 38 40 43 50 52 54 55 56 59 63 66 70 74 76 79 8 9 92 93 94 95 98
14 17 20 23 29 30 32 34 4 40 43 44 45 5 55 57 62 64 65 66 7 70 77 78 79 81 85 86 87 94 95
0 1 11 13 18 19 2 21 23 24 25 28 34 37 42 47 49 57 6 62 66 67 7 73 80 81 85 86 88 9 95 96 97
0 12 25 27 30 37 46 49 5 51 55 56 59 6 62 63 69 71 73 78 79 81 84 99
1 16 21 27 28 3 31 35 36 42 44 45 47 51 56 57 6 61 62 63 66 68 7 81 85 86 87 94 98
0 1 11 15 17 19 2 21 24 3 31 33 34 35 39 45 46 47 52 64 67 69 7 71 72 75 76 8 82 87 89 90 94 96 97
1 10 12 13 15 19 2 21 28 32 33 35 38 39 42 47 49 50 51 53 55 57 60 62 63 66 67 69 7 71 73 75 77 78 88 9 90 92 94 95 98
1 14 15 18 2 21 22 24 25 26 3 33 36 44 45 48 5 51 54 55 56 57 64 65 67 68 7 73 74 76 79 81 84 86 87 9 93 95 97 99
10 16 20 23 3 32 34 36 40 42 47 5 51 52 53 56 57 59 61 62 66 67 68 7 71 75 79 84 88 89 91 92 94 96 98 99
0 1 2 22 23 27 28 29 3 30 31 32 35 43 44 47 48 49 53 60 62 67 7 70 76 77 78 8 80 81 83 85 87 88 91 94 96 97 99
0 11 25 28 30 31 4 41 42 43 45 48 5 50 53 56 59 6 60 61 67 68 7 72 75 77 84 88 89 90 92 93 94 96 99
0 13 14 16 17 18 24 25 32 35 42 43 46 5 56 58 60 62 67 68 69 74 76 79 84 87 93 94
1 12 2 20 21 3 33 39 4 41 43 47 48 49 50 52 57 58 62 67 68 7 73 79 8 80 85 89 94 95 96 99
12 2 22 23 24 31 33 4 40 41 42 46 47 5 55 56 58 6 62 64 66 68 7 71 74 77 82 83 86 9 93 94 99
12 13 14 15 21 23 24 25 28 29 30 35 36 37 4 41 43 49 51 60 62 67 69 72 73 75 76 77 79 80 81 84 85 88 89 90 91 93 94 95 98
13 14 16 17 18 19 2 20 22 24 25 26 27 28 30 34 41 45 46 48 50 53 54 6 61 62 67 68 76 78 79 8 85 89 93 94
0 1 12 14 15 18 2 22 25 26 28 30 36 38 39 43 44 45 49 51 59 61 62 63 66 69 71 72 73 74 81 82 83 84 87 9 92 93 94 95 96 98
0 13 15 16 17 21 22 24 34 36 37 38 39 45 48 54 55 56 57 58 6 62 63 69 72 75 76 80 81 82 83 86 88 9 90 92
1 13 17 19 22 23 29 3 32 33 38 39 46 47 49 50 51 54 56 60 63 64 70 73 75 84 85 86 87 93 96
11 19 20 22 24 3 30 32 33 37 41 47 50 53 60 61 64 65 7 74 79 83 84 86 87 92 97
1 10 11 13 14 16 17 20 24 25 26 32 35 36 39 4 40 41 44 5 51 52 53 55 56 58 62 63 67 69 70 72 84 88 89 91 93
0 10 12 19 20 27 3 34 37 4 40 46 47 49 5 52 53 55 57 6 60 62 66 67 73 74 75 77 79 85 88 93 97
2 23 28 3 35 4 42 45 46 47 50 52 6 7 70 73 76 77 79 80 89 91 93 94 98
12 21 25 3 30 33 34 40 43 48 52 55 57 6 70 73 77 79 8 80 81 82 84 88 89 9 90 91 94 97
13 15 16 18 22 26 28 30 31 34 35 37 4 40 41 42 43 50 54 56 62 77 80 82 83 84 88 89 94 95 96 97 98 99
20 22 24 25 26 28 29 3 32 36 40 43 44 46 47 48 49 50 55 57 59 63 65 69 70 73 77 85 86 88 93 94 97
11 18 19 28 30 32 36 37 43 44 45 48 5 53 55 56 61 68 69 7 70 74 77 80 81 82 85 86 9 93 96
11 16 2 21 22 23 26 39 46 50 58 62 63 66 67 70 71 74 75 78 93 95 96 97
0 1 13 15 17 19 22 30 34 39 40 42 43 46 47 48 53 58 59 62 63 64 67 70 72 77 78 83 85 87 89 9 91 97 99
11 13 17 18 19 2 21 23 26 28 31 35 38 4 42 43 45 49 51 54 57 61 67 69 7 76 78 8 81 82 86 90 91 94 98
1 11 12 14 19 2 25 29 3 31 32 35 38 4 40 44 5 50 53 55 56 60 65 69 71 76 78 81 82 9 91 94 96 99
0 12 13 14 17 18 2 20 23 24 26 27 31 35 36 37 38 4 42 45 50 58 6 62 63 64 65 67 7 70 72 73 79 81 82 89 9 91 92 93 97 99
14 2 21 3 32 33 35 37 41 42 43 47 48 5 52 54 59 60 69 70 76 78 80 81 87 88 9 90 94 98
1 16 17 21 23 27 28 29 35 36 39 4 40 43 47 57 61 63 71 73 74 75 81 87 91 93 95
0 11 12 13 15 20 23 31 33 34 35 38 39 40 51 58 65 77 80 82 87 91
0 10 13 18 21 22 3 31 32 36 41 42 43 46 5 50 51 53 55 56 59 63 66 68 7 70 71 72 73 76 77 79 8 81 83 85 93 95
12 17 2 23 25 27 29 31 34 35 36 39 4 42 43 44 46 49 53 58 6 63 65 66 69 72 74 77 79 80 83 85 86 87 9 91 94 97 98 99
10 11 14 17 19 2 20 22 28 32 33 34 37 39 43 46 47 50 51 52 53 57 58 59 6 61 66 68 69 7 71 79 82 88 89 9 91 94 96 97 98
1 10 14 17 19 2 20 27 29 3 32 34 36 48 50 52 54 56 59 6 7 73 76 77 78 79 80 82 85 88 9 90 93 95 97
14 19 20 21 22 23 24 29 33 39 41 43 49 53 54 59 6 63 67 7 72 78 81 83 84 85 87 93 94 96
0 1 11 15 2 23 25 29 3 30 31 33 34 37 39 4 46 47 48 50 54 56 58 69 7 73 77 78 80 81 82 85 89 9 91 92 93 96
0 11 24 27 29 36 37 4 44 47 55 56 58 59 6 63 64 65 66 67 68 70 72 73 76 77 82 9 96 97
0 10 18 19 21 22 24 35 36 39 41 43 44 48 51 55 58 60 62 63 64 66 69 70 71 72 73 77 78 8 81 82 85 86 89
1 14 16 17 20 23 27 29 31 32 33 38 4 46 51 54 56 58 59 65 66 72 75 76 81 82 85 92 93 94 98 99
17 24 27 28 29 3 30 38 39 42 43 46 48 52 53 55 56 58 59 60 67 68 69 76 77 78 79 84 86 87 91 92 93 94 95 96 97
1 21 25 28 3 36 37 38 39 44 45 47 5 50 54 59 6 62 64 67 71 74 76 77 78 79 80 89 93 94
12 13 18 19 2 22 26 29 30 39 4 43 45 46 50 52 54 55 57 58 59 60 64 66 67 72 77 80 83 84 87 88 90 92 93 96 98
0 17 19 2 20 22 23 29 36 37 43 44 50 53 54 57 59 65 70 71 73 75 77 78 79 84 88 89 90 91 92 95 98 99
10 11 13 20 24 30 32 34 35 36 40 43 44 46 54 61 65 66 70 73 79 81 86 88 92
0 1 11 12 13 17 2 22 28 3 30 43 48 49 50 51 52 59 6 63 65 66 69 73 75 78 8 86 87 89 9 91 95 99
1 13 17 19 23 29 30 32 39 40 41 42 46 48 5 50 54 55 56 61 62 63 68 7 71 73 77 78 8 82 85 90 94 99
1 12 15 16 17 18 19 22 26 29 31 33 36 37 39 4 44 48 57 63 64 68 69 70 73 78 83 84 86 89 92 95 96 98 99
0 10 11 19 23 29 31 32 34 36 37 44 46 51 52 54 59 6 61 7 71 75 76 80 81 82 85 86 92 93 94 95 99
0 12 13 14 17 2 21 22 27 4 41 42 43 44 45 46 50 52 54 57 62 64 72 73 77 81 84 87 89
0 14 15 17 20 21 22 25 29 30 32 34 42 46 49 50 53 54 56 6 60 61 66 69 70 71 72 75 77 81 82 89 91 92 98
13 14 18 19 21 26 32 35 38 42 43 58 59 60 61 64 69 70 72 75 76 78 83 84 85 86 90 94 97 99
1 13 15 17 18 22 23 25 3 34 35 38 39 40 43 44 46 5 51 53 54 60 62 67 68 69 72 77 80 81 82 86 88 89 91 92 93 94 96 98
15 16 24 25 35 36 39 4 42 46 47 48 49 50 51 60 66 67 68 69 7 71 72 74 75 79 8 89 90 91 94 96 99
13 14 16 17 19 20 23 31 34 38 39 4 49 5 50 56 62 63 64 69 7 71 73 75 77 78 80 81 85 86 87 93 98
10 11 15 17 18 19 20 24 25 31 32 33 34 40 49 5 53 56 58 60 61 62 63 64 65 72 74 8 85 86 87 94 97 98
0 18 25 29 30 33 34 40 41 44 47 51 55 67 68 7 70 72 75 8 80 81 87 9 93 95 97 98 99
0 11 13 16 18 21 27 28 3 30 39 4 40 44 47 50 52 57 58 59 60 61 65 67 68 70 72 74 77 79 8 83 87 89 9 90 92 98
15 18 22 23 27 28 3 32 35 36 37 4 42 44 47 48 50 54 55 59 60 66 69 70 74 77 78 83 84 92 97
0 13 2 3 7 8
0 11 13 14 18 26 27 29 3 40 48 49 5 50 51 52 53 58 59 6 62 63 65 7 72 79 81 86 87 88 9 94 95 96 97 98
0 1 10 14 16 17 18 22 23 25 27 29 30 33 39 4 42 45 47 52 56 6 60 64 65 7 70 75 77 83 84 86 88 94 96
0 13 16 18 21 23 26 28 34 41 44 45 50 58 59 6 61 64 66 74 75 76 77 78 80 81 82 85 96 98
1 12 21 22 24 26 29 34 43 44 45 46 47 51 52 53 55 57 63 64 71 73 78 79 84 87 88 9 90 95 96 99
1 10 11 17 18 2 22 23 25 26 30 33 37 43 50 54 59 64 65 67 7 72 74 76 77 8 82 83 88 90 93 94 96 97
10 11 12 13 19 23 33 36 38 4 44 48 49 51 52 61 64 76 77 79 80 81 83 92 99
12 14 17 19 23 24 28 3 30 35 36 4 45 47 51 53 57 60 62 66 67 68 69 71 72 73 75 79 80 81 82 86 89 93 97 98 99
0 13 15 17 22 26 27 28 29 3 32 34 38 4 40 42 47 48 5 52 53 54 56 58 60 61 63 65 66 67 74 8 83 85 87 88 90 92 93 94 98 99
12 13 16 17 18 19 26 27 28 29 30 33 36 38 40 45 47 52 56 59 6 63 7 75 79 83 87 89 9 93 99
1 13 14 20 22 24 26 28 3 30 31 32 33 34 38 39 43 44 50 51 6 60 62 63 66 70 74 77 81 83 88 89 9 90 92 95
0 1 13 19 25 26 32 33 34 37 40 48 50 51 52 6 62 63 64 68 71 72 75 76 79 81 83 88 89 91 96 97
10 11 13 14 2 20 22 23 24 26 27 28 3 31 38 4 44 45 48 49 5 50 51 52 57 58 59 6 61 63 72 75 81 84 85 86 93 97
0 1 10 11 16 21 25 26 29 30 34 35 38 39 40 45 46 51 66 67 68 7 72 74 78 8 80 81 94 95 97 98 99
14 15 16 17 3 30 31 33 35 38 40 46 49 52 54 58 6 60 63 64 66 68 69 7 70 71 73 75 78 79 82 84 87 89 90 93 99
10 14 22 26 28 33 36 37 39 5 50 52 53 54 62 72 74 77 82 84 87 88 9
1 10 13 20 21 23 24 25 26 29 3 36 37 42 44 47 48 59 61 65 67 69 70 72 74 75 79 80 82 86 89 96
0 1 14 17 18 19 22 30 33 37 40 44 45 55 59 68 71 76 77 78 79 89 92
0 10 15 18 2 20 23 24 3 31 35 36 38 42 48 49 5 50 51 54 62 63 65 67 69 79 81 82 84 85 88 89 9 92 99
11 20 21 24 25 26 27 3 30 31 47 49 50 58 65 66 69 70 74 75 76 80 83 84 88 92 95 96 97
1 10 13 15 17 2 21 22 24 25 32 35 44 46 47 49 5 50 51 59 60 62 63 67 7 75 78 79 80 83 84 86 87 91 92 93 94 95 97 98 99
11 19 2 20 23 27 3 30 32 39 40 41 45 46 47 48 52 54 56 60 61 62 64 65 67 71 72 74 77 8 80 81 84 90 95 97 99
1 10 13 15 16 17 19 2 20 22 25 31 32 38 44 50 55 57 6 61 63 68 79 82 83 85 9 90 93 99
11 15 17 18 19 22 26 29 30 32 34 43 44 45 49 50 52 58 6 61 66 7 71 72 83 86 88 89 9 97
0 12 13 15 20 24 27 31 32 40 42 44 46 49 5 52 53 56 6 64 74 77 78 83 84 88 92 93 95 99
1 12 13 15 16 17 18 19 2 20 28 30 31 32 33 35 36 39 43 44 46 50 52 53 58 59 60 66 67 69 7 72 73 74 75 79 80 82 87 88 9 93 95
1 10 11 14 17 2 23 25 26 29 33 40 42 45 46 5 56 6 61 67 68 69 70 71 73 8 88 96 97 98 99
0 10 13 21 23 24 35 37 38 4 41 43 45 48 53 56 57 6 62 64 75 76 78 81 87 88 92
1 11 21 24 25 3 30 31 34 39 41 42 49 51 56 59 60 61 7 72 75 78 82 83 84 9 90 93 97 98 99
0 10 13 15 24 26 27 28 29 33 37 38 45 46 48 50 51 52 53 6 62 69 7 71 72 74 79 8 80 81 82 86 89 91 94
12 14 2 23 24 25 28 3 36 37 42 44 45 47 51 56 63 64 65 66 67 71 76 77 79 8 80 82 89 94 95
10 11 14 15 17 20 21 22 27 29 32 34 37 4 46 52 53 55 56 57 58 6 61 63 70 73 78 79 8 85 86 88 89 91 96 97
1 14 18 19 22 3 31 35 37 38 39 41 45 48 5 50 57 59 64 65 72 73 74 76 79 8 80 82 85 89 95 97 99
12 13 14 16 17 24 27 29 34 38 39 4 40 42 44 47 55 59 6 60 66 67 68 69 70 71 72 8 85 88 89 9 90 96
10 15 16 17 22 23 26 27 28 29 30 35 38 4 44 46 51 52 53 6 63 64 65 66 7 70 73 85 9 90 92 93 99
10 13 15 2 20 30 34 35 39 40 5 50 51 52 56 58 6 66 68 74 78 79 82 85 87 88 90 91 94 96 99
0 17 18 19 21 22 28 3 34 37 41 48 49 50 51 54 56 58 59 63 68 70 72 75 80 88 9 90 93 95 97 98
10 12 13 14 18 19 22 24 28 33 36 40 41 42 43 50 54 55 57 58 61 62 63 66 69 70 72 74 81 82 86 88 89 90 96
0 12 13 14 15 19 26 28 31 34 38 45 49 51 56 61 62 67 69 71 72 75 76 77 78 83 85 9 97
1 10 13 14 16 18 19 20 21 23 25 26 28 35 48 50 52 54 57 60 62 76 78 82 9 98 99
11 27 29 35 38 4 45 46 47 52 56 58 59 6 61 68 7 71 72 74 75 80 86 88
1 11 16 17 19 2 21 22 23 28 3 30 31 33 34 38 41 42 43 44 46 48 51 59 61 7 70 78 79 80 82 86 88 89 91 93 94 95 97 98 99
1 10 12 13 16 17 19 20 21 23 24 27 3 30 32 33 34 35 36 38 42 46 47 48 49 51 57 58 6 60 64 68 73 76 84 85 87 9 98 99
10 14 19 2 24 26 27 29 35 38 39 40 43 45 47 49 5 59 6 60 62 66 67 72 73 74 75 77 78 80 83 88 90 93 94 98
1 12 14 16 19 22 24 27 30 33 35 38 4 40 42 45 47 49 5 51 53 54 6 65 69 70 74 86 87 89 9 91 98
0 1 12 13 23 25 27 28 32 37 40 42 45 46 47 55 57 6 62 71 73 75 76 80 83 86 90 91 95 97
10 11 12 14 17 20 21 23 29 30 31 32 33 38 43 45 5 51 52 53 56 57 58 60 7 76 77 79 8 83 84 85 89 9 93 94 97
0 12 13 14 16 19 20 21 24 28 32 33 37 38 39 4 42 51 52 54 55 56 59 61 65 68 71 76 77 78 79 8 81 87 88 9 90 91 96
16 17 19 22 24 25 3 30 37 38 40 42 46 54 58 73 74 75 76 78 79 83 86 89 92 94 96 98
0 13 18 29 35 37 40 41 42 43 47 51 56 57 59 63 64 67 70 76 78 84 88 9 90 97 98 99
13 16 19 2 23 24 33 34 35 36 39 42 43 5 52 54 62 66 68 72 73 75 77 79 83 86 91 93 94 97
1 12 13 2 25 26 28 3 35 4 46 47 49 52 54 56 63 64 65 68 74 76 79 8 80 81 82 83 88 9 90 94 96
0 11 14 17 2 22 23 28 29 37 38 39 4 46 48 5 50 51 54 57 58 6 60 64 68 69 7 72 73 74 85 88 89 90 96
10 14 17 19 2 40 44 48 5 50 52 53 60 62 64 66 68 70 72 77 83 85 88 90 95 98
11 17 21 23 25 27 39 4 43 5 53 56 64 68 72 79 8 87 95
1 12 17 2 20 21 24 25 26 27 29 32 34 38 39 41 44 45 46 5 54 6 63 65 67 74 77 83 84 85 86 87 88 92 94 96 99
0 14 17 2 23 25 30 31 40 41 42 44 48 49 51 54 55 57 58 6 60 62 69 71 85 86 87 89 93 94 95 97 99
11 12 14 17 22 23 34 37 39 4 42 44 45 47 48 49 51 57 62 63 66 69 72 77 8 89 91 99
16 2 21 33 35 36 38 39 4 42 45 49 50 52 53 54 63 65 70 72 73 80 82 98
0 1 13 15 18 28 3 30 33 34 37 39 41 42 43 45 5 53 57 6 60 66 67 69 7 71 72 74 8 81 86 87 88 9 91 92 93 98 99
12 15 2 21 22 25 26 27 29 34 36 41 45 47 49 53 59 60 61 62 63 72 74 78 81 89 90 95 96 99
0 11 12 31 33 34 4 40 42 49 5 52 53 58 62 7 71 72 75 78 79 8 83 86 92 95 99
1 14 18 2 21 24 27 28 3 34 4 40 44 51 56 62 7 72 75 78 8 80 81 82 83 88 89 90 93
0 1 11 15 16 17 18 20 21 22 23 27 28 3 33 34 36 40 42 44 50 52 54 6 61 62 65 67 72 76 79 80 84 85 92 93 97 98 99
0 17 19 23 26 29 30 34 36 39 40 41 42 43 48 49 51 52 53 55 56 59 60 62 67 68 70 73 74 79 80 84 88 89 90 96 97
1 11 12 15 2 20 22 23 25 26 28 3 34 36 38 39 46 48 52 53 55 58 6 61 64 65 66 7 71 72 74 76 78 8 80 83 95 97 99
11 15 16 19 21 22 23 25 26 3 32 33 34 38 45 50 52 62 66 76 77 82 85 86 88 9 91 92 95 96
0 1 10 11 13 14 15 16 18 20 24 26 28 31 32 33 4 45 47 49 50 52 54 61 63 65 69 7 70 73 74 75 77 8 80 85 86 89 91 96 98
12 17 2 20 21 22 25 27 28 33 37 39 41 43 46 48 5 58 60 64 65 68 69 7 71 72 78 80 82 84 96 98
11 12 13 14 15 16 19 20 22 38 39 46 48 5 55 59 6 61 62 64 67 70 76 77 79 8 81 83 84 85 87 89 92 94 95
1 11 14 15 16 18 20 21 24 28 30 31 32 33 34 35 37 38 39 40 41 43 45 49 5 62 67 68 69 8 81 83 87 88 89 9 90 94 98
1 15 17 22 25 26 35 36 39 4 5 50 51 53 54 59 60 63 64 66 67 69 7 71 73 75 8 81 82 84 86 89 91
0 1 13 15 17 19 22 24 28 3 30 33 34 35 36 38 40 43 48 55 59 60 61 62 63 64 73 80 90 93 94
10 16 2 22 23 24 26 28 29 31 32 34 39 42 51 53 54 55 6 63 64 66 67 68 7 71 76 79 81 85 87 89 9 91 98 99
12 23 24 25 28 30 32 37 38 39 40 46 49 57 65 66 67 68 71 75 77 85 86 88 89 9 90 94 96
0 10 16 19 25 26 27 28 30 31 32 33 37 38 40 41 53 54 58 6 62 64 66 69 70 71 77 78 80 81 84 86 88 89 91 92 97 98
12 15 17 21 22 23 25 27 30 38 40 43 44 49 54 55 56 59 61 62 65 66 68 70 74 77 79 84 86 9 94
1 13 14 15 17 2 25 29 31 36 37 43 45 46 48 52 55 56 62 65 66 69 72 74 8 80 83 85 87 92 93
0 1 10 12 14 18 21 24 25 3 32 34 35 43 45 47 49 5 51 52 53 56 6 60 62 64 71 72 76 89 90 92 99
10 11 13 17 19 2 20 22 25 34 37 38 39 40 41 43 45 46 48 49 54 56 62 64 67 7 72 73 74 75 77 79 83 9 90 91 92 93 96 97
0 1 11 20 28 29 3 31 33 34 36 37 38 39 4 40 47 48 49 5 50 57 58 59 61 62 63 65 67 68 69 71 75 79 88 90 96 97
1 11 16 18 2 22 26 31 32 34 39 45 47 50 51 6 62 67 69 71 77 78 8 87 88 89 9 91 95
12 20 22 23 25 26 30 31 35 39 47 48 51 52 55 56 62 64 67 7 70 75 79 82 86 88 9 91 92 93 96 98
10 12 15 18 22 25 27 28 30 32 34 35 37 45 46 47 49 50 52 56 59 6 62 65 68 74 75 80 84 87 88 90 94 95 96 98
0 1 11 12 19 2 21 23 24 25 30 37 41 42 43 44 45 48 49 5 51 52 59 60 63 64 66 68 71 74 78 79 82 84 86 89 9 96 97
1 11 16 17 20 21 23 28 29 30 32 33 4 40 41 43 44 46 49 58 61 67 68 69 7 77 82 84 85 92 93 96 99
10 18 2 20 23 25 29 32 33 34 43 44 55 57 58 59 60 61 62 63 64 7 72 75 79 8 84 87 94 95 96 97
0 10 11 19 22 24 25 27 30 31 33 34 36 44 56 6 62 63 65 7 71 74 76 83 85 86 9 95 97 98
0 1 14 16 18 19 20 25 27 3 35 36 40 5 51 53 59 63 67 68 7 70 77 85 94 98 99
0 15 17 2 22 28 30 40 43 45 5 52 56 6 60 61 69 70 72 76 82 83 85 90 91 94
12 13 14 17 18 24 29 32 36 37 38 4 47 49 5 51 62 66 67 68 70 71 72 73 75 76 90 95 96 97 98
12 15 20 30 33 34 35 4 42 49 5 50 53 56 62 65 66 73 75 84 85 88 93 94 96 97 98 99
0 10 12 15 16 2 24 27 31 34 36 37 38 46 47 49 5 50 51 53 54 56 57 61 62 65 7 72 78 86 9 90 91 94 99
10 11 17 21 24 32 36 39 41 43 48 54 66 67 7 71 73 76 78 79 84 88 89 9 91 93 96
10 12 13 15 16 17 19 2 21 26 30 31 34 37 41 43 44 47 48 5 50 51 60 62 63 68 70 73 78 8 80 81 83 85 87 88 89 91 92 95
1 10 12 17 26 30 32 35 36 39 4 40 43 44 47 5 54 6 62 68 69 70 73 75 79 8 80 81 89 9 90 97 99
0 1 10 11 15 16 23 26 28 32 33 34 4 45 46 51 55 57 59 61 64 65 67 68 72 73 78 81 83 89 91 97
1 10 16 21 23 24 3 31 32 33 35 36 39 41 45 46 47 48 52 54 57 6 61 62 65 72 74 75 77 78 79 8 81 82 84 85 89 91
0 10 16 18 23 29 32 37 39 48 51 53 57 58 6 62 66 67 7 73 75 76 79 83 85 88 93 98
10 17 19 24 25 26 3 30 31 32 38 39 43 49 50 52 56 7 70 72 73 74 78 83 85 88 89 91 98
11 13 14 15 16 18 20 21 29 31 32 33 38 41 44 46 5 50 55 57 66 7 71 76 79 86 87 91 93 95 96 97 98 99
11 13 15 16 17 25 28 29 30 32 4 42 43 45 47 48 49 51 52 54 59 6 60 73 74 80 81 83 88 90 91 99
11 13 17 18 2 22 24 26 28 29 30 33 34 35 37 4 42 44 48 53 54 59 60 61 68 69 74 75 77 82 84 86 90 92 93 98
1 11 15 16 19 25 26 3 31 32 35 36 38 44 45 47 48 49 53 55 56 58 64 67 68 72 76 8 80 82 83 84 86 87 89 9 91 92 99
0 10 16 20 23 29 38 40 49 56 58 59 6 60 61 62 63 64 65 66 68 69 7 72 76 78 80 81 82 88 89 91 94 97 99
18 19 2 26 28 30 31 39 4 42 43 45 46 48 49 51 71 72 77 83 85 89 93 96 98
0 10 17 18 2 20 21 24 29 35 36 37 39 4 42 5 55 57 58 6 61 63 64 69 73 74 75 76 77 78 8 80 81 82 84 96 97
17 26 29 33 39 43 44 46 52 53 55 60 66 67 69 70 71 80 81 82 85 88 89 90 92 94 95
0 12 15 2 22 25 27 30 31 39 4 41 45 46 47 48 49 5 51 52 54 59 6 61 69 7 70 73 75 76 80 83 85 89 94 96 98
17 19 25 27 28 3 33 37 43 46 47 50 54 58 59 6 60 63 64 65 73 8 89 90 94 96
14 15 16 17 2 21 22 24 27 36 4 44 45 5 51 54 60 62 64 69 7 72 77 78 85 89 91 93 94 96 99
1 13 15 2 22 24 26 27 28 36 42 49 50 52 53 58 59 68 70 74 82 83 85 88 89 9 92 94
13 17 18 20 22 23 26 29 3 33 40 41 42 46 48 49 5 55 57 6 61 62 63 64 67 7 72 75 81 85 90 91 92 94 95
14 16 17 19 21 25 27 28 3 38 46 5 52 55 59 6 60 62 64 7 71 74 76 77 8 81 87 88 9 90 91 95 97 98
0 14 15 18 19 2 21 23 25 33 35 37 47 48 49 52 56 58 64 66 76 78 79 8 80 82 83 89 94 95 97
13 16 22 26 40 43 45 47 54 62 63 65 68 69 70 71 74 75 77 80 86 87 9 90 92 93 95 98
11 13 14 16 19 2 24 25 26 34 37 41 44 48 50 6 64 65 67 69 7 73 74 76 77 80 81 85 86 87 9 90 93 99
2 20 23 24 25 28 29 37 38 39 45 5 50 51 52 54 56 58 59 61 63 64 66 67 69 70 73 76 77 8 88 93 94 98 99
15 17 36 37 4 41 42 47 5 50 53 56 60 62 67 68 70 72 73 80 84 88 89 9 90 91 92 94 97 98
12 18 2 20 22 23 26 3 30 34 37 40 46 49 5 58 6 60 61 63 64 68 69 76 80 82 84 85 87 90 92
12 13 2 23 24 26 27 3 4 40 46 50 51 53 55 56 57 59 6 60 73 76 82 87 88 91 93 95 96 99
0 16 17 18 22 23 29 34 35 36 37 40 41 43 48 49 51 52 54 60 62 67 70 75 76 8 81 89 91 92 95
10 11 16 18 22 25 32 36 42 43 45 49 50 55 61 63 65 69 71 72 77 78 80 81 82 83 86 90 99
1 12 18 19 22 28 29 30 32 36 37 50 54 56 57 6 60 62 63 72 73 74 76 79 85 89 9 96 97