0.0 1.0
1.0 1.0
2.0 1.0
3.0 1.0
4.0 1.0
5.0 1.0
6.0 1.0
7.0 1.0
8.0 1.0
9.0 0.21760477
10.0 0.13783498
11.0 0.11372283
12.0 0.09980352
13.0 0.087435775
14.0 0.07691364
15.0 0.068482764
16.0 0.0630041
17.0 0.064290635
18.0 0.06329142
19.0 0.061332315
20.0 0.053282417
21.0 0.05309687
22.0 0.054756388
23.0 0.052621584
24.0 0.058733303
25.0 0.05957596
26.0 0.056228902
27.0 0.064645946
28.0 0.07281642
29.0 0.069208294
30.0 0.06542624
31.0 0.055471856
32.0 0.060413055
33.0 0.07691671
34.0 0.08478259
35.0 0.09756744
36.0 0.11136195
37.0 0.121365696
38.0 0.12326893
39.0 0.13389064
40.0 0.13360183
41.0 0.121855244
42.0 0.12964047
43.0 0.12947349
44.0 0.1278889
45.0 0.12659834
46.0 0.10420512
47.0 0.1038524
48.0 0.102258414
49.0 0.10209936
50.0 0.09195437
51.0 0.097503625
52.0 0.08919108
53.0 0.0890542
54.0 0.104736865
55.0 0.10225547
56.0 0.11737801
57.0 0.13700348
58.0 0.13907981
59.0 0.121240765
60.0 0.130362
61.0 0.12237881
62.0 0.15151823
63.0 0.16977637
64.0 0.18106337
65.0 0.19401102
66.0 0.1981061
67.0 0.19625905
68.0 0.1838693
69.0 0.16795383
70.0 0.16726428
71.0 0.16055048
72.0 0.16567786
73.0 0.15404885
74.0 0.14939879
75.0 0.13994713
76.0 0.13035607
77.0 0.14632003
78.0 0.11884787
79.0 0.10332058
80.0 0.09509711
81.0 0.109608665
82.0 0.11866258
83.0 0.12187002
84.0 0.14134279
85.0 0.14503418
86.0 0.15276122
87.0 0.15393722
88.0 0.15076834
89.0 0.14852889
90.0 0.17719083
91.0 0.20932335
92.0 0.24289948
93.0 0.24646333
94.0 0.24460728
95.0 0.2302516
96.0 0.23196603
97.0 0.22795276
98.0 0.20501928
99.0 0.21759978
100.0 0.23298092
101.0 0.22463153
102.0 0.22184692
103.0 0.19929901
104.0 0.17346258
105.0 0.13065809
106.0 0.13414682
107.0 0.10562553
108.0 0.10149104
109.0 0.13425535
110.0 0.15106365
111.0 0.11540417
112.0 0.12636282
113.0 0.12514652
114.0 0.15834568
115.0 0.13712955
116.0 0.16663085
117.0 0.19417885
118.0 0.22430699
119.0 0.24253613
120.0 0.2422601
121.0 0.24155025
122.0 0.1878697
123.0 0.17390087
124.0 0.17277691
125.0 0.20056404
126.0 0.19786172
127.0 0.17969845
128.0 0.20148237
129.0 0.21262883
130.0 0.22271812
131.0 0.2279005
132.0 0.2195221
133.0 0.23164757
134.0 0.22536853
135.0 0.22609526
136.0 0.25486666
137.0 0.24307287
138.0 0.25369278
139.0 0.24695279
140.0 0.22682968
141.0 0.23109293
142.0 0.28603843
143.0 0.2647956
144.0 0.2541152
145.0 0.25571245
146.0 0.2772191
147.0 0.27319664
148.0 0.2686047
149.0 0.27377987
150.0 0.26309282
151.0 0.24855144
152.0 0.23720415
153.0 0.23929006
154.0 0.23996481
155.0 0.25046882
156.0 0.24506715
157.0 0.2705057
158.0 0.2777541
159.0 0.26918
160.0 0.26991105
161.0 0.2786109
162.0 0.2524671
163.0 0.22231604
164.0 0.18134971
165.0 0.17965686
166.0 0.20785363
167.0 0.19951962
168.0 0.18662365
169.0 0.1633497
170.0 0.13913138
171.0 0.166111
172.0 0.16445611
173.0 0.1601928
174.0 0.16170046
175.0 0.186727
176.0 0.19547324
177.0 0.19306254
178.0 0.18617302
179.0 0.17876674
180.0 0.1642321
181.0 0.16137157
182.0 0.17678165
183.0 0.1668748
184.0 0.19714227
185.0 0.19827057
186.0 0.1939343
187.0 0.24562337
188.0 0.24205564
189.0 0.25378847
190.0 0.266013
191.0 0.27891606
192.0 0.27488607
193.0 0.266362
194.0 0.27359727
195.0 0.2756756
196.0 0.2861606
197.0 0.28281957
198.0 0.26337996
199.0 0.2724267
200.0 0.27131906
201.0 0.27026972
202.0 0.27820787
203.0 0.28322238
204.0 0.28380856
205.0 0.25505155
206.0 0.2463225
207.0 0.22277366
208.0 0.19624062
209.0 0.19977337
210.0 0.18617006
211.0 0.16478072
212.0 0.16897704
213.0 0.17630191
214.0 0.17456466
215.0 0.1805729
216.0 0.19901744
217.0 0.20177181
218.0 0.19197698
219.0 0.1904291
220.0 0.21007867
221.0 0.21831304
222.0 0.2118865
223.0 0.21216227
224.0 0.22778523
225.0 0.21124133
226.0 0.22713393
227.0 0.24547099
228.0 0.26720148
229.0 0.26805562
230.0 0.27500117
231.0 0.29324841
232.0 0.29970062
233.0 0.29973525
234.0 0.2945718
235.0 0.280578
236.0 0.2895599
237.0 0.2911682
238.0 0.29534453
239.0 0.28672954
240.0 0.26015443
241.0 0.2590639
242.0 0.27402917
243.0 0.2671538
244.0 0.2562817
245.0 0.27170277
246.0 0.24121626
247.0 0.22235367
248.0 0.2278069
249.0 0.20073038
250.0 0.19766568
251.0 0.19738676
252.0 0.18034257
253.0 0.17283727
254.0 0.17743243
255.0 0.18168794
256.0 0.20523727
257.0 0.20676526
258.0 0.1899647
259.0 0.18839727
260.0 0.18285018
261.0 0.1805349
262.0 0.16868109
263.0 0.16111955
264.0 0.1331041
265.0 0.14658436
266.0 0.14963947
267.0 0.15093538
268.0 0.13412459
269.0 0.113201365
270.0 0.10343642
271.0 0.117903195
272.0 0.10814227
273.0 0.110665366
274.0 0.10814324
275.0 0.12445467
276.0 0.13434218
277.0 0.15891632
278.0 0.16263701
279.0 0.17331675
280.0 0.19608904
281.0 0.21245845
282.0 0.22327316
283.0 0.20984437
284.0 0.2164609
285.0 0.2271125
286.0 0.2233004
287.0 0.21576309
288.0 0.22253121
289.0 0.22862996
290.0 0.21449313
291.0 0.23192313
292.0 0.21232706
293.0 0.19202285
294.0 0.1899128
295.0 0.20496207
296.0 0.20485656
297.0 0.2116875
298.0 0.2062452
299.0 0.18867739
300.0 0.18224896
301.0 0.19499765
302.0 0.17867498
303.0 0.18958691
304.0 0.18622476
305.0 0.22130623
306.0 0.23371269
307.0 0.23338768
308.0 0.23809496
309.0 0.25545618
310.0 0.24658586
311.0 0.23465973
312.0 0.22249581
313.0 0.20559056
314.0 0.2137326
315.0 0.21356347
316.0 0.21891132
317.0 0.22044557
318.0 0.23601475
319.0 0.23043194
320.0 0.21389653
321.0 0.21717028
322.0 0.19629827
323.0 0.20210387
324.0 0.21902747
325.0 0.21883336
326.0 0.21865103
327.0 0.22522914
328.0 0.21719375
329.0 0.20403633
330.0 0.2008337
331.0 0.20616901
332.0 0.19455177
333.0 0.22379488
334.0 0.21446268
335.0 0.22804703
336.0 0.20779155
337.0 0.21158308
338.0 0.20082754
339.0 0.1878074
340.0 0.18274637
341.0 0.1707881
342.0 0.17716493
343.0 0.18181798
344.0 0.19465129
345.0 0.18057044
346.0 0.19611377
347.0 0.22288334
348.0 0.24462189
349.0 0.2537771
350.0 0.25963014
351.0 0.26891565
352.0 0.27583927
353.0 0.2901529
354.0 0.2988681
355.0 0.30544102
356.0 0.30061233
357.0 0.30026445
358.0 0.30148324
359.0 0.2948188
360.0 0.28035313
361.0 0.27629557
362.0 0.25925606
363.0 0.2521032
364.0 0.23006955
365.0 0.20122276
366.0 0.188832
367.0 0.1921509
368.0 0.16502547
369.0 0.15348257
370.0 0.16560043
371.0 0.15344074
372.0 0.16497587
373.0 0.14889134
374.0 0.15844993
375.0 0.14818902
376.0 0.19167951
377.0 0.20398852
378.0 0.19061679
379.0 0.19959956
380.0 0.18492608
381.0 0.18279059
382.0 0.18619128
383.0 0.18156463
384.0 0.19297709
385.0 0.19523664
386.0 0.19934459
387.0 0.21324496
388.0 0.22311358
389.0 0.23390713
390.0 0.23118548
391.0 0.24809207
392.0 0.2391785
393.0 0.24824426
394.0 0.25204858
395.0 0.2413361
396.0 0.25436807
397.0 0.24628168
398.0 0.2469351
399.0 0.25906393
400.0 0.28316507
401.0 0.28248915
402.0 0.28345558
403.0 0.2530651
404.0 0.24227065
405.0 0.2358851
406.0 0.2774475
407.0 0.28123984
408.0 0.27819157
409.0 0.28646445
410.0 0.28349015
411.0 0.27978104
412.0 0.27057132
413.0 0.28060806
414.0 0.29362866
415.0 0.28991672
416.0 0.28293684
417.0 0.2853828
418.0 0.25618804
419.0 0.24503195
420.0 0.23483938
421.0 0.23572461
422.0 0.23597105
423.0 0.25518632
424.0 0.23380348
425.0 0.22925381
426.0 0.22933757
427.0 0.24293008
428.0 0.23100157
429.0 0.24202529
430.0 0.21989504
431.0 0.22260216
432.0 0.23758999
433.0 0.23413992
434.0 0.27447006
435.0 0.29589128
436.0 0.30132136
437.0 0.30129963
438.0 0.29441
439.0 0.32398885
440.0 0.3090557
441.0 0.3139797
442.0 0.29980326
443.0 0.3229425
444.0 0.31975904
445.0 0.3002758
446.0 0.3073136
447.0 0.29681033
448.0 0.28267306
449.0 0.29735017
450.0 0.2828111
451.0 0.2900881
452.0 0.30765328
453.0 0.32657906
454.0 0.29484656
455.0 0.32915148
456.0 0.30040798
457.0 0.290625
458.0 0.29012895
459.0 0.30487412
460.0 0.3178836
461.0 0.34562066
462.0 0.355343
463.0 0.31110018
464.0 0.322323
465.0 0.32067502
466.0 0.2822308
467.0 0.30288124
468.0 0.3048309
469.0 0.32170108
470.0 0.30308127
471.0 0.30501837
472.0 0.3397763
473.0 0.33379602
474.0 0.33784875
475.0 0.3448699
476.0 0.36415127
477.0 0.35659987
478.0 0.37110418
479.0 0.39710543
480.0 0.42337024
481.0 0.45620772
482.0 0.4783391
483.0 0.5172379
484.0 0.50473046
485.0 0.5294706
486.0 0.53876275
487.0 0.5394192
488.0 0.55850226
489.0 0.5715848
490.0 0.58489096
491.0 0.5841028
492.0 0.60961586
493.0 0.59587586
494.0 0.63466954
495.0 0.6015388
496.0 0.61714846
497.0 0.65218246
498.0 0.67070353
499.0 0.6867057
500.0 0.711932
501.0 0.72292995
502.0 0.761391
503.0 0.76543367
504.0 0.7976825
505.0 0.8155463
506.0 0.8478814
507.0 0.849728
508.0 0.89084786
509.0 0.83574647
510.0 0.83584285
511.0 0.8513257
512.0 0.87010366
513.0 0.8813171
514.0 0.85969496
515.0 0.852845
516.0 0.8533037
517.0 0.8572307
518.0 0.8654934
519.0 0.86254096
520.0 0.86437666
521.0 0.8578971
522.0 0.88058573
523.0 0.897835
524.0 0.8856537
525.0 0.8648057
526.0 0.8708961
527.0 0.899363
528.0 0.8973842
529.0 0.8961987
530.0 0.8845113
531.0 0.9061119
532.0 0.89847904
533.0 0.88407856
534.0 0.8974541
535.0 0.9099994
536.0 0.90531075
537.0 0.9191601
538.0 0.9224594
539.0 0.92205215
540.0 0.9466259
541.0 0.95707005
542.0 0.9567289
543.0 0.9713602
544.0 0.96869
545.0 0.9535142
546.0 0.9709338
547.0 0.9699803
548.0 0.969598
549.0 0.96807325
550.0 0.9675329
551.0 0.96610487
552.0 0.9672716
553.0 0.9653891
554.0 0.96515846
555.0 0.96146965
556.0 0.9640021
557.0 0.9591741
558.0 0.95817906
559.0 0.9610217
560.0 0.9627441
561.0 0.9628544
562.0 0.9627125
563.0 0.94869256
564.0 0.96138155
565.0 0.92681205
566.0 0.92297614
567.0 0.9210036
568.0 0.91761976
569.0 0.91712236
570.0 0.91715366
571.0 0.91304713
572.0 0.92075276
573.0 0.927707
574.0 0.9201767
575.0 0.92641854
576.0 0.9375281
577.0 0.9342948
578.0 0.9345396
579.0 0.94779
580.0 0.949026
581.0 0.9459705
582.0 0.9371047
583.0 0.93944573
584.0 0.9552886
585.0 0.9582863
586.0 0.96284497
587.0 0.96469927
588.0 0.9675233
589.0 0.9703951
590.0 0.97015166
591.0 1.0
592.0 1.0
593.0 1.0
594.0 1.0
595.0 1.0
596.0 1.0
597.0 0.9858182
598.0 0.98635226
599.0 0.98663545
600.0 0.9868286
601.0 0.98662406
602.0 0.97086436
603.0 0.96886754
604.0 0.9682027
605.0 0.9693818
606.0 0.9675593
607.0 0.96799886
608.0 0.9685059
609.0 0.9642278
610.0 0.9822028
611.0 0.98024684
612.0 0.98119724
613.0 0.98425674
614.0 0.9837908
615.0 1.0
616.0 1.0
617.0 1.0
618.0 1.0
619.0 1.0
620.0 1.0
621.0 1.0
622.0 1.0
623.0 0.98269504
624.0 0.9810316
625.0 0.98113585
626.0 0.98273176
627.0 0.98239684
628.0 0.9828825
629.0 0.98317623
630.0 0.9830842
631.0 0.98332185
632.0 0.9822761
633.0 0.9850141
634.0 0.98551804
635.0 0.984671
636.0 1.0
637.0 1.0
638.0 1.0
639.0 1.0
640.0 1.0
641.0 1.0
642.0 1.0
643.0 1.0
644.0 1.0
645.0 1.0
646.0 1.0
647.0 1.0
648.0 1.0
649.0 1.0
650.0 1.0
651.0 0.97534245
652.0 0.9624522
653.0 0.96021444
654.0 0.9602624
655.0 0.9637356
656.0 0.96580046
657.0 0.96489674
658.0 0.96516585
659.0 0.9658519
660.0 0.95567435
661.0 0.95492154
662.0 0.9548984
663.0 0.9550369
664.0 0.97540045
665.0 0.98766595
666.0 0.9886729
667.0 0.9886553
668.0 0.98798376
669.0 0.98773205
670.0 0.988562
671.0 0.98775804
672.0 0.98840684
673.0 1.0
674.0 0.9875414
675.0 0.9876159
676.0 0.9882032
677.0 0.9750794
678.0 0.97362024
679.0 0.96978825
680.0 0.97079855
681.0 0.94323945
682.0 0.9254545
683.0 0.91091204
684.0 0.9155535
685.0 0.91490453
686.0 0.9136273
687.0 0.9215174
688.0 0.91714114
689.0 0.91376406
690.0 0.8945631
691.0 0.8941566
692.0 0.89809525
693.0 0.88850397
694.0 0.9121884
695.0 0.93568027
696.0 0.96136457
697.0 0.96390146
698.0 0.96460825
699.0 0.97097605
700.0 0.9698422
701.0 0.97211117
702.0 0.9735392
703.0 0.98668087
704.0 0.98871654
705.0 0.98885626
706.0 0.98764235
707.0 1.0
708.0 1.0
709.0 1.0
710.0 1.0
711.0 1.0
712.0 1.0
713.0 1.0
714.0 1.0
715.0 1.0
716.0 1.0
717.0 1.0
718.0 1.0
719.0 1.0
720.0 1.0
721.0 1.0
722.0 1.0
723.0 1.0
724.0 1.0
725.0 1.0
726.0 1.0
727.0 1.0
728.0 1.0
729.0 1.0
730.0 1.0
731.0 1.0
732.0 1.0
733.0 0.98634803
734.0 0.9847328
735.0 0.9826499
736.0 0.9820853
737.0 0.98392606
738.0 0.9843231
739.0 0.98409605
740.0 0.9841717
741.0 0.98290116
742.0 0.98262525
743.0 0.98139477
744.0 0.981322
745.0 0.982336
746.0 1.0
747.0 0.98301095
748.0 0.9827562
749.0 0.98353934
750.0 0.9832749
751.0 0.9833812
752.0 0.98546726
753.0 0.9867683
754.0 0.9752507
755.0 0.97462445
756.0 0.97641736
757.0 0.9759236
758.0 0.9761121
759.0 0.97624004
760.0 0.9884215
761.0 0.97601825
762.0 0.9652705
763.0 0.96567935
764.0 0.96498626
765.0 0.9652375
766.0 0.9597453
767.0 0.97390544
768.0 0.9741876
769.0 0.9745377
770.0 0.97410697
771.0 0.9616211
772.0 0.96302325
773.0 0.9598263
774.0 0.97641104
775.0 0.9890567
776.0 0.98917
777.0 0.98870087
778.0 0.97829574
779.0 0.9773009
780.0 0.9777279
781.0 0.9784618
782.0 0.97881085
783.0 0.979619
784.0 0.9892427
785.0 0.98893094
786.0 0.9889732
787.0 0.9876291
788.0 0.9877914
789.0 0.9877232
790.0 0.9871168
791.0 1.0
792.0 0.9861779
793.0 0.9850914
794.0 0.985539
795.0 0.98553044
796.0 0.9843766
797.0 0.9875745
798.0 0.98696464
799.0 0.987809
800.0 0.9882562
801.0 0.98797196
802.0 0.98819435
803.0 0.9883503
804.0 0.98908335
805.0 1.0
806.0 1.0
807.0 1.0
808.0 1.0
809.0 1.0
810.0 1.0
811.0 1.0
812.0 0.977694
813.0 0.9778637
814.0 0.976607
815.0 0.9748295
816.0 0.97282714
817.0 0.97084117
818.0 0.9726699
819.0 0.97256064
820.0 0.9334789
821.0 0.9337438
822.0 0.937913
823.0 0.93879884
824.0 0.94306064
825.0 0.9635893
826.0 0.9621893
827.0 0.9606422
828.0 0.9589247
829.0 0.96017355
830.0 0.9586644
831.0 0.9550093
832.0 0.943985
833.0 0.97054
834.0 0.9700192
835.0 0.96687174
836.0 0.9652714
837.0 0.9471493
838.0 0.93951243
839.0 0.935974
840.0 0.924326
841.0 0.9280449
842.0 0.9382714
843.0 0.94818825
844.0 0.9486085
845.0 0.96424234
846.0 0.98109365
847.0 0.9837344
848.0 0.9866533
849.0 0.9879733
850.0 1.0
851.0 1.0
852.0 1.0
853.0 1.0
854.0 1.0
855.0 1.0
856.0 1.0
857.0 1.0
858.0 1.0
859.0 1.0
860.0 1.0
861.0 1.0
862.0 1.0
863.0 0.9878897
864.0 0.9736234
865.0 0.9714161
866.0 0.97325075
867.0 0.9702588
868.0 0.9703611
869.0 0.97258633
870.0 0.97308356
871.0 0.9622759
872.0 0.96183676
873.0 0.96245646
874.0 0.9583667
875.0 0.96002376
876.0 0.9747179
877.0 0.9887131
878.0 0.98884434
879.0 0.98871136
880.0 0.9780649
881.0 0.9657596
882.0 0.96624374
883.0 0.9663059
884.0 0.9772362
885.0 0.9759763
886.0 0.9762105
887.0 0.9638331
888.0 0.9638331
889.0 0.9507574
890.0 0.9405451
891.0 0.9422522
892.0 0.9418855
893.0 0.94975483
894.0 0.96347016
895.0 0.9650624
896.0 0.9663764
897.0 0.96375555
898.0 0.9633013
899.0 0.9498466
900.0 0.962684
901.0 0.96289414
902.0 0.97551286
903.0 0.987919
904.0 0.9881638
905.0 0.98868924
906.0 0.9884447
907.0 0.98840195
908.0 0.9882216
909.0 0.98883134
910.0 0.9886053
911.0 0.98771834
912.0 1.0
913.0 1.0
914.0 1.0
915.0 0.9851126
916.0 0.9849813
917.0 0.9846988
918.0 0.98479515
919.0 0.9848539
920.0 0.98645496
921.0 0.97223985
922.0 0.97160274
923.0 0.9698256
924.0 0.971043
925.0 0.95621705
926.0 0.9534781
927.0 0.9482045
928.0 0.9621502
929.0 0.94658804
930.0 0.93759465
931.0 0.9287761
932.0 0.92047155
933.0 0.92586714
934.0 0.94044596
935.0 0.94146967
936.0 0.9469674
937.0 0.9513465
938.0 0.96400696
939.0 0.9655321
940.0 0.9648387
941.0 0.9664688
942.0 0.9774211
943.0 0.9887828
944.0 1.0
945.0 1.0
946.0 0.98916465
947.0 0.9895368
948.0 0.97966903
949.0 0.9794397
950.0 0.9795164
951.0 0.97936237
952.0 0.9781163
953.0 0.9777279
954.0 0.9661883
955.0 0.965919
956.0 0.9624693
957.0 0.9625589
958.0 0.9602552
959.0 0.97175795
960.0 0.9717052
961.0 0.9856879
962.0 0.984066
963.0 0.9860497
964.0 0.9861692
965.0 0.9873439
966.0 0.98712134
967.0 0.98622733
968.0 0.9857251
969.0 0.98570186
970.0 0.98602575
971.0 0.9861892
972.0 0.9862117
973.0 0.9869048
974.0 0.9858857
975.0 0.98553807
976.0 0.9703531
977.0 0.96829677
978.0 0.9683676
979.0 0.96550596
980.0 0.982982
981.0 0.98222303
982.0 0.98141676
983.0 0.9833887
984.0 0.9832749
985.0 0.9841865
986.0 0.9836387
987.0 0.9687257
988.0 0.94687223
989.0 0.9654245
990.0 0.9526558
991.0 0.9543832
992.0 0.95414823
993.0 0.95246106
994.0 0.9511028
995.0 0.94362193
996.0 0.93664503
997.0 0.9376109
998.0 0.9440385
999.0 0.9457033
1000.0 0.9645797
1001.0 0.9805201
1002.0 0.98122936
1003.0 1.0
1004.0 1.0
1005.0 1.0
1006.0 1.0
1007.0 1.0
1008.0 1.0
1009.0 1.0
1010.0 1.0
1011.0 1.0
1012.0 1.0
1013.0 1.0
1014.0 1.0
1015.0 1.0
1016.0 1.0
1017.0 1.0
1018.0 1.0
1019.0 1.0
1020.0 1.0
1021.0 1.0
1022.0 1.0
1023.0 1.0
1024.0 1.0
1025.0 1.0
1026.0 1.0
1027.0 1.0
1028.0 1.0
1029.0 1.0
1030.0 1.0
1031.0 0.9816128
1032.0 0.9833003
1033.0 0.9828558
1034.0 0.9823445
1035.0 0.9830999
1036.0 0.9830542
1037.0 0.9467262
1038.0 0.9262468
1039.0 0.9150253
1040.0 0.9118465
1041.0 0.90803725
1042.0 0.8983593
1043.0 0.9091104
1044.0 0.92338455
1045.0 0.92850363
1046.0 0.93272495
1047.0 0.93280214
1048.0 0.9287645
1049.0 0.9248911
1050.0 0.9610494
1051.0 0.9810316
1052.0 1.0
1053.0 1.0
1054.0 1.0
1055.0 1.0
1056.0 1.0
1057.0 1.0
1058.0 0.980984
1059.0 0.98232603
1060.0 0.98294497
1061.0 0.9598752
1062.0 0.96142566
1063.0 0.9577405
1064.0 0.95947546
1065.0 0.9612965
1066.0 0.9613442
1067.0 0.9595947
1068.0 0.96192384
1069.0 0.9641021
1070.0 0.9657267
1071.0 0.98387176
1072.0 0.98488307
1073.0 0.98529303
1074.0 1.0
1075.0 1.0
1076.0 1.0
1077.0 1.0
1078.0 1.0
1079.0 1.0
1080.0 0.9864991
1081.0 0.9870789
1082.0 0.9868923
1083.0 0.9757066
1084.0 0.97566485
1085.0 0.975377
1086.0 0.9739735
1087.0 0.96342355
1088.0 0.9651308
1089.0 0.96355706
1090.0 0.96012294
1091.0 0.9581206
1092.0 0.93547994
1093.0 0.94777447
1094.0 0.9490526
1095.0 0.94868356
1096.0 0.95838773
1097.0 0.95816576
1098.0 0.9600746
1099.0 0.9596862
1100.0 0.97233075
1101.0 0.9714607
1102.0 0.9673761
1103.0 0.9634205
1104.0 0.9615337
1105.0 1.0
1106.0 1.0
1107.0 1.0
1108.0 0.9734961
1109.0 0.973862
1110.0 0.97239685
1111.0 0.97221875
1112.0 0.9736519
1113.0 0.9766394
1114.0 0.9770878
1115.0 0.95452017
1116.0 0.9604069
1117.0 0.9462306
1118.0 0.9517827
1119.0 0.95385927
1120.0 0.95626646
1121.0 0.9724919
1122.0 0.9719634
1123.0 0.96042234
1124.0 0.9587834
1125.0 0.9583377
1126.0 0.95653194
1127.0 0.95797366
1128.0 0.97260344
1129.0 0.9721854
1130.0 0.9859462
1131.0 0.9857547
1132.0 0.9847286
1133.0 0.9842466
1134.0 0.98395896
1135.0 0.9818544
1136.0 1.0
1137.0 1.0
1138.0 1.0
1139.0 1.0
1140.0 1.0
1141.0 1.0
1142.0 1.0
1143.0 1.0
1144.0 1.0
1145.0 1.0
1146.0 1.0
1147.0 1.0
1148.0 1.0
1149.0 1.0
1150.0 0.9842081
1151.0 0.9842872
1152.0 0.9838836
1153.0 0.9671885
1154.0 0.94846785
1155.0 0.95072985
1156.0 0.9495026
1157.0 0.9490536
1158.0 0.95291966
1159.0 0.936448
1160.0 0.9379341
1161.0 0.9346273
1162.0 0.925679
1163.0 0.940019
1164.0 0.94655335
1165.0 0.94772375
1166.0 0.95398176
1167.0 0.9697987
1168.0 0.9709203
1169.0 0.970056
1170.0 0.96678907
1171.0 0.9668267
1172.0 0.9828571
1173.0 0.9822546
1174.0 0.98014146
1175.0 0.9779548
1176.0 0.97896004
1177.0 0.97997856
1178.0 0.97957635
1179.0 1.0
1180.0 0.98173517
1181.0 0.9832545
1182.0 0.98311156
1183.0 0.98317623
1184.0 0.98312455
1185.0 0.98335475
1186.0 0.9817987
1187.0 0.98243207
1188.0 0.9842432
1189.0 0.9832225
1190.0 0.96865875
1191.0 0.96869
1192.0 0.9704608
1193.0 0.986676
1194.0 0.9870797
1195.0 0.9750893
1196.0 0.9750964
1197.0 0.9725726
1198.0 0.9714477
1199.0 0.9710525
1200.0 0.968652
1201.0 0.95652044
1202.0 0.95119333
1203.0 0.96754724
1204.0 0.95034367
1205.0 0.95384634
1206.0 0.9572788
1207.0 0.9566577
1208.0 0.97102964
1209.0 0.9737134
1210.0 0.9735392
1211.0 0.97404116
1212.0 0.9730687
1213.0 0.97250396
1214.0 0.98508936
1215.0 0.985296
1216.0 0.9853812
1217.0 1.0
1218.0 1.0
1219.0 1.0
1220.0 1.0
1221.0 0.9835035
1222.0 0.98311543
1223.0 0.9822028
1224.0 0.9805512
1225.0 0.98133624
1226.0 0.9811908
1227.0 0.9797664
1228.0 0.9815928
1229.0 0.98197055
1230.0 0.98287183
1231.0 0.9688123
1232.0 0.96987325
1233.0 0.95891446
1234.0 0.97234124
1235.0 0.9738417
1236.0 0.97444284
1237.0 0.9754307
1238.0 0.9631432
1239.0 0.9630999
1240.0 0.9628061
1241.0 0.96097326
1242.0 0.9621958
1243.0 0.96305645
1244.0 0.9746537
1245.0 0.9596343
1246.0 0.9712665
1247.0 0.9541674
1248.0 0.93100786
1249.0 0.9280469
1250.0 0.93209577
1251.0 0.95066345
1252.0 0.94357365
1253.0 0.94476104
1254.0 0.9483021
1255.0 0.95205283
1256.0 0.9541738
1257.0 0.9545844
1258.0 0.97047865
1259.0 0.97066593
1260.0 0.9852743
1261.0 1.0
1262.0 0.9853137
1263.0 0.9848789
1264.0 0.9857177
1265.0 0.9847392
1266.0 0.9841956
1267.0 0.9830083
1268.0 0.98150444
1269.0 0.98266226
1270.0 0.9825535
1271.0 0.9823728
1272.0 0.98270184
1273.0 0.9816159
1274.0 0.97848815
1275.0 1.0
1276.0 1.0
1277.0 1.0
1278.0 0.9750241
1279.0 0.97417545
1280.0 0.9719132
1281.0 0.9714977
1282.0 0.9677
1283.0 0.9725212
1284.0 0.9720313
1285.0 0.9716705
1286.0 0.97144955
1287.0 0.9713751
1288.0 0.96985877
1289.0 0.96900374
1290.0 0.97209877
1291.0 1.0
1292.0 1.0
1293.0 0.97572535
1294.0 0.9748612
1295.0 0.9735408
1296.0 0.97518784
1297.0 0.9524936
1298.0 0.9578379
1299.0 0.9554564
1300.0 0.95735896
1301.0 0.9551974
1302.0 0.9536271
1303.0 0.95581925
1304.0 0.95713425
1305.0 0.96043897
1306.0 0.97881395
1307.0 0.98039496
1308.0 0.97986287
1309.0 0.97926205
1310.0 1.0
1311.0 1.0
1312.0 1.0
1313.0 1.0
1314.0 0.980277
1315.0 0.98114234
1316.0 0.98167115
1317.0 0.981929
1318.0 0.9819528
1319.0 0.9825715
1320.0 0.98207355
1321.0 0.9815928
1322.0 0.9806181
1323.0 0.95720947
1324.0 0.95765084
1325.0 0.95401543
1326.0 0.95214164
1327.0 0.97409934
1328.0 0.9707148
1329.0 0.9635086
1330.0 0.9640874
1331.0 0.9552658
1332.0 0.9584952
1333.0 0.9600867
1334.0 0.9545907
1335.0 0.9566178
1336.0 1.0
1337.0 1.0
1338.0 1.0
1339.0 1.0
1340.0 1.0
1341.0 1.0
1342.0 1.0
1343.0 1.0
1344.0 0.96733004
1345.0 0.97212356
1346.0 0.97310996
1347.0 0.9738277
1348.0 0.9447355
1349.0 0.9443716
1350.0 0.9442162
1351.0 0.9551608
1352.0 0.95866317
1353.0 0.9606974
1354.0 0.9621372
1355.0 0.9630916
1356.0 0.96480954
1357.0 0.98132676
1358.0 0.96131694
1359.0 0.9620062
1360.0 0.96227056
1361.0 0.98071516
1362.0 0.98047686
1363.0 0.9792992
1364.0 0.978954
1365.0 0.9784184
1366.0 0.9763373
1367.0 0.97357583
1368.0 0.96869445
1369.0 0.9674944
1370.0 0.95974284
1371.0 1.0
1372.0 1.0
1373.0 1.0
1374.0 1.0
1375.0 0.93987125
1376.0 0.94021493
1377.0 0.93965644
1378.0 0.9303791
1379.0 0.9490141
1380.0 0.9447703
1381.0 0.91668534
1382.0 0.9258922
1383.0 0.9314974
1384.0 0.92574185
1385.0 0.9364434
1386.0 0.93648016
1387.0 0.9361941
1388.0 0.9692812
1389.0 0.9730539
1390.0 0.9743294
1391.0 0.97374326
1392.0 0.94982374
1393.0 0.91897523
1394.0 0.94852424
1395.0 0.9431476
1396.0 0.9437663
1397.0 0.94270265
1398.0 0.9440599
1399.0 0.94311816
1400.0 0.9396316
1401.0 0.9399616
1402.0 0.932101
1403.0 0.93393904
1404.0 0.94104147
1405.0 0.97289085
1406.0 1.0
1407.0 1.0
1408.0 0.97108114
1409.0 0.97096646
1410.0 0.97047865
1411.0 0.9723238
1412.0 0.9746289
1413.0 0.9736519
1414.0 0.9708082
1415.0 0.9747427
1416.0 0.9750865
1417.0 0.973992
1418.0 0.94837296
1419.0 0.9312867
1420.0 0.93272495
1421.0 0.95390445
1422.0 0.95515627
1423.0 0.9512439
1424.0 0.9525142
1425.0 0.9511951
1426.0 0.94222033
1427.0 0.94458914
1428.0 0.94497097
1429.0 0.94032866
1430.0 0.9460589
1431.0 0.9702507
1432.0 1.0
1433.0 1.0
1434.0 1.0
1435.0 1.0
1436.0 1.0
1437.0 1.0
1438.0 1.0
1439.0 0.9720384
1440.0 0.9750298
1441.0 0.95256543
1442.0 0.9575075
1443.0 0.9574869
1444.0 0.958632
1445.0 0.95990086
1446.0 0.9576957
1447.0 0.95656633
1448.0 0.95896816
1449.0 0.9583851
1450.0 0.9580673
1451.0 0.9549447
1452.0 0.9747804
1453.0 0.9731789
1454.0 1.0
1455.0 1.0
1456.0 1.0
1457.0 1.0
1458.0 1.0
1459.0 1.0
1460.0 1.0
1461.0 1.0
1462.0 1.0
1463.0 0.9573341
1464.0 0.95896816
1465.0 0.96001405
1466.0 0.959423
1467.0 0.96128964
1468.0 0.92798203
1469.0 0.9356048
1470.0 0.94388837
1471.0 0.945218
1472.0 0.94542223
1473.0 0.9415281
1474.0 0.9368999
1475.0 0.9312078
1476.0 0.96632314
1477.0 0.9679498
1478.0 0.9645854
1479.0 0.9602528
1480.0 0.9653727
1481.0 1.0
1482.0 0.9617148
1483.0 0.9647898
1484.0 0.9618478
1485.0 0.92648226
1486.0 0.92652774
1487.0 0.92663604
1488.0 0.92680657
1489.0 0.9270385
1490.0 0.9273306
1491.0 0.92768145
1492.0 0.9280893
1493.0 0.9285522
1494.0 0.94584054
1495.0 0.96353406
1496.0 0.9815994
1497.0 1.0
1498.0 1.0186962
1499.0 1.0376455