57
41
89
75
97
17 46
32
70
55
0
67 8
27 8
2
81
43
27
86
11
42
21 77
43 81
5 57
2 24 55
58
24 29 3
50
17
17 59 82
83
98
21 32
65
87 99
32
47
46
60 76
68 83
0
60
22
12 51 83 86
26 46 48
92 99
20
28 79
65
22
12
78
16
90
84
66
69
2 37 88
29 80
70
67
69
70
95
99
49
20
25 6
17
91
36
11 36
21 7
91
10 14
62 95
86
5 88
6
59
3
71
69
29
96
33 68
11 16
48
11 55
18
86
14 27
38 55
99
2
84
85
1
82
86
61
78 99
77 92
11
56
12 82
64
90
71
23 85
31
39
87
99
7
3
44 67
62
4 60
60 78
86
8
13 78
28 59 75
80
89
36 58
92
38
48
34
27
45 73
21
3
19 25 6 80 94
39 51
61
33 76 91
39
80
70
62
44
7
73
16
42 66
5 97
87
17 22 57
35
19
87
39
4 96
47
76
40 73
11
79
3 61
94
25 41
45
68
31
97
80
19
2
61
58
41
22 93
37 48
4
58
72
2
37
9
15
36 63
13
39
14
26 68
33
77
34
73 92
6
77
75
22
96
83
73 83 84
29 48 5
28
81 97
87
16 88
33 82 96
27 86