"Rank","Move","Name","Country","Points","Height","Weight","Plays","TopRank"
"1","0","Djokovic Novak","Serbia","9725",187,80,"right",1
"2","0","Sinner Jannik","Italy","8710",188,76,"right",2
"3","0","Alcaraz Carlos","Spain","8645",185,72,"right",1
"4","0","Medvedev Daniil","Russia","7165",198,83,"right",1
"5","0","Zverev Alexander","Germany","5415",198,90,"right",2
"6","0","Rublev Andrey","Russia","4890",188,70,"right",5
"7","0","Rune Holger","Denmark","3795",185,68,"right",4
"8","2","Hurkacz Hubert","Poland","3665",196,81,"right",8
"9","0","Dimitrov Grigor","Bulgaria","3540",191,81,"right",3
"10","-2","Ruud Casper","Norway","3465",183,77,"right",2
"11","0","De Minaur Alex","Australia","3355",183,69,"right",9
"12","0","Tsitsipas Stefanos","Greece","3175",193,89,"right",3
"13","0","Fritz Taylor","USA","2765",193,86,"right",5
"14","2","Shelton Ben","USA","2490",NA,NA,"left",14
"15","-1","Humbert Ugo","France","2425",188,73,"left",14
"16","-1","Paul Tommy","USA","2350",185,82,"right",12
"17","0","Khachanov Karen","Russia","2005",198,87,"right",8
"18","0","Bublik Alexander","Kazakhstan","1992",198,77,"right",18
"19","0","Baez Sebastian","Argentina","1955",170,70,"right",19
"20","0","Mannarino Adrian","France","1875",180,79,"left",17
"21","1","Jarry Nicolas","Chile","1755",198,90,"right",18
"22","1","Cerundolo Francisco","Argentina","1715",185,78,"right",19
"23","-2","Tiafoe Frances","USA","1685",188,86,"right",10
"24","0","Musetti Lorenzo","Italy","1590",185,75,"right",15
"25","1","Struff Jan-Lennard","Germany","1493",193,92,"right",21
"26","-1","Griekspoor Tallon","Netherlands","1475",188,85,"right",21
"27","0","Korda Sebastian","USA","1445",193,75,"right",23
"28","1","Lehecka Jiri","Czech Republic","1400",183,80,"right",23
"29","-1","Davidovich Fokina Alejandro","Spain","1395",183,80,"right",21
"30","1","Norrie Cameron","Great Britain","1290",188,82,"left",8
"31","-1","Etcheverry Tomas Martin","Argentina","1260",196,82,"right",27
"32","1","Thompson Jordan","Australia","1235",183,82,"right",32
"33","-1","Coric Borna","Croatia","1204",188,85,"right",12
"34","0","Djere Laslo","Serbia","1185",188,82,"right",27
"35","1","Auger Aliassime Felix","Canada","1150",193,88,"right",6
"36","1","Fils Arthur","France","1145",NA,NA,"right",34
"37","1","Marozsan Fabian","Hungary","1122",NA,NA,"right",37
"38","-3","Arnaldi Matteo","Italy","1121",NA,NA,"right",35
"39","0","Draper Jack","Great Britain","1101",191,80,"left",37
"40","5","Monfils Gael","France","1092",193,85,"right",6
"41","-1","Safiullin Roman","Russia","1089",185,75,"right",36
"42","-1","Eubanks Christopher","USA","1087",201,82,"right",29
"43","1","Karatsev Aslan","Russia","1073",185,85,"right",14
"44","3","Ofner Sebastian","Austria","1056",191,81,"right",37
"45","3","Tabilo Alejandro","Chile","1051",188,75,"left",39
"46","0","Popyrin Alexei","Australia","1047",196,78,"right",38
"47","-4","Machac Tomas","Czech Republic","1033",183,73,"right",43
"48","3","Giron Marcos","USA","1030",180,77,"right",44
"49","0","Zhang Zhizhen","China","1005",193,87,"right",46
"50","-8","Evans Daniel","Great Britain","996",175,75,"right",21
