Store_Location,Customer_ID,Age_Group,Product_Quality_Rating,Staff_Friendliness_Rating,Perthleanliness_Rating,Overall_Satisfaction_Rating
Gold Coast,1,26-35,4,5,5,4
Brisbane,2,36-45,4,5,4,4
Sunshine Coast,3,36-45,5,3,3,4
Sunshine Coast,4,56+,5,4,2,4
Sunshine Coast,5,46-55,4,3,4,4
Melbourne,6,56+,4,4,3,4
Sunshine Coast,7,36-45,5,4,4,4
Perth,8,56+,5,3,4,4
Gold Coast,9,36-45,4,4,4,4
Brisbane,10,26-35,4,3,2,4
Brisbane,11,56+,4,4,5,4
Gold Coast,12,18-25,4,4,3,4
Perth,13,26-35,4,4,5,4
Melbourne,14,18-25,2,3,2,2
Brisbane,15,36-45,3,4,5,4
Melbourne,16,18-25,4,5,3,4
Melbourne,17,46-55,3,4,2,4
Brisbane,18,36-45,4,3,2,4
Melbourne,19,18-25,3,4,3,4
Gold Coast,20,36-45,3,5,4,4
Sunshine Coast,21,46-55,5,3,4,4
Brisbane,22,18-25,4,4,2,4
Sunshine Coast,23,18-25,4,3,3,4
Brisbane,24,26-35,3,4,5,4
Perth,25,18-25,4,3,5,4
Sunshine Coast,26,18-25,4,3,4,4
Brisbane,27,36-45,3,3,3,3
Melbourne,28,46-55,4,4,3,4
Sunshine Coast,29,56+,4,4,4,4
Sunshine Coast,30,46-55,4,3,2,4
Sunshine Coast,31,46-55,4,5,3,4
Brisbane,32,18-25,5,3,1,4
Melbourne,33,56+,4,4,3,4
Melbourne,34,56+,3,3,4,3
Melbourne,35,46-55,5,3,2,4
Brisbane,36,36-45,3,4,5,4
Perth,37,56+,4,3,2,4
Gold Coast,38,56+,2,4,1,3
Sunshine Coast,39,46-55,3,5,3,4
Sunshine Coast,40,26-35,4,4,4,4
Perth,41,56+,5,5,5,5
Gold Coast,42,46-55,4,3,2,4
Perth,43,26-35,4,4,4,4
Brisbane,44,46-55,4,5,3,4
Brisbane,45,46-55,3,2,3,2
Gold Coast,46,36-45,3,3,4,3
Brisbane,47,18-25,4,4,4,4
Gold Coast,48,26-35,5,4,1,4
Melbourne,49,18-25,4,4,5,4
Gold Coast,50,26-35,3,4,5,4
Melbourne,51,26-35,4,4,2,4
Perth,52,56+,4,4,3,4
Perth,53,36-45,3,5,4,4
Brisbane,54,36-45,4,4,3,4
Melbourne,55,46-55,5,4,2,4
Melbourne,56,18-25,5,4,2,4
Melbourne,57,46-55,3,4,3,4
Melbourne,58,36-45,4,4,4,4
Sunshine Coast,59,46-55,4,4,4,4
Sunshine Coast,60,36-45,5,4,3,4
Perth,61,36-45,4,4,4,4
Sunshine Coast,62,26-35,4,5,1,4
Brisbane,63,46-55,3,5,4,4
Sunshine Coast,64,26-35,3,4,1,4
Gold Coast,65,46-55,5,5,3,5
Melbourne,66,36-45,5,4,2,4
Perth,67,36-45,4,2,1,3
Gold Coast,68,56+,5,3,4,4
Sunshine Coast,69,26-35,4,3,2,4
Gold Coast,70,18-25,3,4,3,4
Gold Coast,71,46-55,4,4,3,4
Gold Coast,72,18-25,5,5,4,5
Sunshine Coast,73,56+,4,4,3,4
Gold Coast,74,36-45,5,4,1,4
Gold Coast,75,26-35,2,5,4,4
Gold Coast,76,18-25,5,2,2,4
Brisbane,77,26-35,4,4,1,4
Gold Coast,78,36-45,4,5,2,4
Sunshine Coast,79,26-35,4,3,5,4
Perth,80,26-35,2,5,4,4
Brisbane,81,46-55,4,4,3,4
Melbourne,82,18-25,4,4,3,4
Melbourne,83,56+,5,5,3,5
Sunshine Coast,84,26-35,4,5,5,4
Brisbane,85,26-35,3,4,3,4
Brisbane,86,56+,4,4,4,4
Melbourne,87,18-25,5,4,4,4
Perth,88,36-45,4,3,3,4
Gold Coast,89,46-55,4,5,3,4
Perth,90,56+,4,3,3,4
Brisbane,91,26-35,4,4,3,4
Sunshine Coast,92,36-45,5,4,3,4
Perth,93,46-55,3,4,4,4
Perth,94,56+,4,4,3,4
Brisbane,95,26-35,4,5,4,4
Melbourne,96,18-25,3,4,3,4
Brisbane,97,56+,4,4,3,4
Perth,98,26-35,4,3,1,4
Perth,99,36-45,4,4,4,4
Sunshine Coast,100,56+,4,4,3,4
Perth,101,46-55,3,5,4,4
Sunshine Coast,102,18-25,4,3,1,4
Perth,103,56+,4,5,5,4
Melbourne,104,56+,3,5,3,4
Perth,105,18-25,4,4,4,4
Sunshine Coast,106,36-45,4,5,2,4
Sunshine Coast,107,46-55,5,3,4,4
Sunshine Coast,108,26-35,4,3,2,4
Perth,109,36-45,4,3,2,4
Sunshine Coast,110,26-35,4,5,5,4
Gold Coast,111,46-55,2,5,3,4
Melbourne,112,36-45,4,4,3,4
Perth,113,56+,4,4,4,4
Sunshine Coast,114,36-45,5,3,4,4
Melbourne,115,26-35,4,5,3,4
Perth,116,56+,4,4,3,4
Melbourne,117,18-25,4,4,5,4
Gold Coast,118,36-45,3,5,3,4
Perth,119,36-45,5,4,3,4
Sunshine Coast,120,56+,5,4,4,4
Brisbane,121,36-45,5,3,4,4
Sunshine Coast,122,56+,3,4,4,4
Perth,123,18-25,5,5,4,5
Sunshine Coast,124,36-45,3,5,2,4
Brisbane,125,26-35,4,5,5,4
Brisbane,126,36-45,5,4,2,4
Brisbane,127,56+,3,3,3,3
Sunshine Coast,128,56+,4,4,2,4
Perth,129,26-35,4,4,3,4
Sunshine Coast,130,26-35,4,5,3,4
Brisbane,131,56+,3,3,3,3
Gold Coast,132,56+,4,5,4,4
Brisbane,133,36-45,3,4,5,4
Brisbane,134,56+,4,4,4,4
Perth,135,26-35,3,3,3,3
Sunshine Coast,136,36-45,5,3,4,4
Perth,137,56+,3,5,4,4
Sunshine Coast,138,18-25,4,4,2,4
Brisbane,139,26-35,5,3,4,4
Brisbane,140,18-25,3,3,4,3
Brisbane,141,36-45,4,4,3,4
Sunshine Coast,142,26-35,5,5,5,5
Brisbane,143,36-45,3,4,3,4
Perth,144,46-55,4,3,3,4
Perth,145,26-35,4,4,3,4
Brisbane,146,36-45,5,4,3,4
Gold Coast,147,18-25,3,2,2,2
Sunshine Coast,148,36-45,3,4,1,4
Gold Coast,149,56+,4,4,5,4
Brisbane,150,56+,4,5,2,4
Gold Coast,151,18-25,4,5,2,4
Sunshine Coast,152,36-45,4,5,1,4
Sunshine Coast,153,26-35,3,4,2,4
Gold Coast,154,18-25,4,3,1,4
Melbourne,155,36-45,4,5,5,4
Sunshine Coast,156,46-55,3,4,4,4
Brisbane,157,56+,5,4,2,4
Brisbane,158,18-25,4,4,5,4
Brisbane,159,36-45,3,4,4,4
Melbourne,160,46-55,5,4,3,4
Brisbane,161,56+,3,4,1,4
Gold Coast,162,46-55,5,4,5,4
Melbourne,163,18-25,5,4,1,4
Sunshine Coast,164,36-45,3,4,1,4
Melbourne,165,46-55,5,3,4,4
Brisbane,166,46-55,4,4,5,4
Brisbane,167,46-55,5,4,5,4
Gold Coast,168,26-35,5,5,4,5
Sunshine Coast,169,46-55,4,2,4,3
Sunshine Coast,170,36-45,3,5,4,4
Melbourne,171,36-45,3,5,4,4
Brisbane,172,36-45,3,2,3,2
Brisbane,173,56+,4,4,3,4
Melbourne,174,46-55,4,4,3,4
Perth,175,18-25,4,3,2,4
Brisbane,176,56+,5,3,3,4
Sunshine Coast,177,26-35,4,3,1,4
Melbourne,178,36-45,5,5,3,5
Melbourne,179,26-35,4,5,2,4
Gold Coast,180,56+,5,5,2,5
Brisbane,181,26-35,5,5,3,5
Brisbane,182,56+,3,3,5,3
Sunshine Coast,183,26-35,3,4,4,4
Perth,184,36-45,4,4,1,4
Sunshine Coast,185,46-55,4,3,2,4
Perth,186,36-45,5,5,4,5
Gold Coast,187,36-45,4,4,2,4
Sunshine Coast,188,36-45,4,4,3,4
Sunshine Coast,189,46-55,3,5,4,4
Brisbane,190,36-45,3,4,2,4
Sunshine Coast,191,56+,4,4,3,4
Brisbane,192,26-35,5,5,1,5
Gold Coast,193,46-55,4,3,2,4
Perth,194,18-25,3,4,3,4
Sunshine Coast,195,56+,4,4,1,4
Gold Coast,196,46-55,4,4,4,4
Brisbane,197,26-35,3,4,3,4
Perth,198,46-55,4,3,4,4
Sunshine Coast,199,56+,4,5,3,4
Sunshine Coast,200,56+,3,4,5,4
Melbourne,201,18-25,4,4,3,4
Sunshine Coast,202,36-45,4,5,2,4
Gold Coast,203,26-35,5,3,3,4
Sunshine Coast,204,56+,5,3,4,4
Sunshine Coast,205,56+,3,3,3,3
Melbourne,206,26-35,3,4,3,4
Melbourne,207,56+,4,3,2,4
Melbourne,208,18-25,4,5,2,4
Sunshine Coast,209,18-25,4,2,1,3
Perth,210,36-45,5,5,5,5
Perth,211,46-55,4,4,2,4
Gold Coast,212,26-35,5,4,2,4
Sunshine Coast,213,18-25,5,4,2,4
Melbourne,214,18-25,5,4,4,4
Perth,215,18-25,4,4,3,4
Sunshine Coast,216,18-25,5,5,4,5
Melbourne,217,36-45,3,4,2,4
Gold Coast,218,56+,4,4,3,4
Perth,219,18-25,4,4,2,4
Perth,220,36-45,4,4,5,4
Brisbane,221,46-55,5,4,2,4
Melbourne,222,56+,3,3,3,3
Brisbane,223,46-55,5,3,4,4
Gold Coast,224,56+,3,5,3,4
Brisbane,225,56+,4,4,3,4
Sunshine Coast,226,56+,5,4,3,4
Perth,227,36-45,4,4,3,4
Brisbane,228,26-35,3,4,3,4
Brisbane,229,46-55,3,4,4,4
Melbourne,230,56+,5,3,5,4
Melbourne,231,56+,3,4,2,4
Brisbane,232,18-25,4,3,1,4
Sunshine Coast,233,18-25,4,4,3,4
Brisbane,234,36-45,3,3,5,3
Sunshine Coast,235,56+,5,5,2,5
Brisbane,236,46-55,5,4,5,4
Gold Coast,237,46-55,2,4,5,3
Gold Coast,238,18-25,4,5,2,4
Brisbane,239,18-25,3,5,4,4
Melbourne,240,26-35,5,5,5,5
Sunshine Coast,241,56+,3,3,3,3
Gold Coast,242,56+,4,3,3,4
Sunshine Coast,243,18-25,4,4,2,4
Perth,244,18-25,5,4,2,4
Melbourne,245,18-25,3,4,2,4
Melbourne,246,26-35,4,3,2,4
Perth,247,26-35,4,4,3,4
Melbourne,248,26-35,3,3,2,3
Gold Coast,249,56+,5,4,3,4
Perth,250,26-35,4,3,1,4
Gold Coast,251,56+,3,3,3,3
Gold Coast,252,18-25,5,3,4,4
Perth,253,56+,5,3,1,4
Sunshine Coast,254,46-55,5,5,3,5
Sunshine Coast,255,36-45,3,3,4,3
Melbourne,256,18-25,4,5,2,4
Perth,257,46-55,5,4,5,4
Gold Coast,258,36-45,3,4,4,4
Sunshine Coast,259,46-55,4,3,2,4
Sunshine Coast,260,36-45,5,5,3,5
Melbourne,261,36-45,3,4,4,4
Melbourne,262,26-35,4,4,3,4
Melbourne,263,46-55,1,5,4,3
Melbourne,264,46-55,3,4,2,4
Perth,265,18-25,4,5,3,4
Brisbane,266,56+,3,3,1,3
Sunshine Coast,267,46-55,5,4,3,4
Melbourne,268,46-55,3,5,2,4
Gold Coast,269,18-25,4,3,2,4
Sunshine Coast,270,18-25,4,5,4,4
Melbourne,271,26-35,5,5,4,5
Melbourne,272,56+,3,4,4,4
Perth,273,56+,5,5,2,5
Brisbane,274,26-35,4,5,3,4
Brisbane,275,18-25,3,4,4,4
Perth,276,18-25,4,3,3,4
Gold Coast,277,18-25,4,3,5,4
Brisbane,278,46-55,4,4,3,4
Gold Coast,279,56+,4,4,3,4
Sunshine Coast,280,56+,4,4,3,4
Sunshine Coast,281,36-45,4,4,3,4
Brisbane,282,36-45,5,3,3,4
Brisbane,283,46-55,5,4,4,4
Sunshine Coast,284,46-55,3,4,4,4
Sunshine Coast,285,56+,5,4,2,4
Brisbane,286,36-45,2,5,1,4
Sunshine Coast,287,26-35,4,5,1,4
Brisbane,288,18-25,4,4,4,4
Perth,289,56+,4,4,2,4
Melbourne,290,26-35,4,3,1,4
Brisbane,291,46-55,4,4,3,4
Gold Coast,292,18-25,4,4,5,4
Brisbane,293,46-55,4,4,3,4
Sunshine Coast,294,36-45,5,3,4,4
Gold Coast,295,26-35,4,3,3,4
Gold Coast,296,18-25,3,5,3,4
Melbourne,297,18-25,5,4,4,4
Brisbane,298,46-55,4,5,3,4
Perth,299,56+,5,4,3,4
Gold Coast,300,26-35,5,4,3,4
Gold Coast,301,18-25,3,5,2,4
Perth,302,18-25,4,4,4,4
Gold Coast,303,36-45,5,4,3,4
Sunshine Coast,304,26-35,4,4,2,4
Perth,305,26-35,4,4,4,4
Sunshine Coast,306,18-25,4,4,2,4
Brisbane,307,26-35,5,4,3,4
Brisbane,308,26-35,4,4,3,4
Brisbane,309,18-25,4,5,4,4
Sunshine Coast,310,18-25,4,3,4,4
Gold Coast,311,46-55,4,4,3,4
Gold Coast,312,46-55,5,4,4,4
Perth,313,46-55,5,5,5,5
Perth,314,46-55,5,4,4,4
Gold Coast,315,26-35,5,5,3,5
Melbourne,316,36-45,4,3,1,4
Sunshine Coast,317,18-25,5,4,2,4
Sunshine Coast,318,18-25,4,5,3,4
Sunshine Coast,319,56+,4,4,2,4
Melbourne,320,36-45,4,5,3,4
Perth,321,36-45,4,4,3,4
Perth,322,18-25,4,5,4,4
Sunshine Coast,323,36-45,3,5,3,4
Perth,324,56+,5,4,4,4
Sunshine Coast,325,26-35,3,4,3,4
Gold Coast,326,46-55,3,5,1,4
Gold Coast,327,56+,5,5,2,5
Perth,328,46-55,5,4,3,4
Melbourne,329,18-25,4,4,2,4
Perth,330,26-35,5,4,4,4
Brisbane,331,56+,4,3,5,4
Sunshine Coast,332,36-45,3,3,4,3
Brisbane,333,26-35,4,3,3,4
Perth,334,56+,3,3,5,3
Gold Coast,335,26-35,5,4,3,4
Sunshine Coast,336,18-25,4,4,3,4
Perth,337,36-45,3,5,2,4
Melbourne,338,46-55,4,3,3,4
Perth,339,46-55,4,5,3,4
Melbourne,340,46-55,4,4,3,4
Gold Coast,341,56+,3,4,3,4
Melbourne,342,26-35,4,5,3,4
Brisbane,343,36-45,4,3,4,4
Brisbane,344,36-45,4,4,4,4
Brisbane,345,56+,4,4,4,4
Brisbane,346,36-45,4,4,1,4
Brisbane,347,36-45,3,4,1,4
Melbourne,348,26-35,3,5,4,4
Brisbane,349,26-35,3,3,1,3
Sunshine Coast,350,26-35,4,4,3,4
Melbourne,351,56+,4,4,2,4
Gold Coast,352,56+,5,4,1,4
Melbourne,353,56+,5,3,4,4
Perth,354,36-45,4,5,4,4
Gold Coast,355,46-55,4,5,2,4
Brisbane,356,36-45,3,4,1,4
Brisbane,357,26-35,4,3,2,4
Perth,358,46-55,4,4,3,4
Brisbane,359,18-25,4,4,1,4
Gold Coast,360,46-55,3,5,3,4
Gold Coast,361,26-35,4,4,3,4
Gold Coast,362,26-35,5,3,4,4
Melbourne,363,26-35,4,5,3,4
Melbourne,364,26-35,4,5,2,4
Gold Coast,365,18-25,5,4,4,4
Melbourne,366,46-55,4,4,3,4
Melbourne,367,18-25,4,4,3,4
Sunshine Coast,368,36-45,4,4,2,4
Melbourne,369,46-55,4,5,2,4
Sunshine Coast,370,36-45,3,5,2,4
Sunshine Coast,371,36-45,4,4,3,4
Melbourne,372,36-45,4,3,5,4
Melbourne,373,26-35,5,3,1,4
Melbourne,374,46-55,5,3,1,4
Brisbane,375,56+,5,4,5,4
Sunshine Coast,376,46-55,3,5,3,4
Brisbane,377,26-35,5,4,2,4
Gold Coast,378,46-55,4,4,4,4
Melbourne,379,26-35,5,4,2,4
Gold Coast,380,46-55,3,5,5,4
Brisbane,381,46-55,3,5,4,4
Sunshine Coast,382,36-45,4,4,2,4
Perth,383,18-25,2,4,5,3
Melbourne,384,46-55,4,5,2,4
Gold Coast,385,56+,3,5,4,4
Gold Coast,386,18-25,4,5,3,4
Gold Coast,387,56+,4,4,5,4
Brisbane,388,46-55,5,4,5,4
Brisbane,389,26-35,5,4,3,4
Perth,390,46-55,4,5,2,4
Brisbane,391,36-45,3,5,4,4
Sunshine Coast,392,26-35,4,4,2,4
Sunshine Coast,393,56+,3,5,5,4
Gold Coast,394,46-55,5,5,3,5
Melbourne,395,46-55,5,5,3,5
Gold Coast,396,26-35,4,5,3,4
Sunshine Coast,397,46-55,3,4,1,4
Sunshine Coast,398,18-25,5,4,2,4
Sunshine Coast,399,56+,4,5,4,4
Gold Coast,400,46-55,5,3,2,4
Perth,401,46-55,3,4,2,4
Melbourne,402,26-35,4,4,4,4
Perth,403,36-45,4,4,4,4
Perth,404,56+,4,5,4,4
Melbourne,405,18-25,4,4,4,4
Sunshine Coast,406,18-25,4,4,2,4
Sunshine Coast,407,26-35,3,3,1,3
Gold Coast,408,18-25,4,5,5,4
Gold Coast,409,36-45,4,5,3,4
Perth,410,46-55,4,5,3,4
Melbourne,411,56+,5,4,5,4
Melbourne,412,46-55,3,4,4,4
Brisbane,413,26-35,3,4,4,4
Brisbane,414,46-55,5,5,5,5
Perth,415,36-45,4,4,2,4
Gold Coast,416,18-25,3,4,4,4
Sunshine Coast,417,56+,5,4,3,4
Sunshine Coast,418,36-45,4,4,3,4
Perth,419,26-35,5,4,5,4
Melbourne,420,56+,4,4,4,4
Brisbane,421,46-55,5,5,4,5
Gold Coast,422,26-35,5,3,4,4
Melbourne,423,46-55,4,4,3,4
Gold Coast,424,36-45,5,3,2,4
Gold Coast,425,36-45,5,5,2,5
Perth,426,26-35,5,3,1,4
Brisbane,427,18-25,3,4,5,4
Brisbane,428,26-35,5,4,2,4
Sunshine Coast,429,18-25,5,5,3,5
Melbourne,430,26-35,3,4,3,4
Melbourne,431,26-35,3,4,3,4
Brisbane,432,56+,2,5,4,4
Gold Coast,433,18-25,4,3,4,4
Sunshine Coast,434,18-25,5,2,2,4
Sunshine Coast,435,36-45,5,4,3,4
Gold Coast,436,46-55,4,4,3,4
Sunshine Coast,437,36-45,5,3,3,4
Gold Coast,438,18-25,3,5,5,4
Sunshine Coast,439,56+,3,4,4,4
Brisbane,440,18-25,4,4,4,4
Sunshine Coast,441,46-55,4,3,4,4
Sunshine Coast,442,46-55,4,5,4,4
Melbourne,443,26-35,2,5,3,4
Sunshine Coast,444,56+,4,4,1,4
Gold Coast,445,36-45,3,5,3,4
Brisbane,446,56+,5,3,2,4
Sunshine Coast,447,26-35,4,3,2,4
Brisbane,448,18-25,3,3,4,3
Brisbane,449,46-55,4,4,4,4
Sunshine Coast,450,18-25,3,4,3,4
Melbourne,451,18-25,4,4,3,4
Perth,452,26-35,5,4,5,4
Sunshine Coast,453,36-45,3,3,3,3
Perth,454,18-25,4,5,5,4
Sunshine Coast,455,46-55,4,4,4,4
Brisbane,456,46-55,3,5,1,4
Sunshine Coast,457,36-45,4,4,4,4
Perth,458,36-45,3,4,3,4
Brisbane,459,26-35,4,4,5,4
Sunshine Coast,460,56+,3,4,4,4
Melbourne,461,46-55,5,5,3,5
Gold Coast,462,18-25,4,5,2,4
Sunshine Coast,463,26-35,3,4,3,4
Melbourne,464,36-45,4,5,2,4
Perth,465,18-25,4,4,2,4
Melbourne,466,56+,4,5,4,4
Gold Coast,467,36-45,4,3,5,4
Melbourne,468,56+,5,5,3,5
Sunshine Coast,469,56+,4,4,2,4
Melbourne,470,46-55,4,3,4,4
Sunshine Coast,471,46-55,4,4,4,4
Perth,472,56+,2,3,2,2
Gold Coast,473,46-55,3,5,3,4
Melbourne,474,36-45,5,3,3,4
Gold Coast,475,56+,5,4,2,4
Melbourne,476,56+,4,2,4,3
Gold Coast,477,26-35,4,4,3,4
Melbourne,478,26-35,4,2,4,3
Perth,479,26-35,5,3,2,4
Perth,480,26-35,5,5,2,5
Sunshine Coast,481,18-25,4,5,4,4
Melbourne,482,26-35,3,4,3,4
Perth,483,36-45,3,3,5,3
Perth,484,18-25,4,4,3,4
Gold Coast,485,36-45,3,4,3,4
Perth,486,26-35,3,3,4,3
Perth,487,56+,3,5,1,4
Sunshine Coast,488,18-25,3,5,1,4
Brisbane,489,56+,5,4,1,4
Gold Coast,490,36-45,5,4,5,4
Perth,491,36-45,4,4,2,4
Brisbane,492,18-25,5,2,5,4
Brisbane,493,36-45,4,4,2,4
Perth,494,18-25,3,3,3,3
Sunshine Coast,495,36-45,5,3,5,4
Melbourne,496,56+,4,4,5,4
Sunshine Coast,497,46-55,3,5,5,4
Perth,498,26-35,4,5,4,4
Gold Coast,499,26-35,3,4,4,4
Melbourne,500,46-55,3,4,4,4
