﻿Date,Shooter,Hit_R1,Hit_R2,Hit_R3,Hit_R4,Hit_R5,Score_R1,Score_R2,Score_R3,Score_R4,Score_R5,Hit_Total,Score_Total,Hit_AVG,Score_AVG
21/03/2024,Max,4,3,5,5,4,9,7,12,13,8,21,49,4,10
22/03/2024,Max,5,4,4,4,3,15,12,11,10,9,20,57,4,11.4
21/01/2024,Emily,3,2,1,3,2,6,2,1,8,7,11,24,3,4
21/03/2024,Emily,5,4,3,3,4,12,7,8,6,5,19,38,4,8
21/03/2024,Geoff,5,5,4,4,3,13,12,10,8,6,21,49,4,10
21/03/2024,Martin,3,2,1,3,4,6,3,2,7,8,13,26,3,5
