deg,XRT_AX,XRT_BX,XRT_AY,XRT_BY,SOT_AX,SOT_BX,SOT_AY,SOT_BY
valid,1,1,1,1,1,1,1,1,revB
offset,115.87019,102.81097,1980.5744,1981.2016,50.126650,36.603375,94.320964,94.947579
0,0.0000000,0.0000000,0.0000000,0.0000000,0.0000000,0.0000000,0.0000000,0.0000000
1,0.030849539,0.013144616,-0.021909347,-0.0059428851,0.033003832,0.014222320,-0.016868463,0.00063489664
2,0.060276260,0.026548558,-0.043433234,-0.012160760,0.064402281,0.028488856,-0.033381701,0.00093911154
3,0.088269232,0.040193142,-0.064552654,-0.018648664,0.094183907,0.042775594,-0.049529851,0.00090706037
4,0.11482130,0.054059940,-0.085249534,-0.025401070,0.12234071,0.057058957,-0.065303837,0.00053426049
5,0.13992905,0.068130828,-0.10550678,-0.032411916,0.14886810,0.071315854,-0.080695383,-0.00018267203
6,0.16359278,0.082388021,-0.12530828,-0.039674621,0.17376483,0.085523739,-0.095697022,-0.0012460282
7,0.18581639,0.096814120,-0.14463898,-0.047182119,0.19703300,0.099660660,-0.11030210,-0.0026570146
8,0.20660739,0.11139214,-0.16348487,-0.054926875,0.21867793,0.11370531,-0.12450480,-0.0044157644
9,0.22597680,0.12610556,-0.18183303,-0.062900923,0.23870813,0.12763706,-0.13830010,-0.0065213511
10,0.24393903,0.14093835,-0.19967163,-0.071095882,0.25713522,0.14143605,-0.15168384,-0.0089718046
11,0.26051184,0.15587500,-0.21698999,-0.079502992,0.27397385,0.15508316,-0.16465264,-0.011764130
12,0.27571624,0.17090055,-0.23377854,-0.088113136,0.28924161,0.16856012,-0.17720397,-0.014894329
13,0.28957633,0.18600064,-0.25002887,-0.096916873,0.30295893,0.18184952,-0.18933612,-0.018357422
14,0.30211924,0.20116151,-0.26573373,-0.10590446,0.31514899,0.19493485,-0.20104815,-0.022147476
15,0.31337500,0.21637004,-0.28088704,-0.11506590,0.32583763,0.20780052,-0.21233994,-0.026257629
16,0.32337638,0.23161377,-0.29548388,-0.12439093,0.33505319,0.22043193,-0.22321216,-0.030680123
17,0.33215879,0.24688092,-0.30952051,-0.13386909,0.34282644,0.23281546,-0.23366622,-0.035406335
18,0.33976013,0.26216039,-0.32299433,-0.14348973,0.34919046,0.24493851,-0.24370430,-0.040426807
19,0.34622061,0.27744182,-0.33590392,-0.15324205,0.35418048,0.25678955,-0.25332931,-0.045731288
20,0.35158267,0.29271556,-0.34824902,-0.16311513,0.35783378,0.26835809,-0.26254488,-0.051308764
21,0.35589074,0.30797269,-0.36003047,-0.17309792,0.36018954,0.27963476,-0.27135531,-0.057147501
22,0.35919114,0.32320506,-0.37125026,-0.18317933,0.36128872,0.29061126,-0.27976559,-0.063235082
23,0.36153189,0.33840525,-0.38191149,-0.19334818,0.36117393,0.30128043,-0.28778134,-0.069558450
24,0.36296255,0.35356659,-0.39201832,-0.20359332,0.35988927,0.31163622,-0.29540880,-0.076103951
25,0.36353403,0.36868320,-0.40157598,-0.21390356,0.35748017,0.32167373,-0.30265479,-0.082857371
26,0.36329846,0.38374991,-0.41059075,-0.22426775,0.35399330,0.33138918,-0.30952667,-0.089803989
27,0.36230896,0.39876233,-0.41906988,-0.23467480,0.34947639,0.34077993,-0.31603237,-0.096928616
28,0.36061951,0.41371682,-0.42702162,-0.24511368,0.34397809,0.34984449,-0.32218026,-0.10421564
29,0.35828474,0.42861046,-0.43445516,-0.25557345,0.33754781,0.35858247,-0.32797919,-0.11164908
30,0.35535978,0.44344106,-0.44138056,-0.26604331,0.33023560,0.36699462,-0.33343845,-0.11921261
31,0.35190008,0.45820714,-0.44780879,-0.27651257,0.32209200,0.37508280,-0.33856768,-0.12688964
32,0.34796119,0.47290794,-0.45375161,-0.28697070,0.31316788,0.38284997,-0.34337689,-0.13466334
33,0.34359865,0.48754335,-0.45922156,-0.29740733,0.30351430,0.39030016,-0.34787641,-0.14251668
34,0.33886778,0.50211394,-0.46423194,-0.30781231,0.29318240,0.39743845,-0.35207683,-0.15043250
35,0.33382351,0.51662093,-0.46879671,-0.31817565,0.28222320,0.40427099,-0.35598898,-0.15839353
36,0.32852022,0.53106612,-0.47293050,-0.32848760,0.27068752,0.41080489,-0.35962388,-0.16638245
37,0.32301156,0.54545195,-0.47664850,-0.33873863,0.25862582,0.41704830,-0.36299273,-0.17438196
38,0.31735033,0.55978139,-0.47996647,-0.34891945,0.24608809,0.42301029,-0.36610680,-0.18237476
39,0.31158828,0.57405795,-0.48290064,-0.35902102,0.23312367,0.42870085,-0.36897750,-0.19034365
40,0.30577594,0.58828566,-0.48546767,-0.36903456,0.21978119,0.43413087,-0.37161623,-0.19827156
41,0.29996256,0.60246900,-0.48768462,-0.37895155,0.20610842,0.43931207,-0.37403440,-0.20614157
42,0.29419586,0.61661292,-0.48956886,-0.38876374,0.19215215,0.44425701,-0.37624339,-0.21393698
43,0.28852198,0.63072275,-0.49113804,-0.39846316,0.17795809,0.44897898,-0.37825450,-0.22164134
44,0.28298529,0.64480421,-0.49241001,-0.40804212,0.16357077,0.45349202,-0.38007889,-0.22923847
45,0.27762830,0.65886333,-0.49340280,-0.41749321,0.14903342,0.45781083,-0.38172760,-0.23671251
46,0.27249153,0.67290646,-0.49413451,-0.42680930,0.13438790,0.46195076,-0.38321145,-0.24404798
47,0.26761342,0.68694019,-0.49462332,-0.43598356,0.11967458,0.46592772,-0.38454104,-0.25122975
48,0.26303017,0.70097133,-0.49488736,-0.44500941,0.10493229,0.46975817,-0.38572671,-0.25824316
49,0.25877572,0.71500687,-0.49494473,-0.45388057,0.090198235,0.47345905,-0.38677849,-0.26507395
50,0.25488161,0.72905393,-0.49481339,-0.46259104,0.075507903,0.47704772,-0.38770609,-0.27170838
51,0.25137693,0.74311974,-0.49451111,-0.47113508,0.060895023,0.48054192,-0.38851886,-0.27813320
52,0.24828823,0.75721158,-0.49405544,-0.47950720,0.046391499,0.48395971,-0.38922574,-0.28433568
53,0.24563947,0.77133673,-0.49346366,-0.48770219,0.032027361,0.48731941,-0.38983525,-0.29030366
54,0.24345196,0.78550246,-0.49275267,-0.49571507,0.017830717,0.49063957,-0.39035548,-0.29602554
55,0.24174432,0.79971597,-0.49193903,-0.50354113,0.0038277234,0.49393888,-0.39079403,-0.30149033
56,0.24053245,0.81398434,-0.49103883,-0.51117585,-0.0099574559,0.49723612,-0.39115798,-0.30668763
57,0.23982948,0.82831452,-0.49006769,-0.51861495,-0.023502665,0.50055012,-0.39145392,-0.31160766
58,0.23964579,0.84271325,-0.48904068,-0.52585435,-0.036787778,0.50389971,-0.39168786,-0.31624129
59,0.23998895,0.85718705,-0.48797233,-0.53289019,-0.049794706,0.50730363,-0.39186526,-0.32058002
60,0.24086378,0.87174220,-0.48687650,-0.53971876,-0.062507402,0.51078049,-0.39199102,-0.32461600
61,0.24227231,0.88638463,-0.48576642,-0.54633653,-0.074911856,0.51434874,-0.39206940,-0.32834205
62,0.24421383,0.90111998,-0.48465464,-0.55274013,-0.086996086,0.51802658,-0.39210408,-0.33175163
63,0.24668489,0.91595348,-0.48355293,-0.55892633,-0.098750121,0.52183192,-0.39209811,-0.33483889
64,0.24967936,0.93088997,-0.48247232,-0.56489202,-0.11016598,0.52578232,-0.39205389,-0.33759860
65,0.25318846,0.94593385,-0.48142304,-0.57063420,-0.12123763,0.52989496,-0.39197320,-0.34002622
66,0.25720083,0.96108904,-0.48041448,-0.57614998,-0.13196097,0.53418656,-0.39185717,-0.34211785
67,0.26170256,0.97635896,-0.47945517,-0.58143652,-0.14233378,0.53867336,-0.39170628,-0.34387023
68,0.26667728,0.99174652,-0.47855279,-0.58649108,-0.15235566,0.54337104,-0.39152037,-0.34528074
69,0.27210625,1.0072541,-0.47771407,-0.59131095,-0.16202799,0.54829471,-0.39129860,-0.34634738
70,0.27796841,1.0228833,-0.47694487,-0.59589345,-0.17135390,0.55345882,-0.39103953,-0.34706877
71,0.28424050,1.0386355,-0.47625007,-0.60023591,-0.18033812,0.55887717,-0.39074104,-0.34744412
72,0.29089713,1.0545111,-0.47563365,-0.60433569,-0.18898702,0.56456284,-0.39040041,-0.34747323
73,0.29791094,1.0705101,-0.47509859,-0.60819011,-0.19730845,0.57052812,-0.39001426,-0.34715643
74,0.30525263,1.0866316,-0.47464692,-0.61179648,-0.20531171,0.57678455,-0.38957862,-0.34649464
75,0.31289114,1.1028743,-0.47427972,-0.61515206,-0.21300745,0.58334282,-0.38908893,-0.34548926
76,0.32079378,1.1192360,-0.47399707,-0.61825405,-0.22040757,0.59021278,-0.38854003,-0.34414221
77,0.32892628,1.1357140,-0.47379810,-0.62109959,-0.22752517,0.59740336,-0.38792620,-0.34245588
78,0.33725302,1.1523047,-0.47368098,-0.62368573,-0.23437443,0.60492260,-0.38724117,-0.34043311
79,0.34573710,1.1690040,-0.47364291,-0.62600945,-0.24097050,0.61277760,-0.38647814,-0.33807715
80,0.35434050,1.1858069,-0.47368016,-0.62806758,-0.24732944,0.62097448,-0.38562982,-0.33539167
81,0.36302424,1.2027078,-0.47378806,-0.62985689,-0.25346810,0.62951840,-0.38468842,-0.33238069
82,0.37174851,1.2197003,-0.47396104,-0.63137398,-0.25940400,0.63841351,-0.38364573,-0.32904857
83,0.38047282,1.2367775,-0.47419261,-0.63261534,-0.26515527,0.64766294,-0.38249307,-0.32539999
84,0.38915616,1.2539316,-0.47447543,-0.63357732,-0.27074049,0.65726882,-0.38122140,-0.32143988
85,0.39775714,1.2711542,-0.47480129,-0.63425612,-0.27617864,0.66723224,-0.37982131,-0.31717345
86,0.40623417,1.2884361,-0.47516119,-0.63464778,-0.28148895,0.67755325,-0.37828303,-0.31260611
87,0.41454559,1.3057677,-0.47554530,-0.63474819,-0.28669083,0.68823086,-0.37659651,-0.30774345
88,0.42264984,1.3231385,-0.47594305,-0.63455309,-0.29180372,0.69926304,-0.37475144,-0.30259122
89,0.43050561,1.3405375,-0.47634314,-0.63405803,-0.29684704,0.71064675,-0.37273725,-0.29715529
90,0.43807199,1.3579531,-0.47673357,-0.63325842,-0.30184005,0.72237788,-0.37054320,-0.29144162
91,0.44530864,1.3753729,-0.47710172,-0.63214950,-0.30680173,0.73445134,-0.36815838,-0.28545623
92,0.45217593,1.3927843,-0.47743433,-0.63072635,-0.31175074,0.74686101,-0.36557175,-0.27920516
93,0.45863507,1.4101739,-0.47771757,-0.62898388,-0.31670527,0.75959978,-0.36277220,-0.27269444
94,0.46464829,1.4275278,-0.47793711,-0.62691686,-0.32168295,0.77265955,-0.35974857,-0.26593009
95,0.47017898,1.4448317,-0.47807812,-0.62451990,-0.32670077,0.78603129,-0.35648968,-0.25891804
96,0.47519179,1.4620708,-0.47812535,-0.62178746,-0.33177499,0.79970502,-0.35298441,-0.25166414
97,0.47965283,1.4792300,-0.47806317,-0.61871390,-0.33692105,0.81366983,-0.34922168,-0.24417412
98,0.48352974,1.4962936,-0.47787562,-0.61529340,-0.34215348,0.82791396,-0.34519054,-0.23645355
99,0.48679186,1.5132458,-0.47754644,-0.61152007,-0.34748580,0.84242477,-0.34088020,-0.22850786
100,0.48941031,1.5300703,-0.47705918,-0.60738789,-0.35293052,0.85718882,-0.33628004,-0.22034223
101,0.49135816,1.5467507,-0.47639718,-0.60289075,-0.35849895,0.87219185,-0.33137966,-0.21196166
102,0.49261049,1.5632702,-0.47554367,-0.59802247,-0.36420127,0.88741888,-0.32616897,-0.20337089
103,0.49314452,1.5796119,-0.47448182,-0.59277680,-0.37004633,0.90285419,-0.32063813,-0.19457439
104,0.49293969,1.5957587,-0.47319477,-0.58714745,-0.37604172,0.91848139,-0.31477769,-0.18557635
105,0.49197778,1.6116936,-0.47166573,-0.58112810,-0.38219363,0.93428347,-0.30857853,-0.17638066
106,0.49024295,1.6273993,-0.46987797,-0.57471241,-0.38850683,0.95024281,-0.30203200,-0.16699090
107,0.48772184,1.6428585,-0.46781494,-0.56789406,-0.39498465,0.96634125,-0.29512984,-0.15741028
108,0.48440365,1.6580541,-0.46546029,-0.56066676,-0.40162892,0.98256014,-0.28786432,-0.14764170
109,0.48028016,1.6729689,-0.46279791,-0.55302426,-0.40843997,0.99888035,-0.28022820,-0.13768770
110,0.47534581,1.6875860,-0.45981203,-0.54496038,-0.41541657,1.0152824,-0.27221478,-0.12755042
111,0.46959774,1.7018885,-0.45648722,-0.53646906,-0.42255593,1.0317463,-0.26381795,-0.11723166
112,0.46303583,1.7158597,-0.45280848,-0.52754432,-0.42985371,1.0482521,-0.25503220,-0.10673281
113,0.45566269,1.7294834,-0.44876127,-0.51818037,-0.43730400,1.0647791,-0.24585264,-0.096054914
114,0.44748371,1.7427433,-0.44433159,-0.50837156,-0.44489929,1.0813069,-0.23627506,-0.085198591
115,0.43850707,1.7556239,-0.43950596,-0.49811244,-0.45263056,1.0978145,-0.22629589,-0.074164091
116,0.42874371,1.7681097,-0.43427156,-0.48739777,-0.46048719,1.1142812,-0.21591231,-0.062951281
117,0.41820736,1.7801859,-0.42861619,-0.47622258,-0.46845708,1.1306859,-0.20512217,-0.051559643
118,0.40691447,1.7918379,-0.42252836,-0.46458216,-0.47652662,1.1470078,-0.19392410,-0.039988288
119,0.39488424,1.8030519,-0.41599734,-0.45247211,-0.48468072,1.1632259,-0.18231746,-0.028235959
120,0.38213852,1.8138144,-0.40901315,-0.43988834,-0.49290288,1.1793195,-0.17030238,-0.016301044
121,0.36870182,1.8241127,-0.40156665,-0.42682713,-0.50117523,1.1952681,-0.15787979,-0.0041815856
122,0.35460123,1.8339347,-0.39364955,-0.41328515,-0.50947856,1.2110511,-0.14505140,0.0081247043
123,0.33986636,1.8432687,-0.38525444,-0.39925945,-0.51779239,1.2266486,-0.13181971,0.020620430
124,0.32452926,1.8521040,-0.37637484,-0.38474754,-0.52609503,1.2420405,-0.11818804,0.033308493
125,0.30862438,1.8604305,-0.36700520,-0.36974739,-0.53436365,1.2572076,-0.10416050,0.046192076
126,0.29218841,1.8682389,-0.35714096,-0.35425746,-0.54257435,1.2721306,-0.089742041,0.059274620
127,0.27526025,1.8755207,-0.34677853,-0.33827672,-0.55070225,1.2867911,-0.074938389,0.072559801
128,0.25788090,1.8822682,-0.33591536,-0.32180467,-0.55872155,1.3011708,-0.059756096,0.086051510
129,0.24009332,1.8884744,-0.32454991,-0.30484140,-0.56660562,1.3152523,-0.044202510,0.099753825
130,0.22194233,1.8941335,-0.31268171,-0.28738756,-0.57432711,1.3290185,-0.028285773,0.11367099
131,0.20347448,1.8992402,-0.30031133,-0.26944444,-0.58185802,1.3424530,-0.012014811,0.12780736
132,0.18473795,1.9037904,-0.28744043,-0.25101394,-0.58916983,1.3555401,0.0046006771,0.14216743
133,0.16578237,1.9077808,-0.27407171,-0.23209862,-0.59623357,1.3682648,0.021550233,0.15675574
134,0.14665871,1.9112089,-0.26020898,-0.21270173,-0.60301993,1.3806127,0.038822658,0.17157688
135,0.12741912,1.9140735,-0.24585711,-0.19282719,-0.60949937,1.3925704,0.056406025,0.18663546
136,0.10811681,1.9163740,-0.23102205,-0.17247965,-0.61564225,1.4041250,0.074287704,0.20193604
137,0.088805830,1.9181110,-0.21571083,-0.15166448,-0.62141892,1.4152647,0.092454383,0.21748316
138,0.069540985,1.9192858,-0.19993152,-0.13038781,-0.62679982,1.4259782,0.11089209,0.23328122
139,0.050377625,1.9199011,-0.18369326,-0.10865649,-0.63175563,1.4362554,0.12958621,0.24933455
140,0.031371497,1.9199600,-0.16700620,-0.086478171,-0.63625735,1.4460868,0.14852155,0.26564726
141,0.012578575,1.9194671,-0.14988154,-0.063861278,-0.64027644,1.4554641,0.16768231,0.28222331
142,-0.0059451071,1.9184277,-0.13233146,-0.040815018,-0.64378493,1.4643796,0.18705215,0.29906639
143,-0.024143630,1.9168479,-0.11436910,-0.017349401,-0.64675554,1.4728267,0.20661423,0.31617994
144,-0.041961360,1.9147351,-0.096008576,0.0065247648,-0.64916175,1.4807998,0.22635123,0.33356707
145,-0.059343118,1.9120973,-0.077264910,0.030795864,-0.65097801,1.4882940,0.24624537,0.35123058
146,-0.076234356,1.9089436,-0.058154019,0.055451471,-0.65217976,1.4953056,0.26627847,0.36917288
147,-0.092581327,1.9052840,-0.038692675,0.080478354,-0.65274357,1.5018318,0.28643199,0.38739594
148,-0.10833126,1.9011291,-0.018898473,0.10586247,-0.65264729,1.5078705,0.30668704,0.40590132
149,-0.12343252,1.8964907,0.0012102086,0.13158898,-0.65187009,1.5134208,0.32702446,0.42469007
150,-0.13783478,1.8913812,0.021614249,0.15764224,-0.65039262,1.5184828,0.34742484,0.44376276
151,-0.15148919,1.8858138,0.042293825,0.18400582,-0.64819709,1.5230572,0.36786853,0.46311936
152,-0.16434855,1.8798026,0.063228456,0.21066250,-0.64526734,1.5271460,0.38833575,0.48275932
153,-0.17636742,1.8733622,0.084397052,0.23759430,-0.64158899,1.5307519,0.40880659,0.50268143
154,-0.18750235,1.8665082,0.10577796,0.26478247,-0.63714949,1.5338783,0.42926105,0.52288388
155,-0.19771195,1.8592565,0.12734900,0.29220754,-0.63193822,1.5365299,0.44967909,0.54336419
156,-0.20695710,1.8516240,0.14908756,0.31984928,-0.62594655,1.5387120,0.47004070,0.56411917
157,-0.21520106,1.8436278,0.17097058,0.34768678,-0.61916796,1.5404307,0.49032590,0.58514493
158,-0.22240960,1.8352858,0.19297466,0.37569845,-0.61159805,1.5416929,0.51051483,0.60643684
159,-0.22855114,1.8266163,0.21507611,0.40386203,-0.60323468,1.5425064,0.53058774,0.62798951
160,-0.23359686,1.8176381,0.23725095,0.43215460,-0.59407795,1.5428796,0.55052509,0.64979677
161,-0.23752084,1.8083704,0.25947507,0.46055266,-0.58413031,1.5428217,0.57030755,0.67185167
162,-0.24030013,1.7988326,0.28172416,0.48903212,-0.57339658,1.5423425,0.58991608,0.69414642
163,-0.24191487,1.7890446,0.30397387,0.51756834,-0.56188400,1.5414525,0.60933193,0.71667244
164,-0.24234841,1.7790265,0.32619982,0.54613614,-0.54960227,1.5401629,0.62853672,0.73942029
165,-0.24158731,1.7687987,0.34837766,0.57470988,-0.53656356,1.5384851,0.64751245,0.76237969
166,-0.23962153,1.7583814,0.37048316,0.60326346,-0.52278254,1.5364315,0.66624157,0.78553953
167,-0.23644437,1.7477955,0.39249219,0.63177035,-0.50827639,1.5340146,0.68470700,0.80888782
168,-0.23205265,1.7370614,0.41438088,0.66020367,-0.49306481,1.5312476,0.70289217,0.83241173
169,-0.22644666,1.7261998,0.43612559,0.68853618,-0.47717003,1.5281439,0.72078104,0.85609756
170,-0.21963024,1.7152314,0.45770301,0.71674036,-0.46061676,1.5247174,0.73835819,0.87993078
171,-0.21161084,1.7041765,0.47909021,0.74478843,-0.44343223,1.5209821,0.75560877,0.90389599
172,-0.20239946,1.6930555,0.50026470,0.77265240,-0.42564612,1.5169526,0.77251862,0.92797696
173,-0.19201073,1.6818887,0.52120443,0.80030412,-0.40729056,1.5126433,0.78907423,0.95215663
174,-0.18046288,1.6706957,0.54188792,0.82771531,-0.38840007,1.5080691,0.80526282,0.97641712
175,-0.16777773,1.6594964,0.56229427,0.85485761,-0.36901152,1.5032449,0.82107232,1.0007398
176,-0.15398066,1.6483097,0.58240320,0.88170266,-0.34916409,1.4981856,0.83649145,1.0251051
177,-0.13910060,1.6371547,0.60219512,0.90822210,-0.32889920,1.4929062,0.85150967,1.0494929
178,-0.12316999,1.6260496,0.62165115,0.93438764,-0.30826044,1.4874217,0.86611730,1.0738822
179,-0.10622471,1.6150123,0.64075320,0.96017111,-0.28729349,1.4817469,0.88030543,1.0982513
180,-0.088304009,1.6040602,0.65948396,0.98554452,-0.26604605,1.4758966,0.89406602,1.1225779
181,-0.069450488,1.5932100,0.67782700,1.0104801,-0.24456776,1.4698854,0.90739188,1.1468390
182,-0.049709966,1.5824777,0.69576675,1.0349503,-0.22291008,1.4637278,0.92027669,1.1710108
183,-0.029131416,1.5718789,0.71328857,1.0589279,-0.20112621,1.4574377,0.93271501,1.1950692
184,-0.0077668601,1.5614282,0.73037878,1.0823861,-0.17927099,1.4510292,0.94470227,1.2189894
185,0.014328735,1.5511396,0.74702467,1.1052985,-0.15740074,1.4445155,0.95623482,1.2427460
186,0.037097577,1.5410263,0.76321454,1.1276392,-0.13557320,1.4379100,0.96730990,1.2663134
187,0.060479170,1.5311006,0.77893772,1.1493826,-0.11384738,1.4312252,0.97792563,1.2896652
188,0.084410450,1.5213741,0.79418461,1.1705040,-0.092283416,1.4244734,0.98808105,1.3127749
189,0.10882592,1.5118573,0.80894666,1.1909790,-0.070942472,1.4176664,0.99777608,1.3356155
190,0.13365782,1.5025599,0.82321643,1.2107840,-0.049886570,1.4108153,1.0070115,1.3581598
191,0.15883624,1.4934907,0.83698757,1.2298962,-0.029178460,1.4039307,1.0157891,1.3803804
192,0.18428932,1.4846575,0.85025483,1.2482934,-0.0088814779,1.3970227,1.0241114,1.4022495
193,0.20994342,1.4760672,0.86301411,1.2659541,0.010940612,1.3901008,1.0319818,1.4237394
194,0.23572325,1.4677255,0.87526240,1.2828580,0.030223763,1.3831736,1.0394046,1.4448221
195,0.26155212,1.4596373,0.88699783,1.2989852,0.048903807,1.3762493,1.0463849,1.4654698
196,0.28735206,1.4518063,0.89821964,1.3143172,0.066916606,1.3693351,1.0529285,1.4856545
197,0.31304404,1.4442354,0.90892821,1.3288361,0.084198216,1.3624379,1.0590423,1.5053483
198,0.33854817,1.4369262,0.91912499,1.3425251,0.10068505,1.3555634,1.0647337,1.5245237
199,0.36378388,1.4298793,0.92881257,1.3553684,0.11631402,1.3487168,1.0700108,1.5431531
200,0.38867016,1.4230945,0.93799458,1.3673514,0.13102274,1.3419025,1.0748826,1.5612092
201,0.41312568,1.4165702,0.94667575,1.3784605,0.14474964,1.3351242,1.0793587,1.5786652
202,0.43706910,1.4103040,0.95486183,1.3886831,0.15743417,1.3283845,1.0834494,1.5954944
203,0.46041920,1.4042924,0.96255962,1.3980080,0.16901694,1.3216855,1.0871655,1.6116707
204,0.48309513,1.3985308,0.96977688,1.4064250,0.17943988,1.3150284,1.0905186,1.6271684
205,0.50501660,1.3930137,0.97652238,1.4139252,0.18864640,1.3084137,1.0935206,1.6419625
206,0.52610408,1.3877346,0.98280581,1.4205008,0.19658156,1.3018409,1.0961840,1.6560283
207,0.54627904,1.3826859,0.98863775,1.4261453,0.20319223,1.2953088,1.0985220,1.6693421
208,0.56546413,1.3778591,0.99402968,1.4308536,0.20842719,1.2888154,1.1005480,1.6818807
209,0.58358339,1.3732448,0.99899391,1.4346216,0.21223736,1.2823580,1.1022759,1.6936217
210,0.60056248,1.3688327,1.0035435,1.4374468,0.21457587,1.2759331,1.1037198,1.7045436
211,0.61632883,1.3646115,1.0076923,1.4393277,0.21539825,1.2695364,1.1048944,1.7146256
212,0.63081187,1.3605693,1.0114549,1.4402643,0.21466254,1.2631629,1.1058145,1.7238480
213,0.64394324,1.3566930,1.0148465,1.4402577,0.21232946,1.2568068,1.1064951,1.7321920
214,0.65565692,1.3529690,1.0178828,1.4393107,0.20836248,1.2504617,1.1069515,1.7396398
215,0.66588948,1.3493829,1.0205803,1.4374270,0.20272799,1.2441205,1.1071990,1.7461748
216,0.67458022,1.3459195,1.0229559,1.4346118,0.19539537,1.2377755,1.1072533,1.7517814
217,0.68167135,1.3425632,1.0250269,1.4308715,0.18633718,1.2314183,1.1071297,1.7564451
218,0.68710816,1.3392973,1.0268110,1.4262140,0.17552915,1.2250401,1.1068438,1.7601527
219,0.69083917,1.3361051,1.0283264,1.4206481,0.16295037,1.2186312,1.1064113,1.7628923
220,0.69281630,1.3329688,1.0295915,1.4141844,0.14858334,1.2121817,1.1058475,1.7646531
221,0.69299502,1.3298706,1.0306248,1.4068343,0.13241405,1.2056811,1.1051677,1.7654258
222,0.69133442,1.3267919,1.0314453,1.3986105,0.11443207,1.1991185,1.1043871,1.7652022
223,0.68779746,1.3237140,1.0320718,1.3895272,0.094630604,1.1924825,1.1035206,1.7639758
224,0.68235095,1.3206178,1.0325234,1.3795995,0.073006537,1.1857615,1.1025829,1.7617412
225,0.67496579,1.3174837,1.0328190,1.3688437,0.049560511,1.1789434,1.1015884,1.7584945
226,0.66561696,1.3142921,1.0329777,1.3572774,0.024296951,1.1720159,1.1005512,1.7542333
227,0.65428371,1.3110232,1.0330183,1.3449191,-0.0027759033,1.1649665,1.0994849,1.7489566
228,0.64094954,1.3076572,1.0329595,1.3317886,-0.031645968,1.1577825,1.0984027,1.7426650
229,0.62560237,1.3041739,1.0328198,1.3179065,-0.062297305,1.1504510,1.0973175,1.7353603
230,0.60823454,1.3005535,1.0326173,1.3032945,-0.094710112,1.1429591,1.0962416,1.7270461
231,0.58884285,1.2967760,1.0323700,1.2879753,-0.12886073,1.1352938,1.0951867,1.7177273
232,0.56742866,1.2928216,1.0320953,1.2719725,-0.16472165,1.1274422,1.0941641,1.7074104
233,0.54399786,1.2886706,1.0318103,1.2553107,-0.20226155,1.1193913,1.0931845,1.6961033
234,0.51856090,1.2843036,1.0315315,1.2380150,-0.24144529,1.1111282,1.0922578,1.6838155
235,0.49113283,1.2797015,1.0312749,1.2201116,-0.28223400,1.1026404,1.0913933,1.6705580
236,0.46173326,1.2748456,1.0310560,1.2016274,-0.32458507,1.0939153,1.0905999,1.6563431
237,0.43038632,1.2697173,1.0308895,1.1825899,-0.36845229,1.0849408,1.0898854,1.6411847
238,0.39712072,1.2642988,1.0307896,1.1630273,-0.41378582,1.0757048,1.0892571,1.6250981
239,0.36196961,1.2585725,1.0307696,1.1429683,-0.46053233,1.0661959,1.0887215,1.6081002
240,0.32497059,1.2525216,1.0308421,1.1224423,-0.50863507,1.0564029,1.0882844,1.5902090
241,0.28616564,1.2461297,1.0310189,1.1014790,-0.55803396,1.0463149,1.0879508,1.5714441
242,0.24560103,1.2393811,1.0313110,1.0801087,-0.60866569,1.0359219,1.0877247,1.5518263
243,0.20332728,1.2322610,1.0317285,1.0583620,-0.66046380,1.0252139,1.0876097,1.5313779
244,0.15939899,1.2247550,1.0322806,1.0362699,-0.71335886,1.0141819,1.0876081,1.5101223
245,0.11387483,1.2168497,1.0329754,1.0138634,-0.76727855,1.0028174,1.0877218,1.4880841
246,0.066817345,1.2085325,1.0338202,0.99117411,-0.82214777,0.99111232,1.0879517,1.4652894
247,0.018292886,1.1997916,1.0348214,0.96823342,-0.87788885,0.97905962,1.0882977,1.4417651
248,-0.031628547,1.1906162,1.0359842,0.94507301,-0.93442163,0.96665278,1.0887592,1.4175395
249,-0.082873442,1.1809963,1.0373128,0.92172454,-0.99166364,0.95388610,1.0893344,1.3926418
250,-0.13536493,1.1709231,1.0388105,0.89821967,-1.0495302,0.94075466,1.0900211,1.3671023
251,-0.18902292,1.1603886,1.0404793,0.87458995,-1.1079348,0.92725439,1.0908159,1.3409520
252,-0.24376433,1.1493859,1.0423204,0.85086680,-1.1667889,0.91338205,1.0917147,1.3142233
253,-0.29950317,1.1379091,1.0443337,0.82708145,-1.2260024,0.89913532,1.0927127,1.2869489
254,-0.35615080,1.1259536,1.0465182,0.80326488,-1.2854837,0.88451274,1.0938043,1.2591627
255,-0.41361610,1.1135156,1.0488718,0.77944776,-1.3451401,0.86951383,1.0949829,1.2308990
256,-0.47180564,1.1005926,1.0513911,0.75566041,-1.4048774,0.85413903,1.0962414,1.2021932
257,-0.53062391,1.0871833,1.0540720,0.73193271,-1.4646008,0.83838975,1.0975719,1.1730807
258,-0.58997353,1.0732874,1.0569091,0.70829411,-1.5242148,0.82226838,1.0989658,1.1435980
259,-0.64975544,1.0589059,1.0598959,0.68477350,-1.5836231,0.80577832,1.1004137,1.1137817
260,-0.70986912,1.0440407,1.0630251,0.66139925,-1.6427293,0.78892395,1.1019056,1.0836689
261,-0.77021282,1.0286953,1.0662883,0.63819907,-1.7014368,0.77171067,1.1034309,1.0532971
262,-0.83068381,1.0128740,1.0696759,0.61520004,-1.7596491,0.75414489,1.1049783,1.0227040
263,-0.89117853,0.99658239,1.0731777,0.59242849,-1.8172698,0.73623403,1.1065361,0.99192740
264,-0.95159292,0.97982730,1.0767823,0.56991005,-1.8742033,0.71798653,1.1080919,0.96100539
265,-1.0118226,0.96261666,1.0804774,0.54766951,-1.9303542,0.69941183,1.1096329,0.92997598
266,-1.0717629,0.94495953,1.0842499,0.52573085,-1.9856285,0.68052037,1.1111456,0.89887718
267,-1.1313097,0.92686613,1.0880859,0.50411715,-2.0399328,0.66132356,1.1126163,0.86774693
268,-1.1903589,0.90834780,1.0919705,0.48285061,-2.0931752,0.64183383,1.1140309,0.83662297
269,-1.2488071,0.88941696,1.0958883,0.46195246,-2.1452652,0.62206453,1.1153748,0.80554281
270,-1.3065518,0.87008714,1.0998228,0.44144296,-2.1961139,0.60202996,1.1166332,0.77454365
271,-1.3634916,0.85037289,1.1037573,0.42134137,-2.2456344,0.58174535,1.1177910,0.74366232
272,-1.4195261,0.83028980,1.1076740,0.40166589,-2.2937415,0.56122682,1.1188328,0.71293519
273,-1.4745568,0.80985448,1.1115549,0.38243370,-2.3403525,0.54049136,1.1197431,0.68239812
274,-1.5284866,0.78908448,1.1153811,0.36366085,-2.3853868,0.51955680,1.1205062,0.65208640
275,-1.5812206,0.76799828,1.1191334,0.34536232,-2.4287666,0.49844177,1.1211063,0.62203463
276,-1.6326660,0.74661527,1.1227923,0.32755195,-2.4704167,0.47716570,1.1215276,0.59227676
277,-1.6827323,0.72495568,1.1263376,0.31024244,-2.5102646,0.45574874,1.1217542,0.56284592
278,-1.7313315,0.70304058,1.1297491,0.29344535,-2.5482411,0.43421175,1.1217704,0.53377441
279,-1.7783785,0.68089179,1.1330060,0.27717106,-2.5842799,0.41257623,1.1215603,0.50509367
280,-1.8237911,0.65853186,1.1360876,0.26142879,-2.6183182,0.39086432,1.1211084,0.47683417
281,-1.8674901,0.63598402,1.1389728,0.24622658,-2.6502965,0.36909874,1.1203992,0.44902536
282,-1.9093999,0.61327216,1.1416406,0.23157129,-2.6801589,0.34730271,1.1194176,0.42169565
283,-1.9494482,0.59042072,1.1440698,0.21746859,-2.7078533,0.32549995,1.1181485,0.39487237
284,-1.9875661,0.56745467,1.1462393,0.20392299,-2.7333311,0.30371461,1.1165773,0.36858165
285,-2.0236888,0.54439949,1.1481282,0.19093780,-2.7565479,0.28197120,1.1146897,0.34284845
286,-2.0577553,0.52128106,1.1497154,0.17851518,-2.7774631,0.26029459,1.1124717,0.31769650
287,-2.0897086,0.49812564,1.1509805,0.16665612,-2.7960401,0.23870988,1.1099098,0.29314822
288,-2.1194959,0.47495981,1.1519029,0.15536048,-2.8122467,0.21724244,1.1069910,0.26922474
289,-2.1470686,0.45181039,1.1524625,0.14462695,-2.8260546,0.19591776,1.1037028,0.24594584
290,-2.1723826,0.42870442,1.1526397,0.13445314,-2.8374401,0.17476145,1.1000331,0.22332990
291,-2.1953981,0.40566909,1.1524152,0.12483554,-2.8463834,0.15379920,1.0959706,0.20139393
292,-2.2160800,0.38273167,1.1517701,0.11576956,-2.8528693,0.13305665,1.0915044,0.18015348
293,-2.2343977,0.35991944,1.1506864,0.10724957,-2.8568870,0.11255940,1.0866245,0.15962265
294,-2.2503253,0.33725969,1.1491463,0.099268886,-2.8584300,0.092332921,1.0813214,0.13981409
295,-2.2638416,0.31477959,1.1471328,0.091819838,-2.8574961,0.072402518,1.0755862,0.12073895
296,-2.2749302,0.29250619,1.1446297,0.084893773,-2.8540878,0.052793245,1.0694110,0.10240689
297,-2.2835793,0.27046633,1.1416216,0.078481093,-2.8482117,0.033529867,1.0627886,0.084826070
298,-2.2897821,0.24868660,1.1380935,0.072571289,-2.8398788,0.014636798,1.0557124,0.068003139
299,-2.2935363,0.22719326,1.1340318,0.067152972,-2.8291046,-0.0038619562,1.0481768,0.051943240
300,-2.2948447,0.20601224,1.1294235,0.062213909,-2.8159087,-0.021942851,1.0401771,0.036650007
301,-2.2937147,0.18516901,1.1242564,0.057741065,-2.8003152,-0.039582859,1.0317091,0.022125576
302,-2.2901583,0.16468858,1.1185195,0.053720633,-2.7823520,-0.056759526,1.0227699,0.0083705887
303,-2.2841922,0.14459546,1.1122028,0.050138082,-2.7620515,-0.073451019,1.0133571,-0.0046157947
304,-2.2758379,0.12491355,1.1052972,0.046978192,-2.7394500,-0.089636181,1.0034695,-0.016835878
305,-2.2651213,0.10566614,1.0977948,0.044225100,-2.7145877,-0.10529458,0.99310653,-0.028293414
306,-2.2520728,0.086875854,1.0896888,0.041862342,-2.6875087,-0.12040655,0.98226876,-0.038993580
307,-2.2367271,0.068564603,1.0809734,0.039872894,-2.6582609,-0.13495326,0.97095754,-0.048942957
308,-2.2191234,0.050753531,1.0716441,0.038239221,-2.6268958,-0.14891673,0.95917515,-0.058149498
309,-2.1993048,0.033462986,1.0616974,0.036943320,-2.5934686,-0.16227988,0.94692481,-0.066622503
310,-2.1773186,0.016712475,1.0511312,0.035966768,-2.5580376,-0.17502659,0.93421062,-0.074372581
311,-2.1532160,0.00052062904,1.0399444,0.035290764,-2.5206646,-0.18714172,0.92103762,-0.081411618
312,-2.1270522,-0.015094834,1.0281373,0.034896180,-2.4814146,-0.19861117,0.90741173,-0.087752736
313,-2.0988858,-0.030117138,1.0157112,0.034763606,-2.4403553,-0.20942185,0.89333976,-0.093410254
314,-2.0687789,-0.044530486,1.0026689,0.034873396,-2.3975576,-0.21956180,0.87882940,-0.098399645
315,-2.0367972,-0.058320080,0.98901415,0.035205716,-2.3530947,-0.22902017,0.86388923,-0.10273749
316,-2.0030093,-0.071472153,0.97475212,0.035740591,-2.3070428,-0.23778722,0.84852865,-0.10644142
317,-1.9674869,-0.083973987,0.95988911,0.036457953,-2.2594799,-0.24585442,0.83275789,-0.10953009
318,-1.9303047,-0.095813938,0.94443265,0.037337681,-2.2104867,-0.25321438,0.81658802,-0.11202310
319,-1.8915397,-0.10698145,0.92839149,0.038359655,-2.1601455,-0.25986096,0.80003088,-0.11394096
320,-1.8512716,-0.11746706,0.91177555,0.039503795,-2.1085406,-0.26578920,0.78309907,-0.11530504
321,-1.8095823,-0.12726245,0.89459593,0.040750108,-2.0557580,-0.27099539,0.76580594,-0.11613747
322,-1.7665558,-0.13636039,0.87686486,0.042078730,-2.0018851,-0.27547706,0.74816555,-0.11646116
323,-1.7222777,-0.14475480,0.85859574,0.043469974,-1.9470105,-0.27923297,0.73019264,-0.11629965
324,-1.6768355,-0.15244075,0.83980303,0.044904363,-1.8912238,-0.28226315,0.71190260,-0.11567711
325,-1.6303180,-0.15941442,0.82050229,0.046362679,-1.8346159,-0.28456887,0.69331144,-0.11461829
326,-1.5828153,-0.16567315,0.80071012,0.047825998,-1.7772779,-0.28615264,0.67443576,-0.11314838
327,-1.5344185,-0.17121538,0.78044411,0.049275733,-1.7193017,-0.28701822,0.65529267,-0.11129303
328,-1.4852192,-0.17604070,0.75972284,0.050693665,-1.6607793,-0.28717059,0.63589985,-0.10907824
329,-1.4353100,-0.18014981,0.73856582,0.052061984,-1.6018030,-0.28661595,0.61627540,-0.10653034
330,-1.3847836,-0.18354450,0.71699344,0.053363320,-1.5424651,-0.28536173,0.59643787,-0.10367584
331,-1.3337328,-0.18622766,0.69502696,0.054580780,-1.4828573,-0.28341651,0.57640621,-0.10054149
332,-1.2822503,-0.18820325,0.67268843,0.055697975,-1.4230711,-0.28079005,0.55619970,-0.097154082
333,-1.2304287,-0.18947625,0.65000063,0.056699051,-1.3631973,-0.27749326,0.53583795,-0.093540503
334,-1.1783600,-0.19005271,0.62698709,0.057568721,-1.3033258,-0.27353815,0.51534081,-0.089727602
335,-1.1261353,-0.18993965,0.60367195,0.058292283,-1.2435458,-0.26893784,0.49472837,-0.085742149
336,-1.0738451,-0.18914508,0.58007997,0.058855654,-1.1839449,-0.26370647,0.47402089,-0.081610775
337,-1.0215784,-0.18767794,0.55623647,0.059245385,-1.1246096,-0.25785924,0.45323877,-0.077359907
338,-0.96942312,-0.18554811,0.53216721,0.059448687,-1.0656248,-0.25141230,0.43240247,-0.073015710
339,-0.91746566,-0.18276633,0.50789843,0.059453445,-1.0070739,-0.24438277,0.41153252,-0.068604028
340,-0.86579061,-0.17934418,0.48345673,0.059248243,-0.94903808,-0.23678865,0.39064945,-0.064150329
341,-0.81448072,-0.17529408,0.45886899,0.058822369,-0.89159693,-0.22864883,0.36977372,-0.059679644
342,-0.76361666,-0.17062918,0.43416240,0.058165837,-0.83482767,-0.21998298,0.34892573,-0.055216518
343,-0.71327687,-0.16536340,0.40936430,0.057269394,-0.77880531,-0.21081157,0.32812572,-0.050784956
344,-0.66353739,-0.15951130,0.38450217,0.056124530,-0.72360243,-0.20115576,0.30739376,-0.046408370
345,-0.61447171,-0.15308813,0.35960357,0.054723484,-0.66928908,-0.19103739,0.28674971,-0.042109531
346,-0.56615058,-0.14610971,0.33469608,0.053059255,-0.61593266,-0.18047891,0.26621315,-0.037910527
347,-0.51864196,-0.13859242,0.30980720,0.051125597,-0.56359776,-0.16950334,0.24580337,-0.033832709
348,-0.47201081,-0.13055317,0.28496433,0.048917030,-0.51234613,-0.15813418,0.22553931,-0.029896656
349,-0.42631897,-0.12200930,0.26019470,0.046428832,-0.46223653,-0.14639541,0.20543953,-0.026122135
350,-0.38162511,-0.11297859,0.23552531,0.043657042,-0.41332464,-0.13431138,0.18552216,-0.022528056
351,-0.33798454,-0.10347915,0.21098285,0.040598453,-0.36566301,-0.12190677,0.16580488,-0.019132446
352,-0.29544921,-0.093529432,0.18659368,0.037250610,-0.31930095,-0.10920654,0.14630488,-0.015952407
353,-0.25406751,-0.083148153,0.16238374,0.033611798,-0.27428449,-0.096235858,0.12703881,-0.013004094
354,-0.21388431,-0.072354235,0.13837849,0.029681036,-0.23065632,-0.083020059,0.10802276,-0.010302682
355,-0.17494081,-0.061166773,0.11460290,0.025458068,-0.18845574,-0.069584556,0.089272232,-0.0078623437
356,-0.13727452,-0.049604978,0.091081343,0.020943345,-0.14771861,-0.055954801,0.070802111,-0.0056962254
357,-0.10091922,-0.037688127,0.067837572,0.016138017,-0.10847732,-0.042156215,0.052626627,-0.0038164297
358,-0.065904884,-0.025435520,0.044894662,0.011043915,-0.070760777,-0.028214136,0.034759336,-0.0022339976
359,-0.032257718,-0.012866426,0.022274966,0.0056635337,-0.034594402,-0.014153750,0.017213097,-0.00095889515
360,-8.8000959e-08,-3.6277171e-08,6.1617584e-08,1.6185140e-08,-9.4262937e-08,-3.9577422e-08,4.7526541e-08,-2.2256614e-09
