XRT N-S vs UFSS-A
      240.979
     0.117221
     0.631727
     0.122095
    0.0797584
    0.0899326
    0.0339523
XRT N-S vs UFSS-B
      203.770
     0.958370
    -0.269567
   -0.0937614
   -0.0634803
    0.0601000
   -0.0654809
XRT E-W vs UFSS-A
      3958.63
   -0.0354997
    -0.928660
     0.165668
     0.239623
    -0.100190
     0.127072
XRT E-W vs UFSS-B
      3965.38
    -0.249448
    -0.907053
     0.263681
     0.322009
   -0.0840274
     0.246441
SOT N-S vs UFSS-A
      100.444
    -0.461207
     0.800852
     0.192931
     0.142083
     0.162383
     0.207303
SOT N-S vs UFSS-B
      62.0578
     0.452056
    -0.145384
    0.0161738
    0.0484446
    0.0910646
    0.0482269
SOT E-W vs UFSS-A
      189.204
    -0.168674
    -0.962905
  -0.00918715
     0.125514
  -0.00536835
   -0.0602122
SOT E-W vs UFSS-B
      196.214
    -0.444181
    -0.851457
     0.114757
     0.177674
    0.0572774
    0.0267695
