deg,XRT_AX,XRT_BX,XRT_AY,XRT_BY,SOT_AX,SOT_BX,SOT_AY,SOT_BY
valid,1,1,1,1,1,1,1,1,revB
offset,127.95132,102.80910,1974.4713,1981.6420,84.092840,57.991594,64.002785,71.321854
0,0.0000000,0.0000000,0.0000000,0.0000000,0.0000000,0.0000000,0.0000000,0.0000000
1,0.022219999,0.023857238,-0.0085659080,-0.011115084,0.011294779,0.014369600,-0.0097361055,-0.0084700423
2,0.044227426,0.047762496,-0.017159475,-0.022054500,0.022704510,0.029201411,-0.019356485,-0.016809593
3,0.065991569,0.071682270,-0.025780286,-0.032816740,0.034220564,0.044481318,-0.028852970,-0.025015240
4,0.087481867,0.095583147,-0.034427479,-0.043400499,0.045833533,0.060194344,-0.038217361,-0.033083560
5,0.10866798,0.11943189,-0.043099741,-0.053804677,0.057533246,0.076324671,-0.047441453,-0.041011126
6,0.12951983,0.14319548,-0.051795315,-0.064028375,0.069308779,0.092855671,-0.056517060,-0.048794526
7,0.15000769,0.16684125,-0.060512002,-0.074070898,0.081148470,0.10976993,-0.065436047,-0.056430375
8,0.17010225,0.19033688,-0.069247166,-0.083931753,0.093039942,0.12704930,-0.074190348,-0.063915327
9,0.18977465,0.21365053,-0.077997738,-0.093610648,0.10497012,0.14467489,-0.082771997,-0.071246093
10,0.20899655,0.23675088,-0.086760228,-0.10310749,0.11692524,0.16262716,-0.091173152,-0.078419453
11,0.22774021,0.25960721,-0.095530730,-0.11242237,0.12889089,0.18088590,-0.099386117,-0.085432265
12,0.24597852,0.28218946,-0.10430493,-0.12155560,0.14085204,0.19943031,-0.10740337,-0.092281487
13,0.26368509,0.30446830,-0.11307813,-0.13050764,0.15279305,0.21823902,-0.11521759,-0.098964181
14,0.28083426,0.32641518,-0.12184525,-0.13927918,0.16469770,0.23729015,-0.12282166,-0.10547753
15,0.29740118,0.34800244,-0.13060081,-0.14787105,0.17654925,0.25656133,-0.13020873,-0.11181885
16,0.31336188,0.36920330,-0.13933903,-0.15628428,0.18833042,0.27602977,-0.13737219,-0.11798561
17,0.32869327,0.38999198,-0.14805373,-0.16452006,0.20002348,0.29567227,-0.14430573,-0.12397542
18,0.34337324,0.41034370,-0.15673847,-0.17257974,0.21161025,0.31546530,-0.15100332,-0.12978605
19,0.35738065,0.43023479,-0.16538644,-0.18046485,0.22307216,0.33538506,-0.15745929,-0.13541548
20,0.37069543,0.44964269,-0.17399059,-0.18817703,0.23439025,0.35540746,-0.16366827,-0.14086185
21,0.38329857,0.46854603,-0.18254358,-0.19571810,0.24554525,0.37550827,-0.16962528,-0.14612349
22,0.39517219,0.48692467,-0.19103782,-0.20309000,0.25651761,0.39566306,-0.17532568,-0.15119894
23,0.40629957,0.50475972,-0.19946548,-0.21029478,0.26728754,0.41584734,-0.18076525,-0.15608697
24,0.41666515,0.52203360,-0.20781854,-0.21733465,0.27783503,0.43603657,-0.18594014,-0.16078653
25,0.42625462,0.53873006,-0.21608877,-0.22421189,0.28813994,0.45620621,-0.19084692,-0.16529683
26,0.43505488,0.55483423,-0.22426778,-0.23092890,0.29818198,0.47633179,-0.19548259,-0.16961728
27,0.44305411,0.57033264,-0.23234704,-0.23748816,0.30794083,0.49638893,-0.19984457,-0.17374754
28,0.45024178,0.58521322,-0.24031789,-0.24389224,0.31739614,0.51635343,-0.20393071,-0.17768749
29,0.45660864,0.59946538,-0.24817157,-0.25014378,0.32652755,0.53620128,-0.20773932,-0.18143727
30,0.46214680,0.61307997,-0.25589924,-0.25624547,0.33531482,0.55590875,-0.21126915,-0.18499725
31,0.46684966,0.62604930,-0.26349199,-0.26220006,0.34373778,0.57545240,-0.21451939,-0.18836804
32,0.47071198,0.63836721,-0.27094092,-0.26801034,0.35177645,0.59480917,-0.21748969,-0.19155049
33,0.47372985,0.65002898,-0.27823707,-0.27367912,0.35941105,0.61395638,-0.22018017,-0.19454569
34,0.47590071,0.66103143,-0.28537152,-0.27920923,0.36662205,0.63287184,-0.22259136,-0.19735499
35,0.47722335,0.67137286,-0.29233539,-0.28460352,0.37339022,0.65153381,-0.22472428,-0.19997993
36,0.47769789,0.68105305,-0.29911985,-0.28986481,0.37969667,0.66992115,-0.22658037,-0.20242234
37,0.47732580,0.69007327,-0.30571615,-0.29499591,0.38552293,0.68801326,-0.22816151,-0.20468423
38,0.47610987,0.69843627,-0.31211564,-0.29999963,0.39085092,0.70579019,-0.22947002,-0.20676787
39,0.47405418,0.70614626,-0.31830982,-0.30487870,0.39566306,0.72323267,-0.23050864,-0.20867571
40,0.47116413,0.71320885,-0.32429030,-0.30963582,0.39994230,0.74032214,-0.23128051,-0.21041044
41,0.46744639,0.71963111,-0.33004890,-0.31427364,0.40367214,0.75704076,-0.23178918,-0.21197494
42,0.46290887,0.72542148,-0.33557758,-0.31879471,0.40683667,0.77337150,-0.23203859,-0.21337228
43,0.45756074,0.73058975,-0.34086856,-0.32320151,0.40942064,0.78929815,-0.23203305,-0.21460572
44,0.45141235,0.73514706,-0.34591425,-0.32749644,0.41140949,0.80480533,-0.23177724,-0.21567867
45,0.44447521,0.73910581,-0.35070732,-0.33168177,0.41278935,0.81987855,-0.23127615,-0.21659474
46,0.43676202,0.74247968,-0.35524070,-0.33575967,0.41354712,0.83450424,-0.23053512,-0.21735766
47,0.42828654,0.74528355,-0.35950760,-0.33973218,0.41367048,0.84866974,-0.22955980,-0.21797131
48,0.41906361,0.74753346,-0.36350154,-0.34360121,0.41314795,0.86236336,-0.22835611,-0.21843969
49,0.40910911,0.74924659,-0.36721634,-0.34736851,0.41196886,0.87557439,-0.22693024,-0.21876691
50,0.39843991,0.75044115,-0.37064614,-0.35103570,0.41012346,0.88829311,-0.22528862,-0.21895717
51,0.38707380,0.75113640,-0.37378544,-0.35460421,0.40760289,0.90051082,-0.22343791,-0.21901476
52,0.37502951,0.75135255,-0.37662906,-0.35807532,0.40439921,0.91221983,-0.22138495,-0.21894404
53,0.36232659,0.75111070,-0.37917223,-0.36145013,0.40050544,0.92341352,-0.21913676,-0.21874941
54,0.34898539,0.75043280,-0.38141050,-0.36472953,0.39591559,0.93408629,-0.21670051,-0.21843529
55,0.33502705,0.74934159,-0.38333985,-0.36791425,0.39062464,0.94423362,-0.21408349,-0.21800615
56,0.32047336,0.74786051,-0.38495662,-0.37100480,0.38462860,0.95385201,-0.21129309,-0.21746644
57,0.30534681,0.74601367,-0.38625756,-0.37400147,0.37792451,0.96293907,-0.20833676,-0.21682058
58,0.28967044,0.74382577,-0.38723983,-0.37690437,0.37051042,0.97149343,-0.20522200,-0.21607299
59,0.27346785,0.74132201,-0.38790098,-0.37971337,0.36238545,0.97951480,-0.20195632,-0.21522801
60,0.25676313,0.73852805,-0.38823899,-0.38242813,0.35354977,0.98700393,-0.19854723,-0.21428992
61,0.23958077,0.73546993,-0.38825224,-0.38504807,0.34400461,0.99396261,-0.19500218,-0.21326291
62,0.22194566,0.73217402,-0.38793954,-0.38757240,0.33375227,1.0003937,-0.19132858,-0.21215107
63,0.20388299,0.72866690,-0.38730010,-0.39000008,0.32279611,1.0063009,-0.18753372,-0.21095836
64,0.18541818,0.72497534,-0.38633357,-0.39232985,0.31114054,1.0116893,-0.18362480,-0.20968862
65,0.16657689,0.72112621,-0.38503998,-0.39456021,0.29879107,1.0165645,-0.17960884,-0.20834552
66,0.14738488,0.71714639,-0.38341978,-0.39668942,0.28575421,1.0209334,-0.17549273,-0.20693255
67,0.12786802,0.71306272,-0.38147385,-0.39871551,0.27203756,1.0248038,-0.17128311,-0.20545302
68,0.10805218,0.70890195,-0.37920343,-0.40063628,0.25764972,1.0281842,-0.16698643,-0.20391003
69,0.087963211,0.70469061,-0.37661018,-0.40244929,0.24260034,1.0310842,-0.16260888,-0.20230647
70,0.067626871,0.70045500,-0.37369613,-0.40415185,0.22690004,1.0335142,-0.15815638,-0.20064498
71,0.047068775,0.69622110,-0.37046370,-0.40574108,0.21056048,1.0354854,-0.15363455,-0.19892796
72,0.026314340,0.69201448,-0.36691565,-0.40721383,0.19359422,1.0370099,-0.14904870,-0.19715753
73,0.0053887314,0.68786027,-0.36305513,-0.40856676,0.17601483,1.0381004,-0.14440377,-0.19533554
74,-0.015683189,0.68378307,-0.35888561,-0.40979630,0.15783676,1.0387704,-0.13970438,-0.19346356
75,-0.036876914,0.67980692,-0.35441090,-0.41089867,0.13907538,1.0390342,-0.13495472,-0.19154284
76,-0.058168338,0.67595519,-0.34963512,-0.41186988,0.11974690,1.0389066,-0.13015863,-0.18957432
77,-0.079533806,0.67225057,-0.34456271,-0.41270573,0.099868396,1.0384030,-0.12531950,-0.18755862
78,-0.10095016,0.66871497,-0.33919838,-0.41340185,0.079457739,1.0375394,-0.12044029,-0.18549601
79,-0.12239478,0.66536949,-0.33354714,-0.41395366,0.058533572,1.0363325,-0.11552353,-0.18338644
80,-0.14384564,0.66223437,-0.32761422,-0.41435642,0.037115278,1.0347991,-0.11057125,-0.18122949
81,-0.16528132,0.65932894,-0.32140512,-0.41460522,0.015222939,1.0329568,-0.10558505,-0.17902438
82,-0.18668108,0.65667154,-0.31492555,-0.41469498,-0.0071226968,1.0308233,-0.10056602,-0.17676999
83,-0.20802485,0.65427953,-0.30818143,-0.41462048,-0.029900260,1.0284168,-0.095514759,-0.17446481
84,-0.22929332,0.65216921,-0.30117887,-0.41437636,-0.053087797,1.0257558,-0.090431368,-0.17210697
85,-0.25046792,0.65035577,-0.29392414,-0.41395712,-0.076662813,1.0228590,-0.085315439,-0.16969422
86,-0.27153088,0.64885331,-0.28642366,-0.41335718,-0.10060232,1.0197453,-0.080166053,-0.16722392
87,-0.29246526,0.64767474,-0.27868398,-0.41257082,-0.12488286,1.0164336,-0.074981777,-0.16469309
88,-0.31325493,0.64683181,-0.27071177,-0.41159223,-0.14948059,1.0129432,-0.069760659,-0.16209834
89,-0.33388465,0.64633503,-0.26251378,-0.41041556,-0.17437128,1.0092931,-0.064500236,-0.15943593
90,-0.35434004,0.64619371,-0.25409683,-0.40903484,-0.19953041,1.0055026,-0.059197530,-0.15670173
91,-0.37460764,0.64641586,-0.24546779,-0.40744410,-0.22493316,1.0015908,-0.053849052,-0.15389127
92,-0.39467488,0.64700826,-0.23663357,-0.40563730,-0.25055450,0.99757662,-0.048450812,-0.15099969
93,-0.41453013,0.64797637,-0.22760109,-0.40360839,-0.27636924,0.99347903,-0.042998324,-0.14802180
94,-0.43416266,0.64932439,-0.21837726,-0.40135129,-0.30235203,0.98931669,-0.037486612,-0.14495206
95,-0.45356271,0.65105520,-0.20896896,-0.39885997,-0.32847746,0.98510802,-0.031910226,-0.14178459
96,-0.47272144,0.65317039,-0.19938302,-0.39612838,-0.35472009,0.98087117,-0.026263249,-0.13851319
97,-0.49163094,0.65567024,-0.18962622,-0.39315052,-0.38105450,0.97662397,-0.020539314,-0.13513133
98,-0.51028424,0.65855375,-0.17970525,-0.38992044,-0.40745531,0.97238386,-0.014731621,-0.13163220
99,-0.52867531,0.66181863,-0.16962669,-0.38643226,-0.43389727,0.96816788,-0.0088329486,-0.12800868
100,-0.54679904,0.66546130,-0.15939703,-0.38268019,-0.46035528,0.96399260,-0.0028356774,-0.12425339
101,-0.56465121,0.66947694,-0.14902259,-0.37865851,-0.48680445,0.95987409,0.0032681919,-0.12035870
102,-0.58222852,0.67385949,-0.13850957,-0.37436164,-0.51322013,0.95582791,0.0094870167,-0.11631672
103,-0.59952855,0.67860166,-0.12786398,-0.36978411,-0.53957795,0.95186903,0.015829490,-0.11211935
104,-0.61654973,0.68369497,-0.11709167,-0.36492061,-0.56585391,0.94801181,0.022304614,-0.10775827
105,-0.63329136,0.68912979,-0.10619829,-0.35976597,-0.59202436,0.94427000,0.028921680,-0.10322500
106,-0.64975354,0.69489532,-0.095189274,-0.35431521,-0.61806608,0.94065665,0.035690233,-0.098510882
107,-0.66593719,0.70097971,-0.084069849,-0.34856352,-0.64395630,0.93718413,0.042620054,-0.093607105
108,-0.68184397,0.70736999,-0.072845005,-0.34250632,-0.66967277,0.93386408,0.049721122,-0.088504753
109,-0.69747632,0.71405222,-0.061519493,-0.33613920,-0.69519376,0.93070739,0.057003590,-0.083194806
110,-0.71283738,0.72101143,-0.050097813,-0.32945804,-0.72049812,0.92772418,0.064477751,-0.077668171
111,-0.72793096,0.72823176,-0.038584205,-0.32245892,-0.74556529,0.92492377,0.072154006,-0.071915704
112,-0.74276152,0.73569641,-0.026982646,-0.31513819,-0.77037537,0.92231467,0.080042834,-0.065928236
113,-0.75733414,0.74338778,-0.015296837,-0.30749248,-0.79490913,0.91990456,0.088154757,-0.059696598
114,-0.77165449,0.75128747,-0.0035302029,-0.29951869,-0.81914803,0.91770029,0.096500306,-0.053211647
115,-0.78572873,0.75937633,0.0083141145,-0.29121403,-0.84307425,0.91570782,0.10508999,-0.046464293
116,-0.79956358,0.76763454,0.020233259,-0.28257600,-0.86667075,0.91393229,0.11393424,-0.039445520
117,-0.81316616,0.77604166,0.032224661,-0.27360243,-0.88992124,0.91237793,0.12304342,-0.032146423
118,-0.82654404,0.78457667,0.044286040,-0.26429147,-0.91281025,0.91104812,0.13242775,-0.024558225
119,-0.83970516,0.79321806,0.056415405,-0.25464162,-0.93532310,0.90994535,0.14209728,-0.016672308
120,-0.85265777,0.80194386,0.068611050,-0.24465171,-0.95744598,0.90907124,0.15206186,-0.0084802425
121,-0.86541044,0.81073173,0.080871557,-0.23432094,-0.97916590,0.90842651,0.16233111,2.6190263e-05
122,-0.87797196,0.81955898,0.093195787,-0.22364887,-1.0004708,0.90801103,0.17291436,0.0088549675
123,-0.89035133,0.82840270,0.10558288,-0.21263542,-1.0213493,0.90782379,0.18382064,0.018013800
124,-0.90255771,0.83723974,0.11803224,-0.20128092,-1.0417912,0.90786295,0.19505866,0.027510104
125,-0.91460034,0.84604687,0.13054354,-0.18958606,-1.0617870,0.90812580,0.20663671,0.037350977
126,-0.92648857,0.85480074,0.14311672,-0.17755192,-1.0813281,0.90860881,0.21856269,0.047543169
127,-0.93823175,0.86347803,0.15575196,-0.16517997,-1.1004068,0.90930762,0.23084407,0.058093059
128,-0.94983921,0.87205546,0.16844966,-0.15247210,-1.1190164,0.91021710,0.24348782,0.069006629
129,-0.96132022,0.88050989,0.18121048,-0.13943058,-1.1371510,0.91133131,0.25650041,0.080289440
130,-0.97268395,0.88881834,0.19403528,-0.12605809,-1.1548057,0.91264358,0.26988776,0.091946608
131,-0.98393940,0.89695811,0.20692511,-0.11235773,-1.1719762,0.91414651,0.28365523,0.10398278
132,-0.99509542,0.90490676,0.21988123,-0.098332985,-1.1886595,0.91583196,0.29780758,0.11640211
133,-1.0061606,0.91264227,0.23290507,-0.083987755,-1.2048531,0.91769115,0.31234895,0.12920824
134,-1.0171433,0.92014299,0.24599821,-0.069326346,-1.2205556,0.91971464,0.32728281,0.14240429
135,-1.0280514,0.92738781,0.25916239,-0.054353468,-1.2357663,0.92189236,0.34261196,0.15599281
136,-1.0388928,0.93435610,0.27239946,-0.039074231,-1.2504854,0.92421367,0.35833850,0.16997578
137,-1.0496748,0.94102787,0.28571140,-0.023494146,-1.2647138,0.92666735,0.37446381,0.18435460
138,-1.0604041,0.94738373,0.29910026,-0.0076191171,-1.2784534,0.92924169,0.39098852,0.19913007
139,-1.0710874,0.95340502,0.31256818,0.0085445600,-1.2917066,0.93192450,0.40791249,0.21430233
140,-1.0817306,0.95907379,0.32611735,0.024990205,-1.3044767,0.93470311,0.42523481,0.22987094
141,-1.0923392,0.96437290,0.33975000,0.041710760,-1.3167678,0.93756449,0.44295377,0.24583476
142,-1.1029181,0.96928602,0.35346838,0.058698792,-1.3285844,0.94049522,0.46106684,0.26219203
143,-1.1134720,0.97379770,0.36727471,0.075946506,-1.3399320,0.94348154,0.47957069,0.27894028
144,-1.1240045,0.97789339,0.38117122,0.093445749,-1.3508165,0.94650944,0.49846114,0.29607638
145,-1.1345191,0.98155950,0.39516009,0.11118802,-1.3612446,0.94956463,0.51773316,0.31359652
146,-1.1450183,0.98478338,0.40924340,0.12916449,-1.3712233,0.95263264,0.53738089,0.33149618
147,-1.1555043,0.98755344,0.42342319,0.14736598,-1.3807603,0.95569882,0.55739762,0.34977014
148,-1.1659784,0.98985906,0.43770137,0.16578301,-1.3898640,0.95874843,0.57777577,0.36841250
149,-1.1764415,0.99169071,0.45207973,0.18440580,-1.3985428,0.96176662,0.59850692,0.38741662
150,-1.1868938,0.99303994,0.46655991,0.20322426,-1.4068061,0.96473853,0.61958179,0.40677519
151,-1.1973346,0.99389938,0.48114338,0.22222804,-1.4146632,0.96764930,0.64099025,0.42648017
152,-1.2077628,0.99426278,0.49583143,0.24140650,-1.4221241,0.97048412,0.66272134,0.44652283
153,-1.2181766,0.99412499,0.51062513,0.26074875,-1.4291990,0.97322827,0.68476325,0.46689376
154,-1.2285735,0.99348201,0.52552534,0.28024368,-1.4358983,0.97586717,0.70710336,0.48758282
155,-1.2389502,0.99233095,0.54053267,0.29987993,-1.4422329,0.97838640,0.72972821,0.50857923
156,-1.2493031,0.99067009,0.55564747,0.31964594,-1.4482137,0.98077177,0.75262358,0.52987150
157,-1.2596277,0.98849880,0.57086978,0.33952996,-1.4538518,0.98300934,0.77577444,0.55144750
158,-1.2699188,0.98581762,0.58619939,0.35952004,-1.4591586,0.98508545,0.79916500,0.57329444
159,-1.2801707,0.98262818,0.60163573,0.37960410,-1.4641454,0.98698676,0.82277873,0.59539890
160,-1.2903772,0.97893322,0.61717793,0.39976988,-1.4688237,0.98870033,0.84659838,0.61774682
161,-1.3005314,0.97473661,0.63282477,0.42000500,-1.4732050,0.99021357,0.87060599,0.64032354
162,-1.3106258,0.97004326,0.64857466,0.44029697,-1.4773008,0.99151436,0.89478295,0.66311382
163,-1.3206523,0.96485916,0.66442563,0.46063320,-1.4811225,0.99259103,0.91910997,0.68610184
164,-1.3306025,0.95919132,0.68037535,0.48100102,-1.4846814,0.99343241,0.94356717,0.70927124
165,-1.3404673,0.95304779,0.69642109,0.50138769,-1.4879888,0.99402783,0.96813407,0.73260511
166,-1.3502373,0.94643758,0.71255969,0.52178042,-1.4910559,0.99436721,0.99278965,0.75608607
167,-1.3599024,0.93937064,0.72878760,0.54216642,-1.4938935,0.99444101,1.0175124,0.77969623
168,-1.3694523,0.93185786,0.74510083,0.56253284,-1.4965124,0.99424032,1.0422802,0.80341725
169,-1.3788763,0.92391101,0.76149497,0.58286689,-1.4989229,0.99375684,1.0670706,0.82723039
170,-1.3881633,0.91554269,0.77796518,0.60315575,-1.5011354,0.99298291,1.0918607,0.85111647
171,-1.3973019,0.90676630,0.79450615,0.62338667,-1.5031598,0.99191154,1.1166273,0.87505597
172,-1.4062804,0.89759603,0.81111217,0.64354694,-1.5050055,0.99053642,1.1413467,0.89902900
173,-1.4150869,0.88804674,0.82777705,0.66362394,-1.5066818,0.98885191,1.1659952,0.92301539
174,-1.4237094,0.87813399,0.84449417,0.68360513,-1.5081976,0.98685312,1.1905485,0.94699466
175,-1.4321355,0.86787396,0.86125645,0.70347807,-1.5095614,0.98453583,1.2149823,0.97094610
176,-1.4403528,0.85728337,0.87805638,0.72323043,-1.5107811,0.98189657,1.2392721,0.99484879
177,-1.4483490,0.84637950,0.89488600,0.74285005,-1.5118643,0.97893260,1.2633933,1.0186816
178,-1.4561114,0.83518006,0.91173693,0.76232489,-1.5128183,0.97564190,1.2873213,1.0424233
179,-1.4636277,0.82370320,0.92860033,0.78164308,-1.5136497,0.97202321,1.3110313,1.0660525
180,-1.4708853,0.81196741,0.94546696,0.80079295,-1.5143646,0.96807598,1.3344985,1.0895477
181,-1.4778718,0.79999150,0.96232715,0.81976301,-1.5149687,0.96380041,1.3576985,1.1128876
182,-1.4845751,0.78779451,0.97917084,0.83854197,-1.5154673,0.95919743,1.3806067,1.1360504
183,-1.4909831,0.77539568,0.99598755,0.85711878,-1.5158650,0.95426869,1.4031987,1.1590149
184,-1.4970838,0.76281440,1.0127665,0.87548261,-1.5161659,0.94901656,1.4254504,1.1817596
185,-1.5028658,0.75007010,1.0294963,0.89362288,-1.5163737,0.94344411,1.4473378,1.2042631
186,-1.5083178,0.73718226,1.0461656,0.91152927,-1.5164913,0.93755510,1.4688374,1.2265044
187,-1.5134286,0.72417033,1.0627623,0.92919172,-1.5165215,0.93135398,1.4899258,1.2484623
188,-1.5181879,0.71105365,1.0792742,0.94660046,-1.5164661,0.92484586,1.5105803,1.2701162
189,-1.5225853,0.69785142,1.0956889,0.96374600,-1.5163266,0.91803648,1.5307783,1.2914455
190,-1.5266113,0.68458264,1.1119934,0.98061914,-1.5161041,0.91093223,1.5504977,1.3124298
191,-1.5302564,0.67126605,1.1281747,0.99721099,-1.5157989,0.90354009,1.5697173,1.3330493
192,-1.5335121,0.65792010,1.1442194,1.0135130,-1.5154109,0.89586762,1.5884159,1.3532842
193,-1.5363702,0.64456285,1.1601139,1.0295169,-1.5149396,0.88792294,1.6065733,1.3731154
194,-1.5388231,0.63121199,1.1758446,1.0452148,-1.5143838,0.87971471,1.6241698,1.3925240
195,-1.5408639,0.61788471,1.1913975,1.0605990,-1.5137420,0.87125208,1.6411863,1.4114917
196,-1.5424863,0.60459771,1.2067584,1.0756624,-1.5130121,0.86254467,1.6576045,1.4300004
197,-1.5436847,0.59136715,1.2219132,1.0903980,-1.5121917,0.85360258,1.6734068,1.4480329
198,-1.5444542,0.57820859,1.2368475,1.1047993,-1.5112777,0.84443627,1.6885764,1.4655721
199,-1.5447906,0.56513693,1.2515470,1.1188599,-1.5102670,0.83505664,1.7030972,1.4826018
200,-1.5446905,0.55216643,1.2659971,1.1325742,-1.5091556,0.82547490,1.7169541,1.4991062
201,-1.5441512,0.53931062,1.2801836,1.1459365,-1.5079395,0.81570259,1.7301328,1.5150702
202,-1.5431708,0.52658227,1.2940918,1.1589418,-1.5066143,0.80575153,1.7426199,1.5304792
203,-1.5417484,0.51399338,1.3077073,1.1715852,-1.5051750,0.79563380,1.7544028,1.5453196
204,-1.5398835,0.50155515,1.3210159,1.1838622,-1.5036166,0.78536165,1.7654700,1.5595780
205,-1.5375769,0.48927792,1.3340033,1.1957689,-1.5019336,0.77494756,1.7758109,1.5732420
206,-1.5348299,0.47717119,1.3466552,1.2073014,-1.5001204,0.76440412,1.7854158,1.5863000
207,-1.5316448,0.46524356,1.3589579,1.2184564,-1.4981712,0.75374401,1.7942761,1.5987409
208,-1.5280246,0.45350274,1.3708973,1.2292308,-1.4960797,0.74298000,1.8023842,1.6105544
209,-1.5239733,0.44195550,1.3824600,1.2396220,-1.4938398,0.73212487,1.8097335,1.6217312
210,-1.5194957,0.43060771,1.3936325,1.2496276,-1.4914450,0.72119143,1.8163184,1.6322625
211,-1.5145973,0.41946427,1.4044019,1.2592456,-1.4888888,0.71019239,1.8221344,1.6421405
212,-1.5092847,0.40852914,1.4147552,1.2684744,-1.4861646,0.69914043,1.8271781,1.6513581
213,-1.5035651,0.39780533,1.4246801,1.2773125,-1.4832658,0.68804809,1.8314470,1.6599090
214,-1.4974465,0.38729489,1.4341643,1.2857590,-1.4801855,0.67692777,1.8349397,1.6677877
215,-1.4909380,0.37699894,1.4431962,1.2938131,-1.4769172,0.66579168,1.8376559,1.6749898
216,-1.4840491,0.36691761,1.4517644,1.3014744,-1.4734542,0.65465183,1.8395963,1.6815113
217,-1.4767903,0.35705014,1.4598579,1.3087428,-1.4697899,0.64351997,1.8407628,1.6873495
218,-1.4691727,0.34739480,1.4674663,1.3156186,-1.4659178,0.63240755,1.8411582,1.6925020
219,-1.4612083,0.33794898,1.4745797,1.3221021,-1.4618315,0.62132575,1.8407862,1.6969678
220,-1.4529096,0.32870915,1.4811884,1.3281941,-1.4575248,0.61028539,1.8396519,1.7007463
221,-1.4442899,0.31967092,1.4872836,1.3338956,-1.4529917,0.59929690,1.8377609,1.7038380
222,-1.4353631,0.31082903,1.4928569,1.3392079,-1.4482263,0.58837035,1.8351203,1.7062440
223,-1.4261437,0.30217739,1.4979003,1.3441326,-1.4432230,0.57751538,1.8317378,1.7079664
224,-1.4166468,0.29370914,1.5024066,1.3486713,-1.4379766,0.56674117,1.8276223,1.7090081
225,-1.4068879,0.28541661,1.5063691,1.3528260,-1.4324819,0.55605644,1.8227833,1.7093725
226,-1.3968832,0.27729141,1.5097818,1.3565990,-1.4267343,0.54546944,1.8172316,1.7090642
227,-1.3866493,0.26932445,1.5126392,1.3599926,-1.4207293,0.53498788,1.8109787,1.7080884
228,-1.3762030,0.26150599,1.5149366,1.3630096,-1.4144630,0.52461898,1.8040369,1.7064509
229,-1.3655619,0.25382563,1.5166698,1.3656526,-1.4079317,0.51436940,1.7964193,1.7041584
230,-1.3547436,0.24627241,1.5178355,1.3679246,-1.4011320,0.50424524,1.7881401,1.7012184
231,-1.3437661,0.23883485,1.5184309,1.3698288,-1.3940613,0.49425205,1.7792138,1.6976390
232,-1.3326476,0.23150094,1.5184538,1.3713686,-1.3867171,0.48439479,1.7696560,1.6934289
233,-1.3214065,0.22425824,1.5179030,1.3725472,-1.3790975,0.47467785,1.7594828,1.6885975
234,-1.3100615,0.21709394,1.5167778,1.3733684,-1.3712010,0.46510502,1.7487111,1.6831550
235,-1.2986312,0.20999484,1.5150782,1.3738358,-1.3630266,0.45567948,1.7373583,1.6771121
236,-1.2871344,0.20294748,1.5128050,1.3739533,-1.3545739,0.44640384,1.7254425,1.6704800
237,-1.2755897,0.19593814,1.5099598,1.3737247,-1.3458429,0.43728010,1.7129821,1.6632706
238,-1.2640160,0.18895292,1.5065447,1.3731542,-1.3368341,0.42830964,1.6999963,1.6554963
239,-1.2524317,0.18197779,1.5025626,1.3722457,-1.3275486,0.41949328,1.6865047,1.6471701
240,-1.2408554,0.17499863,1.4980171,1.3710036,-1.3179880,0.41083124,1.6725271,1.6383052
241,-1.2293053,0.16800131,1.4929127,1.3694320,-1.3081543,0.40232315,1.6580840,1.6289156
242,-1.2177994,0.16097173,1.4872543,1.3675352,-1.2980502,0.39396806,1.6431959,1.6190156
243,-1.2063554,0.15389586,1.4810476,1.3653176,-1.2876790,0.38576450,1.6278840,1.6086197
244,-1.1949907,0.14675985,1.4742992,1.3627837,-1.2770443,0.37771040,1.6121693,1.5977431
245,-1.1837223,0.13955001,1.4670160,1.3599378,-1.2661503,0.36980318,1.5960733,1.5864011
246,-1.1725668,0.13225294,1.4592058,1.3567843,-1.2550018,0.36203976,1.5796175,1.5746095
247,-1.1615402,0.12485552,1.4508771,1.3533278,-1.2436041,0.35441652,1.5628238,1.5623840
248,-1.1506580,0.11734502,1.4420388,1.3495727,-1.2319630,0.34692940,1.5457138,1.5497411
249,-1.1399353,0.10970909,1.4327007,1.3455235,-1.2200848,0.33957387,1.5283094,1.5366970
250,-1.1293863,0.10193590,1.4228729,1.3411847,-1.2079763,0.33234495,1.5106323,1.5232683
251,-1.1190247,0.094014085,1.4125663,1.3365607,-1.1956446,0.32523726,1.4927043,1.5094718
252,-1.1088636,0.085932886,1.4017923,1.3316559,-1.1830976,0.31824504,1.4745471,1.4953243
253,-1.0989152,0.077682143,1.3905628,1.3264748,-1.1703433,0.31136216,1.4561820,1.4808428
254,-1.0891910,0.069252363,1.3788903,1.3210218,-1.1573904,0.30458218,1.4376304,1.4660442
255,-1.0797017,0.060634759,1.3667878,1.3153012,-1.1442478,0.29789835,1.4189135,1.4509456
256,-1.0704571,0.051821293,1.3542686,1.3093173,-1.1309250,0.29130363,1.4000520,1.4355638
257,-1.0614661,0.042804718,1.3413466,1.3030745,-1.1174317,0.28479077,1.3810665,1.4199160
258,-1.0527370,0.033578613,1.3280362,1.2965769,-1.1037779,0.27835231,1.3619772,1.4040189
259,-1.0442768,0.024137422,1.3143519,1.2898289,-1.0899741,0.27198060,1.3428039,1.3878894
260,-1.0360917,0.014476487,1.3003088,1.2828344,-1.0760311,0.26566787,1.3235660,1.3715442
261,-1.0281870,0.0045920778,1.2859223,1.2755976,-1.0619596,0.25940624,1.3042825,1.3549997
262,-1.0205670,-0.0055185798,1.2712081,1.2681227,-1.0477711,0.25318775,1.2849720,1.3382723
263,-1.0132350,-0.015857277,1.2561821,1.2604134,-1.0334769,0.24700441,1.2656524,1.3213781
264,-1.0061931,-0.026424800,1.2408605,1.2524739,-1.0190886,0.24084824,1.2463413,1.3043330
265,-0.99944262,-0.037220910,1.2252598,1.2443079,-1.0046181,0.23471128,1.2270555,1.2871527
266,-0.99298375,-0.048244327,1.2093964,1.2359194,-0.99007715,0.22858566,1.2078114,1.2698525
267,-0.98681566,-0.059492714,1.1932872,1.2273121,-0.97547781,0.22246361,1.1886248,1.2524476
268,-0.98093646,-0.070962669,1.1769490,1.2184897,-0.96083214,0.21633747,1.1695107,1.2349525
269,-0.97534323,-0.082649714,1.1603987,1.2094559,-0.94615223,0.21019982,1.1504836,1.2173818
270,-0.97003203,-0.094548294,1.1436534,1.2002144,-0.93145018,0.20404339,1.1315573,1.1997495
271,-0.96499787,-0.10665177,1.1267301,1.1907686,-0.91673806,0.19786119,1.1127450,1.1820693
272,-0.96023477,-0.11895244,1.1096458,1.1811223,-0.90202786,0.19164651,1.0940589,1.1643544
273,-0.95573571,-0.13144150,1.0924174,1.1712788,-0.88733150,0.18539292,1.0755109,1.1466177
274,-0.95149269,-0.14410911,1.0750619,1.1612417,-0.87266077,0.17909438,1.0571120,1.1288716
275,-0.94749675,-0.15694436,1.0575960,1.1510142,-0.85802729,0.17274517,1.0388722,1.1111282
276,-0.94373796,-0.16993531,1.0400363,1.1406000,-0.84344251,0.16634003,1.0208013,1.0933989
277,-0.94020544,-0.18306900,1.0223995,1.1300022,-0.82891766,0.15987409,1.0029079,1.0756949
278,-0.93688745,-0.19633146,1.0047018,1.1192242,-0.81446371,0.15334295,0.98520003,1.0580269
279,-0.93377133,-0.20970775,0.98695913,1.1082694,-0.80009136,0.14674272,0.96768504,1.0404049
280,-0.93084358,-0.22318199,0.96918745,1.0971410,-0.78581101,0.14006999,0.95036943,1.0228386
281,-0.92808991,-0.23673738,0.95140223,1.0858424,-0.77163272,0.13332189,0.93325899,1.0053373
282,-0.92549521,-0.25035622,0.93361870,1.0743767,-0.75756618,0.12649613,0.91635878,0.98790956
283,-0.92304366,-0.26401998,0.91585173,1.0627473,-0.74362070,0.11959098,0.89967311,0.97056368
284,-0.92071874,-0.27770932,0.89811585,1.0509575,-0.72980519,0.11260530,0.88320558,0.95330733
285,-0.91850323,-0.29140411,0.88042518,1.0390105,-0.71612809,0.10553857,0.86695908,0.93614773
286,-0.91637935,-0.30508351,0.86279346,1.0269096,-0.70259742,0.098390886,0.85093580,0.91909161
287,-0.91432871,-0.31872601,0.84523396,1.0146581,-0.68922069,0.091163006,0.83513722,0.90214521
288,-0.91233241,-0.33230946,0.82775952,1.0022593,-0.67600491,0.083856321,0.81956417,0.88531427
289,-0.91037108,-0.34581112,0.81038252,0.98971659,-0.66295659,0.076472888,0.80421683,0.86860407
290,-0.90842493,-0.35920774,0.79311483,0.97703335,-0.65008167,0.069015432,0.78909472,0.85201939
291,-0.90647380,-0.37247559,0.77596780,0.96421296,-0.63738558,0.061487350,0.77419677,0.83556458
292,-0.90449720,-0.38559053,0.75895227,0.95125888,-0.62487313,0.053892715,0.75952129,0.81924350
293,-0.90247441,-0.39852807,0.74207856,0.93817459,-0.61254858,0.046236279,0.74506602,0.80305957
294,-0.90038447,-0.41126340,0.72535639,0.92496361,-0.60041560,0.038523467,0.73082818,0.78701577
295,-0.89820630,-0.42377149,0.70879495,0.91162954,-0.58847724,0.030760380,0.71680442,0.77111466
296,-0.89591872,-0.43602715,0.69240285,0.89817601,-0.57673596,0.022953785,0.70299093,0.75535838
297,-0.89350051,-0.44800504,0.67618809,0.88460671,-0.56519359,0.015111109,0.68938340,0.73974866
298,-0.89093048,-0.45967982,0.66015812,0.87092539,-0.55385134,0.0072404314,0.67597711,0.72428686
299,-0.88818754,-0.47102613,0.64431975,0.85713588,-0.54270982,-0.00064952987,0.66276689,0.70897395
300,-0.88525072,-0.48201873,0.62867920,0.84324205,-0.53176899,-0.0085494310,0.64974721,0.69381054
301,-0.88209926,-0.49263248,0.61324211,0.82924785,-0.52102821,-0.016449318,0.63691218,0.67879692
302,-0.87871268,-0.50284251,0.59801346,0.81515732,-0.51048621,-0.024338644,0.62425559,0.66393303
303,-0.87507080,-0.51262419,0.58299767,0.80097454,-0.50014112,-0.032206289,0.61177092,0.64921852
304,-0.87115382,-0.52195326,0.56819853,0.78670368,-0.48999046,-0.040040582,0.59945141,0.63465273
305,-0.86694237,-0.53080585,0.55361922,0.77234900,-0.48003115,-0.047829324,0.58729007,0.62023476
306,-0.86241759,-0.53915859,0.53926234,0.75791483,-0.47025953,-0.055559812,0.57527971,0.60596341
307,-0.85756114,-0.54698863,0.52512987,0.74340555,-0.46067137,-0.063218868,0.56341297,0.59183729
308,-0.85235532,-0.55427374,0.51122323,0.72882565,-0.45126187,-0.070792865,0.55168238,0.57785477
309,-0.84678304,-0.56099233,0.49754325,0.71417970,-0.44202570,-0.078267762,0.54008035,0.56401403
310,-0.84082795,-0.56712355,0.48409018,0.69947232,-0.43295700,-0.085629130,0.52859924,0.55031307
311,-0.83447444,-0.57264734,0.47086373,0.68470824,-0.42404940,-0.092862189,0.51723136,0.53674973
312,-0.82770771,-0.57754447,0.45786306,0.66989224,-0.41529605,-0.099951842,0.50596905,0.52332171
313,-0.82051381,-0.58179662,0.44508679,0.65502918,-0.40668965,-0.10688271,0.49480463,0.51002661
314,-0.81287969,-0.58538639,0.43253304,0.64012401,-0.39822245,-0.11363917,0.48373052,0.49686190
315,-0.80479325,-0.58829743,0.42019941,0.62518172,-0.38988627,-0.12020539,0.47273922,0.48382500
316,-0.79624335,-0.59051439,0.40808303,0.61020740,-0.38167258,-0.12656537,0.46182334,0.47091324
317,-0.78721988,-0.59202308,0.39618058,0.59520618,-0.37357248,-0.13270300,0.45097565,0.45812392
318,-0.77771381,-0.59281039,0.38448826,0.58018325,-0.36557672,-0.13860206,0.44018908,0.44545432
319,-0.76771716,-0.59286444,0.37300189,0.56514389,-0.35767579,-0.14424631,0.42945677,0.43290171
320,-0.75722309,-0.59217457,0.36171685,0.55009339,-0.34985989,-0.14961949,0.41877211,0.42046337
321,-0.74622593,-0.59073136,0.35062815,0.53503711,-0.34211899,-0.15470539,0.40812871,0.40813659
322,-0.73472115,-0.58852672,0.33973046,0.51998047,-0.33444286,-0.15948787,0.39752047,0.39591873
323,-0.72270545,-0.58555385,0.32901810,0.50492890,-0.32682112,-0.16395095,0.38694159,0.38380720
324,-0.71017673,-0.58180735,0.31848509,0.48988789,-0.31924324,-0.16807879,0.37638660,0.37179948
325,-0.69713414,-0.57728314,0.30812515,0.47486292,-0.31169862,-0.17185576,0.36585036,0.35989314
326,-0.68357807,-0.57197859,0.29793176,0.45985954,-0.30417658,-0.17526653,0.35532809,0.34808585
327,-0.66951019,-0.56589247,0.28789815,0.44488328,-0.29666642,-0.17829603,0.34481539,0.33637541
328,-0.65493342,-0.55902497,0.27801737,0.42993971,-0.28915749,-0.18092954,0.33430825,0.32475974
329,-0.63985198,-0.55137773,0.26828226,0.41503436,-0.28163914,-0.18315274,0.32380307,0.31323689
330,-0.62427136,-0.54295384,0.25868553,0.40017281,-0.27410087,-0.18495174,0.31329668,0.30180509
331,-0.60819831,-0.53375785,0.24921975,0.38536058,-0.26653225,-0.18631309,0.30278631,0.29046269
332,-0.59164089,-0.52379575,0.23987741,0.37060321,-0.25892307,-0.18722389,0.29226967,0.27920825
333,-0.57460839,-0.51307498,0.23065091,0.35590618,-0.25126329,-0.18767175,0.28174488,0.26804047
334,-0.55711139,-0.50160443,0.22153262,0.34127497,-0.24354313,-0.18764489,0.27121056,0.25695827
335,-0.53916170,-0.48939441,0.21251488,0.32671500,-0.23575306,-0.18713214,0.26066575,0.24596074
336,-0.52077234,-0.47645665,0.20359006,0.31223164,-0.22788390,-0.18612301,0.25010998,0.23504717
337,-0.50195756,-0.46280428,0.19475054,0.29783022,-0.21992678,-0.18460768,0.23954324,0.22421705
338,-0.48273279,-0.44845182,0.18598879,0.28351600,-0.21187326,-0.18257707,0.22896598,0.21347009
339,-0.46311461,-0.43341512,0.17729736,0.26929414,-0.20371528,-0.18002285,0.21837912,0.20280618
340,-0.44312075,-0.41771136,0.16866891,0.25516977,-0.19544524,-0.17693749,0.20778405,0.19222544
341,-0.42277003,-0.40135903,0.16009623,0.24114790,-0.18705604,-0.17331428,0.19718260,0.18172818
342,-0.40208233,-0.38437786,0.15157230,0.22723346,-0.17854107,-0.16914733,0.18657707,0.17131495
343,-0.38107857,-0.36678881,0.14309027,0.21343126,-0.16989427,-0.16443163,0.17597020,0.16098647
344,-0.35978066,-0.34861400,0.13464351,0.19974601,-0.16111018,-0.15916308,0.16536515,0.15074369
345,-0.33821145,-0.32987671,0.12622561,0.18618232,-0.15218390,-0.15333845,0.15476553,0.14058776
346,-0.31639471,-0.31060130,0.11783042,0.17274465,-0.14311117,-0.14695549,0.14417535,0.13052001
347,-0.29435507,-0.29081317,0.10945206,0.15943733,-0.13388840,-0.14001284,0.13359901,0.12054199
348,-0.27211794,-0.27053868,0.10108497,0.14626457,-0.12451266,-0.13251014,0.12304133,0.11065541
349,-0.24970954,-0.24980516,0.092723859,0.13323042,-0.11498169,-0.12444798,0.11250746,0.10086219
350,-0.22715676,-0.22864079,0.084363802,0.12033879,-0.10529398,-0.11582794,0.10200293,0.091164408
351,-0.20448716,-0.20707456,0.076000204,0.10759341,-0.095448739,-0.10665260,0.091533592,0.081564306
352,-0.18172889,-0.18513623,0.067628835,0.094997884,-0.085445910,-0.096925498,0.081105627,0.072064290
353,-0.15891065,-0.16285624,0.059245841,0.082555611,-0.075286210,-0.086651202,0.070725503,0.062666915
354,-0.13606162,-0.14026564,0.050847756,0.070269834,-0.064971124,-0.075835257,0.060399968,0.053374871
355,-0.11321139,-0.11739606,0.042431517,0.058143617,-0.054502919,-0.064484206,0.050136022,0.044190979
356,-0.090389930,-0.094279595,0.033994471,0.046179836,-0.043884652,-0.052605579,0.039940898,0.035118176
357,-0.067627493,-0.070948766,0.025534384,0.034381183,-0.033120177,-0.040207887,0.029822034,0.026159503
358,-0.044954573,-0.047436441,0.017049452,0.022750160,-0.022214146,-0.027300615,0.019787057,0.017318098
359,-0.022401838,-0.023775761,0.0085383084,0.011289073,-0.011172013,-0.013894203,0.0098437481,0.0085971762
360,-6.2232516e-08,-6.6432364e-08,2.3848997e-08,3.1240006e-08,-3.1329904e-08,-3.9415404e-08,2.7304807e-08,2.3799132e-08
