deg,XRT_AX,XRT_BX,XRT_AY,XRT_BY,SOT_AX,SOT_BX,SOT_AY,SOT_BY
valid,1,1,1,1,1,1,1,1,revB
offset,94.749638,94.628711,1991.2407,1982.0060,24.788230,24.336214,108.91624,99.313452
0,0.0000000,0.0000000,0.0000000,0.0000000,0.0000000,0.0000000,0.0000000,0.0000000
1,0.12600450,0.033835963,-0.040527245,0.0069862527,0.12205727,0.034431477,-0.031581922,0.025632768
2,0.24958546,0.067898582,-0.080158553,0.012961754,0.24021997,0.068998084,-0.062395492,0.050196182
3,0.37062837,0.10214698,-0.11888015,0.017949224,0.35443782,0.10366359,-0.092466405,0.073628069
4,0.48902730,0.13654141,-0.15668082,0.021973574,0.46467144,0.13839280,-0.12182126,0.095871018
5,0.60468495,0.17104325,-0.19355187,0.025061800,0.57089224,0.17315158,-0.15048744,0.11687249
6,0.71751277,0.20561516,-0.22948710,0.027242877,0.67308229,0.20790691,-0.17849297,0.13658490
7,0.82743099,0.24022107,-0.26448278,0.028547642,0.77123409,0.24262692,-0.20586641,0.15496571
8,0.93436866,0.27482625,-0.29853757,0.029008680,0.86535045,0.27728091,-0.23263676,0.17197752
9,1.0382636,0.30939736,-0.33165251,0.028660202,0.95544422,0.31183941,-0.25883327,0.18758804
10,1.1390625,0.34390250,-0.36383093,0.027537926,1.0415381,0.34627416,-0.28448539,0.20177023
11,1.2367208,0.37831125,-0.39507841,0.025678946,1.1236642,0.38055816,-0.30962259,0.21450224
12,1.3312026,0.41259469,-0.42540270,0.023121612,1.2018640,0.41466571,-0.33427430,0.22576744
13,1.4224805,0.44672544,-0.45481365,0.019905396,1.2761881,0.44857238,-0.35846976,0.23555445
14,1.5105358,0.48067771,-0.48332314,0.016070763,1.3466953,0.48225507,-0.38223792,0.24385705
15,1.5953582,0.51442726,-0.51094499,0.011659044,1.4134530,0.51569197,-0.40560732,0.25067421
16,1.6769454,0.54795148,-0.53769488,0.0067122985,1.4765364,0.54886262,-0.42860600,0.25600999
17,1.7553034,0.58122938,-0.56359024,0.0012731861,1.5360283,0.58174788,-0.45126140,0.25987350
18,1.8304459,0.61424159,-0.58865020,-0.0046151648,1.5920186,0.61432992,-0.47360022,0.26227882
19,1.9023946,0.64697037,-0.61289544,-0.010909289,1.6446037,0.64659225,-0.49564838,0.26324487
20,1.9711782,0.67939961,-0.63634812,-0.017565512,1.6938866,0.67851972,-0.51743092,0.26279538
21,2.0368332,0.71151481,-0.65903178,-0.024540084,1.7399762,0.71009844,-0.53897186,0.26095871
22,2.0994025,0.74330311,-0.68097120,-0.031789301,1.7829864,0.74131587,-0.56029420,0.25776771
23,2.1589362,0.77475322,-0.70219233,-0.039269632,1.8230365,0.77216073,-0.58141977,0.25325965
24,2.2154904,0.80585545,-0.72272218,-0.046937842,1.8602501,0.80262300,-0.60236923,0.24747598
25,2.2691279,0.83660167,-0.74258866,-0.054751113,1.8947549,0.83269392,-0.62316194,0.24046223
26,2.3199167,0.86698526,-0.76182052,-0.062667157,1.9266822,0.86236596,-0.64381594,0.23226778
27,2.3679307,0.89700113,-0.78044722,-0.070644334,1.9561662,0.89163277,-0.66434788,0.22294573
28,2.4132491,0.92664563,-0.79849879,-0.078641759,1.9833440,0.92048920,-0.68477297,0.21255264
29,2.4559554,0.95591656,-0.81600575,-0.086619410,2.0083546,0.94893123,-0.70510496,0.20114840
30,2.4961383,0.98481310,-0.83299899,-0.094538227,2.0313389,0.97695593,-0.72535607,0.18879595
31,2.5338901,1.0133358,-0.84950962,-0.10236021,2.0524388,1.0045615,-0.74553699,0.17556111
32,2.5693072,1.0414864,-0.86556891,-0.11004852,2.0717971,1.0317471,-0.76565684,0.16151230
33,2.6024892,1.0692681,-0.88120814,-0.11756756,2.0895566,1.0585131,-0.78572314,0.14672037
34,2.6335391,1.0966850,-0.89645850,-0.12488304,2.1058603,1.0848605,-0.80574184,0.13125831
35,2.6625621,1.1237426,-0.91135098,-0.13196209,2.1208501,1.1107915,-0.82571726,0.11520104
36,2.6896662,1.1504474,-0.92591626,-0.13877331,2.1346673,1.1363091,-0.84565214,0.098625138
37,2.7149609,1.1768068,-0.94018462,-0.14528683,2.1474512,1.1614172,-0.86554761,0.081608605
38,2.7385577,1.2028293,-0.95418581,-0.15147439,2.1593397,1.1861204,-0.88540323,0.064230605
39,2.7605689,1.2285242,-0.96794897,-0.15730939,2.1704678,1.2104241,-0.90521698,0.046571212
40,2.7811078,1.2539017,-0.98150255,-0.16276691,2.1809682,1.2343344,-0.92498531,0.028711153
41,2.8002882,1.2789727,-0.99487418,-0.16782380,2.1909703,1.2578582,-0.94470317,0.010731552
42,2.8182239,1.3037488,-1.0080906,-0.17245868,2.2006000,1.2810027,-0.96436402,-0.0072863289
43,2.8350284,1.3282423,-1.0211775,-0.17665197,2.2099796,1.3037761,-0.98395991,-0.025261341
44,2.8508147,1.3524658,-1.0341597,-0.18038593,2.2192269,1.3261868,-1.0034815,-0.043112703
45,2.8656946,1.3764326,-1.0470608,-0.18364469,2.2284556,1.3482438,-1.0229180,-0.060760257
46,2.8797790,1.4001564,-1.0599030,-0.18641421,2.2377744,1.3699565,-1.0422577,-0.078124708
47,2.8931767,1.4236512,-1.0727075,-0.18868234,2.2472870,1.3913347,-1.0614872,-0.095127871
48,2.9059950,1.4469312,-1.0854940,-0.19043877,2.2570920,1.4123886,-1.0805922,-0.11169291
49,2.9183386,1.4700108,-1.0982810,-0.19167507,2.2672823,1.4331286,-1.0995574,-0.12774458
50,2.9303099,1.4929046,-1.1110852,-0.19238463,2.2779452,1.4535655,-1.1183664,-0.14320942
51,2.9420083,1.5156273,-1.1239222,-0.19256269,2.2891621,1.4737100,-1.1370018,-0.15801604
52,2.9535302,1.5381933,-1.1368058,-0.19220624,2.3010082,1.4935733,-1.1554455,-0.17209524
53,2.9649687,1.5606173,-1.1497484,-0.19131407,2.3135527,1.5131666,-1.1736785,-0.18538032
54,2.9764133,1.5829135,-1.1627606,-0.18988668,2.3268583,1.5325011,-1.1916812,-0.19780719
55,2.9879496,1.6050961,-1.1758516,-0.18792626,2.3409813,1.5515881,-1.2094335,-0.20931461
56,2.9996594,1.6271790,-1.1890289,-0.18543662,2.3559716,1.5704390,-1.2269147,-0.21984434
57,3.0116199,1.6491758,-1.2022982,-0.18242316,2.3718724,1.5890650,-1.2441037,-0.22934132
58,3.0239044,1.6710994,-1.2156637,-0.17889281,2.3887206,1.6074773,-1.2609790,-0.23775384
59,3.0365812,1.6929627,-1.2291279,-0.17485394,2.4065462,1.6256871,-1.2775193,-0.24503366
60,3.0497144,1.7147778,-1.2426916,-0.17031633,2.4253728,1.6437052,-1.2937027,-0.25113616
61,3.0633629,1.7365563,-1.2563540,-0.16529107,2.4452176,1.6615426,-1.3095076,-0.25602045
62,3.0775809,1.7583092,-1.2701126,-0.15979049,2.4660911,1.6792096,-1.3249124,-0.25964952
63,3.0924174,1.7800469,-1.2839635,-0.15382810,2.4879977,1.6967168,-1.3398957,-0.26199029
64,3.1079166,1.8017790,-1.2979008,-0.14741848,2.5109354,1.7140743,-1.3544364,-0.26301373
65,3.1241174,1.8235145,-1.3119176,-0.14057722,2.5348960,1.7312919,-1.3685138,-0.26269491
66,3.1410536,1.8452615,-1.3260049,-0.13332081,2.5598656,1.7483790,-1.3821076,-0.26101308
67,3.1587538,1.8670274,-1.3401528,-0.12566657,2.5858242,1.7653451,-1.3951981,-0.25795172
68,3.1772415,1.8888186,-1.3543495,-0.11763254,2.6127465,1.7821989,-1.4077664,-0.25349854
69,3.1965349,1.9106409,-1.3685821,-0.10923740,2.6406014,1.7989490,-1.4197942,-0.24764555
70,3.2166474,1.9324989,-1.3828364,-0.10050036,2.6693531,1.8156036,-1.4312642,-0.24038902
71,3.2375870,1.9543966,-1.3970967,-0.091441070,2.6989604,1.8321704,-1.4421599,-0.23172951
72,3.2593569,1.9763370,-1.4113464,-0.082079527,2.7293779,1.8486571,-1.4524659,-0.22167184
73,3.2819553,1.9983220,-1.4255677,-0.072435972,2.7605553,1.8650704,-1.4621679,-0.21022503
74,3.3053759,2.0203527,-1.4397416,-0.062530791,2.7924387,1.8814172,-1.4712528,-0.19740232
75,3.3296073,2.0424292,-1.4538482,-0.052384418,2.8249699,1.8977036,-1.4797086,-0.18322102
76,3.3546340,2.0645508,-1.4678670,-0.042017239,2.8580875,1.9139356,-1.4875248,-0.16770254
77,3.3804358,2.0867157,-1.4817762,-0.031449495,2.8917269,1.9301184,-1.4946922,-0.15087222
78,3.4069884,2.1089212,-1.4955537,-0.020701183,2.9258206,1.9462572,-1.5012030,-0.13275929
79,3.4342636,2.1311637,-1.5091765,-0.0097919690,2.9602986,1.9623566,-1.5070511,-0.11339671
80,3.4622290,2.1534387,-1.5226212,0.0012589098,2.9950888,1.9784209,-1.5122317,-0.092821126
81,3.4908491,2.1757407,-1.5358638,0.012432732,3.0301173,1.9944538,-1.5167416,-0.071072659
82,3.5200845,2.1980634,-1.5488803,0.023711379,3.0653086,2.0104591,-1.5205795,-0.048194815
83,3.5498927,2.2203997,-1.5616459,0.035077420,3.1005863,2.0264397,-1.5237454,-0.024234318
84,3.5802286,2.2427416,-1.5741360,0.046514196,3.1358733,2.0423984,-1.5262413,0.00075905718
85,3.6110438,2.2650803,-1.5863259,0.058005891,3.1710921,2.0583378,-1.5280707,0.026732646
86,3.6422879,2.2874063,-1.5981908,0.069537613,3.2061652,2.0742600,-1.5292389,0.053631082
87,3.6739082,2.3097093,-1.6097061,0.081095462,3.2410156,2.0901667,-1.5297530,0.081396480
88,3.7058498,2.3319782,-1.6208474,0.092666596,3.2755669,2.1060595,-1.5296217,0.10996864
89,3.7380565,2.3542015,-1.6315906,0.10423929,3.3097440,2.1219396,-1.5288557,0.13928522
90,3.7704704,2.3763670,-1.6419120,0.11580301,3.3434731,2.1378082,-1.5274671,0.16928201
91,3.8030328,2.3984618,-1.6517883,0.12734843,3.3766824,2.1536659,-1.5254699,0.19989308
92,3.8356838,2.4204726,-1.6611971,0.13886753,3.4093020,2.1695134,-1.5228799,0.23105102
93,3.8683632,2.4423857,-1.6701162,0.15035357,3.4412648,2.1853510,-1.5197143,0.26268720
94,3.9010106,2.4641868,-1.6785247,0.16180122,3.4725063,2.2011789,-1.5159922,0.29473194
95,3.9335653,2.4858614,-1.6864021,0.17320650,3.5029652,2.2169972,-1.5117341,0.32711481
96,3.9659672,2.5073946,-1.6937291,0.18456686,3.5325835,2.2328059,-1.5069622,0.35976479
97,3.9981568,2.5287712,-1.7004872,0.19588118,3.5613072,2.2486047,-1.5017002,0.39261057
98,4.0300751,2.5499760,-1.7066593,0.20714981,3.5890861,2.2643935,-1.4959731,0.42558074
99,4.0616645,2.5709935,-1.7122291,0.21837453,3.6158741,2.2801719,-1.4898074,0.45860409
100,4.0928689,2.5918082,-1.7171818,0.22955861,3.6416299,2.2959397,-1.4832310,0.49160975
101,4.1236336,2.6124044,-1.7215037,0.24070677,3.6663168,2.3116963,-1.4762728,0.52452752
102,4.1539059,2.6327666,-1.7251827,0.25182518,3.6899028,2.3274417,-1.4689631,0.55728807
103,4.1836354,2.6528794,-1.7282078,0.26292145,3.7123612,2.3431753,-1.4613333,0.58982313
104,4.2127737,2.6727275,-1.7305698,0.27400461,3.7336708,2.3588971,-1.4534155,0.62206579
105,4.2412756,2.6922958,-1.7322606,0.28508508,3.7538154,2.3746067,-1.4452432,0.65395069
106,4.2690981,2.7115696,-1.7332741,0.29617463,3.7727846,2.3903042,-1.4368502,0.68541422
107,4.2962018,2.7305342,-1.7336054,0.30728635,3.7905737,2.4059894,-1.4282713,0.71639475
108,4.3225502,2.7491756,-1.7332515,0.31843462,3.8071837,2.4216626,-1.4195420,0.74683288
109,4.3481103,2.7674802,-1.7322110,0.32963505,3.8226215,2.4373241,-1.4106980,0.77667156
110,4.3728527,2.7854348,-1.7304840,0.34090440,3.8368998,2.4529742,-1.4017757,0.80585635
111,4.3967517,2.8030266,-1.7280724,0.35226057,3.8500372,2.4686136,-1.3928116,0.83433559
112,4.4197857,2.8202438,-1.7249800,0.36372248,3.8620584,2.4842431,-1.3838423,0.86206055
113,4.4419368,2.8370748,-1.7212119,0.37531007,3.8729937,2.4998636,-1.3749048,0.88898564
114,4.4631914,2.8535089,-1.7167751,0.38704416,3.8828795,2.5154763,-1.3660357,0.91506855
115,4.4835402,2.8695362,-1.7116785,0.39894639,3.8917580,2.5310826,-1.3572714,0.94027038
116,4.5029779,2.8851474,-1.7059323,0.41103917,3.8996768,2.5466842,-1.3486484,0.96455584
117,4.5215039,2.9003342,-1.6995487,0.42334553,3.9066894,2.5622828,-1.3402022,0.98789328
118,4.5391218,2.9150890,-1.6925413,0.43588912,3.9128546,2.5778805,-1.3319683,1.0102549
119,4.5558397,2.9294050,-1.6849255,0.44869401,3.9182367,2.5934796,-1.3239811,1.0316169
120,4.5716703,2.9432767,-1.6767181,0.46178467,3.9229049,2.6090826,-1.3162744,1.0519593
121,4.5866304,2.9566991,-1.6679375,0.47518585,3.9269334,2.6246921,-1.3088812,1.0712663
122,4.6007416,2.9696684,-1.6586038,0.48892247,3.9304014,2.6403112,-1.3018333,1.0895264
123,4.6140297,2.9821817,-1.6487383,0.50301951,3.9333923,2.6559430,-1.2951614,1.1067321
124,4.6265249,2.9942373,-1.6383638,0.51750191,3.9359939,2.6715909,-1.2888949,1.1228803
125,4.6382615,3.0058342,-1.6275044,0.53239448,3.9382978,2.6872584,-1.2830619,1.1379721
126,4.6492783,3.0169728,-1.6161854,0.54772175,3.9403996,2.7029493,-1.2776890,1.1520130
127,4.6596180,3.0276542,-1.6044334,0.56350789,3.9423980,2.7186674,-1.2728011,1.1650127
128,4.6693271,3.0378808,-1.5922762,0.57977660,3.9443950,2.7344169,-1.2684216,1.1769852
129,4.6784561,3.0476559,-1.5797425,0.59655099,3.9464951,2.7502020,-1.2645720,1.1879489
130,4.6870592,3.0569839,-1.5668619,0.61385343,3.9488053,2.7660270,-1.2612718,1.1979263
131,4.6951940,3.0658702,-1.5536651,0.63170553,3.9514348,2.7818963,-1.2585387,1.2069440
132,4.7029213,3.0743213,-1.5401835,0.65012795,3.9544942,2.7978146,-1.2563881,1.2150329
133,4.7103052,3.0823447,-1.5264491,0.66914030,3.9580953,2.8137863,-1.2548335,1.2222279
134,4.7174127,3.0899489,-1.5124946,0.68876108,3.9623511,2.8298160,-1.2538859,1.2285677
135,4.7243134,3.0971433,-1.4983533,0.70900753,3.9673749,2.8459085,-1.2535543,1.2340949
136,4.7310792,3.1039384,-1.4840587,0.72989554,3.9732799,2.8620684,-1.2538450,1.2388559
137,4.7377844,3.1103454,-1.4696447,0.75143954,3.9801791,2.8783001,-1.2547621,1.2429006
138,4.7445053,3.1163765,-1.4551455,0.77365243,3.9881848,2.8946082,-1.2563070,1.2462823
139,4.7513195,3.1220450,-1.4405952,0.79654545,3.9974080,2.9109971,-1.2584788,1.2490579
140,4.7583064,3.1273646,-1.4260280,0.82012811,4.0079580,2.9274711,-1.2612738,1.2512869
141,4.7655462,3.1323501,-1.4114781,0.84440810,4.0199421,2.9440342,-1.2646859,1.2530322
142,4.7731201,3.1370168,-1.3969792,0.86939120,4.0334651,2.9606902,-1.2687061,1.2543594
143,4.7811095,3.1413809,-1.3825649,0.89508122,4.0486290,2.9774429,-1.2733230,1.2553365
144,4.7895964,3.1454592,-1.3682682,0.92147988,4.0655323,2.9942956,-1.2785223,1.2560341
145,4.7986623,3.1492689,-1.3541216,0.94858681,4.0842699,3.0112515,-1.2842871,1.2565247
146,4.8083884,3.1528280,-1.3401570,0.97639941,4.1049323,3.0283131,-1.2905979,1.2568830
147,4.8188552,3.1561547,-1.3264056,1.0049129,4.1276056,3.0454828,-1.2974324,1.2571853
148,4.8301421,3.1592678,-1.3128974,1.0341200,4.1523710,3.0627627,-1.3047657,1.2575094
149,4.8423269,3.1621864,-1.2996618,1.0640115,4.1793041,3.0801541,-1.3125704,1.2579343
150,4.8554859,3.1649299,-1.2867270,1.0945752,4.2084751,3.0976582,-1.3208161,1.2585401
151,4.8696932,3.1675179,-1.2741199,1.1257971,4.2399477,3.1152752,-1.3294703,1.2594075
152,4.8850205,3.1699701,-1.2618662,1.1576603,4.2737794,3.1330053,-1.3384977,1.2606178
153,4.9015369,3.1723065,-1.2499903,1.1901456,4.3100210,3.1508478,-1.3478606,1.2622526
154,4.9193084,3.1745468,-1.2385153,1.2232313,4.3487158,3.1688012,-1.3575189,1.2643932
155,4.9383977,3.1767109,-1.2274623,1.2568933,4.3899001,3.1868639,-1.3674303,1.2671210
156,4.9588639,3.1788185,-1.2168512,1.2911049,4.4336022,3.2050330,-1.3775500,1.2705165
157,4.9807621,3.1808891,-1.2067001,1.3258368,4.4798427,3.2233053,-1.3878313,1.2746595
158,5.0041432,3.1829418,-1.1970251,1.3610575,4.5286336,3.2416767,-1.3982250,1.2796289
159,5.0290537,3.1849956,-1.1878408,1.3967328,4.5799788,3.2601423,-1.4086804,1.2855019
160,5.0555352,3.1870689,-1.1791597,1.4328264,4.6338734,3.2786965,-1.4191446,1.2923545
161,5.0836244,3.1891798,-1.1709923,1.4692992,4.6903037,3.2973327,-1.4295630,1.3002605
162,5.1133526,3.1913456,-1.1633472,1.5061101,4.7492468,3.3160437,-1.4398793,1.3092918
163,5.1447456,3.1935832,-1.1562308,1.5432156,4.8106710,3.3348212,-1.4500358,1.3195178
164,5.1778236,3.1959087,-1.1496475,1.5805698,4.8745351,3.3536560,-1.4599732,1.3310054
165,5.2126008,3.1983374,-1.1435994,1.6181250,4.9407885,3.3725383,-1.4696311,1.3438186
166,5.2490852,3.2008839,-1.1380866,1.6558310,5.0093715,3.3914569,-1.4789478,1.3580182
167,5.2872785,3.2035619,-1.1331068,1.6936359,5.0802147,3.4104000,-1.4878605,1.3736619
168,5.3271761,3.2063839,-1.1286555,1.7314856,5.1532393,3.4293548,-1.4963059,1.3908037
169,5.3687665,3.2093617,-1.1247262,1.7693244,5.2283571,3.4483073,-1.5042196,1.4094941
170,5.4120317,3.2125058,-1.1213097,1.8070948,5.3054705,3.4672429,-1.5115369,1.4297792
171,5.4569467,3.2158258,-1.1183949,1.8447375,5.3844726,3.4861458,-1.5181926,1.4517015
172,5.5034798,3.2193299,-1.1159684,1.8821917,5.4652473,3.5049992,-1.5241211,1.4752988
173,5.5515919,3.2230251,-1.1140144,1.9193955,5.5476694,3.5237853,-1.5292571,1.5006045
174,5.6012372,3.2269172,-1.1125151,1.9562852,5.6316045,3.5424855,-1.5335350,1.5276475
175,5.6523626,3.2310107,-1.1114502,1.9927963,5.7169098,3.5610801,-1.5368895,1.5564518
176,5.7049081,3.2353086,-1.1107975,2.0288632,5.8034338,3.5795484,-1.5392560,1.5870364
177,5.7588063,3.2398126,-1.1105327,2.0644192,5.8910166,3.5978690,-1.5405701,1.6194153
178,5.8139831,3.2445229,-1.1106291,2.0993971,5.9794903,3.6160192,-1.5407684,1.6535974
179,5.8703570,3.2494383,-1.1110584,2.1337288,6.0686791,3.6339756,-1.5397883,1.6895862
180,5.9278399,3.2545560,-1.1117899,2.1673460,6.1583999,3.6517140,-1.5375682,1.7273800
181,5.9863367,3.2598718,-1.1127914,2.2001798,6.2484623,3.6692090,-1.5340479,1.7669716
182,6.0457455,3.2653799,-1.1140285,2.2321614,6.3386691,3.6864347,-1.5291686,1.8083482
183,6.1059579,3.2710730,-1.1154652,2.2632218,6.4288167,3.7033642,-1.5228730,1.8514919
184,6.1668590,3.2769422,-1.1170638,2.2932921,6.5186955,3.7199698,-1.5151054,1.8963788
185,6.2283277,3.2829769,-1.1187850,2.3223038,6.6080903,3.7362230,-1.5058122,1.9429798
186,6.2902366,3.2891652,-1.1205879,2.3501889,6.6967807,3.7520949,-1.4949418,1.9912599
187,6.3524528,3.2954936,-1.1224305,2.3768797,6.7845416,3.7675555,-1.4824447,2.0411790
188,6.4148374,3.3019467,-1.1242690,2.4023098,6.8711437,3.7825744,-1.4682739,2.0926912
189,6.4772462,3.3085080,-1.1260587,2.4264132,6.9563541,3.7971206,-1.4523846,2.1457454
190,6.5395301,3.3151593,-1.1277538,2.4491254,7.0399364,3.8111626,-1.4347350,2.2002848
191,6.6015348,3.3218807,-1.1293074,2.4703830,7.1216517,3.8246681,-1.4152858,2.2562477
192,6.6631019,3.3286512,-1.1306718,2.4901239,7.2012590,3.8376048,-1.3940005,2.3135670
193,6.7240684,3.3354481,-1.1317985,2.5082877,7.2785155,3.8499397,-1.3708460,2.3721704
194,6.7842676,3.3422473,-1.1326386,2.5248159,7.3531776,3.8616397,-1.3457919,2.4319809
195,6.8435292,3.3490235,-1.1331422,2.5396515,7.4250010,3.8726711,-1.3188113,2.4929166
196,6.9016800,3.3557497,-1.1332597,2.5527398,7.4937418,3.8830003,-1.2898806,2.5548908
197,6.9585438,3.3623981,-1.1329406,2.5640283,7.5591565,3.8925935,-1.2589795,2.6178124
198,7.0139419,3.3689393,-1.1321349,2.5734667,7.6210032,3.9014167,-1.2260914,2.6815859
199,7.0676939,3.3753428,-1.1307922,2.5810071,7.6790416,3.9094359,-1.1912032,2.7461118
200,7.1196176,3.3815772,-1.1288625,2.5866045,7.7330342,3.9166173,-1.1543055,2.8112867
201,7.1695298,3.3876097,-1.1262961,2.5902163,7.7827462,3.9229271,-1.1153927,2.8770032
202,7.2172464,3.3934068,-1.1230435,2.5918030,7.8279469,3.9283316,-1.0744630,2.9431507
203,7.2625834,3.3989341,-1.1190562,2.5913279,7.8684096,3.9327975,-1.0315185,3.0096152
204,7.3053564,3.4041560,-1.1142861,2.5887574,7.9039126,3.9362919,-0.98656501,3.0762798
205,7.3453821,3.4090365,-1.1086861,2.5840613,7.9342396,3.9387820,-0.93961248,3.1430248
206,7.3824780,3.4135388,-1.1022101,2.5772124,7.9591804,3.9402358,-0.89067473,3.2097280
207,7.4164633,3.4176256,-1.0948130,2.5681871,7.9785313,3.9406217,-0.83976957,3.2762651
208,7.4471590,3.4212588,-1.0864512,2.5569653,7.9920959,3.9399087,-0.78691879,3.3425097
209,7.4743886,3.4244002,-1.0770823,2.5435304,7.9996854,3.9380666,-0.73214815,3.4083340
210,7.4979787,3.4270110,-1.0666655,2.5278693,8.0011194,3.9350658,-0.67548739,3.4736086
211,7.5177589,3.4290524,-1.0551617,2.5099728,7.9962260,3.9308778,-0.61697017,3.5382034
212,7.5335630,3.4304854,-1.0425336,2.4898355,7.9848430,3.9254746,-0.55663409,3.6019873
213,7.5452287,3.4312707,-1.0287456,2.4674555,7.9668174,3.9188297,-0.49452062,3.6648288
214,7.5525987,3.4313694,-1.0137644,2.4428350,7.9420070,3.9109172,-0.43067505,3.7265965
215,7.5555206,3.4307425,-0.99755857,2.4159802,7.9102799,3.9017127,-0.36514643,3.7871589
216,7.5538479,3.4293513,-0.98009907,2.3869008,7.8715155,3.8911927,-0.29798754,3.8463854
217,7.5474397,3.4271576,-0.96135914,2.3556109,7.8256046,3.8793350,-0.22925479,3.9041458
218,7.5361619,3.4241233,-0.94131449,2.3221281,7.7724499,3.8661190,-0.15900811,3.9603116
219,7.5198868,3.4202113,-0.91994333,2.2864742,7.7119665,3.8515252,-0.087310905,4.0147551
220,7.4984944,3.4153847,-0.89722649,2.2486749,7.6440820,3.8355356,-0.014229947,4.0673511
221,7.4718718,3.4096077,-0.87314750,2.2087596,7.5687367,3.8181338,0.060164756,4.1179759
222,7.4399143,3.4028451,-0.84769267,2.1667619,7.4858845,3.7993050,0.13580006,4.1665087
223,7.4025255,3.3950627,-0.82085115,2.1227188,7.3954923,3.7790360,0.21259980,4.2128309
224,7.3596175,3.3862275,-0.79261499,2.0766716,7.2975408,3.7573150,0.29048494,4.2568274
225,7.3111114,3.3763074,-0.76297920,2.0286649,7.1920246,3.7341324,0.36937369,4.2983861
226,7.2569375,3.3652717,-0.73194181,1.9787471,7.0789523,3.7094801,0.44918166,4.3373986
227,7.1970357,3.3530909,-0.69950390,1.9269704,6.9583464,3.6833519,0.52982200,4.3737604
228,7.1313553,3.3397370,-0.66566962,1.8733901,6.8302438,3.6557433,0.61120559,4.4073709
229,7.0598562,3.3251835,-0.63044627,1.8180655,6.6946957,3.6266520,0.69324115,4.4381342
230,6.9825079,3.3094054,-0.59384425,1.7610586,6.5517676,3.5960774,0.77583544,4.4659590
231,6.8992907,3.2923794,-0.55587715,1.7024351,6.4015392,3.5640210,0.85889340,4.4907587
232,6.8101953,3.2740841,-0.51656168,1.6422637,6.2441046,3.5304862,0.94231840,4.5124520
233,6.7152232,3.2544997,-0.47591772,1.5806159,6.0795721,3.4954785,1.0260123,4.5309629
234,6.6143866,3.2336083,-0.43396831,1.5175664,5.9080641,3.4590053,1.1098758,4.5462209
235,6.5077088,3.2113942,-0.39073958,1.4531923,5.7297170,3.4210764,1.1938085,4.5581614
236,6.3952241,3.1878435,-0.34626081,1.3875735,5.5446811,3.3817033,1.2777089,4.5667256
237,6.2769778,3.1629445,-0.30056431,1.3207924,5.3531202,3.3408997,1.3614753,4.5718609
238,6.1530263,3.1366875,-0.25368545,1.2529335,5.1552116,3.2986815,1.4450049,4.5735207
239,6.0234371,3.1090652,-0.20566257,1.1840837,4.9511457,3.2550665,1.5281952,4.5716652
240,5.8882889,3.0800724,-0.15653695,1.1143315,4.7411260,3.2100748,1.6109432,4.5662608
241,5.7476712,3.0497062,-0.10635273,1.0437677,4.5253681,3.1637285,1.6931460,4.5572807
242,5.6016846,3.0179661,-0.055156856,0.97248432,4.3041003,3.1160516,1.7747014,4.5447047
243,5.4504405,2.9848539,-0.0029990035,0.90057508,4.0775623,3.0670704,1.8555071,4.5285196
244,5.2940611,2.9503738,0.050068518,0.82813488,3.8460054,3.0168131,1.9354619,4.5087187
245,5.1326790,2.9145325,0.10399084,0.75525977,3.6096920,2.9653100,2.0144655,4.4853027
246,4.9664373,2.8773388,0.15871065,0.68204669,3.3688947,2.9125932,2.0924184,4.4582789
247,4.7954893,2.8388044,0.21416825,0.60859332,3.1238963,2.8586970,2.1692226,4.4276615
248,4.6199983,2.7989431,0.27030173,0.53499786,2.8749893,2.8036574,2.2447814,4.3934720
249,4.4401372,2.7577713,0.32704702,0.46135887,2.6224750,2.7475125,2.3190000,4.3557386
250,4.2560884,2.7153078,0.38433804,0.38777504,2.3666630,2.6903020,2.3917851,4.3144963
251,4.0680436,2.6715738,0.44210684,0.31434505,2.1078711,2.6320675,2.4630456,4.2697871
252,3.8762031,2.6265930,0.50028367,0.24116730,1.8464240,2.5728525,2.5326925,4.2216598
253,3.6807760,2.5803915,0.55879717,0.16833979,1.5826533,2.5127018,2.6006393,4.1701699
254,3.4819792,2.5329976,0.61757451,0.095959888,1.3168966,2.4516622,2.6668018,4.1153791
255,3.2800375,2.4844421,0.67654149,0.024124140,1.0494967,2.3897818,2.7310986,4.0573562
256,3.0751833,2.4347581,0.73562270,-0.047071909,0.78080124,2.3271104,2.7934511,3.9961758
257,2.8676557,2.3839809,0.79474171,-0.11753391,0.51116194,2.2636991,2.8537837,3.9319190
258,2.6577003,2.3321481,0.85382115,-0.18716888,0.24093378,2.1996004,2.9120238,3.8646727
259,2.4455690,2.2792994,0.91278294,-0.25588543,-0.029525555,2.1348681,2.9681021,3.7945297
260,2.2315191,2.2254766,0.97154839,-0.32359388,-0.29985643,2.0695572,3.0219529,3.7215887
261,2.0158132,2.1707235,1.0300384,-0.39020648,-0.56969793,2.0037239,3.0735136,3.6459535
262,1.7987183,2.1150861,1.0881735,-0.45563757,-0.83868862,1.9374252,3.1227254,3.5677332
263,1.5805059,2.0586120,1.1458744,-0.51980375,-1.1064672,1.8707194,3.1695333,3.4870421
264,1.3614507,2.0013508,1.2030614,-0.58262402,-1.3726732,1.8036654,3.2138859,3.4039989
265,1.1418309,1.9433539,1.2596555,-0.64401997,-1.6369479,1.7363230,3.2557358,3.3187272
266,0.92192702,1.8846742,1.3155777,-0.70391590,-1.8989347,1.6687528,3.2950396,3.2313545
267,0.70202169,1.8253664,1.3707499,-0.76223899,-2.1582801,1.6010158,3.3317578,3.1420123
268,0.48239901,1.7654864,1.4250943,-0.81891942,-2.4146343,1.5331736,3.3658551,3.0508360
269,0.26334400,1.7050917,1.4785342,-0.87389052,-2.6676518,1.4652884,3.3973005,2.9579640
270,0.045142081,1.6442411,1.5309940,-0.92708885,-2.9169923,1.3974223,3.4260668,2.8635382
271,-0.17192152,1.5829945,1.5823990,-0.97845439,-3.1623212,1.3296381,3.4521313,2.7677027
272,-0.38756230,1.5214130,1.6326761,-1.0279306,-3.4033104,1.2619983,3.4754755,2.6706047
273,-0.60149706,1.4595584,1.6817536,-1.0754645,-3.6396386,1.1945657,3.4960852,2.5723930
274,-0.81344446,1.3974938,1.7295613,-1.1210068,-3.8709925,1.1274030,3.5139504,2.4732184
275,-1.0231255,1.3352826,1.7760310,-1.1645120,-4.0970670,1.0605727,3.5290653,2.3732331
276,-1.2302643,1.2729892,1.8210962,-1.2059385,-4.3175658,0.99413681,3.5414285,2.2725905
277,-1.4345882,1.2106783,1.8646925,-1.2452484,-4.5322023,0.92815735,3.5510429,2.1714448
278,-1.6358287,1.1484151,1.9067579,-1.2824082,-4.7406996,0.86269565,3.5579153,2.0699506
279,-1.8337220,1.0862652,1.9472324,-1.3173879,-4.9427918,0.79781252,3.5620569,1.9682626
280,-2.0280092,1.0242942,1.9860586,-1.3501619,-5.1382238,0.73356812,3.5634829,1.8665353
281,-2.2184369,0.96256777,2.0231816,-1.3807086,-5.3267521,0.67002186,3.5622127,1.7649226
282,-2.4047580,0.90115160,2.0585493,-1.4090106,-5.5081452,0.60723229,3.5582695,1.6635776
283,-2.5867319,0.84011114,2.0921121,-1.4350545,-5.6821842,0.54525704,3.5516805,1.5626521
284,-2.7641248,0.77951155,2.1238235,-1.4588311,-5.8486631,0.48415268,3.5424769,1.4622963
285,-2.9367107,0.71941756,2.1536399,-1.4803355,-6.0073888,0.42397471,3.5306933,1.3626586
286,-3.1042712,0.65989335,2.1815207,-1.4995666,-6.1581823,0.36477739,3.5163683,1.2638851
287,-3.2665966,0.60100245,2.2074284,-1.5165277,-6.3008780,0.30661369,3.4995438,1.1661195
288,-3.4234857,0.54280762,2.2313287,-1.5312260,-6.4353249,0.24953525,3.4802651,1.0695025
289,-3.5747464,0.48537070,2.2531907,-1.5436728,-6.5613863,0.19359222,3.4585811,0.97417183
290,-3.7201962,0.42875256,2.2729867,-1.5538833,-6.6789401,0.13883324,3.4345437,0.88026169
291,-3.8596624,0.37301295,2.2906924,-1.5618767,-6.7878791,0.085305363,3.4082077,0.78790261
292,-3.9929824,0.31821038,2.3062868,-1.5676761,-6.8881112,0.033053956,3.3796311,0.69722115
293,-4.1200040,0.26440206,2.3197525,-1.5713082,-6.9795593,-0.017877339,3.3488746,0.60833960
294,-4.2405860,0.21164376,2.3310755,-1.5728036,-7.0621618,-0.067446683,3.3160015,0.52137575
295,-4.3545979,0.15998972,2.3402454,-1.5721965,-7.1358720,-0.11561409,3.2810774,0.43644268
296,-4.4619204,0.10949257,2.3472550,-1.5695243,-7.2006588,-0.16234151,3.2441706,0.35364847
297,-4.5624457,0.060203197,2.3521010,-1.5648283,-7.2565064,-0.20759283,3.2053512,0.27309601
298,-4.6560776,0.012170715,2.3547834,-1.5581526,-7.3034140,-0.25133399,3.1646916,0.19488282
299,-4.7427316,-0.034557665,2.3553056,-1.5495449,-7.3413963,-0.29353297,3.1222657,0.11910084
300,-4.8223350,-0.079936700,2.3536747,-1.5390557,-7.3704827,-0.33415987,3.0781494,0.045836232
301,-4.8948273,-0.12392319,2.3499010,-1.5267384,-7.3907179,-0.37318692,3.0324199,-0.024830740
302,-4.9601596,-0.16647606,2.3439985,-1.5126493,-7.4021611,-0.41058854,2.9851558,-0.092825884
303,-5.0182955,-0.20755641,2.3359842,-1.4968474,-7.4048860,-0.44634133,2.9364367,-0.15808120
304,-5.0692104,-0.24712759,2.3258788,-1.4793938,-7.3989808,-0.48042416,2.8863433,-0.22053501
305,-5.1128921,-0.28515526,2.3137061,-1.4603525,-7.3845475,-0.51281812,2.8349571,-0.28013202
306,-5.1493402,-0.32160742,2.2994929,-1.4397892,-7.3617020,-0.54350658,2.7823602,-0.33682345
307,-5.1785665,-0.35645449,2.2832693,-1.4177719,-7.3305735,-0.57247517,2.7286351,-0.39056710
308,-5.2005945,-0.38966934,2.2650686,-1.3943702,-7.2913042,-0.59971184,2.6738645,-0.44132735
309,-5.2154597,-0.42122730,2.2449269,-1.3696557,-7.2440491,-0.62520679,2.6181315,-0.48907524
310,-5.2232093,-0.45110623,2.2228831,-1.3437013,-7.1889752,-0.64895254,2.5615186,-0.53378849
311,-5.2239019,-0.47928653,2.1989789,-1.3165813,-7.1262615,-0.67094389,2.5041087,-0.57545148
312,-5.2176074,-0.50575116,2.1732589,-1.2883711,-7.0560983,-0.69117789,2.4459836,-0.61405526
313,-5.2044071,-0.53048564,2.1457699,-1.2591471,-6.9786868,-0.70965388,2.3872252,-0.64959748
314,-5.1843928,-0.55347811,2.1165615,-1.2289867,-6.8942385,-0.72637342,2.3279140,-0.68208240
315,-5.1576673,-0.57471925,2.0856854,-1.1979676,-6.8029748,-0.74134032,2.2681302,-0.71152078
316,-5.1243436,-0.59420238,2.0531956,-1.1661684,-6.7051262,-0.75456054,2.2079526,-0.73792982
317,-5.0845448,-0.61192336,2.0191482,-1.1336675,-6.6009322,-0.76604225,2.1474588,-0.76133307
318,-5.0384036,-0.62788063,1.9836013,-1.1005437,-6.4906404,-0.77579572,2.0867252,-0.78176033
319,-4.9860622,-0.64207518,1.9466146,-1.0668758,-6.3745058,-0.78383333,2.0258266,-0.79924750
320,-4.9276721,-0.65451053,1.9082496,-1.0327420,-6.2527906,-0.79016951,1.9648364,-0.81383644
321,-4.8633931,-0.66519270,1.8685696,-0.99822047,-6.1257631,-0.79482069,1.9038259,-0.82557486
322,-4.7933935,-0.67413017,1.8276388,-0.96338858,-5.9936977,-0.79780525,1.8428648,-0.83451613
323,-4.7178494,-0.68133383,1.7855231,-0.92832300,-5.8568736,-0.79914351,1.7820207,-0.84071906
324,-4.6369442,-0.68681697,1.7422892,-0.89309949,-5.7155744,-0.79885762,1.7213593,-0.84424779
325,-4.5508687,-0.69059523,1.6980050,-0.85779275,-5.5700879,-0.79697152,1.6609437,-0.84517151
326,-4.4598198,-0.69268648,1.6527389,-0.82247623,-5.4207046,-0.79351089,1.6008352,-0.84356430
327,-4.3640009,-0.69311087,1.6065602,-0.78722202,-5.2677179,-0.78850308,1.5410924,-0.83950485
328,-4.2636207,-0.69189066,1.5595387,-0.75210067,-5.1114228,-0.78197706,1.4817714,-0.83307629
329,-4.1588933,-0.68905025,1.5117445,-0.71718108,-4.9521158,-0.77396331,1.4229260,-0.82436587
330,-4.0500372,-0.68461602,1.4632477,-0.68253035,-4.7900936,-0.76449379,1.3646072,-0.81346476
331,-3.9372753,-0.67861634,1.4141187,-0.64821363,-4.6256532,-0.75360184,1.3068634,-0.80046776
332,-3.8208340,-0.67108143,1.3644278,-0.61429403,-4.4590906,-0.74132214,1.2497403,-0.78547304
333,-3.7009428,-0.66204330,1.3142450,-0.58083249,-4.2907007,-0.72769058,1.1932808,-0.76858185
334,-3.5778341,-0.65153567,1.2636397,-0.54788765,-4.1207763,-0.71274424,1.1375250,-0.74989824
335,-3.4517421,-0.63959390,1.2126812,-0.51551577,-3.9496078,-0.69652127,1.0825102,-0.72952877
336,-3.3229028,-0.62625484,1.1614376,-0.48377064,-3.7774822,-0.67906081,1.0282708,-0.70758223
337,-3.1915532,-0.61155683,1.1099767,-0.45270343,-3.6046829,-0.66040294,0.97483834,-0.68416932
338,-3.0579310,-0.59553949,1.0583650,-0.42236268,-3.4314891,-0.64058856,0.92224153,-0.65940235
339,-2.9222738,-0.57824375,1.0066681,-0.39279420,-3.2581749,-0.61965934,0.87050619,-0.63339495
340,-2.7848190,-0.55971163,0.95495020,-0.36404095,-3.0850092,-0.59765762,0.81965526,-0.60626176
341,-2.6458030,-0.53998624,0.90327437,-0.33614308,-2.9122549,-0.57462630,0.76970886,-0.57811813
342,-2.5054606,-0.51911161,0.85170214,-0.30913777,-2.7401684,-0.55060881,0.72068428,-0.54907981
343,-2.3640249,-0.49713263,0.80029349,-0.28305927,-2.5689993,-0.52564899,0.67259600,-0.51926263
344,-2.2217267,-0.47409491,0.74910671,-0.25793880,-2.3989900,-0.49979101,0.62545578,-0.48878222
345,-2.0787937,-0.45004472,0.69819833,-0.23380457,-2.2303747,-0.47307928,0.57927266,-0.45775371
346,-1.9354505,-0.42502884,0.64762301,-0.21068173,-2.0633799,-0.44555842,0.53405301,-0.42629143
347,-1.7919180,-0.39909450,0.59743342,-0.18859235,-1.8982232,-0.41727308,0.48980062,-0.39450860
348,-1.6484128,-0.37228923,0.54768020,-0.16755544,-1.7351133,-0.38826795,0.44651675,-0.36251708
349,-1.5051470,-0.34466080,0.49841184,-0.14758693,-1.5742498,-0.35858765,0.40420018,-0.33042705
350,-1.3623278,-0.31625709,0.44967462,-0.12869971,-1.4158226,-0.32827662,0.36284730,-0.29834675
351,-1.2201569,-0.28712601,0.40151255,-0.11090360,-1.2600116,-0.29737911,0.32245223,-0.26638225
352,-1.0788305,-0.25731536,0.35396728,-0.094205429,-1.1069869,-0.26593902,0.28300682,-0.23463712
353,-0.93853844,-0.22687278,0.30707809,-0.078609017,-0.95690808,-0.23399991,0.24450082,-0.20321222
354,-0.79946442,-0.19584563,0.26088181,-0.064115251,-0.80992418,-0.20160487,0.20692196,-0.17220548
355,-0.66178530,-0.16428090,0.21541276,-0.050722119,-0.66617360,-0.16879649,0.17025599,-0.14171160
356,-0.52567100,-0.13222508,0.17070277,-0.038424764,-0.52578390,-0.13561675,0.13448689,-0.11182190
357,-0.39128414,-0.099724160,0.12678110,-0.027215547,-0.38887168,-0.10210700,0.099596866,-0.082624055
358,-0.25877983,-0.066823433,0.083674458,-0.017084110,-0.25554252,-0.068307876,0.065566544,-0.054201936
359,-0.12830544,-0.033567487,0.041406955,-0.0080174557,-0.12589094,-0.034259230,0.032375039,-0.026635388
360,-3.5465465e-07,-9.4003312e-08,1.1425277e-07,-2.0911330e-08,-3.4575617e-07,-9.5795997e-08,8.9166790e-08,-7.2911917e-08
