deg,XRT_AX,XRT_BX,XRT_AY,XRT_BY,SOT_AX,SOT_BX,SOT_AY,SOT_BY
valid,1,1,1,1,1,1,1,1,revB
offset,129.08739,107.50548,1975.9334,1983.1738,87.611650,65.392167,62.318493,69.719550
0,0.0000000,0.0000000,0.0000000,0.0000000,0.0000000,0.0000000,0.0000000,0.0000000
1,0.014092573,0.014303908,0.0051746994,0.010861648,0.013236124,0.0098359892,-0.0046764217,-0.0047308929
2,0.027697786,0.028657038,0.010727814,0.022029681,0.026261299,0.019910571,-0.0093870772,-0.0093280780
3,0.040815543,0.043054443,0.016642494,0.033474269,0.039067055,0.030222169,-0.014130859,-0.013789965
4,0.053446552,0.057491440,0.022901461,0.045165199,0.051644819,0.040768698,-0.018906265,-0.018115145
5,0.065592304,0.071963622,0.029487042,0.057071938,0.063985922,0.051547556,-0.023711413,-0.022302408
6,0.077255048,0.086466846,0.036381193,0.069163695,0.076081605,0.062555620,-0.028544047,-0.026350751
7,0.088437770,0.10099723,0.043565534,0.081409481,0.087923033,0.073789244,-0.033401553,-0.030259391
8,0.099144161,0.11555117,0.051021376,0.093778169,0.099501302,0.085244256,-0.038280969,-0.034027776
9,0.10937859,0.13012529,0.058729752,0.10623856,0.11080745,0.096915957,-0.043179001,-0.037655593
10,0.11914609,0.14471648,0.066671453,0.11875945,0.12183247,0.10879913,-0.048092034,-0.041142778
11,0.12845228,0.15932186,0.074827056,0.13130967,0.13256731,0.12088801,-0.053016151,-0.044489522
12,0.13730339,0.17393881,0.083176959,0.14385818,0.14300291,0.13317636,-0.057947145,-0.047696280
13,0.14570619,0.18856490,0.091701413,0.15637413,0.15313019,0.14565739,-0.062880537,-0.050763773
14,0.15366797,0.20319794,0.10038056,0.16882687,0.16294006,0.15832382,-0.067811590,-0.053692995
15,0.16119647,0.21783594,0.10919446,0.18118608,0.17242346,0.17116787,-0.072735329,-0.056485214
16,0.16829991,0.23247710,0.11812313,0.19342180,0.18157136,0.18418129,-0.077646557,-0.059141975
17,0.17498687,0.24711981,0.12714658,0.20550449,0.19037476,0.19735532,-0.082539871,-0.061665104
18,0.18126630,0.26176262,0.13624485,0.21740509,0.19882471,0.21068078,-0.087409682,-0.064056700
19,0.18714748,0.27640425,0.14539802,0.22909508,0.20691235,0.22414801,-0.092250233,-0.066319141
20,0.19263996,0.29104355,0.15458629,0.24054654,0.21462888,0.23774692,-0.097055614,-0.068455077
21,0.19775353,0.30567953,0.16378998,0.25173220,0.22196563,0.25146704,-0.10181979,-0.070467427
22,0.20249815,0.32031127,0.17298955,0.26262550,0.22891401,0.26529745,-0.10653659,-0.072359376
23,0.20688396,0.33493799,0.18216570,0.27320067,0.23546559,0.27922689,-0.11119978,-0.074134364
24,0.21092121,0.34955899,0.19129933,0.28343270,0.24161205,0.29324374,-0.11580303,-0.075796083
25,0.21462020,0.36417361,0.20037162,0.29329750,0.24734526,0.30733604,-0.12033995,-0.077348465
26,0.21799126,0.37878129,0.20936404,0.30277185,0.25265725,0.32149150,-0.12480410,-0.078795675
27,0.22104472,0.39338148,0.21825839,0.31183352,0.25754025,0.33569757,-0.12918904,-0.080142096
28,0.22379084,0.40797366,0.22703685,0.32046127,0.26198669,0.34994142,-0.13348831,-0.081392323
29,0.22623979,0.42255732,0.23568197,0.32863490,0.26598921,0.36420998,-0.13769545,-0.082551143
30,0.22840160,0.43713193,0.24417673,0.33633531,0.26954071,0.37849000,-0.14180405,-0.083623527
31,0.23028614,0.45169696,0.25250460,0.34354451,0.27263433,0.39276799,-0.14580773,-0.084614609
32,0.23190306,0.46625181,0.26064948,0.35024567,0.27526346,0.40703036,-0.14970016,-0.085529674
33,0.23326174,0.48079583,0.26859582,0.35642315,0.27742181,0.42126336,-0.15347510,-0.086374140
34,0.23437132,0.49532832,0.27632860,0.36206255,0.27910334,0.43545316,-0.15712639,-0.087153540
35,0.23524058,0.50984846,0.28383338,0.36715069,0.28030237,0.44958584,-0.16064799,-0.087873501
36,0.23587799,0.52435536,0.29109629,0.37167568,0.28101350,0.46364746,-0.16403395,-0.088539729
37,0.23629160,0.53884798,0.29810409,0.37562692,0.28123168,0.47762407,-0.16727846,-0.089157984
38,0.23648907,0.55332517,0.30484418,0.37899513,0.28095224,0.49150174,-0.17037587,-0.089734063
39,0.23647762,0.56778563,0.31130462,0.38177234,0.28017083,0.50526659,-0.17332065,-0.090273775
40,0.23626399,0.58222789,0.31747418,0.38395196,0.27888351,0.51890483,-0.17610746,-0.090782924
41,0.23585445,0.59665033,0.32334228,0.38552874,0.27708671,0.53240279,-0.17873113,-0.091267280
42,0.23525475,0.61105113,0.32889912,0.38649878,0.27477726,0.54574692,-0.18118664,-0.091732563
43,0.23447010,0.62542829,0.33413560,0.38685956,0.27195241,0.55892388,-0.18346921,-0.092184414
44,0.23350517,0.63977957,0.33904340,0.38660994,0.26860983,0.57192052,-0.18557423,-0.092628376
45,0.23236405,0.65410257,0.34361495,0.38575013,0.26474762,0.58472392,-0.18749730,-0.093069868
46,0.23105025,0.66839461,0.34784348,0.38428173,0.26036431,0.59732144,-0.18923422,-0.093514162
47,0.22956670,0.68265280,0.35172300,0.38220769,0.25545889,0.60970072,-0.19078102,-0.093966360
48,0.22791571,0.69687403,0.35524834,0.37953230,0.25003079,0.62184974,-0.19213395,-0.094431371
49,0.22609898,0.71105490,0.35841514,0.37626120,0.24407993,0.63375681,-0.19328947,-0.094913885
50,0.22411760,0.72519180,0.36121984,0.37240136,0.23760667,0.64541064,-0.19424427,-0.095418352
51,0.22197205,0.73928083,0.36365974,0.36796103,0.23061187,0.65680034,-0.19499527,-0.095948958
52,0.21966216,0.75331784,0.36573294,0.36294979,0.22309684,0.66791542,-0.19553961,-0.096509603
53,0.21718716,0.76729841,0.36743839,0.35737844,0.21506342,0.67874588,-0.19587467,-0.097103880
54,0.21454568,0.78121786,0.36877587,0.35125903,0.20651388,0.68928219,-0.19599803,-0.097735051
55,0.21173570,0.79507125,0.36974598,0.34460483,0.19745103,0.69951530,-0.19590753,-0.098406028
56,0.20875464,0.80885335,0.37035018,0.33743028,0.18787814,0.70943669,-0.19560120,-0.099119350
57,0.20559931,0.82255868,0.37059073,0.32975095,0.17779898,0.71903839,-0.19507730,-0.099877168
58,0.20226595,0.83618149,0.37047072,0.32158356,0.16721781,0.72831297,-0.19433429,-0.10068122
59,0.19875024,0.84971578,0.36999405,0.31294586,0.15613939,0.73725359,-0.19337087,-0.10153282
60,0.19504730,0.86315526,0.36916545,0.30385665,0.14456896,0.74585401,-0.19218591,-0.10243284
61,0.19115174,0.87649343,0.36799042,0.29433572,0.13251225,0.75410856,-0.19077850,-0.10338169
62,0.18705767,0.88972352,0.36647525,0.28440381,0.11997547,0.76201222,-0.18914791,-0.10437930
63,0.18275872,0.90283853,0.36462703,0.27408257,0.10696530,0.76956061,-0.18729358,-0.10542511
64,0.17824804,0.91583122,0.36245358,0.26339447,0.093488927,0.77674995,-0.18521515,-0.10651806
65,0.17351838,0.92869414,0.35996347,0.25236283,0.079553963,0.78357714,-0.18291241,-0.10765660
66,0.16856209,0.94141962,0.35716600,0.24101170,0.065168503,0.79003972,-0.18038531,-0.10883863
67,0.16337113,0.95399981,0.35407119,0.22936584,0.050341090,0.79613592,-0.17763395,-0.11006152
68,0.15793714,0.96642664,0.35068974,0.21745066,0.035080709,0.80186459,-0.17465857,-0.11132212
69,0.15225146,0.97869189,0.34703301,0.20529218,0.019396782,0.80722528,-0.17145952,-0.11261672
70,0.14630514,0.99078718,0.34311302,0.19291693,0.0032991534,0.81221819,-0.16803730,-0.11394107
71,0.14008903,1.0027040,0.33894241,0.18035198,-0.013201920,0.81684420,-0.16439249,-0.11529036
72,0.13359377,1.0144336,0.33453442,0.16762477,-0.030095778,0.82110484,-0.16052577,-0.11665925
73,0.12680982,1.0259672,0.32990287,0.15476317,-0.047371373,0.82500231,-0.15643792,-0.11804182
74,0.11972757,1.0372961,0.32506213,0.14179532,-0.065017282,0.82853944,-0.15212977,-0.11943162
75,0.11233729,1.0484111,0.32002707,0.12874965,-0.083021721,0.83171972,-0.14760224,-0.12082164
76,0.10462924,1.0593033,0.31481308,0.11565477,-0.10137256,0.83454727,-0.14285626,-0.12220433
77,0.096593675,1.0699637,0.30943601,0.10253945,-0.12005733,0.83702684,-0.13789285,-0.12357163
78,0.088220901,1.0803830,0.30391213,0.089432527,-0.13906326,0.83916378,-0.13271302,-0.12491492
79,0.079501311,1.0905523,0.29825813,0.076362872,-0.15837726,0.84096404,-0.12731782,-0.12622508
80,0.070425430,1.1004625,0.29249107,0.063359323,-0.17798598,0.84243415,-0.12170829,-0.12749248
81,0.060983956,1.1101044,0.28662834,0.050450631,-0.19787580,0.84358120,-0.11588547,-0.12870702
82,0.051167804,1.1194691,0.28068767,0.037665399,-0.21803284,0.84441283,-0.10985039,-0.12985809
83,0.040968149,1.1285477,0.27468703,0.025032031,-0.23844300,0.84493720,-0.10360406,-0.13093465
84,0.030376464,1.1373313,0.26864466,0.012578673,-0.25909197,0.84516296,-0.097147453,-0.13192520
85,0.019384565,1.1458113,0.26257900,0.00033316350,-0.27996526,0.84509927,-0.090481486,-0.13281782
86,0.0079846512,1.1539790,0.25650867,-0.011677026,-0.30104820,0.84475573,-0.083607035,-0.13360019
87,-0.0038306568,1.1618261,0.25045243,-0.023424836,-0.32232598,0.84414236,-0.076524915,-0.13425963
88,-0.016068276,1.1693444,0.24442915,-0.034883676,-0.34378363,0.84326960,-0.069235867,-0.13478307
89,-0.028734622,1.1765258,0.23845779,-0.046027469,-0.36540612,0.84214827,-0.061740561,-0.13515714
90,-0.041835574,1.1833625,0.23255732,-0.056830701,-0.38717829,0.84078953,-0.054039581,-0.13536815
91,-0.055376438,1.1898470,0.22674674,-0.067268466,-0.40908494,0.83920486,-0.046133422,-0.13540215
92,-0.069361910,1.1959720,0.22104502,-0.077316515,-0.43111079,0.83740604,-0.038022486,-0.13524493
93,-0.083796044,1.2017304,0.21547106,-0.086951292,-0.45324058,0.83540510,-0.029707076,-0.13488207
94,-0.098682221,1.2071157,0.21004367,-0.096149980,-0.47545900,0.83321432,-0.021187390,-0.13429897
95,-0.11402312,1.2121213,0.20478154,-0.10489054,-0.49775079,0.83084616,-0.012463520,-0.13348088
96,-0.12982068,1.2167413,0.19970318,-0.11315174,-0.52010071,0.82831323,-0.0035354491,-0.13241291
97,-0.14607609,1.2209700,0.19482692,-0.12091321,-0.54249359,0.82562831,0.0055969504,-0.13108012
98,-0.16278975,1.2248021,0.19017087,-0.12815545,-0.56491432,0.82280426,0.014933919,-0.12946748
99,-0.17996125,1.2282327,0.18575287,-0.13485987,-0.58734790,0.81985400,0.024475807,-0.12756000
100,-0.19758936,1.2312573,0.18159048,-0.14100882,-0.60977946,0.81679048,0.034223081,-0.12534266
101,-0.21567200,1.2338718,0.17770094,-0.14658564,-0.63219425,0.81362668,0.044176313,-0.12280053
102,-0.23420623,1.2360726,0.17410114,-0.15157463,-0.65457769,0.81037551,0.054336184,-0.11991876
103,-0.25318822,1.2378565,0.17080760,-0.15596111,-0.67691538,0.80704983,0.064703482,-0.11668266
104,-0.27261327,1.2392209,0.16783643,-0.15973145,-0.69919311,0.80366239,0.075279094,-0.11307769
105,-0.29247577,1.2401633,0.16520332,-0.16287304,-0.72139689,0.80022583,0.086064002,-0.10908953
106,-0.31276921,1.2406822,0.16292349,-0.16537436,-0.74351297,0.79675258,0.097059280,-0.10470410
107,-0.33348617,1.2407763,0.16101168,-0.16722495,-0.76552783,0.79325492,0.10826609,-0.099907632
108,-0.35461831,1.2404447,0.15948213,-0.16841543,-0.78742825,0.78974486,0.11968565,-0.094686657
109,-0.37615639,1.2396873,0.15834855,-0.16893751,-0.80920126,0.78623417,0.13131929,-0.089028085
110,-0.39809026,1.2385044,0.15762410,-0.16878402,-0.83083422,0.78273433,0.14316835,-0.082919225
111,-0.42040886,1.2368967,0.15732136,-0.16794886,-0.85231478,0.77925649,0.15523425,-0.076347825
112,-0.44310024,1.2348657,0.15745232,-0.16642705,-0.87363094,0.77581145,0.16751844,-0.069302111
113,-0.46615156,1.2324130,0.15802835,-0.16421469,-0.89477104,0.77240964,0.18002241,-0.061770818
114,-0.48954911,1.2295412,0.15906023,-0.16130898,-0.91572376,0.76906108,0.19274766,-0.053743234
115,-0.51327834,1.2262532,0.16055804,-0.15770821,-0.93647818,0.76577537,0.20569568,-0.045209227
116,-0.53732384,1.2225523,0.16253125,-0.15341174,-0.95702372,0.76256163,0.21886799,-0.036159283
117,-0.56166938,1.2184427,0.16498862,-0.14841999,-0.97735023,0.75942853,0.23226605,-0.026584538
118,-0.58629797,1.2139287,0.16793824,-0.14273443,-0.99744794,0.75638423,0.24589130,-0.016476813
119,-0.61119181,1.2090155,0.17138750,-0.13635759,-1.0173075,0.75343637,0.25974514,-0.0058286403
120,-0.63633238,1.2037085,0.17534309,-0.12929299,-1.0369200,0.75059205,0.27382888,0.0053667050
121,-0.66170043,1.1980137,0.17981097,-0.12154517,-1.0562768,0.74785780,0.28814378,0.017115175
122,-0.68727605,1.1919379,0.18479638,-0.11311963,-1.0753700,0.74523961,0.30269099,0.029421922
123,-0.71303867,1.1854878,0.19030384,-0.10402285,-1.0941919,0.74274283,0.31747154,0.042291277
124,-0.73896711,1.1786712,0.19633712,-0.094262208,-1.1127352,0.74037225,0.33248633,0.055726720
125,-0.76503962,1.1714958,0.20289927,-0.083846021,-1.1309933,0.73813203,0.34773614,0.069730859
126,-0.79123391,1.1639702,0.20999257,-0.072783464,-1.1489599,0.73602570,0.36322156,0.084305413
127,-0.81752720,1.1561032,0.21761860,-0.061084563,-1.1666290,0.73405616,0.37894301,0.099451187
128,-0.84389627,1.1479041,0.22577816,-0.048760165,-1.1839954,0.73222567,0.39490072,0.11516806
129,-0.87031747,1.1393825,0.23447133,-0.035821900,-1.2010540,0.73053585,0.41109471,0.13145496
130,-0.89676681,1.1305485,0.24369745,-0.022282153,-1.2178004,0.72898766,0.42752475,0.14830987
131,-0.92321999,1.1214126,0.25345512,-0.0081540271,-1.2342306,0.72758141,0.44419038,0.16572980
132,-0.94965244,1.1119856,0.26374220,0.0065486892,-1.2503409,0.72631678,0.46109088,0.18371076
133,-0.97603937,1.1022785,0.27455587,0.021811559,-1.2661283,0.72519277,0.47822524,0.20224781
134,-1.0023558,1.0923028,0.28589255,0.037619532,-1.2815901,0.72420775,0.49559215,0.22133498
135,-1.0285768,1.0820702,0.29774797,0.053956984,-1.2967239,0.72335945,0.51318999,0.24096533
136,-1.0546771,1.0715926,0.31011716,0.070807751,-1.3115281,0.72264496,0.53101684,0.26113092
137,-1.0806315,1.0608824,0.32299448,0.088155170,-1.3260011,0.72206074,0.54907040,0.28182279
138,-1.1064152,1.0499519,0.33637358,0.10598212,-1.3401421,0.72160266,0.56734802,0.30303102
139,-1.1320029,1.0388137,0.35024748,0.12427104,-1.3539504,0.72126595,0.58584670,0.32474467
140,-1.1573700,1.0274807,0.36460853,0.14300401,-1.3674259,0.72104528,0.60456304,0.34695183
141,-1.1824916,1.0159657,0.37944846,0.16216275,-1.3805689,0.72093472,0.62349325,0.36963962
142,-1.2073436,1.0042818,0.39475837,0.18172867,-1.3933799,0.72092779,0.64263311,0.39279420
143,-1.2319017,0.99244221,0.41052875,0.20168291,-1.4058600,0.72101748,0.66197801,0.41640077
144,-1.2561424,0.98046000,0.42674950,0.22200639,-1.4180105,0.72119625,0.68152289,0.44044360
145,-1.2800422,0.96834845,0.44340999,0.24267983,-1.4298331,0.72145604,0.70126225,0.46490605
146,-1.3035783,0.95612080,0.46049897,0.26368378,-1.4413299,0.72178835,0.72119015,0.48977059
147,-1.3267284,0.94379026,0.47800472,0.28499869,-1.4525032,0.72218418,0.74130018,0.51501881
148,-1.3494708,0.93137001,0.49591497,0.30660493,-1.4633557,0.72263412,0.76158547,0.54063143
149,-1.3717843,0.91887314,0.51421696,0.32848279,-1.4738904,0.72312837,0.78203870,0.56658838
150,-1.3936484,0.90631266,0.53289746,0.35061257,-1.4841105,0.72365672,0.80265204,0.59286877
151,-1.4150433,0.89370144,0.55194280,0.37297459,-1.4940196,0.72420864,0.82341720,0.61945094
152,-1.4359499,0.88105220,0.57133885,0.39554920,-1.5036215,0.72477323,0.84432542,0.64631252
153,-1.4563500,0.86837749,0.59107109,0.41831686,-1.5129201,0.72533936,0.86536744,0.67343041
154,-1.4762262,0.85568964,0.61112460,0.44125813,-1.5219198,0.72589558,0.88653352,0.70078085
155,-1.4955620,0.84300077,0.63148411,0.46435369,-1.5306249,0.72643024,0.90781345,0.72833945
156,-1.5143415,0.83032273,0.65213398,0.48758443,-1.5390401,0.72693149,0.92919652,0.75608121
157,-1.5325502,0.81766709,0.67305828,0.51093140,-1.5471703,0.72738729,0.95067156,0.78398060
158,-1.5501743,0.80504515,0.69424074,0.53437590,-1.5550203,0.72778550,0.97222693,0.81201154
159,-1.5672010,0.79246784,0.71566486,0.55789945,-1.5625954,0.72811383,0.99385051,0.84014751
160,-1.5836187,0.77994578,0.73731384,0.58148385,-1.5699007,0.72835996,1.0155297,0.86836154
161,-1.5994167,0.76748921,0.75917068,0.60511118,-1.5769416,0.72851153,1.0372516,0.89662627
162,-1.6145853,0.75510798,0.78121816,0.62876384,-1.5837236,0.72855617,1.0590026,0.92491401
163,-1.6291162,0.74281155,0.80343887,0.65242455,-1.5902521,0.72848153,1.0807688,0.95319677
164,-1.6430019,0.73060894,0.82581525,0.67607636,-1.5965328,0.72827535,1.1025360,0.98144631
165,-1.6562363,0.71850872,0.84832959,0.69970268,-1.6025713,0.72792545,1.1242895,1.0096342
166,-1.6688143,0.70651904,0.87096405,0.72328730,-1.6083732,0.72741979,1.1460140,1.0377318
167,-1.6807319,0.69464753,0.89370070,0.74681437,-1.6139442,0.72674651,1.1676942,1.0657104
168,-1.6919864,0.68290137,0.91652155,0.77026846,-1.6192899,0.72589392,1.1893143,1.0935413
169,-1.7025761,0.67128722,0.93940852,0.79363452,-1.6244161,0.72485057,1.2108579,1.1211957
170,-1.7125007,0.65981124,0.96234353,0.81689789,-1.6293282,0.72360528,1.2323087,1.1486449
171,-1.7217610,0.64847907,0.98530847,0.84004436,-1.6340320,0.72214716,1.2536498,1.1758603
172,-1.7303587,0.63729581,1.0082852,0.86306009,-1.6385328,0.72046563,1.2748642,1.2028132
173,-1.7382970,0.62626603,1.0312557,0.88593169,-1.6428361,0.71855047,1.2959344,1.2294756
174,-1.7455802,0.61539376,1.0542019,0.90864619,-1.6469473,0.71639184,1.3168431,1.2558192
175,-1.7522134,0.60468248,1.0771059,0.93119101,-1.6508716,0.71398031,1.3375723,1.2818163
176,-1.7582032,0.59413510,1.0999497,0.95355400,-1.6546141,0.71130688,1.3581041,1.3074395
177,-1.7635573,0.58375401,1.1227155,0.97572342,-1.6581799,0.70836299,1.3784204,1.3326617
178,-1.7682841,0.57354102,1.1453858,0.99768794,-1.6615737,0.70514060,1.3985029,1.3574562
179,-1.7723934,0.56349739,1.1679428,1.0194366,-1.6648004,0.70163215,1.4183334,1.3817970
180,-1.7758960,0.55362383,1.1903694,1.0409590,-1.6678645,0.69783061,1.4378933,1.4056584
181,-1.7788036,0.54392051,1.2126481,1.0622448,-1.6707703,0.69372950,1.4571643,1.4290153
182,-1.7811289,0.53438703,1.2347621,1.0832843,-1.6735222,0.68932291,1.4761277,1.4518434
183,-1.7828855,0.52502248,1.2566943,1.1040682,-1.6761242,0.68460551,1.4947652,1.4741186
184,-1.7840880,0.51582540,1.2784282,1.1245873,-1.6785801,0.67957257,1.5130583,1.4958181
185,-1.7847519,0.50679383,1.2999473,1.1448329,-1.6808937,0.67421997,1.5309887,1.5169194
186,-1.7848932,0.49792527,1.3212355,1.1647967,-1.6830682,0.66854423,1.5485381,1.5374008
187,-1.7845292,0.48921674,1.3422767,1.1844705,-1.6851071,0.66254250,1.5656884,1.5572416
188,-1.7836774,0.48066475,1.3630554,1.2038468,-1.6870134,0.65621257,1.5824217,1.5764218
189,-1.7823565,0.47226538,1.3835559,1.2229178,-1.6887898,0.64955289,1.5987202,1.5949224
190,-1.7805854,0.46401419,1.4037633,1.2416765,-1.6904390,0.64256259,1.6145664,1.6127251
191,-1.7783839,0.45590634,1.4236626,1.2601159,-1.6919633,0.63524145,1.6299431,1.6298127
192,-1.7757723,0.44793656,1.4432392,1.2782293,-1.6933650,0.62758991,1.6448334,1.6461688
193,-1.7727711,0.44009915,1.4624789,1.2960102,-1.6946458,0.61960912,1.6592206,1.6617783
194,-1.7694018,0.43238805,1.4813677,1.3134523,-1.6958076,0.61130087,1.6730885,1.6766268
195,-1.7656857,0.42479681,1.4998919,1.3305495,-1.6968518,0.60266762,1.6864212,1.6907011
196,-1.7616448,0.41731864,1.5180382,1.3472959,-1.6977797,0.59371251,1.6992033,1.7039889
197,-1.7573012,0.40994643,1.5357937,1.3636857,-1.6985922,0.58443933,1.7114198,1.7164792
198,-1.7526774,0.40267277,1.5531456,1.3797133,-1.6992901,0.57485253,1.7230561,1.7281619
199,-1.7477960,0.39548996,1.5700817,1.3953731,-1.6998741,0.56495721,1.7340984,1.7390280
200,-1.7426795,0.38839006,1.5865899,1.4106599,-1.7003445,0.55475909,1.7445330,1.7490697
201,-1.7373506,0.38136488,1.6026587,1.4255682,-1.7007014,0.54426452,1.7543471,1.7582803
202,-1.7318322,0.37440607,1.6182768,1.4400929,-1.7009448,0.53348048,1.7635285,1.7666543
203,-1.7261468,0.36750504,1.6334332,1.4542287,-1.7010743,0.52241452,1.7720653,1.7741871
204,-1.7203169,0.36065312,1.6481175,1.4679705,-1.7010896,0.51107477,1.7799466,1.7808755
205,-1.7143649,0.35384146,1.6623193,1.4813133,-1.7009898,0.49946994,1.7871620,1.7867172
206,-1.7083128,0.34706113,1.6760290,1.4942520,-1.7007743,0.48760926,1.7937018,1.7917112
207,-1.7021825,0.34030316,1.6892369,1.5067814,-1.7004419,0.47550252,1.7995570,1.7958575
208,-1.6959954,0.33355849,1.7019341,1.5188966,-1.6999913,0.46315997,1.8047193,1.7991574
209,-1.6897726,0.32681809,1.7141118,1.5305924,-1.6994214,0.45059236,1.8091813,1.8016131
210,-1.6835346,0.32007292,1.7257616,1.5418638,-1.6987304,0.43781089,1.8129362,1.8032280
211,-1.6773015,0.31331398,1.7368756,1.5527056,-1.6979167,0.42482720,1.8159781,1.8040066
212,-1.6710930,0.30653235,1.7474461,1.5631127,-1.6969785,0.41165332,1.8183018,1.8039545
213,-1.6649279,0.29971921,1.7574659,1.5730798,-1.6959137,0.39830166,1.8199030,1.8030781
214,-1.6588245,0.29286585,1.7669282,1.5826018,-1.6947204,0.38478500,1.8207782,1.8013852
215,-1.6528004,0.28596373,1.7758264,1.5916732,-1.6933963,0.37111641,1.8209247,1.7988844
216,-1.6468724,0.27900446,1.7841544,1.6002888,-1.6919391,0.35730928,1.8203407,1.7955854
217,-1.6410567,0.27197988,1.7919064,1.6084431,-1.6903464,0.34337725,1.8190252,1.7914986
218,-1.6353684,0.26488205,1.7990771,1.6161306,-1.6886157,0.32933420,1.8169781,1.7866357
219,-1.6298220,0.25770327,1.8056615,1.6233459,-1.6867444,0.31519419,1.8142002,1.7810091
220,-1.6244309,0.25043613,1.8116549,1.6300834,-1.6847300,0.30097150,1.8106931,1.7746321
221,-1.6192077,0.24307353,1.8170530,1.6363375,-1.6825697,0.28668049,1.8064592,1.7675188
222,-1.6141640,0.23560868,1.8218519,1.6421025,-1.6802608,0.27233567,1.8015020,1.7596843
223,-1.6093105,0.22803514,1.8260482,1.6473727,-1.6778006,0.25795162,1.7958256,1.7511443
224,-1.6046567,0.22034683,1.8296387,1.6521424,-1.6751863,0.24354295,1.7894352,1.7419152
225,-1.6002113,0.21253806,1.8326204,1.6564059,-1.6724151,0.22912430,1.7823367,1.7320143
226,-1.5959818,0.20460357,1.8349912,1.6601575,-1.6694842,0.21471028,1.7745369,1.7214595
227,-1.5919747,0.19653848,1.8367488,1.6633913,-1.6663908,0.20031546,1.7660434,1.7102693
228,-1.5881953,0.18833839,1.8378915,1.6661018,-1.6631322,0.18595432,1.7568648,1.6984627
229,-1.5846480,0.17999934,1.8384182,1.6682833,-1.6597056,0.17164124,1.7470103,1.6860594
230,-1.5813359,0.17151784,1.8383277,1.6699300,-1.6561083,0.15739044,1.7364900,1.6730796
231,-1.5782612,0.16289089,1.8376195,1.6710365,-1.6523376,0.14321600,1.7253149,1.6595438
232,-1.5754248,0.15411598,1.8362935,1.6715971,-1.6483911,0.12913176,1.7134965,1.6454731
233,-1.5728266,0.14519113,1.8343497,1.6716067,-1.6442660,0.11515136,1.7010474,1.6308890
234,-1.5704654,0.13611484,1.8317886,1.6710598,-1.6399600,0.10128817,1.6879807,1.6158131
235,-1.5683388,0.12688618,1.8286112,1.6699513,-1.6354707,0.087555293,1.6743103,1.6002676
236,-1.5664433,0.11750473,1.8248186,1.6682762,-1.6307958,0.073965504,1.6600507,1.5842746
237,-1.5647746,0.10797060,1.8204125,1.6660298,-1.6259331,0.060531252,1.6452173,1.5678568
238,-1.5633269,0.098284467,1.8153949,1.6632074,-1.6208804,0.047264626,1.6298260,1.5510368
239,-1.5620938,0.088447545,1.8097681,1.6598047,-1.6156359,0.034177335,1.6138932,1.5338374
240,-1.5610674,0.078461595,1.8035349,1.6558175,-1.6101976,0.021280684,1.5974361,1.5162814
241,-1.5602393,0.068328929,1.7966983,1.6512420,-1.6045639,0.0085855538,1.5804724,1.4983917
242,-1.5595997,0.058052405,1.7892619,1.6460746,-1.5987330,-0.0038976166,1.5630203,1.4801913
243,-1.5591381,0.047635429,1.7812293,1.6403120,-1.5927035,-0.016158851,1.5450985,1.4617029
244,-1.5588430,0.037081946,1.7726050,1.6339514,-1.5864741,-0.028188649,1.5267263,1.4429492
245,-1.5587019,0.026396438,1.7633933,1.6269903,-1.5800436,-0.039978006,1.5079232,1.4239530
246,-1.5587016,0.015583918,1.7535994,1.6194264,-1.5734109,-0.051518425,1.4887094,1.4047367
247,-1.5588280,0.0046499198,1.7432284,1.6112581,-1.5665751,-0.062801925,1.4691052,1.3853224
248,-1.5590664,-0.0063995101,1.7322862,1.6024842,-1.5595355,-0.073821062,1.4491315,1.3657322
249,-1.5594011,-0.017557823,1.7207788,1.5931037,-1.5522915,-0.084568928,1.4288093,1.3459877
250,-1.5598159,-0.028817978,1.7087127,1.5831165,-1.5448426,-0.095039166,1.4081599,1.3261104
251,-1.5602938,-0.040172459,1.6960946,1.5725226,-1.5371885,-0.10522598,1.3872050,1.3061212
252,-1.5608173,-0.051613285,1.6829319,1.5613230,-1.5293292,-0.11512411,1.3659662,1.2860409
253,-1.5613684,-0.063132025,1.6692321,1.5495187,-1.5212647,-0.12472891,1.3444656,1.2658895
254,-1.5619285,-0.074719819,1.6550031,1.5371118,-1.5129951,-0.13403624,1.3227252,1.2456870
255,-1.5624786,-0.086367390,1.6402534,1.5241048,-1.5045209,-0.14304258,1.3007671,1.2254527
256,-1.5629991,-0.098065066,1.6249916,1.5105008,-1.4958425,-0.15174493,1.2786135,1.2052052
257,-1.5634705,-0.10980280,1.6092269,1.4963034,-1.4869606,-0.16014090,1.2562867,1.1849629
258,-1.5638726,-0.12157018,1.5929687,1.4815173,-1.4778762,-0.16822862,1.2338088,1.1647435
259,-1.5641851,-0.13335646,1.5762269,1.4661474,-1.4685901,-0.17600679,1.2112019,1.1445642
260,-1.5643875,-0.14515060,1.5590117,1.4501996,-1.4591035,-0.18347466,1.1884881,1.1244415
261,-1.5644592,-0.15694124,1.5413337,1.4336805,-1.4494177,-0.19063202,1.1656891,1.1043914
262,-1.5643796,-0.16871677,1.5232038,1.4165972,-1.4395341,-0.19747917,1.1428268,1.0844292
263,-1.5641280,-0.18046534,1.5046335,1.3989578,-1.4294543,-0.20401696,1.1199227,1.0645695
264,-1.5636837,-0.19217486,1.4856344,1.3807709,-1.4191801,-0.21024670,1.0969979,1.0448263
265,-1.5630262,-0.20383307,1.4662186,1.3620462,-1.4087133,-0.21617025,1.0740736,1.0252131
266,-1.5621350,-0.21542753,1.4463985,1.3427937,-1.3980559,-0.22178989,1.0511703,1.0057424
267,-1.5609900,-0.22694565,1.4261869,1.3230247,-1.3872100,-0.22710840,1.0283084,0.98642630
268,-1.5595714,-0.23837475,1.4055969,1.3027508,-1.3761778,-0.23212898,1.0055080,0.96727602
269,-1.5578594,-0.24970204,1.3846421,1.2819847,-1.3649617,-0.23685527,0.98278845,0.94830217
270,-1.5558348,-0.26091466,1.3633361,1.2607398,-1.3535642,-0.24129131,0.96016902,0.92951463
271,-1.5534790,-0.27199974,1.3416932,1.2390301,-1.3419878,-0.24544152,0.93766835,0.91092259
272,-1.5507734,-0.28294437,1.3197279,1.2168705,-1.3302352,-0.24931070,0.91530461,0.89253455
273,-1.5477004,-0.29373568,1.2974550,1.1942769,-1.3183092,-0.25290396,0.89309548,0.87435828
274,-1.5442427,-0.30436085,1.2748895,1.1712656,-1.3062126,-0.25622677,0.87105809,0.85640090
275,-1.5403838,-0.31480710,1.2520469,1.1478538,-1.2939484,-0.25928486,0.84920899,0.83866881
276,-1.5361076,-0.32506178,1.2289430,1.1240594,-1.2815196,-0.26208426,0.82756416,0.82116776
277,-1.5313990,-0.33511234,1.2055936,1.0999012,-1.2689292,-0.26463123,0.80613897,0.80390279
278,-1.5262434,-0.34494640,1.1820152,1.0753986,-1.2561805,-0.26693226,0.78494815,0.78687832
279,-1.5206273,-0.35455173,1.1582243,1.0505715,-1.2432767,-0.26899402,0.76400578,0.77009810
280,-1.5145378,-0.36391632,1.1342376,1.0254409,-1.2302210,-0.27082337,0.74332531,0.75356526
281,-1.5079628,-0.37302837,1.1100722,1.0000281,-1.2170167,-0.27242732,0.72291947,0.73728229
282,-1.5008914,-0.38187633,1.0857455,0.97435516,-1.2036672,-0.27381296,0.70280032,0.72125110
283,-1.4933133,-0.39044893,1.0612749,0.94844482,-1.1901759,-0.27498752,0.68297920,0.70547300
284,-1.4852194,-0.39873518,1.0366782,0.92232033,-1.1765462,-0.27595826,0.66346675,0.68994875
285,-1.4766015,-0.40672442,1.0119732,0.89600552,-1.1627817,-0.27673250,0.64427287,0.67467854
286,-1.4674524,-0.41440630,0.98717799,0.86952473,-1.1488857,-0.27731755,0.62540673,0.65966204
287,-1.4577659,-0.42177084,0.96231088,0.84290282,-1.1348617,-0.27772074,0.60687676,0.64489843
288,-1.4475370,-0.42880845,0.93739024,0.81616511,-1.1207133,-0.27794934,0.58869066,0.63038639
289,-1.4367616,-0.43550989,0.91243456,0.78933734,-1.1064439,-0.27801056,0.57085536,0.61612415
290,-1.4254367,-0.44186636,0.88746250,0.76244563,-1.0920571,-0.27791152,0.55337706,0.60210949
291,-1.4135605,-0.44786949,0.86249277,0.73551650,-1.0775564,-0.27765923,0.53626119,0.58833980
292,-1.4011322,-0.45351133,0.83754416,0.70857672,-1.0629452,-0.27726056,0.51951247,0.57481208
293,-1.3881521,-0.45878439,0.81263554,0.68165339,-1.0482272,-0.27672223,0.50313485,0.56152296
294,-1.3746217,-0.46368165,0.78778579,0.65477380,-1.0334057,-0.27605077,0.48713154,0.54846873
295,-1.3605434,-0.46819657,0.76301384,0.62796545,-1.0184842,-0.27525251,0.47150505,0.53564540
296,-1.3459211,-0.47232308,0.73833858,0.60125598,-1.0034662,-0.27433357,0.45625712,0.52304867
297,-1.3307593,-0.47605564,0.71377890,0.57467310,-0.98835511,-0.27329979,0.44138882,0.51067400
298,-1.3150639,-0.47938920,0.68935364,0.54824462,-0.97315435,-0.27215679,0.42690050,0.49851662
299,-1.2988419,-0.48231921,0.66508158,0.52199831,-0.95786730,-0.27090989,0.41279181,0.48657157
300,-1.2821011,-0.48484165,0.64098140,0.49596191,-0.94249732,-0.26956411,0.39906175,0.47483369
301,-1.2648506,-0.48695302,0.61707168,0.47016308,-0.92704776,-0.26812417,0.38570863,0.46329770
302,-1.2471005,-0.48865036,0.59337086,0.44462930,-0.91152194,-0.26659446,0.37273014,0.45195819
303,-1.2288617,-0.48993122,0.56989724,0.41938789,-0.89592314,-0.26497903,0.36012333,0.44080964
304,-1.2101462,-0.49079368,0.54666892,0.39446592,-0.88025463,-0.26328158,0.34788464,0.42984649
305,-1.1909670,-0.49123635,0.52370381,0.36989017,-0.86451967,-0.26150546,0.33600992,0.41906310
306,-1.1713381,-0.49125837,0.50101961,0.34568705,-0.84872146,-0.25965362,0.32449447,0.40845384
307,-1.1512742,-0.49085940,0.47863374,0.32188262,-0.83286322,-0.25772866,0.31333303,0.39801307
308,-1.1307909,-0.49003962,0.45656338,0.29850245,-0.81694813,-0.25573278,0.30251980,0.38773518
309,-1.1099047,-0.48879971,0.43482539,0.27557166,-0.80097935,-0.25366781,0.29204853,0.37761461
310,-1.0886328,-0.48714088,0.41343635,0.25311481,-0.78496005,-0.25153516,0.28191244,0.36764587
311,-1.0669933,-0.48506482,0.39241245,0.23115585,-0.76889337,-0.24933587,0.27210433,0.35782356
312,-1.0450048,-0.48257371,0.37176955,0.20971812,-0.75278244,-0.24707055,0.26261658,0.34814241
313,-1.0226868,-0.47967023,0.35152313,0.18882426,-0.73663040,-0.24473945,0.25344116,0.33859726
314,-1.0000591,-0.47635751,0.33168822,0.16849619,-0.72044038,-0.24234240,0.24456968,0.32918311
315,-0.97714247,-0.47263914,0.31227946,0.14875503,-0.70421552,-0.23987885,0.23599340,0.31989511
316,-0.95395790,-0.46851917,0.29331102,0.12962110,-0.68795897,-0.23734785,0.22770328,0.31072863
317,-0.93052698,-0.46400205,0.27479659,0.11111383,-0.67167389,-0.23474810,0.21968998,0.30167919
318,-0.90687174,-0.45909267,0.25674937,0.093251770,-0.65536346,-0.23207790,0.21194390,0.29274256
319,-0.88301458,-0.45379633,0.23918204,0.076052509,-0.63903088,-0.22933518,0.20445524,0.28391471
320,-0.85897822,-0.44811869,0.22210675,0.059532652,-0.62267939,-0.22651754,0.19721398,0.27519185
321,-0.83478568,-0.44206579,0.20553507,0.043707780,-0.60631225,-0.22362223,0.19020992,0.26657043
322,-0.81046023,-0.43564402,0.18947802,0.028592420,-0.58993278,-0.22064615,0.18343275,0.25804717
323,-0.78602528,-0.42886010,0.17394601,0.014200005,-0.57354431,-0.21758591,0.17687202,0.24961902
324,-0.76150441,-0.42172106,0.15894885,0.00054284568,-0.55715027,-0.21443779,0.17051722,0.24128324
325,-0.73692126,-0.41423424,0.14449569,-0.012367899,-0.54075412,-0.21119781,0.16435778,0.23303731
326,-0.71229950,-0.40640723,0.13059507,-0.024522248,-0.52435938,-0.20786172,0.15838309,0.22487902
327,-0.68766279,-0.39824789,0.11725485,-0.035911427,-0.50796966,-0.20442499,0.15258256,0.21680643
328,-0.66303468,-0.38976432,0.10448222,-0.046527886,-0.49158863,-0.20088290,0.14694561,0.20881788
329,-0.63843864,-0.38096482,0.092283664,-0.056365323,-0.47522005,-0.19723048,0.14146175,0.20091197
330,-0.61389795,-0.37185787,0.080664985,-0.065418702,-0.45886776,-0.19346260,0.13612055,0.19308761
331,-0.58943565,-0.36245216,0.069631260,-0.073684268,-0.44253572,-0.18957393,0.13091169,0.18534395
332,-0.56507453,-0.35275649,0.059186843,-0.081159558,-0.42622795,-0.18555903,0.12582498,0.17768043
333,-0.54083706,-0.34277981,0.049335355,-0.087843415,-0.40994862,-0.18141230,0.12085041,0.17009675
334,-0.51674533,-0.33253117,0.040079671,-0.093735993,-0.39370199,-0.17712806,0.11597814,0.16259288
335,-0.49282106,-0.32201971,0.031421918,-0.098838763,-0.37749242,-0.17270056,0.11119854,0.15516902
336,-0.46908549,-0.31125463,0.023363466,-0.10315451,-0.36132444,-0.16812398,0.10650219,0.14782565
337,-0.44555936,-0.30024518,0.015904920,-0.10668736,-0.34520265,-0.16339247,0.10187995,0.14056344
338,-0.42226291,-0.28900063,0.0090461239,-0.10944272,-0.32913183,-0.15850021,0.097322929,0.13338332
339,-0.39921578,-0.27753027,0.0027861496,-0.11142734,-0.31311688,-0.15344137,0.092822529,0.12628641
340,-0.37643703,-0.26584334,-0.0028766992,-0.11264926,-0.29716284,-0.14821018,0.088370461,0.11927406
341,-0.35394506,-0.25394907,-0.0079448894,-0.11311780,-0.28127490,-0.14280095,0.083958757,0.11234778
342,-0.33175759,-0.24185663,-0.012421656,-0.11284357,-0.26545838,-0.13720809,0.079579791,0.10550928
343,-0.30989167,-0.22957512,-0.016311003,-0.11183844,-0.24971879,-0.13142612,0.075226292,0.098760407
344,-0.28836359,-0.21711354,-0.019617692,-0.11011552,-0.23406175,-0.12544973,0.070891357,0.092103172
345,-0.26718887,-0.20448080,-0.022347249,-0.10768914,-0.21849307,-0.11927378,0.066568462,0.085539712
346,-0.24638228,-0.19168567,-0.024505946,-0.10457482,-0.20301871,-0.11289333,0.062251478,0.079072278
347,-0.22595777,-0.17873677,-0.026100801,-0.10078925,-0.18764479,-0.10630365,0.057934679,0.072703221
348,-0.20592845,-0.16564260,-0.027139567,-0.096350263,-0.17237758,-0.099500277,0.053612748,0.066434972
349,-0.18630662,-0.15241146,-0.027630722,-0.091276793,-0.15722354,-0.092479019,0.049280788,0.060270030
350,-0.16710369,-0.13905147,-0.027583456,-0.085588845,-0.14218926,-0.085235969,0.044934330,0.054210936
351,-0.14833024,-0.12557057,-0.027007660,-0.079307460,-0.12728152,-0.077767542,0.040569334,0.048260267
352,-0.12999594,-0.11197649,-0.025913911,-0.072454674,-0.11250723,-0.070070487,0.036182194,0.042420606
353,-0.11210959,-0.098276727,-0.024313457,-0.065053477,-0.097873494,-0.062141912,0.031769743,0.036694535
354,-0.094679106,-0.084478562,-0.022218200,-0.057127770,-0.083387544,-0.053979303,0.027329255,0.031084611
355,-0.077711496,-0.070589038,-0.019640679,-0.048702316,-0.069056780,-0.045580540,0.022858441,0.025593349
356,-0.061212890,-0.056614953,-0.016594049,-0.039802699,-0.054888753,-0.036943916,0.018355454,0.020223208
357,-0.045188525,-0.042562852,-0.013092064,-0.030455268,-0.040891157,-0.028068156,0.013818880,0.014976570
358,-0.029642754,-0.028439026,-0.0091490533,-0.020687091,-0.027071833,-0.018952425,0.0092477430,0.0098557246
359,-0.014579055,-0.014249502,-0.0047798991,-0.010525897,-0.013438756,-0.0095963493,0.0046414952,0.0048628536
360,-3.9978744e-08,-3.9815774e-08,-1.3887757e-08,-2.9835064e-08,-3.7197822e-08,-2.7095751e-08,1.2992615e-08,1.3377843e-08
