XRT N-S vs UFSS-A
      212.062
     0.638440
    -0.848363
      1.00538
    0.0243425
     0.150517
     0.328505
XRT N-S vs UFSS-B
      226.475
     0.772505
     -1.00923
     0.222513
     0.344425
   -0.0695460
     0.105168
XRT E-W vs UFSS-A
      3984.44
    -0.875783
    -0.116549
    -0.109958
     0.163411
    -0.139425
   -0.0820471
XRT E-W vs UFSS-B
      3974.14
     -1.17852
    -0.710050
     0.226460
    -0.152311
     0.215314
   -0.0138786
SOT N-S vs UFSS-A
      87.6233
    -0.246367
    -0.487627
     0.633986
    -0.439297
     0.232011
   -0.0126796
SOT N-S vs UFSS-B
      102.171
     0.115889
    -0.793243
     0.160293
    -0.139243
 -0.000330345
   -0.0241428
SOT E-W vs UFSS-A
      211.143
    -0.564947
    -0.329615
   -0.0281039
     0.276875
   -0.0668980
    0.0522152
SOT E-W vs UFSS-B
      200.590
    -0.951805
    -0.809348
     0.258350
    0.0629894
    0.0958643
    0.0413858
