deg,XRT_AX,XRT_BX,XRT_AY,XRT_BY,SOT_AX,SOT_BX,SOT_AY,SOT_BY
valid,1,1,1,1,1,1,1,1,revB
offset,120.18958,117.86331,1985.9678,1987.0600,59.193957,56.843401,96.197662,97.107880
0,0.0000000,0.0000000,0.0000000,0.0000000,0.0000000,0.0000000,0.0000000,0.0000000
1,0.013140155,0.017959437,-0.0063886652,-0.0056914094,0.0075753331,0.013430431,-0.0039301956,-0.0043003743
2,0.025865628,0.036190114,-0.012483071,-0.011415950,0.014381705,0.026772790,-0.0078598242,-0.0086632500
3,0.038156653,0.054678342,-0.018282892,-0.017173130,0.020406487,0.040019681,-0.011785478,-0.013084971
4,0.049994200,0.073409890,-0.023788042,-0.022962029,0.025638581,0.053163896,-0.015703370,-0.017561437
5,0.061360011,0.092370018,-0.028998668,-0.028781298,0.030068434,0.066198425,-0.019609338,-0.022088116
6,0.072236635,0.11154350,-0.033915138,-0.034629157,0.033688059,0.079116470,-0.023498858,-0.026660055
7,0.082607456,0.13091466,-0.038538041,-0.040503398,0.036491039,0.091911453,-0.027367047,-0.031271890
8,0.092456727,0.15046741,-0.042868173,-0.046401390,0.038472542,0.10457703,-0.031208677,-0.035917863
9,0.10176960,0.17018526,-0.046906530,-0.052320077,0.039629315,0.11710710,-0.035018180,-0.040591831
10,0.11053213,0.19005140,-0.050654298,-0.058255987,0.039959692,0.12949582,-0.038789667,-0.045287285
11,0.11873134,0.21004866,-0.054112843,-0.064205232,0.039463581,0.14173759,-0.042516930,-0.049997363
12,0.12635520,0.23015964,-0.057283702,-0.070163520,0.038142462,0.15382712,-0.046193463,-0.054714865
13,0.13339266,0.25036665,-0.060168567,-0.076126157,0.035999371,0.16575935,-0.049812469,-0.059432273
14,0.13983367,0.27065184,-0.062769280,-0.082088057,0.033038884,0.17752956,-0.053366876,-0.064141765
15,0.14566920,0.29099715,-0.065087814,-0.088043749,0.029267098,0.18913328,-0.056849351,-0.068835237
16,0.15089122,0.31138442,-0.067126267,-0.093987386,0.024691603,0.20056637,-0.060252315,-0.073504316
17,0.15549276,0.33179537,-0.068886846,-0.099912761,0.019321462,0.21182498,-0.063567958,-0.078140383
18,0.15946786,0.35221170,-0.070371852,-0.10581331,0.013167172,0.22290558,-0.066788255,-0.082734592
19,0.16281161,0.37261507,-0.071583672,-0.11168212,0.0062406350,0.23380494,-0.069904981,-0.087277887
20,0.16552013,0.39298716,-0.072524762,-0.11751197,-0.0014448814,0.24452017,-0.072909731,-0.091761026
21,0.16759059,0.41330972,-0.073197633,-0.12329529,-0.0098747863,0.25504869,-0.075793931,-0.096174599
22,0.16902119,0.43356460,-0.073604839,-0.12902424,-0.019033208,0.26538825,-0.078548864,-0.10050905
23,0.16981116,0.45373379,-0.073748962,-0.13469067,-0.028903042,0.27553692,-0.081165678,-0.10475469
24,0.16996075,0.47379942,-0.073632599,-0.14028617,-0.039466000,0.28549308,-0.083635412,-0.10890173
25,0.16947122,0.49374388,-0.073258348,-0.14580206,-0.050702663,0.29525547,-0.085949010,-0.11294031
26,0.16834481,0.51354976,-0.072628795,-0.15122943,-0.062592537,0.30482311,-0.088097341,-0.11686048
27,0.16658475,0.53319996,-0.071746497,-0.15655914,-0.075114109,0.31419539,-0.090071217,-0.12065226
28,0.16419525,0.55267768,-0.070613974,-0.16178184,-0.088244910,0.32337198,-0.091861410,-0.12430566
29,0.16118144,0.57196647,-0.069233691,-0.16688800,-0.10196157,0.33235288,-0.093458676,-0.12781069
30,0.15754937,0.59105025,-0.067608049,-0.17186790,-0.11623989,0.34113841,-0.094853766,-0.13115735
31,0.15330600,0.60991337,-0.065739368,-0.17671169,-0.13105491,0.34972918,-0.096037453,-0.13433572
32,0.14845915,0.62854061,-0.063629878,-0.18140938,-0.14638094,0.35812611,-0.097000544,-0.13733591
33,0.14301748,0.64691722,-0.061281707,-0.18595084,-0.16219170,0.36633042,-0.097733902,-0.14014814
34,0.13699048,0.66502894,-0.058696868,-0.19032586,-0.17846032,0.37434361,-0.098228464,-0.14276272
35,0.13038841,0.68286205,-0.055877249,-0.19452418,-0.19515943,0.38216746,-0.098475261,-0.14517006
36,0.12322229,0.70040337,-0.052824602,-0.19853543,-0.21226127,0.38980402,-0.098465430,-0.14736075
37,0.11550383,0.71764029,-0.049540533,-0.20234924,-0.22973769,0.39725561,-0.098190241,-0.14932550
38,0.10724546,0.73456078,-0.046026493,-0.20595522,-0.24756029,0.40452480,-0.097641107,-0.15105522
39,0.098460231,0.75115345,-0.042283772,-0.20934295,-0.26570045,0.41161440,-0.096809606,-0.15254100
40,0.089161803,0.76740751,-0.038313485,-0.21250207,-0.28412942,0.41852744,-0.095687494,-0.15377416
41,0.079364409,0.78331284,-0.034116569,-0.21542225,-0.30281838,0.42526720,-0.094266726,-0.15474622
42,0.069082808,0.79885998,-0.029693776,-0.21809320,-0.32173854,0.43183714,-0.092539469,-0.15544895
43,0.058332249,0.81404012,-0.025045666,-0.22050474,-0.34086116,0.43824093,-0.090498118,-0.15587440
44,0.047128426,0.82884518,-0.020172603,-0.22264677,-0.36015767,0.44448240,-0.088135314,-0.15601486
45,0.035487440,0.84326773,-0.015074751,-0.22450932,-0.37959970,0.45056559,-0.085443954,-0.15586293
46,0.023425756,0.85730108,-0.0097520668,-0.22608255,-0.39915919,0.45649466,-0.082417212,-0.15541148
47,0.010960159,0.87093922,-0.0042043040,-0.22735678,-0.41880840,0.46227392,-0.079048544,-0.15465372
48,-0.0018922880,0.88417686,0.0015689944,-0.22832251,-0.43852005,0.46790781,-0.075331709,-0.15358317
49,-0.015114286,0.89700944,0.0075684943,-0.22897042,-0.45826730,0.47340088,-0.071260778,-0.15219367
50,-0.028688342,0.90943310,0.013795071,-0.22929142,-0.47802387,0.47875778,-0.066830145,-0.15047941
51,-0.042596814,0.92144470,0.020249809,-0.22927662,-0.49776408,0.48398323,-0.062034540,-0.14843494
52,-0.056821953,0.93304179,0.026933998,-0.22891740,-0.51746291,0.48908203,-0.056869040,-0.14605516
53,-0.071345942,0.94422264,0.033849133,-0.22820539,-0.53709605,0.49405901,-0.051329076,-0.14333533
54,-0.086150941,0.95498622,0.040996909,-0.22713249,-0.55663996,0.49891906,-0.045410445,-0.14027109
55,-0.10121913,0.96533218,0.048379217,-0.22569091,-0.57607189,0.50366707,-0.039109319,-0.13685844
56,-0.11653273,0.97526083,0.055998137,-0.22387315,-0.59537000,0.50830792,-0.032422249,-0.13309380
57,-0.13207408,0.98477317,0.063855936,-0.22167203,-0.61451331,0.51284652,-0.025346176,-0.12897395
58,-0.14782564,0.99387082,0.071955055,-0.21908071,-0.63348182,0.51728770,-0.017878435,-0.12449604
59,-0.16377005,1.0025561,0.080298106,-0.21609268,-0.65225649,0.52163628,-0.010016763,-0.11965766
60,-0.17989015,1.0108318,0.088887860,-0.21270183,-0.67081932,0.52589700,-0.0017592995,-0.11445674
61,-0.19616902,1.0187015,0.097727239,-0.20890236,-0.68915335,0.53007454,0.0068954047,-0.10889165
62,-0.21259005,1.0261691,0.10681930,-0.20468890,-0.70724271,0.53417347,0.015948387,-0.10296111
63,-0.22913689,1.0332394,0.11616724,-0.20005645,-0.72507262,0.53819827,0.025400270,-0.096664266
64,-0.24579357,1.0399174,0.12577436,-0.19500040,-0.74262947,0.54215329,0.035251258,-0.090000635
65,-0.26254448,1.0462088,0.13564408,-0.18951656,-0.75990073,0.54604274,0.045501139,-0.082970125
66,-0.27937440,1.0521198,0.14577988,-0.18360116,-0.77687510,0.54987070,0.056149282,-0.075573028
67,-0.29626854,1.0576568,0.15618534,-0.17725084,-0.79354239,0.55364106,0.067194637,-0.067810014
68,-0.31321257,1.0628269,0.16686411,-0.17046267,-0.80989365,0.55735756,0.078635737,-0.059682130
69,-0.33019263,1.0676375,0.17781986,-0.16323417,-0.82592106,0.56102373,0.090470702,-0.051190789
70,-0.34719534,1.0720963,0.18905630,-0.15556328,-0.84161802,0.56464292,0.10269724,-0.042337770
71,-0.36420785,1.0762115,0.20057715,-0.14744839,-0.85697909,0.56821826,0.11531264,-0.033125207
72,-0.38121783,1.0799914,0.21238614,-0.13888834,-0.87200004,0.57175264,0.12831380,-0.023555583
73,-0.39821349,1.0834448,0.22448695,-0.12988240,-0.88667776,0.57524874,0.14169721,-0.013631721
74,-0.41518362,1.0865805,0.23688326,-0.12043031,-0.90101032,0.57870898,0.15545896,-0.0033567797
75,-0.43211756,1.0894077,0.24957864,-0.11053225,-0.91499694,0.58213554,0.16959476,0.0072657613
76,-0.44900524,1.0919357,0.26257664,-0.10018886,-0.92863791,0.58553033,0.18409992,0.018232107
77,-0.46583717,1.0941739,0.27588067,-0.089401212,-0.94193467,0.58889499,0.19896940,0.029538156
78,-0.48260447,1.0961319,0.28949406,-0.078170843,-0.95488968,0.59223089,0.21419775,0.041179515
79,-0.49929884,1.0978193,0.30341997,-0.066499727,-0.96750647,0.59553912,0.22977920,0.053151504
80,-0.51591257,1.0992457,0.31766144,-0.054390282,-0.97978957,0.59882048,0.24570761,0.065449172
81,-0.53243857,1.1004209,0.33222132,-0.041845365,-0.99174445,0.60207547,0.26197649,0.078067304
82,-0.54887033,1.1013545,0.34710228,-0.028868269,-1.0033776,0.60530429,0.27857902,0.091000436
83,-0.56520193,1.1020561,0.36230678,-0.015462716,-1.0146962,0.60850686,0.29550805,0.10424286
84,-0.58142803,1.1025353,0.37783704,-0.0016328530,-1.0257086,0.61168279,0.31275614,0.11778865
85,-0.59754387,1.1028013,0.39369504,0.012616757,-1.0364237,0.61483137,0.33031552,0.13163165
86,-0.61354527,1.1028635,0.40988249,0.027281138,-1.0468512,0.61795161,0.34817812,0.14576552
87,-0.62942857,1.1027309,0.42640082,0.042354911,-1.0570016,0.62104220,0.36633563,0.16018370
88,-0.64519067,1.1024124,0.44325116,0.057832303,-1.0668860,0.62410152,0.38477943,0.17487948
89,-0.66082901,1.1019165,0.46043431,0.073707152,-1.0765161,0.62712767,0.40350065,0.18984596
90,-0.67634149,1.1012517,0.47795075,0.089972919,-1.0859041,0.63011844,0.42249019,0.20507610
91,-0.69172655,1.1004259,0.49580057,0.10662270,-1.0950629,0.63307131,0.44173870,0.22056270
92,-0.70698307,1.0994469,0.51398354,0.12364922,-1.1040055,0.63598349,0.46123661,0.23629844
93,-0.72211038,1.0983221,0.53249901,0.14104487,-1.1127456,0.63885189,0.48097415,0.25227588
94,-0.73710824,1.0970586,0.55134593,0.15880171,-1.1212971,0.64167315,0.50094135,0.26848745
95,-0.75197682,1.0956629,0.57052286,0.17691144,-1.1296741,0.64444362,0.52112805,0.28492552
96,-0.76671665,1.0941413,0.59002791,0.19536549,-1.1378910,0.64715939,0.54152392,0.30158234
97,-0.78132862,1.0924996,0.60985876,0.21415496,-1.1459622,0.64981630,0.56211848,0.31845009
98,-0.79581394,1.0907433,0.63001263,0.23327067,-1.1539024,0.65240991,0.58290110,0.33552089
99,-0.81017412,1.0888771,0.65048630,0.25270315,-1.1617261,0.65493558,0.60386101,0.35278681
100,-0.82441094,1.0869056,0.67127605,0.27244268,-1.1694480,0.65738840,0.62498732,0.37023985
101,-0.83852641,1.0848326,0.69237769,0.29247927,-1.1770823,0.65976327,0.64626905,0.38787200
102,-0.85252274,1.0826618,0.71378655,0.31280272,-1.1846436,0.66205486,0.66769511,0.40567520
103,-0.86640235,1.0803959,0.73549744,0.33340257,-1.1921457,0.66425764,0.68925433,0.42364139
104,-0.88016778,1.0780375,0.75750470,0.35426817,-1.1996026,0.66636593,0.71093546,0.44176248
105,-0.89382169,1.0755886,0.77980213,0.37538865,-1.2070277,0.66837383,0.73272720,0.46003040
106,-0.90736684,1.0730504,0.80238304,0.39675297,-1.2144341,0.67027532,0.75461821,0.47843705
107,-0.92080603,1.0704240,0.82524023,0.41834992,-1.2218345,0.67206421,0.77659710,0.49697436
108,-0.93414210,1.0677096,0.84836597,0.44016811,-1.2292409,0.67373421,0.79865246,0.51563428
109,-0.94737787,1.0649072,0.87175201,0.46219603,-1.2366650,0.67527887,0.82077287,0.53440878
110,-0.96051612,1.0620160,0.89538961,0.48442200,-1.2441178,0.67669169,0.84294690,0.55328984
111,-0.97355958,1.0590349,0.91926950,0.50683426,-1.2516097,0.67796606,0.86516314,0.57226950
112,-0.98651087,1.0559622,0.94338191,0.52942092,-1.2591504,0.67909531,0.88741018,0.59133981
113,-0.99937249,1.0527957,0.96771655,0.55216999,-1.2667489,0.68007270,0.90967665,0.61049287
114,-1.0121468,1.0495327,0.99226265,0.57506941,-1.2744135,0.68089148,0.93195121,0.62972084
115,-1.0248359,1.0461701,1.0170089,0.59810705,-1.2821514,0.68154487,0.95422258,0.64901589
116,-1.0374419,1.0427043,1.0419436,0.62127073,-1.2899693,0.68202608,0.97647951,0.66837026
117,-1.0499663,1.0391312,1.0670545,0.64454820,-1.2978730,0.68232835,0.99871083,0.68777625
118,-1.0624108,1.0354464,1.0923289,0.66792720,-1.3058672,0.68244495,1.0209054,0.70722620
119,-1.0747764,1.0316449,1.1177537,0.69139544,-1.3139560,0.68236918,1.0430523,0.72671248
120,-1.0870641,1.0277214,1.1433152,0.71494063,-1.3221422,0.68209442,1.0651405,0.74622755
121,-1.0992744,1.0236704,1.1689994,0.73855045,-1.3304279,0.68161413,1.0871591,0.76576390
122,-1.1114075,1.0194857,1.1947920,0.76221263,-1.3388142,0.68092187,1.1090975,0.78531407
123,-1.1234633,1.0151611,1.2206780,0.78591489,-1.3473011,0.68001130,1.1309450,0.80487067
124,-1.1354412,1.0106899,1.2466422,0.80964500,-1.3558877,0.67887623,1.1526909,0.82442633
125,-1.1473403,1.0060652,1.2726692,0.83339077,-1.3645721,0.67751061,1.1743251,0.84397374
126,-1.1591594,1.0012799,1.2987429,0.85714005,-1.3733513,0.67590855,1.1958370,0.86350566
127,-1.1708965,0.99632651,1.3248472,0.88088076,-1.3822215,0.67406433,1.2172165,0.88301484
128,-1.1825497,0.99119756,1.3509655,0.90460087,-1.3911776,0.67197244,1.2384537,0.90249412
129,-1.1941162,0.98588527,1.3770809,0.92828845,-1.4002138,0.66962757,1.2595385,0.92193635
130,-1.2055930,0.98038179,1.4031764,0.95193163,-1.4093231,0.66702462,1.2804613,0.94133442
131,-1.2169766,0.97467915,1.4292347,0.97551865,-1.4184978,0.66415875,1.3012122,0.96068125
132,-1.2282629,0.96876931,1.4552382,0.99903784,-1.4277290,0.66102534,1.3217820,0.97996979
133,-1.2394477,0.96264421,1.4811693,1.0224776,-1.4370069,0.65762005,1.3421611,0.99919300
134,-1.2505261,0.95629577,1.5070100,1.0458265,-1.4463210,0.65393882,1.3623404,1.0183439
135,-1.2614926,0.94971592,1.5327423,1.0690733,-1.4556596,0.64997785,1.3823109,1.0374154
136,-1.2723417,0.94289669,1.5583482,1.0922066,-1.4650106,0.64573366,1.4020635,1.0564006
137,-1.2830670,0.93583016,1.5838093,1.1152154,-1.4743605,0.64120307,1.4215896,1.0752925
138,-1.2936619,0.92850855,1.6091075,1.1380887,-1.4836956,0.63638321,1.4408806,1.0940841
139,-1.3041195,0.92092426,1.6342245,1.1608157,-1.4930011,0.63127154,1.4599279,1.1127684
140,-1.3144322,0.91306983,1.6591419,1.1833857,-1.5022616,0.62586585,1.4787232,1.1313384
141,-1.3245921,0.90493807,1.6838415,1.2057882,-1.5114610,0.62016428,1.4972584,1.1497871
142,-1.3345911,0.89652201,1.7083050,1.2280128,-1.5205827,0.61416532,1.5155255,1.1681075
143,-1.3444206,0.88781498,1.7325144,1.2500491,-1.5296095,0.60786779,1.5335166,1.1862925
144,-1.3540716,0.87881061,1.7564517,1.2718872,-1.5385236,0.60127090,1.5512240,1.2043352
145,-1.3635348,0.86950288,1.7800989,1.2935171,-1.5473068,0.59437420,1.5686402,1.2222282
146,-1.3728008,0.85988614,1.8034384,1.3149289,-1.5559406,0.58717763,1.5857578,1.2399647
147,-1.3818596,0.84995515,1.8264526,1.3361130,-1.5644059,0.57968148,1.6025694,1.2575373
148,-1.3907012,0.83970509,1.8491243,1.3570601,-1.5726835,0.57188643,1.6190680,1.2749389
149,-1.3993152,0.82913158,1.8714364,1.3777607,-1.5807539,0.56379353,1.6352467,1.2921623
150,-1.4076911,0.81823073,1.8933721,1.3982056,-1.5885974,0.55540420,1.6510985,1.3092001
151,-1.4158182,0.80699916,1.9149151,1.4183860,-1.5961944,0.54672022,1.6666170,1.3260451
152,-1.4236858,0.79543401,1.9360492,1.4382930,-1.6035248,0.53774379,1.6817954,1.3426898
153,-1.4312828,0.78353295,1.9567586,1.4579179,-1.6105690,0.52847743,1.6966275,1.3591269
154,-1.4385982,0.77129423,1.9770279,1.4772522,-1.6173071,0.51892406,1.7111070,1.3753488
155,-1.4456209,0.75871668,1.9968422,1.4962876,-1.6237196,0.50908695,1.7252278,1.3913481
156,-1.4523399,0.74579973,2.0161869,1.5150158,-1.6297869,0.49896976,1.7389840,1.4071171
157,-1.4587441,0.73254342,2.0350480,1.5334290,-1.6354900,0.48857646,1.7523698,1.4226484
158,-1.4648225,0.71894843,2.0534118,1.5515191,-1.6408100,0.47791141,1.7653794,1.4379342
159,-1.4705642,0.70501607,2.0712652,1.5692786,-1.6457284,0.46697930,1.7780074,1.4529667
160,-1.4759583,0.69074831,2.0885957,1.5866999,-1.6502272,0.45578515,1.7902484,1.4677384
161,-1.4809943,0.67614777,2.1053911,1.6037756,-1.6542888,0.44433434,1.8020972,1.4822413
162,-1.4856616,0.66121773,2.1216399,1.6204986,-1.6578964,0.43263252,1.8135485,1.4964676
163,-1.4899501,0.64596217,2.1373313,1.6368617,-1.6610336,0.42068570,1.8245975,1.5104096
164,-1.4938499,0.63038572,2.1524548,1.6528582,-1.6636846,0.40850016,1.8352393,1.5240592
165,-1.4973513,0.61449369,2.1670008,1.6684813,-1.6658347,0.39608250,1.8454692,1.5374086
166,-1.5004450,0.59829206,2.1809601,1.6837244,-1.6674696,0.38343958,1.8552827,1.5504499
167,-1.5031220,0.58178749,2.1943243,1.6985811,-1.6685761,0.37057852,1.8646754,1.5631751
168,-1.5053739,0.56498731,2.2070854,1.7130452,-1.6691417,0.35750673,1.8736430,1.5755762
169,-1.5071925,0.54789950,2.2192365,1.7271106,-1.6691551,0.34423184,1.8821813,1.5876454
170,-1.5085703,0.53053271,2.2307708,1.7407714,-1.6686055,0.33076173,1.8902865,1.5993746
171,-1.5095001,0.51289622,2.2416826,1.7540218,-1.6674837,0.31710447,1.8979546,1.6107560
172,-1.5099754,0.49499995,2.2519667,1.7668563,-1.6657812,0.30326836,1.9051821,1.6217816
173,-1.5099902,0.47685443,2.2616186,1.7792693,-1.6634907,0.28926189,1.9119653,1.6324436
174,-1.5095389,0.45847081,2.2706346,1.7912557,-1.6606059,0.27509372,1.9183008,1.6427341
175,-1.5086169,0.43986081,2.2790115,1.8028102,-1.6571220,0.26077266,1.9241856,1.6526454
176,-1.5072199,0.42103673,2.2867470,1.8139281,-1.6530351,0.24630770,1.9296165,1.6621698
177,-1.5053446,0.40201141,2.2938393,1.8246044,-1.6483425,0.23170794,1.9345905,1.6712997
178,-1.5029880,0.38279823,2.3002874,1.8348345,-1.6430430,0.21698259,1.9391051,1.6800274
179,-1.5001482,0.36341105,2.3060909,1.8446141,-1.6371365,0.20214098,1.9431576,1.6883456
180,-1.4968238,0.34386423,2.3112503,1.8539388,-1.6306240,0.18719252,1.9467456,1.6962470
181,-1.4930142,0.32417257,2.3157666,1.8628045,-1.6235082,0.17214669,1.9498669,1.7037242
182,-1.4887196,0.30435131,2.3196414,1.8712073,-1.6157927,0.15701303,1.9525195,1.7107703
183,-1.4839410,0.28441607,2.3228772,1.8791435,-1.6074827,0.14180110,1.9547015,1.7173783
184,-1.4786801,0.26438285,2.3254770,1.8866095,-1.5985844,0.12652053,1.9564113,1.7235415
185,-1.4729395,0.24426796,2.3274445,1.8936018,-1.5891056,0.11118091,1.9576473,1.7292532
186,-1.4667227,0.22408805,2.3287840,1.9001173,-1.5790552,0.095791853,1.9584084,1.7345071
187,-1.4600337,0.20386002,2.3295005,1.9061529,-1.5684435,0.080362951,1.9586934,1.7392969
188,-1.4528777,0.18360099,2.3295994,1.9117058,-1.5572819,0.064903756,1.9585015,1.7436168
189,-1.4452605,0.16332832,2.3290870,1.9167735,-1.5455832,0.049423771,1.9578320,1.7474609
190,-1.4371888,0.14305950,2.3279700,1.9213533,-1.5333615,0.033932438,1.9566845,1.7508238
191,-1.4286701,0.12281217,2.3262557,1.9254432,-1.5206318,0.018439122,1.9550588,1.7537002
192,-1.4197129,0.10260407,2.3239519,1.9290411,-1.5074107,0.0029530974,1.9529549,1.7560851
193,-1.4103261,0.082452969,2.3210670,1.9321451,-1.4937156,-0.012516464,1.9503730,1.7579739
194,-1.4005198,0.062376681,2.3176099,1.9347537,-1.4795653,-0.027960506,1.9473137,1.7593623
195,-1.3903048,0.042392990,2.3135898,1.9368655,-1.4649793,-0.043370102,1.9437776,1.7602460
196,-1.3796925,0.022519630,2.3090167,1.9384793,-1.4499785,-0.058736463,1.9397657,1.7606215
197,-1.3686954,0.0027742371,2.3039008,1.9395942,-1.4345846,-0.074050953,1.9352793,1.7604853
198,-1.3573264,-0.016825679,2.2982528,1.9402094,-1.4188205,-0.089305096,1.9303198,1.7598343
199,-1.3455993,-0.036262780,2.2920837,1.9403246,-1.4027096,-0.10449059,1.9248889,1.7586660
200,-1.3335286,-0.055519929,2.2854050,1.9399394,-1.3862764,-0.11959931,1.9189888,1.7569781
201,-1.3211295,-0.074580234,2.2782284,1.9390540,-1.3695462,-0.13462333,1.9126216,1.7547686
202,-1.3084178,-0.093427078,2.2705662,1.9376685,-1.3525449,-0.14955491,1.9057898,1.7520360
203,-1.2954100,-0.11204416,2.2624307,1.9357835,-1.3352993,-0.16438654,1.8984965,1.7487793
204,-1.2821231,-0.13041552,2.2538347,1.9333999,-1.3178365,-0.17911089,1.8907445,1.7449979
205,-1.2685748,-0.14852560,2.2447909,1.9305185,-1.3001845,-0.19372089,1.8825375,1.7406915
206,-1.2547832,-0.16635923,2.2353127,1.9271408,-1.2823715,-0.20820966,1.8738789,1.7358604
207,-1.2407669,-0.18390170,2.2254132,1.9232683,-1.2644262,-0.22257058,1.8647729,1.7305052
208,-1.2265452,-0.20113879,2.2151061,1.9189030,-1.2463778,-0.23679726,1.8552236,1.7246271
209,-1.2121376,-0.21805677,2.2044050,1.9140469,-1.2282556,-0.25088353,1.8452357,1.7182276
210,-1.1975639,-0.23464246,2.1933236,1.9087024,-1.2100892,-0.26482350,1.8348140,1.7113090
211,-1.1828445,-0.25088325,2.1818757,1.9028724,-1.1919082,-0.27861150,1.8239637,1.7038737
212,-1.1680000,-0.26676712,2.1700754,1.8965598,-1.1737425,-0.29224212,1.8126902,1.6959249
213,-1.1530512,-0.28228265,2.1579364,1.8897678,-1.1556217,-0.30571019,1.8009994,1.6874660
214,-1.1380192,-0.29741907,2.1454728,1.8825002,-1.1375756,-0.31901081,1.7888973,1.6785011
215,-1.1229251,-0.31216629,2.1326984,1.8747608,-1.1196338,-0.33213932,1.7763902,1.6690347
216,-1.1077905,-0.32651489,2.1196272,1.8665538,-1.1018254,-0.34509130,1.7634849,1.6590719
217,-1.0926367,-0.34045614,2.1062729,1.8578837,-1.0841795,-0.35786259,1.7501884,1.6486183
218,-1.0774851,-0.35398203,2.0926494,1.8487553,-1.0667247,-0.37044929,1.7365078,1.6376797
219,-1.0623573,-0.36708531,2.0787701,1.8391737,-1.0494892,-0.38284772,1.7224509,1.6262628
220,-1.0472746,-0.37975944,2.0646486,1.8291444,-1.0325007,-0.39505445,1.7080254,1.6143747
221,-1.0322583,-0.39199867,2.0502981,1.8186731,-1.0157860,-0.40706631,1.6932395,1.6020227
222,-1.0173295,-0.40379798,2.0357318,1.8077659,-0.99937182,-0.41888034,1.6781017,1.5892149
223,-1.0025092,-0.41515316,2.0209626,1.7964290,-0.98328365,-0.43049380,1.6626207,1.5759599
224,-0.98781791,-0.42606076,2.0060032,1.7846692,-0.96754641,-0.44190421,1.6468055,1.5622666
225,-0.97327608,-0.43651812,1.9908661,1.7724934,-0.95218414,-0.45310928,1.6306655,1.5481443
226,-0.95890368,-0.44652336,1.9755634,1.7599088,-0.93721992,-0.46410694,1.6142101,1.5336031
227,-0.94472032,-0.45607540,1.9601070,1.7469231,-0.92267588,-0.47489533,1.5974492,1.5186534
228,-0.93074514,-0.46517392,1.9445086,1.7335441,-0.90857312,-0.48547278,1.5803928,1.5033058
229,-0.91699682,-0.47381940,1.9287795,1.7197800,-0.89493161,-0.49583782,1.5630514,1.4875716
230,-0.90349349,-0.48201308,1.9129306,1.7056392,-0.88177020,-0.50598916,1.5454353,1.4714626
231,-0.89025270,-0.48975697,1.8969726,1.6911305,-0.86910654,-0.51592569,1.5275555,1.4549908
232,-0.87729140,-0.49705384,1.8809157,1.6762630,-0.85695703,-0.52564646,1.5094230,1.4381687
233,-0.86462585,-0.50390718,1.8647700,1.6610458,-0.84533677,-0.53515067,1.4910490,1.4210091
234,-0.85227163,-0.51032124,1.8485449,1.6454886,-0.83425956,-0.54443770,1.4724448,1.4035252
235,-0.84024359,-0.51630096,1.8322496,1.6296013,-0.82373780,-0.55350704,1.4536223,1.3857307
236,-0.82855578,-0.52185198,1.8158929,1.6133939,-0.81378251,-0.56235831,1.4345930,1.3676395
237,-0.81722147,-0.52698063,1.7994832,1.5968768,-0.80440327,-0.57099128,1.4153691,1.3492658
238,-0.80625305,-0.53169387,1.7830285,1.5800606,-0.79560819,-0.57940581,1.3959627,1.3306241
239,-0.79566207,-0.53599933,1.7665362,1.5629561,-0.78740390,-0.58760187,1.3763860,1.3117293
240,-0.78545916,-0.53990522,1.7500137,1.5455744,-0.77979554,-0.59557951,1.3566515,1.2925964
241,-0.77565402,-0.54342034,1.7334675,1.5279268,-0.77278672,-0.60333887,1.3367717,1.2732408
242,-0.76625540,-0.54655404,1.7169041,1.5100247,-0.76637950,-0.61088018,1.3167592,1.2536780
243,-0.75727107,-0.54931623,1.7003294,1.4918799,-0.76057443,-0.61820372,1.2966268,1.2339238
244,-0.74870780,-0.55171728,1.6837489,1.4735041,-0.75537050,-0.62530980,1.2763873,1.2139940
245,-0.74057134,-0.55376805,1.6671675,1.4549095,-0.75076514,-0.63219882,1.2560535,1.1939047
246,-0.73286640,-0.55547982,1.6505901,1.4361082,-0.74675426,-0.63887118,1.2356383,1.1736722
247,-0.72559665,-0.55686430,1.6340210,1.4171126,-0.74333222,-0.64532733,1.2151548,1.1533127
248,-0.71876472,-0.55793353,1.6174638,1.3979351,-0.74049188,-0.65156772,1.1946158,1.1328427
249,-0.71237214,-0.55869991,1.6009223,1.3785884,-0.73822455,-0.65759281,1.1740344,1.1122785
250,-0.70641938,-0.55917613,1.5843994,1.3590851,-0.73652010,-0.66340308,1.1534234,1.0916367
251,-0.70090584,-0.55937515,1.5678978,1.3394381,-0.73536689,-0.66899897,1.1327959,1.0709338
252,-0.69582983,-0.55931014,1.5514200,1.3196603,-0.73475188,-0.67438094,1.1121646,1.0501863
253,-0.69118860,-0.55899446,1.5349679,1.2997645,-0.73466060,-0.67954939,1.0915424,1.0294105
254,-0.68697832,-0.55844163,1.5185431,1.2797639,-0.73507721,-0.68450473,1.0709421,1.0086230
255,-0.68319409,-0.55766525,1.5021470,1.2596714,-0.73598454,-0.68924729,1.0503762,0.98783985
256,-0.67982997,-0.55667903,1.4857805,1.2395000,-0.73736412,-0.69377740,1.0298572,0.96707738
257,-0.67687897,-0.55549669,1.4694444,1.2192630,-0.73919625,-0.69809531,1.0093975,0.94635158
258,-0.67433305,-0.55413195,1.4531389,1.1989732,-0.74146001,-0.70220123,0.98900946,0.92567833
259,-0.67218320,-0.55259849,1.4368643,1.1786437,-0.74413334,-0.70609530,0.96870503,0.90507331
260,-0.67041940,-0.55090991,1.4206203,1.1582875,-0.74719308,-0.70977761,0.94849615,0.88455198
261,-0.66903065,-0.54907966,1.4044066,1.1379174,-0.75061505,-0.71324818,0.92839450,0.86412959
262,-0.66800501,-0.54712108,1.3882224,1.1175464,-0.75437409,-0.71650695,0.90841158,0.84382110
263,-0.66732964,-0.54504729,1.3720669,1.0971871,-0.75844412,-0.71955379,0.88855865,0.82364120
264,-0.66699080,-0.54287118,1.3559390,1.0768521,-0.76279822,-0.72238851,0.86884673,0.80360429
265,-0.66697389,-0.54060537,1.3398375,1.0565540,-0.76740868,-0.72501081,0.84928659,0.78372441
266,-0.66726349,-0.53826219,1.3237610,1.0363050,-0.77224710,-0.72742034,0.82988871,0.76401528
267,-0.66784340,-0.53585363,1.3077079,1.0161174,-0.77728444,-0.72961666,0.81066331,0.74449022
268,-0.66869666,-0.53339132,1.2916765,0.99600322,-0.78249108,-0.73159925,0.79162029,0.72516219
269,-0.66980561,-0.53088647,1.2756650,0.97597419,-0.78783694,-0.73336750,0.77276924,0.70604372
270,-0.67115190,-0.52834987,1.2596716,0.95604194,-0.79329150,-0.73492074,0.75411944,0.68714692
271,-0.67271660,-0.52579187,1.2436942,0.93621784,-0.79882393,-0.73625822,0.73567981,0.66848344
272,-0.67448015,-0.52322231,1.2277308,0.91651303,-0.80440314,-0.73737909,0.71745894,0.65006448
273,-0.67642249,-0.52065052,1.2117793,0.89693839,-0.80999786,-0.73828246,0.69946505,0.63190076
274,-0.67852306,-0.51808529,1.1958377,0.87750451,-0.81557674,-0.73896736,0.68170598,0.61400249
275,-0.68076087,-0.51553484,1.1799039,0.85822173,-0.82110840,-0.73943274,0.66418919,0.59637938
276,-0.68311454,-0.51300683,1.1639759,0.83910006,-0.82656155,-0.73967750,0.64692178,0.57904061
277,-0.68556235,-0.51050829,1.1480515,0.82014920,-0.83190503,-0.73970048,0.62991040,0.56199482
278,-0.68808232,-0.50804564,1.1321288,0.80137854,-0.83710793,-0.73950048,0.61316132,0.54525013
279,-0.69065220,-0.50562464,1.1162058,0.78279712,-0.84213963,-0.73907623,0.59668040,0.52881407
280,-0.69324961,-0.50325043,1.1002808,0.76441362,-0.84696992,-0.73842644,0.58047306,0.51269360
281,-0.69585201,-0.50092744,1.0843521,0.74623639,-0.85156905,-0.73754977,0.56454430,0.49689514
282,-0.69843682,-0.49865944,1.0684179,0.72827336,-0.85590782,-0.73644485,0.54889868,0.48142450
283,-0.70098143,-0.49644951,1.0524767,0.71053211,-0.85995764,-0.73511032,0.53354034,0.46628691
284,-0.70346329,-0.49430004,1.0365273,0.69301981,-0.86369065,-0.73354477,0.51847296,0.45148699
285,-0.70585994,-0.49221269,1.0205685,0.67574324,-0.86707974,-0.73174680,0.50369979,0.43702880
286,-0.70814906,-0.49018845,1.0045991,0.65870876,-0.87009865,-0.72971501,0.48922362,0.42291577
287,-0.71030857,-0.48822758,0.98861845,0.64192231,-0.87272202,-0.72744803,0.47504681,0.40915073
288,-0.71231662,-0.48632963,0.97262577,0.62538942,-0.87492551,-0.72494447,0.46117125,0.39573595
289,-0.71415169,-0.48449347,0.95662065,0.60911515,-0.87668578,-0.72220301,0.44759841,0.38267305
290,-0.71579265,-0.48271723,0.94060284,0.59310418,-0.87798063,-0.71922235,0.43432929,0.36996308
291,-0.71721875,-0.48099839,0.92457234,0.57736069,-0.87878902,-0.71600122,0.42136446,0.35760651
292,-0.71840975,-0.47933372,0.90852934,0.56188845,-0.87909113,-0.71253844,0.40870406,0.34560320
293,-0.71934592,-0.47771931,0.89247431,0.54669078,-0.87886843,-0.70883287,0.39634778,0.33395244
294,-0.72000809,-0.47615061,0.87640792,0.53177054,-0.87810371,-0.70488346,0.38429488,0.32265295
295,-0.72037775,-0.47462240,0.86033113,0.51713014,-0.87678115,-0.70068924,0.37254419,0.31170287
296,-0.72043701,-0.47312884,0.84424513,0.50277153,-0.87488634,-0.69624933,0.36109415,0.30109981
297,-0.72016872,-0.47166348,0.82815137,0.48869623,-0.87240633,-0.69156295,0.34994275,0.29084080
298,-0.71955650,-0.47021926,0.81205155,0.47490529,-0.86932968,-0.68662947,0.33908760,0.28092238
299,-0.71858473,-0.46878856,0.79594766,0.46139932,-0.86564649,-0.68144832,0.32852592,0.27134054
300,-0.71723865,-0.46736320,0.77984193,0.44817848,-0.86134840,-0.67601912,0.31825452,0.26209076
301,-0.71550437,-0.46593447,0.76373686,0.43524248,-0.85642864,-0.67034161,0.30826986,0.25316805
302,-0.71336893,-0.46449318,0.74763521,0.42259063,-0.85088207,-0.66441566,0.29856803,0.24456693
303,-0.71082029,-0.46302964,0.73154000,0.41022175,-0.84470515,-0.65824133,0.28914477,0.23628146
304,-0.70784739,-0.46153374,0.71545452,0.39813430,-0.83789600,-0.65181883,0.27999547,0.22830527
305,-0.70444019,-0.45999495,0.69938230,0.38632627,-0.83045438,-0.64514856,0.27111521,0.22063155
306,-0.70058967,-0.45840234,0.68332714,0.37479526,-0.82238170,-0.63823108,0.26249875,0.21325311
307,-0.69628787,-0.45674464,0.66729305,0.36353848,-0.81368103,-0.63106716,0.25414056,0.20616236
308,-0.69152791,-0.45501028,0.65128432,0.35255273,-0.80435709,-0.62365776,0.24603481,0.19935135
309,-0.68630400,-0.45318738,0.63530545,0.34183444,-0.79441624,-0.61600405,0.23817543,0.19281178
310,-0.68061148,-0.45126383,0.61936117,0.33137967,-0.78386650,-0.60810741,0.23055608,0.18653504
311,-0.67444682,-0.44922730,0.60345644,0.32118412,-0.77271746,-0.59996944,0.22317020,0.18051224
312,-0.66780760,-0.44706529,0.58759640,0.31124314,-0.76098036,-0.59159194,0.21601101,0.17473420
313,-0.66069259,-0.44476516,0.57178642,0.30155176,-0.74866797,-0.58297698,0.20907151,0.16919147
314,-0.65310169,-0.44231417,0.55603205,0.29210470,-0.73579464,-0.57412681,0.20234455,0.16387441
315,-0.64503597,-0.43969952,0.54033900,0.28289634,-0.72237621,-0.56504397,0.19582280,0.15877317
316,-0.63649765,-0.43690839,0.52471318,0.27392080,-0.70843004,-0.55573119,0.18949880,0.15387772
317,-0.62749011,-0.43392796,0.50916063,0.26517194,-0.69397489,-0.54619147,0.18336495,0.14917787
318,-0.61801789,-0.43074548,0.49368754,0.25664334,-0.67903093,-0.53642805,0.17741354,0.14466332
319,-0.60808668,-0.42734828,0.47830024,0.24832834,-0.66361972,-0.52644441,0.17163680,0.14032365
320,-0.59770328,-0.42372384,0.46300516,0.24022009,-0.64776407,-0.51624428,0.16602686,0.13614840
321,-0.58687563,-0.41985978,0.44780884,0.23231150,-0.63148808,-0.50583163,0.16057582,0.13212703
322,-0.57561279,-0.41574395,0.43271792,0.22459532,-0.61481703,-0.49521070,0.15527576,0.12824898
323,-0.56392488,-0.41136443,0.41773911,0.21706412,-0.59777736,-0.48438594,0.15011872,0.12450371
324,-0.55182310,-0.40670958,0.40287917,0.20971033,-0.58039657,-0.47336207,0.14509678,0.12088068
325,-0.53931971,-0.40176809,0.38814491,0.20252625,-0.56270316,-0.46214404,0.14020205,0.11736944
326,-0.52642796,-0.39652899,0.37354320,0.19550406,-0.54472661,-0.45073705,0.13542666,0.11395958
327,-0.51316213,-0.39098169,0.35908089,0.18863588,-0.52649725,-0.43914653,0.13076284,0.11064081
328,-0.49953742,-0.38511603,0.34476485,0.18191373,-0.50804623,-0.42737813,0.12620291,0.10740297
329,-0.48556999,-0.37892231,0.33060194,0.17532959,-0.48940544,-0.41543776,0.12173926,0.10423604
330,-0.47127687,-0.37239130,0.31659899,0.16887543,-0.47060742,-0.40333150,0.11736445,0.10113017
331,-0.45667599,-0.36551428,0.30276277,0.16254318,-0.45168529,-0.39106570,0.11307115,0.098075726
332,-0.44178604,-0.35828309,0.28910003,0.15632481,-0.43267268,-0.37864689,0.10885221,0.095063273
333,-0.42662655,-0.35069012,0.27561743,0.15021231,-0.41360366,-0.36608180,0.10470066,0.092083625
334,-0.41121773,-0.34272838,0.26232154,0.14419771,-0.39451263,-0.35337736,0.10060972,0.089127855
335,-0.39558054,-0.33439147,0.24921883,0.13827312,-0.37543426,-0.34054069,0.096572825,0.086187317
336,-0.37973655,-0.32567368,0.23631568,0.13243077,-0.35640341,-0.32757908,0.092583636,0.083253668
337,-0.36370794,-0.31656991,0.22361833,0.12666295,-0.33745506,-0.31450000,0.088636065,0.080318884
338,-0.34751745,-0.30707580,0.21113288,0.12096211,-0.31862417,-0.30131106,0.084724281,0.077375276
339,-0.33118831,-0.29718765,0.19886527,0.11532086,-0.29994569,-0.28802004,0.080842727,0.074415515
340,-0.31474424,-0.28690250,0.18682132,0.10973194,-0.28145440,-0.27463482,0.076986138,0.071432639
341,-0.29820931,-0.27621812,0.17500663,0.10418832,-0.26318487,-0.26116344,0.073149546,0.068420075
342,-0.28160800,-0.26513305,0.16342664,0.098683149,-0.24517137,-0.24761404,0.069328302,0.065371649
343,-0.26496503,-0.25364654,0.15208659,0.093209798,-0.22744778,-0.23399486,0.065518078,0.062281601
344,-0.24830541,-0.24175865,0.14099152,0.087761883,-0.21004753,-0.22031423,0.061714888,0.059144598
345,-0.23165432,-0.22947019,0.13014626,0.082333274,-0.19300352,-0.20658056,0.057915089,0.055955746
346,-0.21503709,-0.21678275,0.11955541,0.076918112,-0.17634803,-0.19280232,0.054115398,0.052710595
347,-0.19847912,-0.20369872,0.10922335,0.071510824,-0.16011266,-0.17898802,0.050312896,0.049405156
348,-0.18200584,-0.19022125,0.099154218,0.066106138,-0.14432825,-0.16514621,0.046505038,0.046035902
349,-0.16564268,-0.17635428,0.089351920,0.060699097,-0.12902482,-0.15128548,0.042689659,0.042599780
350,-0.14941497,-0.16210253,0.079820110,0.055285072,-0.11423150,-0.13741441,0.038864981,0.039094213
351,-0.13334790,-0.14747149,0.070562191,0.049859775,-0.099976451,-0.12354157,0.035029618,0.035517108
352,-0.11746650,-0.13246741,0.061581315,0.044419272,-0.086286817,-0.10967552,0.031182580,0.031866858
353,-0.10179554,-0.11709730,0.052880371,0.038959991,-0.073188660,-0.095824778,0.027323277,0.028142342
354,-0.086359529,-0.10136893,0.044461992,0.033478734,-0.060706904,-0.081997817,0.023451523,0.024342933
355,-0.071182614,-0.085290786,0.036328549,0.027972689,-0.048865281,-0.068203045,0.019567534,0.020468492
356,-0.056288561,-0.068872080,0.028482149,0.022439434,-0.037686276,-0.054448792,0.015671933,0.016519367
357,-0.041700701,-0.052122726,0.020924639,0.016876947,-0.027191083,-0.040743295,0.011765747,0.012496396
358,-0.027441879,-0.035053321,0.013657606,0.011283613,-0.017399559,-0.027094685,0.0078504087,0.0084009003
359,-0.013534411,-0.017675127,0.0066823752,0.0056582307,-0.0083301843,-0.013510974,0.0039277521,0.0042346805
360,-3.7203193e-08,-4.9692801e-08,1.8225819e-08,1.5825208e-08,-2.2184679e-08,-3.7569144e-08,1.0957990e-08,1.1902188e-08
