XRT N-S vs UFSS-A
      248.303
     0.318767
     0.940317
    0.0950142
   -0.0525519
   -0.0421962
   0.00496908
XRT N-S vs UFSS-B
      238.535
     0.851830
    -0.119985
   -0.0139704
   -0.0317391
    0.0610573
    0.0256688
XRT E-W vs UFSS-A
      3967.79
    -0.410864
    -0.977516
    0.0638448
     0.239354
    -0.135745
   -0.0236293
XRT E-W vs UFSS-B
      3974.20
    -0.377063
    -0.851436
     0.101388
     0.197001
   -0.0585763
   -0.0327905
SOT N-S vs UFSS-A
      163.938
   -0.0323048
      1.09269
    0.0801846
    0.0549900
  -0.00729480
   -0.0304178
SOT N-S vs UFSS-B
      153.861
     0.625695
    0.0443598
  0.000524707
     0.168416
    0.0912265
   -0.0787801
SOT E-W vs UFSS-A
      150.022
    -0.178008
    -0.984265
    0.0542023
     0.225136
  -0.00525138
   -0.0540372
SOT E-W vs UFSS-B
      156.657
    -0.217782
    -0.834522
    0.0831938
     0.219592
   -0.0138496
   -0.0912593
