XRT N-S vs UFSS-A
      256.488
     0.693364
     0.777023
     0.159468
   -0.0445564
   -0.0636356
     0.110925
XRT N-S vs UFSS-B
      215.749
     0.713964
    -0.335184
    0.0643024
   -0.0922060
  -0.00817461
    0.0583721
XRT E-W vs UFSS-A
      3953.26
    -0.548485
    -0.558245
     0.391552
    -0.101381
    0.0169044
   -0.0369397
XRT E-W vs UFSS-B
      3967.47
    -0.570773
    -0.468104
     0.459861
   -0.0407375
    0.0880122
   -0.0523755
SOT N-S vs UFSS-A
      173.519
     0.479300
     0.864153
     0.148318
    0.0182195
  -0.00389293
   -0.0302208
SOT N-S vs UFSS-B
      131.433
     0.503660
    -0.281874
    0.0825919
    0.0245831
   -0.0373804
   -0.0670413
SOT E-W vs UFSS-A
      125.809
    -0.552771
    -0.756696
     0.211414
     0.132941
   -0.0456667
    0.0377493
SOT E-W vs UFSS-B
      140.539
    -0.602806
    -0.660094
     0.269521
     0.152878
   -0.0703646
   -0.0427352
