XRT N-S vs UFSS-A
      249.528
     0.285160
     0.757579
    0.0309539
    0.0332711
    -0.197575
    0.0724967
XRT N-S vs UFSS-B
      229.629
      1.09997
   -0.0309741
   -0.0643698
     0.100169
    -0.163146
   -0.0590680
XRT E-W vs UFSS-A
      3963.76
    -0.192802
    -0.893990
     0.119551
    0.0379534
     0.141115
    0.0935320
XRT E-W vs UFSS-B
      3971.74
    -0.275649
    -0.872755
    0.0886419
    0.0146519
     0.108684
    0.0648958
SOT N-S vs UFSS-A
      132.115
    0.0352435
     0.622382
     0.122282
    0.0157630
   -0.0438152
     0.104322
SOT N-S vs UFSS-B
      111.573
     0.797037
    -0.136352
  -0.00885026
    0.0822925
   -0.0557013
    0.0868750
SOT E-W vs UFSS-A
      172.164
    -0.113132
    -0.885601
   0.00805665
     0.149888
   -0.0225360
   -0.0358338
SOT E-W vs UFSS-B
      180.592
    -0.177828
    -0.949091
    0.0333660
     0.155323
    0.0432729
    0.0107695
