deg,XRT_AX,XRT_BX,XRT_AY,XRT_BY,SOT_AX,SOT_BX,SOT_AY,SOT_BY
valid,1,1,1,1,1,1,1,1,revB
offset,93.970198,82.258474,1987.8243,1979.3224,20.812991,8.7810536,108.24006,99.407622
0,0.0000000,0.0000000,0.0000000,0.0000000,0.0000000,0.0000000,0.0000000,0.0000000
1,0.072300559,0.028695497,-0.032988433,0.0049133253,0.076944129,0.025637978,-0.033302825,0.0056258582
2,0.14299258,0.057177628,-0.065389995,0.0094253308,0.15303793,0.051202440,-0.067020526,0.010913829
3,0.21204971,0.085415364,-0.097181016,0.013535995,0.22818929,0.076669705,-0.10109750,0.015856058
4,0.27944951,0.11337911,-0.12833995,0.017246627,0.30231009,0.10201726,-0.13547844,0.020445916
5,0.34517345,0.14104077,-0.15884737,0.020559839,0.37531638,0.12722378,-0.17010846,0.024678005
6,0.40920680,0.16837375,-0.18868602,0.023479526,0.44712846,0.15226915,-0.20493319,0.028548157
7,0.47153859,0.19535304,-0.21784074,0.026010834,0.51767096,0.17713444,-0.23989890,0.032053423
8,0.53216152,0.22195525,-0.24629849,0.028160129,0.58687294,0.20180198,-0.27495258,0.035192075
9,0.59107190,0.24815861,-0.27404837,0.029934967,0.65466794,0.22625531,-0.31004206,0.037963590
10,0.64826954,0.27394302,-0.30108152,0.031344051,0.72099407,0.25047921,-0.34511607,0.040368642
11,0.70375764,0.29929008,-0.32739118,0.032397200,0.78579402,0.27445970,-0.38012439,0.042409084
12,0.75754274,0.32418308,-0.35297258,0.033105302,0.84901512,0.29818403,-0.41501791,0.044087933
13,0.80963455,0.34860705,-0.37782295,0.033480275,0.91060937,0.32164068,-0.44974868,0.045409347
14,0.86004590,0.37254874,-0.40194147,0.033535021,0.97053344,0.34481933,-0.48427005,0.046378605
15,0.90879257,0.39599667,-0.42532921,0.033283378,1.0287487,0.36771089,-0.51853673,0.047002085
16,0.95589320,0.41894106,-0.44798907,0.032740071,1.0852211,0.39030744,-0.55250483,0.047287232
17,1.0013691,0.44137390,-0.46992575,0.031920667,1.1399214,0.41260225,-0.58613197,0.047242529
18,1.0452443,0.46328890,-0.49114567,0.030841514,1.1928249,0.43458973,-0.61937731,0.046877472
19,1.0875452,0.48468150,-0.51165691,0.029519700,1.2439114,0.45626542,-0.65220165,0.046202530
20,1.1283004,0.50554882,-0.53146913,0.027972989,1.2931653,0.47762597,-0.68456742,0.045229114
21,1.1675410,0.52588970,-0.55059349,0.026219771,1.3405756,0.49866911,-0.71643880,0.043969538
22,1.2052999,0.54570462,-0.56904261,0.024279006,1.3861356,0.51939361,-0.74778171,0.042436983
23,1.2416119,0.56499569,-0.58683044,0.022170165,1.4298429,0.53979925,-0.77856387,0.040645452
24,1.2765136,0.58376663,-0.60397221,0.019913178,1.4716993,0.55988680,-0.80875485,0.038609736
25,1.3100433,0.60202272,-0.62048434,0.017528371,1.5117109,0.57965796,-0.83832605,0.036345363
26,1.3422407,0.61977078,-0.63638433,0.015036415,1.5498877,0.59911536,-0.86725078,0.033868560
27,1.3731468,0.63701910,-0.65169069,0.012458260,1.5862438,0.61826246,-0.89550423,0.031196205
28,1.4028038,0.65377740,-0.66642285,0.0098150877,1.6207969,0.63710358,-0.92306351,0.028345780
29,1.4312549,0.67005680,-0.68060103,0.0071282461,1.6535685,0.65564379,-0.94990767,0.025335325
30,1.4585443,0.68586975,-0.69424619,0.0044191972,1.6845836,0.67388892,-0.97601765,0.022183393
31,1.4847168,0.70122999,-0.70737992,0.0017094600,1.7138707,0.69184549,-1.0013763,0.018908996
32,1.5098179,0.71615245,-0.72002430,-0.00097944537,1.7414615,0.70952065,-1.0259685,0.015531559
33,1.5338936,0.73065324,-0.73220189,-0.0036260517,1.7673908,0.72692217,-1.0497809,0.012070871
34,1.5569901,0.74474956,-0.74393553,-0.0062089984,1.7916963,0.74405835,-1.0728021,0.0085470342
35,1.5791540,0.75845965,-0.75524834,-0.0087070840,1.8144187,0.76093803,-1.0950225,0.0049804159
36,1.6004318,0.77180268,-0.76616353,-0.011099317,1.8356011,0.77757047,-1.1164344,0.0013915969
37,1.6208701,0.78479874,-0.77670439,-0.013364967,1.8552891,0.79396536,-1.1370319,-0.0021986766
38,1.6405153,0.79746873,-0.78689413,-0.015483610,1.8735308,0.81013273,-1.1568108,-0.0057695431
39,1.6594135,0.80983428,-0.79675582,-0.017435179,1.8903762,0.82608294,-1.1757688,-0.0093000744
40,1.6776103,0.82191770,-0.80631231,-0.019200005,1.9058773,0.84182661,-1.1939051,-0.012769324
41,1.6951510,0.83374191,-0.81558608,-0.020758864,1.9200879,0.85737456,-1.2112206,-0.016156376
42,1.7120802,0.84533031,-0.82459922,-0.022093017,1.9330633,0.87273778,-1.2277179,-0.019440389
43,1.7284418,0.85670678,-0.83337333,-0.023184245,1.9448604,0.88792741,-1.2434010,-0.022600647
44,1.7442788,0.86789555,-0.84192939,-0.024014894,1.9555372,0.90295462,-1.2582754,-0.025616602
45,1.7596336,0.87892111,-0.85028776,-0.024567903,1.9651527,0.91783063,-1.2723482,-0.028467918
46,1.7745474,0.88980819,-0.85846802,-0.024826842,1.9737668,0.93256666,-1.2856275,-0.031134515
47,1.7890604,0.90058163,-0.86648897,-0.024775937,1.9814403,0.94717385,-1.2981231,-0.033596613
48,1.8032119,0.91126633,-0.87436851,-0.024400104,1.9882342,0.96166326,-1.3098457,-0.035834767
49,1.8170397,0.92188716,-0.88212362,-0.023684970,1.9942103,0.97604578,-1.3208073,-0.037829914
50,1.8305807,0.93246888,-0.88977024,-0.022616898,1.9994300,0.99033217,-1.3310211,-0.039563404
51,1.8438704,0.94303608,-0.89732329,-0.021183010,2.0039553,1.0045329,-1.3405011,-0.041017039
52,1.8569428,0.95361311,-0.90479653,-0.019371200,2.0078478,1.0186583,-1.3492623,-0.042173109
53,1.8698310,0.96422397,-0.91220260,-0.017170155,2.0111688,1.0327183,-1.3573206,-0.043014422
54,1.8825662,0.97489229,-0.91955292,-0.014569366,2.0139791,1.0467227,-1.3646926,-0.043524336
55,1.8951785,0.98564121,-0.92685765,-0.011559136,2.0163391,1.0606806,-1.3713958,-0.043686791
56,1.9076966,0.99649337,-0.93412571,-0.0081305946,2.0183084,1.0746011,-1.3774482,-0.043486331
57,1.9201475,1.0074708,-0.94136470,-0.0042756976,2.0199456,1.0884927,-1.3828682,-0.042908136
58,1.9325570,1.0185948,-0.94858087,1.2767167e-05,2.0213084,1.1023636,-1.3876750,-0.041938040
59,1.9449494,1.0298861,-0.95577917,0.0047411794,2.0224535,1.1162214,-1.3918879,-0.040562554
60,1.9573474,1.0413645,-0.96296315,0.0099150885,2.0234361,1.1300734,-1.3955267,-0.038768890
61,1.9697724,1.0530491,-0.97013504,0.015539218,2.0243102,1.1439262,-1.3986114,-0.036544971
62,1.9822443,1.0649580,-0.97729566,0.021617470,2.0251284,1.1577862,-1.4011621,-0.033879453
63,1.9947817,1.0771084,-0.98444449,0.028152939,2.0259415,1.1716591,-1.4031991,-0.030761733
64,2.0074017,1.0895166,-0.99157966,0.035147916,2.0267989,1.1855500,-1.4047426,-0.027181967
65,2.0201201,1.1021976,-0.99869792,0.042603908,2.0277481,1.1994637,-1.4058129,-0.023131073
66,2.0329515,1.1151657,-1.0057947,0.050521650,2.0288349,1.2134044,-1.4064300,-0.018600741
67,2.0459089,1.1284340,-1.0128643,0.058901123,2.0301032,1.2273757,-1.4066139,-0.013583439
68,2.0590044,1.1420142,-1.0198994,0.067741573,2.0315949,1.2413806,-1.4063842,-0.0080724127
69,2.0722488,1.1559171,-1.0268917,0.077041532,2.0333499,1.2554217,-1.4057604,-0.0020616926
70,2.0856518,1.1701522,-1.0338316,0.086798844,2.0354063,1.2695011,-1.4047613,0.0044539123
71,2.0992219,1.1847280,-1.0407084,0.097010684,2.0377997,1.2836203,-1.4034056,0.011478814
72,2.1129667,1.1996513,-1.0475103,0.10767359,2.0405641,1.2977801,-1.4017113,0.019016652
73,2.1268928,1.2149282,-1.0542244,0.11878348,2.0437309,1.3119812,-1.3996959,0.027070298
74,2.1410058,1.2305632,-1.0608367,0.13033570,2.0473296,1.3262235,-1.3973766,0.035641864
75,2.1553108,1.2465596,-1.0673323,0.14232503,2.0513877,1.3405064,-1.3947695,0.044732714
76,2.1698116,1.2629194,-1.0736956,0.15474573,2.0559303,1.3548291,-1.3918904,0.054343475
77,2.1845119,1.2796434,-1.0799098,0.16759158,2.0609804,1.3691900,-1.3887543,0.064474049
78,2.1994142,1.2967312,-1.0859578,0.18085590,2.0665590,1.3835874,-1.3853754,0.075123628
79,2.2145209,1.3141810,-1.0918214,0.19453156,2.0726849,1.3980190,-1.3817673,0.086290711
80,2.2298336,1.3319898,-1.0974822,0.20861108,2.0793749,1.4124821,-1.3779426,0.097973121
81,2.2453537,1.3501533,-1.1029208,0.22308659,2.0866438,1.4269736,-1.3739132,0.11016802
82,2.2610821,1.3686661,-1.1081178,0.23794993,2.0945044,1.4414904,-1.3696903,0.12287195
83,2.2770194,1.3875216,-1.1130532,0.25319263,2.1029674,1.4560286,-1.3652841,0.13608082
84,2.2931663,1.4067119,-1.1177068,0.26880597,2.1120418,1.4705844,-1.3607039,0.14978994
85,2.3095229,1.4262282,-1.1220581,0.28478105,2.1217347,1.4851535,-1.3559583,0.16399406
86,2.3260897,1.4460602,-1.1260867,0.30110874,2.1320514,1.4997315,-1.3510550,0.17868741
87,2.3428667,1.4661970,-1.1297720,0.31777981,2.1429958,1.5143137,-1.3460007,0.19386364
88,2.3598544,1.4866262,-1.1330934,0.33478489,2.1545697,1.5288953,-1.3408015,0.20951596
89,2.3770532,1.5073347,-1.1360308,0.35211455,2.1667737,1.5434715,-1.3354625,0.22563709
90,2.3944637,1.5283084,-1.1385639,0.36975931,2.1796070,1.5580370,-1.3299880,0.24221930
91,2.4120868,1.5495322,-1.1406732,0.38770968,2.1930672,1.5725869,-1.3243814,0.25925445
92,2.4299237,1.5709901,-1.1423392,0.40595619,2.2071507,1.5871160,-1.3186456,0.27673401
93,2.4479757,1.5926655,-1.1435432,0.42448943,2.2218528,1.6016189,-1.3127823,0.29464911
94,2.4662448,1.6145407,-1.1442671,0.44330006,2.2371677,1.6160907,-1.3067928,0.31299052
95,2.4847333,1.6365976,-1.1444932,0.46237885,2.2530885,1.6305262,-1.3006777,0.33174872
96,2.5034439,1.6588172,-1.1442049,0.48171671,2.2696075,1.6449203,-1.2944366,0.35091391
97,2.5223800,1.6811802,-1.1433862,0.50130471,2.2867163,1.6592682,-1.2880689,0.37047604
98,2.5415452,1.7036664,-1.1420222,0.52113410,2.3044056,1.6735650,-1.2815730,0.39042484
99,2.5609439,1.7262553,-1.1400990,0.54119634,2.3226655,1.6878063,-1.2749470,0.41074983
100,2.5805811,1.7489260,-1.1376037,0.56148314,2.3414860,1.7019874,-1.2681884,0.43144039
101,2.6004622,1.7716571,-1.1345246,0.58198642,2.3608562,1.7161044,-1.2612942,0.45248574
102,2.6205934,1.7944271,-1.1308512,0.60269839,2.3807652,1.7301532,-1.2542611,0.47387497
103,2.6409814,1.8172141,-1.1265742,0.62361154,2.4012018,1.7441303,-1.2470854,0.49559710
104,2.6616334,1.8399961,-1.1216859,0.64471864,2.4221548,1.7580322,-1.2397630,0.51764107
105,2.6825575,1.8627508,-1.1161797,0.66601279,2.4436129,1.7718560,-1.2322895,0.53999577
106,2.7037622,1.8854561,-1.1100508,0.68748738,2.4655650,1.7855990,-1.2246606,0.56265008
107,2.7252565,1.9080898,-1.1032955,0.70913614,2.4880000,1.7992588,-1.2168716,0.58559286
108,2.7470501,1.9306297,-1.0959120,0.73095313,2.5109073,1.8128336,-1.2089177,0.60881299
109,2.7691532,1.9530538,-1.0879000,0.75293273,2.5342764,1.8263218,-1.2007941,0.63229939
110,2.7915766,1.9753403,-1.0792607,0.77506966,2.5580975,1.8397224,-1.1924963,0.65604104
111,2.8143313,1.9974676,-1.0699970,0.79735899,2.5823610,1.8530345,-1.1840195,0.68002699
112,2.8374290,2.0194144,-1.0601137,0.81979611,2.6070580,1.8662579,-1.1753592,0.70424636
113,2.8608817,2.0411598,-1.0496170,0.84237672,2.6321804,1.8793928,-1.1665113,0.72868837
114,2.8847017,2.0626833,-1.0385150,0.86509688,2.6577206,1.8924399,-1.1574716,0.75334239
115,2.9089016,2.0839648,-1.0268175,0.88795292,2.6836718,1.9054002,-1.1482366,0.77819786
116,2.9334942,2.1049849,-1.0145360,0.91094151,2.7100280,1.9182752,-1.1388030,0.80324440
117,2.9584924,2.1257244,-1.0016837,0.93405958,2.7367841,1.9310670,-1.1291679,0.82847174
118,2.9839095,2.1461652,-0.98827562,0.95730436,2.7639359,1.9437779,-1.1193289,0.85386978
119,3.0097584,2.1662894,-0.97432845,0.98067332,2.7914799,1.9564108,-1.1092843,0.87942857
120,3.0360523,2.1860801,-0.95986055,1.0041642,2.8194140,1.9689691,-1.0990330,0.90513832
121,3.0628039,2.2055210,-0.94489197,1.0277749,2.8477365,1.9814565,-1.0885743,0.93098939
122,3.0900261,2.2245966,-0.92944439,1.0515036,2.8764472,1.9938772,-1.0779084,0.95697234
123,3.1177312,2.2432923,-0.91354110,1.0753486,2.9055466,2.0062357,-1.0670362,0.98307785
124,3.1459311,2.2615941,-0.89720698,1.0993083,2.9350362,2.0185371,-1.0559595,1.0092968
125,3.1746376,2.2794891,-0.88046840,1.1233815,2.9649186,2.0307867,-1.0446808,1.0356202
126,3.2038614,2.2969652,-0.86335322,1.1475667,2.9951974,2.0429901,-1.0332035,1.0620393
127,3.2336129,2.3140112,-0.84589073,1.1718628,3.0258769,2.0551534,-1.0215318,1.0885453
128,3.2639018,2.3306169,-0.82811155,1.1962685,3.0569627,2.0672830,-1.0096710,1.1151298
129,3.2947365,2.3467729,-0.81004762,1.2207828,3.0884610,2.0793855,-0.99762732,1.1417844
130,3.3261250,2.3624710,-0.79173208,1.2454043,3.1203790,2.0914678,-0.98540794,1.1685008
131,3.3580740,2.3777038,-0.77319925,1.2701320,3.1527247,2.1035369,-0.97302104,1.1952709
132,3.3905889,2.3924648,-0.75448449,1.2949643,3.1855069,2.1156003,-0.96047584,1.2220866
133,3.4236741,2.4067488,-0.73562416,1.3199001,3.2187350,2.1276653,-0.94778261,1.2489401
134,3.4573327,2.4205511,-0.71665553,1.3449375,3.2524192,2.1397396,-0.93495264,1.2758235
135,3.4915661,2.4338685,-0.69761668,1.3700749,3.2865703,2.1518309,-0.92199830,1.3027290
136,3.5263744,2.4466983,-0.67854641,1.3953104,3.3211993,2.1639470,-0.90893302,1.3296488
137,3.5617560,2.4590391,-0.65948413,1.4206415,3.3563181,2.1760956,-0.89577128,1.3565753
138,3.5977077,2.4708904,-0.64046980,1.4460659,3.3919385,2.1882846,-0.88252860,1.3835008
139,3.6342242,2.4822523,-0.62154377,1.4715806,3.4280729,2.2005216,-0.86922156,1.4104177
140,3.6712987,2.4931262,-0.60274673,1.4971826,3.4647337,2.2128144,-0.85586776,1.4373181
141,3.7089222,2.5035143,-0.58411957,1.5228682,3.5019335,2.2251703,-0.84248579,1.4641946
142,3.7470837,2.5134194,-0.56570328,1.5486333,3.5396846,2.2375968,-0.82909526,1.4910391
143,3.7857702,2.5228456,-0.54753885,1.5744737,3.5779995,2.2501008,-0.81571671,1.5178440
144,3.8249663,2.5317973,-0.52966714,1.6003843,3.6168903,2.2626894,-0.80237162,1.5446013
145,3.8646545,2.5402801,-0.51212879,1.6263597,3.6563688,2.2753689,-0.78908238,1.5713030
146,3.9048149,2.5483000,-0.49496409,1.6523939,3.6964462,2.2881455,-0.77587220,1.5979409
147,3.9454253,2.5558639,-0.47821285,1.6784804,3.7371334,2.3010252,-0.76276514,1.6245067
148,3.9864610,2.5629793,-0.46191436,1.7046121,3.7784403,2.3140132,-0.74978602,1.6509919
149,4.0278950,2.5696543,-0.44610717,1.7307811,3.8203761,2.3271143,-0.73696035,1.6773880
150,4.0696975,2.5758975,-0.43082906,1.7569792,3.8629493,2.3403331,-0.72431435,1.7036860
151,4.1118363,2.5817182,-0.41611692,1.7831973,3.9061672,2.3536733,-0.71187482,1.7298769
152,4.1542768,2.5871260,-0.40200658,1.8094256,3.9500357,2.3671382,-0.69966911,1.7559514
153,4.1969815,2.5921309,-0.38853279,1.8356538,3.9945598,2.3807302,-0.68772507,1.7818999
154,4.2399105,2.5967435,-0.37572903,1.8618706,4.0397429,2.3944514,-0.67607095,1.8077127
155,4.2830213,2.6009746,-0.36362748,1.8880642,4.0855870,2.4083030,-0.66473538,1.8333796
156,4.3262686,2.6048350,-0.35225885,1.9142220,4.1320924,2.4222853,-0.65374724,1.8588903
157,4.3696046,2.6083362,-0.34165233,1.9403306,4.1792577,2.4363981,-0.64313563,1.8842340
158,4.4129791,2.6114895,-0.33183548,1.9663760,4.2270796,2.4506403,-0.63292978,1.9093997
159,4.4563390,2.6143065,-0.32283413,1.9923432,4.2755530,2.4650098,-0.62315896,1.9343760
160,4.4996288,2.6167986,-0.31467231,2.0182167,4.3246706,2.4795038,-0.61385242,1.9591513
161,4.5427907,2.6189774,-0.30737213,2.0439800,4.3744229,2.4941187,-0.60503931,1.9837135
162,4.5857640,2.6208545,-0.30095375,2.0696159,4.4247985,2.5088496,-0.59674856,2.0080502
163,4.6284861,2.6224411,-0.29543526,2.0951067,4.4757832,2.5236910,-0.58900884,2.0321486
164,4.6708918,2.6237484,-0.29083263,2.1204335,4.5273608,2.5386364,-0.58184846,2.0559955
165,4.7129135,2.6247874,-0.28715964,2.1455771,4.5795124,2.5536781,-0.57529526,2.0795775
166,4.7544817,2.6255688,-0.28442781,2.1705172,4.6322165,2.5688076,-0.56937655,2.1028806
167,4.7955247,2.6261028,-0.28264639,2.1952332,4.6854490,2.5840154,-0.56411905,2.1258906
168,4.8359686,2.6263994,-0.28182222,2.2197035,4.7391833,2.5992908,-0.55954872,2.1485929
169,4.8757378,2.6264682,-0.28195977,2.2439058,4.7933898,2.6146222,-0.55569076,2.1709723
170,4.9147548,2.6263180,-0.28306108,2.2678175,4.8480361,2.6299970,-0.55256948,2.1930137
171,4.9529404,2.6259574,-0.28512570,2.2914150,4.9030872,2.6454015,-0.55020821,2.2147011
172,4.9902138,2.6253943,-0.28815067,2.3146744,4.9585051,2.6608209,-0.54862926,2.2360186
173,5.0264930,2.6246359,-0.29213055,2.3375710,5.0142488,2.6762395,-0.54785378,2.2569497
174,5.0616942,2.6236888,-0.29705734,2.3600797,5.0702746,2.6916405,-0.54790172,2.2774777
175,5.0957328,2.6225589,-0.30292050,2.3821749,5.1265357,2.7070062,-0.54879174,2.2975854
176,5.1285232,2.6212514,-0.30970696,2.4038307,5.1829826,2.7223176,-0.55054112,2.3172556
177,5.1599787,2.6197707,-0.31740112,2.4250205,5.2395627,2.7375552,-0.55316571,2.3364706
178,5.1900119,2.6181202,-0.32598484,2.4457174,5.2962206,2.7526981,-0.55667983,2.3552125
179,5.2185351,2.6163027,-0.33543751,2.4658944,5.3528981,2.7677246,-0.56109623,2.3734630
180,5.2454599,2.6143201,-0.34573601,2.4855240,5.4095340,2.7826121,-0.56642600,2.3912040
181,5.2706980,2.6121733,-0.35685480,2.5045786,5.4660645,2.7973372,-0.57267852,2.4084167
182,5.2941607,2.6098625,-0.36876591,2.5230303,5.5224230,2.8118754,-0.57986139,2.4250824
183,5.3157599,2.6073867,-0.38143903,2.5408512,5.5785403,2.8262016,-0.58798038,2.4411823
184,5.3354073,2.6047441,-0.39484153,2.5580133,5.6343445,2.8402899,-0.59703940,2.4566973
185,5.3530155,2.6019321,-0.40893854,2.5744884,5.6897614,2.8541135,-0.60704039,2.4716083
186,5.3684978,2.5989469,-0.42369299,2.5902486,5.7447141,2.8676449,-0.61798336,2.4858962
187,5.3817682,2.5957839,-0.43906570,2.6052661,5.7991236,2.8808562,-0.62986628,2.4995418
188,5.3927418,2.5924374,-0.45501545,2.6195129,5.8529085,2.8937185,-0.64268507,2.5125259
189,5.4013352,2.5889009,-0.47149906,2.6329617,5.9059855,2.9062027,-0.65643360,2.5248294
190,5.4074664,2.5851669,-0.48847148,2.6455852,5.9582693,2.9182788,-0.67110361,2.5364333
191,5.4110548,2.5812269,-0.50588586,2.6573564,6.0096726,2.9299168,-0.68668472,2.5473187
192,5.4120221,2.5770715,-0.52369370,2.6682488,6.0601065,2.9410859,-0.70316442,2.5574667
193,5.4102918,2.5726904,-0.54184490,2.6782364,6.1094805,2.9517552,-0.72052806,2.5668589
194,5.4057898,2.5680725,-0.56028791,2.6872937,6.1577029,2.9618933,-0.73875881,2.5754769
195,5.3984442,2.5632058,-0.57896978,2.6953957,6.2046804,2.9714689,-0.75783771,2.5833026
196,5.3881861,2.5580772,-0.59783637,2.7025181,6.2503188,2.9804502,-0.77774364,2.5903182
197,5.3749492,2.5526732,-0.61683238,2.7086374,6.2945232,2.9888055,-0.79845336,2.5965065
198,5.3586702,2.5469793,-0.63590152,2.7137307,6.3371977,2.9965031,-0.81994148,2.6018504
199,5.3392892,2.5409803,-0.65498663,2.7177761,6.3782460,3.0035112,-0.84218055,2.6063335
200,5.3167495,2.5346603,-0.67402981,2.7207525,6.4175714,3.0097983,-0.86514103,2.6099395
201,5.2909979,2.5280028,-0.69297255,2.7226397,6.4550771,3.0153329,-0.88879135,2.6126531
202,5.2619852,2.5209906,-0.71175585,2.7234186,6.4906663,3.0200839,-0.91309793,2.6144593
203,5.2296657,2.5136059,-0.73032041,2.7230712,6.5242426,3.0240205,-0.93802526,2.6153437
204,5.1939979,2.5058306,-0.74860670,2.7215805,6.5557099,3.0271122,-0.96353589,2.6152926
205,5.1549447,2.4976460,-0.76655515,2.7189308,6.5849728,3.0293292,-0.98959056,2.6142931
206,5.1124729,2.4890330,-0.78410625,2.7151075,6.6119369,3.0306419,-1.0161482,2.6123329
207,5.0665542,2.4799722,-0.80120076,2.7100975,6.6365089,3.0310217,-1.0431660,2.6094006
208,5.0171646,2.4704439,-0.81777977,2.7038886,6.6585967,3.0304403,-1.0705995,2.6054854
209,4.9642849,2.4604281,-0.83378490,2.6964704,6.6781098,3.0288706,-1.0984027,2.6005777
210,4.9079008,2.4499048,-0.84915842,2.6878338,6.6949595,3.0262859,-1.1265281,2.5946684
211,4.8480028,2.4388538,-0.86384340,2.6779710,6.7090591,3.0226608,-1.1549266,2.5877496
212,4.7845865,2.4272549,-0.87778384,2.6668758,6.7203239,3.0179705,-1.1835480,2.5798144
213,4.7176527,2.4150879,-0.89092482,2.6545436,6.7286719,3.0121915,-1.2123408,2.5708566
214,4.6472073,2.4023329,-0.90321263,2.6409712,6.7340234,3.0053013,-1.2412523,2.5608714
215,4.5732615,2.3889699,-0.91459491,2.6261572,6.7363019,2.9972786,-1.2702288,2.5498548
216,4.4958317,2.3749793,-0.92502077,2.6101016,6.7354336,2.9881034,-1.2992156,2.5378040
217,4.4149398,2.3603418,-0.93444093,2.5928061,6.7313481,2.9777569,-1.3281572,2.5247173
218,4.3306132,2.3450387,-0.94280787,2.5742743,6.7239785,2.9662216,-1.3569975,2.5105941
219,4.2428845,2.3290513,-0.95007589,2.5545111,6.7132614,2.9534816,-1.3856795,2.4954352
220,4.1517919,2.3123618,-0.95620131,2.5335233,6.6991374,2.9395224,-1.4141460,2.4792423
221,4.0573789,2.2949530,-0.96114250,2.5113196,6.6815511,2.9243309,-1.4423393,2.4620185
222,3.9596948,2.2768081,-0.96486006,2.4879099,6.6604511,2.9078957,-1.4702014,2.4437680
223,3.8587938,2.2579114,-0.96731691,2.4633064,6.6357906,2.8902071,-1.4976743,2.4244963
224,3.7547359,2.2382478,-0.96847835,2.4375227,6.6075272,2.8712568,-1.5246997,2.4042103
225,3.6475864,2.2178030,-0.96831221,2.4105740,6.5756233,2.8510384,-1.5512197,2.3829180
226,3.5374158,2.1965639,-0.96678891,2.3824776,6.5400462,2.8295472,-1.5771766,2.3606287
227,3.4242999,2.1745181,-0.96388154,2.3532521,6.5007679,2.8067803,-1.6025129,2.3373531
228,3.3083198,2.1516546,-0.95956598,2.3229180,6.4577659,2.7827367,-1.6271717,2.3131030
229,3.1895614,2.1279634,-0.95382090,2.2914975,6.4110227,2.7574169,-1.6510966,2.2878916
230,3.0681159,2.1034355,-0.94662791,2.2590142,6.3605262,2.7308237,-1.6742322,2.2617336
231,2.9440792,2.0780634,-0.93797156,2.2254938,6.3062699,2.7029615,-1.6965236,2.2346446
232,2.8175521,2.0518407,-0.92783939,2.1909630,6.2482527,2.6738366,-1.7179172,2.2066417
233,2.6886400,2.0247626,-0.91622204,2.1554504,6.1864792,2.6434574,-1.7383603,2.1777433
234,2.5574528,1.9968254,-0.90311321,2.1189862,6.1209597,2.6118341,-1.7578016,2.1479689
235,2.4241048,1.9680271,-0.88850974,2.0816019,6.0517104,2.5789788,-1.7761909,2.1173394
236,2.2887144,1.9383670,-0.87241162,2.0433305,5.9787532,2.5449055,-1.7934798,2.0858768
237,2.1514043,1.9078460,-0.85482201,2.0042064,5.9021158,2.5096304,-1.8096213,2.0536044
238,2.0123008,1.8764665,-0.83574724,1.9642654,5.8218320,2.4731713,-1.8245700,2.0205467
239,1.8715341,1.8442327,-0.81519685,1.9235445,5.7379413,2.4355480,-1.8382824,1.9867292
240,1.7292377,1.8111501,-0.79318353,1.8820820,5.6504892,2.3967823,-1.8507170,1.9521788
241,1.5855486,1.7772260,-0.76972313,1.8399174,5.5595271,2.3568978,-1.8618342,1.9169231
242,1.4406068,1.7424693,-0.74483466,1.7970913,5.4651123,2.3159200,-1.8715965,1.8809912
243,1.2945550,1.7068908,-0.71854026,1.7536455,5.3673077,2.2738762,-1.8799688,1.8444129
244,1.1475389,1.6705028,-0.69086512,1.7096225,5.2661824,2.2307954,-1.8869180,1.8072193
245,0.99970631,1.6333192,-0.66183749,1.6650660,5.1618108,2.1867086,-1.8924136,1.7694420
246,0.85120743,1.5953557,-0.63148862,1.6200205,5.0542733,2.1416483,-1.8964275,1.7311140
247,0.70219433,1.5566298,-0.59985270,1.5745312,4.9436556,2.0956489,-1.8989340,1.6922689
248,0.55282078,1.5171607,-0.56696677,1.5286441,4.8300491,2.0487462,-1.8999104,1.6529411
249,0.40324202,1.4769691,-0.53287071,1.4824057,4.7135503,2.0009778,-1.8993363,1.6131659
250,0.25361450,1.4360775,-0.49760709,1.4358633,4.5942612,1.9523828,-1.8971942,1.5729792
251,0.10409560,1.3945101,-0.46122117,1.3890645,4.4722888,1.9030016,-1.8934693,1.5324176
252,-0.045156611,1.3522927,-0.42376074,1.3420573,4.3477449,1.8528764,-1.8881498,1.4915183
253,-0.19398363,1.3094526,-0.38527606,1.2948901,4.2207464,1.8020504,-1.8812266,1.4503192
254,-0.34222680,1.2660190,-0.34581976,1.2476114,4.0914146,1.7505682,-1.8726937,1.4088584
255,-0.48972757,1.2220222,-0.30544674,1.2002701,3.9598754,1.6984758,-1.8625480,1.3671748
256,-0.63632776,1.1774945,-0.26421400,1.1529149,3.8262589,1.6458201,-1.8507893,1.3253073
257,-0.78186983,1.1324693,-0.22218063,1.1055945,3.6906993,1.5926494,-1.8374204,1.2832954
258,-0.92619713,1.0869817,-0.17940758,1.0583578,3.5533347,1.5390127,-1.8224472,1.2411787
259,-1.0691542,1.0410678,-0.13595761,1.0112532,3.4143068,1.4849601,-1.8058785,1.1989971
260,-1.2105870,0.99476558,-0.091895134,0.96432891,3.2737607,1.4305425,-1.7877263,1.1567905
261,-1.3503431,0.94811380,-0.047286066,0.91763281,3.1318448,1.3758117,-1.7680053,1.1145989
262,-1.4882722,0.90115267,-0.0021977159,0.87121233,2.9887103,1.3208200,-1.7467335,1.0724624
263,-1.6242260,0.85392349,0.043301365,0.82511440,2.8445112,1.2656203,-1.7239317,1.0304210
264,-1.7580589,0.80646863,0.089141530,0.77938529,2.6994040,1.2102663,-1.6996236,0.98851431
265,-1.8896277,0.75883150,0.13525218,0.73407065,2.5535473,1.1548117,-1.6738359,0.94678208
266,-2.0187924,0.71105643,0.18156191,0.68921531,2.4071016,1.0993109,-1.6465981,0.90526360
267,-2.1454160,0.66318860,0.22799865,0.64486327,2.2602290,1.0438183,-1.6179426,0.86399788
268,-2.2693650,0.61527399,0.27448986,0.60105763,2.1130933,0.98838862,-1.5879044,0.82302351
269,-2.3905096,0.56735927,0.32096261,0.55784047,1.9658589,0.93307655,-1.5565214,0.78237862
270,-2.5087238,0.51949175,0.36734380,0.51525281,1.8186913,0.87793677,-1.5238341,0.74210082
271,-2.6238855,0.47171925,0.41356028,0.47333453,1.6717565,0.82302384,-1.4898853,0.70222711
272,-2.7358771,0.42409004,0.45953899,0.43212429,1.5252206,0.76839211,-1.4547206,0.66279384
273,-2.8445854,0.37665277,0.50520716,0.39165950,1.3792499,0.71409562,-1.4183879,0.62383666
274,-2.9499017,0.32945633,0.55049242,0.35197621,1.2340100,0.66018801,-1.3809374,0.58539040
275,-3.0517224,0.28254980,0.59532298,0.31310907,1.0896660,0.60672244,-1.3424215,0.54748909
276,-3.1499486,0.23598235,0.63962775,0.27509129,0.94638217,0.55375149,-1.3028948,0.51016586
277,-3.2444868,0.18980314,0.68333651,0.23795456,0.80432144,0.50132708,-1.2624140,0.47345287
278,-3.3352486,0.14406121,0.72638006,0.20172900,0.66364524,0.44950037,-1.2210374,0.43738130
279,-3.4221512,0.098805430,0.76869035,0.16644312,0.52451320,0.39832169,-1.1788254,0.40198124
280,-3.5051171,0.054084351,0.81020062,0.13212379,0.38708288,0.34784044,-1.1358400,0.36728172
281,-3.5840748,0.0099461564,0.85084553,0.098796162,0.25150945,0.29810501,-1.0921447,0.33331057
282,-3.6589584,-0.033561457,0.89056134,0.066483649,0.11794545,0.24916274,-1.0478046,0.30009443
283,-3.7297079,-0.076391363,0.92928596,0.035207905,-0.013459477,0.20105978,-1.0028859,0.26765872
284,-3.7962692,-0.11849711,0.96695916,0.0049887734,-0.14255889,0.15384104,-0.95745622,0.23602753
285,-3.8585945,-0.15983298,1.0035226,-0.024155729,-0.26920975,0.10755014,-0.91158407,0.20522366
286,-3.9166416,-0.20035414,1.0389201,-0.052209440,-0.39327275,0.062229312,-0.86533896,0.17526853
287,-3.9703750,-0.24001667,1.0730975,-0.079158070,-0.51461248,0.017919331,-0.81879115,0.14618217
288,-4.0197648,-0.27877768,1.1060031,-0.10498922,-0.63309772,-0.025340526,-0.77201159,0.11798317
289,-4.0647878,-0.31659539,1.1375874,-0.12969238,-0.74860164,-0.067512561,-0.72507170,0.090688696
290,-4.1054267,-0.35342921,1.1678035,-0.15325896,-0.86100203,-0.10856071,-0.67804330,0.064314397
291,-4.1416705,-0.38923985,1.1966069,-0.17568227,-0.97018153,-0.14845058,-0.63099841,0.038874442
292,-4.1735142,-0.42398935,1.2239560,-0.19695755,-1.0760278,-0.18714953,-0.58400916,0.014381471
293,-4.2009594,-0.45764118,1.2498117,-0.21708192,-1.1784337,-0.22462671,-0.53714762,-0.0091534100
294,-4.2240134,-0.49016033,1.2741378,-0.23605441,-1.2772976,-0.26085307,-0.49048565,-0.031720651
295,-4.2426898,-0.52151336,1.2969009,-0.25387595,-1.3725234,-0.29580146,-0.44409478,-0.053312259
296,-4.2570080,-0.55166845,1.3180705,-0.27054932,-1.4640205,-0.32944661,-0.39804606,-0.073921813
297,-4.2669937,-0.58059552,1.3376191,-0.28607915,-1.5517047,-0.36176520,-0.35240994,-0.093544462
298,-4.2726781,-0.60826624,1.3555222,-0.30047191,-1.6354973,-0.39273588,-0.30725609,-0.11217693
299,-4.2740985,-0.63465409,1.3717583,-0.31373587,-1.7153261,-0.42233928,-0.26265330,-0.12981750
300,-4.2712976,-0.65973443,1.3863091,-0.32588104,-1.7911250,-0.45055805,-0.21866935,-0.14646604
301,-4.2643238,-0.68348457,1.3991592,-0.33691921,-1.8628342,-0.47737686,-0.17537083,-0.16212395
302,-4.2532308,-0.70588374,1.4102965,-0.34686381,-1.9304005,-0.50278241,-0.13282309,-0.17679420
303,-4.2380777,-0.72691321,1.4197117,-0.35572998,-1.9937771,-0.52676348,-0.091090047,-0.19048127
304,-4.2189288,-0.74655630,1.4273991,-0.36353443,-2.0529238,-0.54931087,-0.050234083,-0.20319115
305,-4.1958532,-0.76479837,1.4333556,-0.37029544,-2.1078071,-0.57041744,-0.010315943,-0.21493133
306,-4.1689251,-0.78162692,1.4375815,-0.37603281,-2.1583999,-0.59007810,0.028605397,-0.22571076
307,-4.1382232,-0.79703156,1.4400800,-0.38076778,-2.2046820,-0.60828980,0.066472835,-0.23553983
308,-4.1038306,-0.81100404,1.4408575,-0.38452302,-2.2466398,-0.62505152,0.10323125,-0.24443034
309,-4.0658348,-0.82353827,1.4399233,-0.38732250,-2.2842665,-0.64036423,0.13882761,-0.25239546
310,-4.0243275,-0.83463033,1.4372896,-0.38919151,-2.3175616,-0.65423092,0.17321104,-0.25944972
311,-3.9794042,-0.84427846,1.4329718,-0.39015651,-2.3465316,-0.66665652,0.20633298,-0.26560893
312,-3.9311641,-0.85248307,1.4269877,-0.39024514,-2.3711892,-0.67764792,0.23814719,-0.27089018
313,-3.8797100,-0.85924676,1.4193583,-0.38948612,-2.3915540,-0.68721389,0.26860987,-0.27531177
314,-3.8251477,-0.86457424,1.4101072,-0.38790917,-2.4076516,-0.69536510,0.29767978,-0.27889318
315,-3.7675864,-0.86847238,1.3992606,-0.38554493,-2.4195142,-0.70211403,0.32531821,-0.28165501
316,-3.7071379,-0.87095018,1.3868473,-0.38242494,-2.4271802,-0.70747497,0.35148914,-0.28361895
317,-3.6439167,-0.87201872,1.3728986,-0.37858149,-2.4306942,-0.71146394,0.37615924,-0.28480771
318,-3.5780396,-0.87169115,1.3574482,-0.37404763,-2.4301066,-0.71409865,0.39929795,-0.28524497
319,-3.5096256,-0.86998265,1.3405322,-0.36885699,-2.4254738,-0.71539848,0.42087752,-0.28495534
320,-3.4387956,-0.86691040,1.3221888,-0.36304381,-2.4168579,-0.71538439,0.44087303,-0.28396428
321,-3.3656721,-0.86249353,1.3024584,-0.35664277,-2.4043266,-0.71407886,0.45926248,-0.28229805
322,-3.2903790,-0.85675309,1.2813832,-0.34968897,-2.3879530,-0.71150585,0.47602673,-0.27998366
323,-3.2130415,-0.84971196,1.2590075,-0.34221782,-2.3678154,-0.70769075,0.49114960,-0.27704881
324,-3.1337856,-0.84139486,1.2353772,-0.33426500,-2.3439971,-0.70266026,0.50461785,-0.27352180
325,-3.0527380,-0.83182823,1.2105401,-0.32586631,-2.3165863,-0.69644239,0.51642118,-0.26943149
326,-2.9700262,-0.82104020,1.1845454,-0.31705766,-2.2856758,-0.68906635,0.52655225,-0.26480725
327,-2.8857774,-0.80906052,1.1574435,-0.30787496,-2.2513628,-0.68056248,0.53500668,-0.25967887
328,-2.8001192,-0.79592050,1.1292864,-0.29835406,-2.2137487,-0.67096221,0.54178301,-0.25407649
329,-2.7131788,-0.78165292,1.1001272,-0.28853063,-2.1729389,-0.66029794,0.54688269,-0.24803057
330,-2.6250829,-0.76629195,1.0700197,-0.27844015,-2.1290427,-0.64860300,0.55031010,-0.24157178
331,-2.5359576,-0.74987311,1.0390190,-0.26811777,-2.0821725,-0.63591156,0.55207244,-0.23473096
332,-2.4459282,-0.73243317,1.0071809,-0.25759828,-2.0324443,-0.62225857,0.55217979,-0.22753908
333,-2.3551185,-0.71401003,0.97456151,-0.24691604,-1.9799770,-0.60767965,0.55064497,-0.22002709
334,-2.2636514,-0.69464270,0.94121777,-0.23610485,-1.9248922,-0.59221102,0.54748357,-0.21222596
335,-2.1716480,-0.67437116,0.90720686,-0.22519798,-1.8673139,-0.57588947,0.54271385,-0.20416654
336,-2.0792278,-0.65323632,0.87258618,-0.21422801,-1.8073686,-0.55875222,0.53635670,-0.19587953
337,-1.9865082,-0.63127987,0.83741326,-0.20322682,-1.7451845,-0.54083684,0.52843559,-0.18739540
338,-1.8936046,-0.60854423,0.80174558,-0.19222552,-1.6808916,-0.52218124,0.51897645,-0.17874433
339,-1.8006301,-0.58507247,0.76564047,-0.18125436,-1.6146213,-0.50282351,0.50800766,-0.16995617
340,-1.7076954,-0.56090815,0.72915497,-0.17034272,-1.5465060,-0.48280191,0.49555993,-0.16106035
341,-1.6149085,-0.53609531,0.69234571,-0.15951902,-1.4766794,-0.46215473,0.48166621,-0.15208585
342,-1.5223744,-0.51067830,0.65526880,-0.14881069,-1.4052754,-0.44092029,0.46636165,-0.14306111
343,-1.4301956,-0.48470173,0.61797968,-0.13824408,-1.3324285,-0.41913677,0.44968345,-0.13401400
344,-1.3384711,-0.45821037,0.58053304,-0.12784448,-1.2582730,-0.39684223,0.43167081,-0.12497175
345,-1.2472970,-0.43124903,0.54298265,-0.11763604,-1.1829435,-0.37407448,0.41236480,-0.11596092
346,-1.1567659,-0.40386249,0.50538134,-0.10764169,-1.1065736,-0.35087102,0.39180827,-0.10700732
347,-1.0669670,-0.37609538,0.46778080,-0.097883202,-1.0292967,-0.32726899,0.37004576,-0.098135991
348,-0.97798595,-0.34799213,0.43023155,-0.088381055,-0.95124498,-0.30330507,0.34712335,-0.089371127
349,-0.88990475,-0.31959683,0.39278278,-0.079154468,-0.87254945,-0.27901546,0.32308859,-0.080736057
350,-0.80280169,-0.29095317,0.35548233,-0.070221350,-0.79333975,-0.25443577,0.29799037,-0.072253194
351,-0.71675124,-0.26210433,0.31837653,-0.061598280,-0.71374383,-0.22960098,0.27187882,-0.063943993
352,-0.63182400,-0.23309290,0.28151017,-0.053300488,-0.63388773,-0.20454541,0.24480516,-0.055828919
353,-0.54808664,-0.20396081,0.24492637,-0.045341835,-0.55389538,-0.17930261,0.21682161,-0.047927408
354,-0.46560187,-0.17474922,0.20866658,-0.037734805,-0.47388834,-0.15390534,0.18798127,-0.040257836
355,-0.38442836,-0.14549847,0.17277043,-0.030490489,-0.39398566,-0.12838551,0.15833799,-0.032837493
356,-0.30462077,-0.11624794,0.13727573,-0.023618582,-0.31430360,-0.10277415,0.12794626,-0.025682553
357,-0.22622967,-0.087036072,0.10221838,-0.017127382,-0.23495549,-0.077101339,0.096861081,-0.018808051
358,-0.14930159,-0.057900198,0.067632359,-0.011023785,-0.15605154,-0.051396177,0.065137850,-0.012227862
359,-0.073878969,-0.028876532,0.033549617,-0.0053132913,-0.077698634,-0.025686746,0.032832244,-0.0059546832
360,-2.0383959e-07,-8.0290590e-08,9.2789378e-08,-1.4260422e-08,-2.1567074e-07,-7.1576125e-08,9.2241009e-08,-1.6151759e-08
