XRT N-S vs UFSS-A
      197.793
      2.40394
     -2.90478
      1.62161
      1.31926
    -0.530904
     0.653579
XRT N-S vs UFSS-B
      169.266
     0.618503
     -1.68497
     0.225389
    0.0525414
   -0.0787114
     0.209543
XRT E-W vs UFSS-A
      3969.69
     -1.57617
     0.436979
    -0.409932
    -0.606326
     0.374999
    -0.235242
XRT E-W vs UFSS-B
      3955.80
    -0.185090
    -0.925176
     0.447093
     0.455928
    -0.159055
    0.0449980
SOT N-S vs UFSS-A
      61.6744
     0.603430
     -2.85761
      1.70708
     0.185225
     0.230250
     0.577837
SOT N-S vs UFSS-B
      30.6933
     0.121865
     -1.70325
     0.481791
   -0.0416961
     0.162251
     0.236255
SOT E-W vs UFSS-A
      199.992
     -1.13464
     0.661126
    -0.527095
   -0.0713849
    0.0115836
    -0.221186
SOT E-W vs UFSS-B
      186.792
    -0.819227
    -0.854385
     0.318326
    0.0967058
    0.0803688
    0.0289150
