XRT N-S vs UFSS-A
      202.410
      1.49907
     -2.93603
      1.60987
     0.516529
     0.107817
     0.483575
XRT N-S vs UFSS-B
      193.358
     0.617448
     -1.37947
     0.443978
   -0.0984397
     0.159799
     0.258466
XRT E-W vs UFSS-A
      3979.71
     -1.14550
     0.264286
    -0.303474
    -0.107362
    0.0168945
   -0.0742960
XRT E-W vs UFSS-B
      3966.85
    -0.223957
     -1.34412
     0.471234
     0.453097
   -0.0748308
    0.0366739
SOT N-S vs UFSS-A
      57.6283
     0.992543
     -3.17995
      1.93047
     0.521259
    0.0912173
     0.416736
SOT N-S vs UFSS-B
      47.9091
     0.691632
     -1.45702
     0.555325
     0.207036
    0.0516123
    0.0267715
SOT E-W vs UFSS-A
      217.720
     -1.32546
     0.247949
    -0.377238
    -0.334848
     0.183821
  -0.00470558
SOT E-W vs UFSS-B
      204.151
    -0.146627
     -1.30571
     0.277178
     0.364143
    0.0234375
    0.0380403
