deg,XRT_AX,XRT_BX,XRT_AY,XRT_BY,SOT_AX,SOT_BX,SOT_AY,SOT_BY
valid,1,1,1,1,1,1,1,1,revB
offset,126.35900,95.070317,1973.1617,1979.6703,85.127516,52.911049,59.318680,66.158804
0,0.0000000,0.0000000,0.0000000,0.0000000,0.0000000,0.0000000,0.0000000,0.0000000
1,0.0079893259,0.020249338,-0.0025541787,-0.0081975831,0.0088257314,0.025005690,-0.0074270186,-0.0073062258
2,0.015759335,0.040418195,-0.0048922415,-0.016044465,0.017548930,0.050069908,-0.014706032,-0.014488141
3,0.023299875,0.060485035,-0.0070185346,-0.023534401,0.026157690,0.075159977,-0.021830176,-0.021536098
4,0.030600647,0.080428773,-0.0089375883,-0.030661768,0.034639635,0.10024319,-0.028792705,-0.028440632
5,0.037651224,0.10022882,-0.010654108,-0.037421587,0.042981949,0.12528688,-0.035587010,-0.035192496
6,0.044441087,0.11986512,-0.012172964,-0.043809532,0.051171395,0.15025850,-0.042206633,-0.041782680
7,0.050959642,0.13931821,-0.013499185,-0.049821948,0.059194352,0.17512567,-0.048645285,-0.048202449
8,0.057196253,0.15856923,-0.014637943,-0.055455861,0.067036841,0.19985628,-0.054896856,-0.054443357
9,0.063140268,0.17759999,-0.015594547,-0.060708983,0.074684555,0.22441853,-0.060955433,-0.060497278
10,0.068781049,0.19639298,-0.016374429,-0.065579727,0.082122897,0.24878101,-0.066815311,-0.066356431
11,0.074107995,0.21493144,-0.016983132,-0.070067207,0.089337007,0.27291279,-0.072471005,-0.072013394
12,0.079110579,0.23319935,-0.017426302,-0.074171242,0.096311802,0.29678344,-0.077917262,-0.077461134
13,0.083778368,0.25118151,-0.017709668,-0.077892359,0.10303201,0.32036314,-0.083149071,-0.082693019
14,0.088101059,0.26886351,-0.017839038,-0.081231790,0.10948220,0.34362273,-0.088161676,-0.087702840
15,0.092068504,0.28623181,-0.017820277,-0.084191472,0.11564685,0.36653376,-0.092950579,-0.092484826
16,0.095670740,0.30327372,-0.017659301,-0.086774040,0.12151032,0.38906857,-0.097511553,-0.097033657
17,0.098898017,0.31997747,-0.017362058,-0.088982821,0.12705698,0.41120033,-0.10184065,-0.10134448
18,0.10174083,0.33633217,-0.016934515,-0.090821825,0.13227116,0.43290311,-0.10593419,-0.10541292
19,0.10418993,0.35232789,-0.016382647,-0.092295736,0.13713726,0.45415195,-0.10978881,-0.10923509
20,0.10623639,0.36795561,-0.015712417,-0.093409894,0.14163976,0.47492287,-0.11340141,-0.11280759
21,0.10787159,0.38320730,-0.014929765,-0.094170287,0.14576323,0.49519296,-0.11676920,-0.11612754
22,0.10908727,0.39807585,-0.014040592,-0.094583530,0.14949245,0.51494041,-0.11988969,-0.11919254
23,0.10987554,0.41255517,-0.013050748,-0.094656847,0.15281237,0.53414455,-0.12276067,-0.12200073
24,0.11022891,0.42664010,-0.011966012,-0.094398053,0.15570820,0.55278591,-0.12538025,-0.12455073
25,0.11014033,0.44032648,-0.010792079,-0.093815528,0.15816542,0.57084625,-0.12774683,-0.12684169
26,0.10960319,0.45361112,-0.0095345486,-0.092918199,0.16016983,0.58830858,-0.12985910,-0.12887327
27,0.10861136,0.46649180,-0.0081989056,-0.091715507,0.16170762,0.60515722,-0.13171607,-0.13064561
28,0.10715920,0.47896727,-0.0067905079,-0.090217388,0.16276536,0.62137782,-0.13331701,-0.13215938
29,0.10524159,0.49103721,-0.0053145711,-0.088434239,0.16333005,0.63695736,-0.13466149,-0.13341572
30,0.10285394,0.50270228,-0.0037761544,-0.086376891,0.16338918,0.65188423,-0.13574936,-0.13441625
31,0.099992214,0.51396406,-0.0021801467,-0.084056575,0.16293076,0.66614820,-0.13658076,-0.13516308
32,0.096652956,0.52482503,-0.00053125239,-0.081484893,0.16194333,0.67974044,-0.13715607,-0.13565876
33,0.092833285,0.53528859,0.0011660219,-0.078673782,0.16041602,0.69265357,-0.13747595,-0.13590629
34,0.088530925,0.54535899,0.0029073804,-0.075635482,0.15833858,0.70488162,-0.13754131,-0.13590911
35,0.083744215,0.55504136,0.0046887513,-0.072382495,0.15570141,0.71642009,-0.13735331,-0.13567105
36,0.078472118,0.56434164,0.0065062987,-0.068927556,0.15249558,0.72726589,-0.13691331,-0.13519636
37,0.072714232,0.57326658,0.0083564349,-0.065283588,0.14871288,0.73741739,-0.13622294,-0.13448966
38,0.066470802,0.58182369,0.010235832,-0.061463671,0.14434581,0.74687440,-0.13528400,-0.13355590
39,0.059742723,0.59002123,0.012141430,-0.057480997,0.13938767,0.75563815,-0.13409850,-0.13240039
40,0.052531547,0.59786817,0.014070454,-0.053348838,0.13383251,0.76371128,-0.13266866,-0.13102874
41,0.044839490,0.60537414,0.016020416,-0.049080501,0.12767522,0.77109784,-0.13099684,-0.12944685
42,0.036669427,0.61254941,0.017989129,-0.044689291,0.12091150,0.77780327,-0.12908558,-0.12766086
43,0.028024903,0.61940486,0.019974712,-0.040188471,0.11353791,0.78383435,-0.12693756,-0.12567718
44,0.018910123,0.62595191,0.021975603,-0.035591221,0.10555188,0.78919920,-0.12455558,-0.12350239
45,0.0093299561,0.63220251,0.023990559,-0.030910602,0.096951711,0.79390726,-0.12194258,-0.12114327
46,-0.00071007221,0.63816909,0.026018671,-0.026159514,0.087736611,0.79796923,-0.11910158,-0.11860674
47,-0.011203784,0.64386449,0.028059360,-0.021350657,0.077906691,0.80139705,-0.11603570,-0.11589986
48,-0.022144356,0.64930195,0.030112389,-0.016496494,0.067462981,0.80420388,-0.11274813,-0.11302977
49,-0.033524330,0.65449508,0.032177865,-0.011609209,0.056407434,0.80640401,-0.10924212,-0.11000367
50,-0.045335620,0.65945774,0.034256240,-0.0067006773,0.044742934,0.80801288,-0.10552095,-0.10682879
51,-0.057569529,0.66420407,0.036348318,-0.0017824216,0.032473294,0.80904697,-0.10158793,-0.10351239
52,-0.070216757,0.66874841,0.038455251,0.0031344199,0.019603265,0.80952381,-0.097446378,-0.10006168
53,-0.083267419,0.67310526,0.040578544,0.0080391289,0.0061385244,0.80946189,-0.093099621,-0.096483818
54,-0.096711061,0.67728923,0.042720052,0.012921441,-0.0079143185,0.80888062,-0.088550952,-0.092785875
55,-0.11053668,0.68131499,0.044881983,0.017771576,-0.022547734,0.80780027,-0.083803634,-0.088974810
56,-0.12473274,0.68519722,0.047066889,0.022580274,-0.037753277,0.80624192,-0.078860880,-0.085057435
57,-0.13928718,0.68895058,0.049277672,0.027338818,-0.053521599,0.80422741,-0.073725840,-0.081040386
58,-0.15418748,0.69258964,0.051517572,0.032039067,-0.069842458,0.80177925,-0.068401586,-0.076930100
59,-0.16942062,0.69612886,0.053790168,0.036673484,-0.086704737,0.79892057,-0.062891101,-0.072732779
60,-0.18497316,0.69958251,0.056099370,0.041235154,-0.10409645,0.79567509,-0.057197261,-0.068454372
61,-0.20083123,0.70296466,0.058449413,0.045717816,-0.12200479,0.79206700,-0.051322830,-0.064100541
62,-0.21698057,0.70628911,0.060844852,0.050115877,-0.14041609,0.78812094,-0.045270441,-0.059676639
63,-0.23340658,0.70956937,0.063290549,0.054424437,-0.15931591,0.78386189,-0.039042589,-0.055187687
64,-0.25009428,0.71281859,0.065791668,0.058639305,-0.17868904,0.77931516,-0.032641618,-0.050638349
65,-0.26702843,0.71604953,0.068353666,0.062757012,-0.19851950,0.77450626,-0.026069712,-0.046032908
66,-0.28419349,0.71927455,0.070982277,0.066774831,-0.21879059,0.76946089,-0.019328889,-0.041375250
67,-0.30157368,0.72250551,0.073683508,0.070690782,-0.23948494,0.76420483,-0.012420985,-0.036668840
68,-0.31915300,0.72575380,0.076463620,0.074503645,-0.26058449,0.75876389,-0.0053476542,-0.031916704
69,-0.33691527,0.72903024,0.079329119,0.078212969,-0.28207057,0.75316383,0.0018896420,-0.027121414
70,-0.35484417,0.73234510,0.082286742,0.081819072,-0.30392392,0.74743033,0.0092896405,-0.022285073
71,-0.37292326,0.73570805,0.085343440,0.085323051,-0.32612470,0.74158887,0.016851281,-0.017409298
72,-0.39113601,0.73912811,0.088506368,0.088726775,-0.34865257,0.73566470,0.024573710,-0.012495213
73,-0.40946584,0.74261365,0.091782861,0.092032890,-0.37148669,0.72968277,0.032456284,-0.0075434312
74,-0.42789616,0.74617235,0.095180428,0.095244813,-0.39460581,0.72366765,0.040498574,-0.0025540536
75,-0.44641038,0.74981119,0.098706727,0.098366724,-0.41798823,0.71764350,0.048700362,0.0024733425
76,-0.46499198,0.75353639,0.10236955,0.10140356,-0.44161193,0.71163396,0.057061646,0.0075397077
77,-0.48362450,0.75735345,0.10617680,0.10436101,-0.46545455,0.70566215,0.065582639,0.012646524
78,-0.50229163,0.76126708,0.11013650,0.10724549,-0.48949346,0.69975056,0.074263763,0.017795806
79,-0.52097717,0.76528120,0.11425671,0.11006414,-0.51370579,0.69392103,0.083105651,0.022990101
80,-0.53966513,0.76939895,0.11854559,0.11282479,-0.53806850,0.68819468,0.092109144,0.028232489
81,-0.55833970,0.77362267,0.12301133,0.11553597,-0.56255838,0.68259185,0.10127528,0.033526573
82,-0.57698536,0.77795385,0.12766211,0.11820686,-0.58715214,0.67713208,0.11060530,0.038876481
83,-0.59558682,0.78239318,0.13250615,0.12084729,-0.61182644,0.67183403,0.12010062,0.044286852
84,-0.61412912,0.78694054,0.13755163,0.12346770,-0.63655793,0.66671546,0.12976285,0.049762829
85,-0.63259763,0.79159497,0.14280669,0.12607910,-0.66132327,0.66179317,0.13959378,0.055310049
86,-0.65097809,0.79635468,0.14827939,0.12869309,-0.68609924,0.65708298,0.14959534,0.060934625
87,-0.66925660,0.80121708,0.15397775,0.13132176,-0.71086272,0.65259969,0.15976964,0.066643138
88,-0.68741970,0.80617876,0.15990963,0.13397773,-0.73559078,0.64835702,0.17011891,0.072442613
89,-0.70545439,0.81123552,0.16608280,0.13667406,-0.76026069,0.64436762,0.18064554,0.078340506
90,-0.72334809,0.81638234,0.17250489,0.13942425,-0.78484999,0.64064302,0.19135200,0.084344681
91,-0.74108875,0.82161346,0.17918333,0.14224216,-0.80933650,0.63719361,0.20224089,0.090463387
92,-0.75866480,0.82692234,0.18612539,0.14514204,-0.83369841,0.63402861,0.21331491,0.096705239
93,-0.77606523,0.83230170,0.19333811,0.14813842,-0.85791428,0.63115609,0.22457680,0.10307919
94,-0.79327956,0.83774355,0.20082832,0.15124612,-0.88196310,0.62858289,0.23602939,0.10959450
95,-0.81029789,0.84323918,0.20860260,0.15448018,-0.90582430,0.62631469,0.24767553,0.11626071
96,-0.82711088,0.84877924,0.21666723,0.15785583,-0.92947785,0.62435591,0.25951813,0.12308764
97,-0.84370983,0.85435369,0.22502826,0.16138842,-0.95290422,0.62270981,0.27156007,0.13008530
98,-0.86008662,0.85995192,0.23369137,0.16509344,-0.97608447,0.62137839,0.28380425,0.13726390
99,-0.87623376,0.86556270,0.24266197,0.16898641,-0.99900027,0.62036247,0.29625353,0.14463384
100,-0.89214441,0.87117425,0.25194509,0.17308284,-1.0216339,0.61966164,0.30891072,0.15220560
101,-0.90781235,0.87677428,0.26154542,0.17739825,-1.0439684,0.61927430,0.32177857,0.15998979
102,-0.92323202,0.88235002,0.27146727,0.18194803,-1.0659873,0.61919768,0.33485976,0.16799704
103,-0.93839852,0.88788822,0.28171454,0.18674746,-1.0876751,0.61942780,0.34815685,0.17623803
104,-0.95330760,0.89337525,0.29229076,0.19181165,-1.1090169,0.61995958,0.36167226,0.18472340
105,-0.96795566,0.89879711,0.30319900,0.19715549,-1.1299986,0.62078678,0.37540831,0.19346374
106,-0.98233977,0.90413944,0.31444191,0.20279359,-1.1506069,0.62190205,0.38936713,0.20246956
107,-0.99645767,0.90938763,0.32602169,0.20874025,-1.1708294,0.62329698,0.40355066,0.21175121
108,-1.0103077,0.91452681,0.33794009,0.21500942,-1.1906544,0.62496209,0.41796066,0.22131888
109,-1.0238890,0.91954190,0.35019837,0.22161466,-1.2100710,0.62688692,0.43259865,0.23118257
110,-1.0372011,0.92441766,0.36279732,0.22856905,-1.2290694,0.62906001,0.44746592,0.24135202
111,-1.0502444,0.92913875,0.37573721,0.23588522,-1.2476404,0.63146896,0.46256350,0.25183665
112,-1.0630197,0.93368976,0.38901786,0.24357525,-1.2657759,0.63410047,0.47789212,0.26264562
113,-1.0755287,0.93805525,0.40263852,0.25165066,-1.2834685,0.63694040,0.49345224,0.27378766
114,-1.0877735,0.94221980,0.41659797,0.26012236,-1.3007119,0.63997379,0.50924400,0.28527115
115,-1.0997568,0.94616807,0.43089446,0.26900060,-1.3175005,0.64318491,0.52526718,0.29710399
116,-1.1114819,0.94988482,0.44552569,0.27829496,-1.3338297,0.64655733,0.54152126,0.30929365
117,-1.1229527,0.95335498,0.46048886,0.28801430,-1.3496957,0.65007394,0.55800531,0.32184706
118,-1.1341735,0.95656366,0.47578061,0.29816673,-1.3650958,0.65371705,0.57471803,0.33477060
119,-1.1451492,0.95949625,0.49139708,0.30875955,-1.3800278,0.65746839,0.59165774,0.34807009
120,-1.1558851,0.96213839,0.50733384,0.31979928,-1.3944908,0.66130919,0.60882233,0.36175073
121,-1.1663873,0.96447610,0.52358595,0.33129158,-1.4084845,0.66522026,0.62620928,0.37581707
122,-1.1766618,0.96649572,0.54014792,0.34324124,-1.4220095,0.66918199,0.64381563,0.39027301
123,-1.1867155,0.96818406,0.55701375,0.35565216,-1.4350673,0.67317448,0.66163798,0.40512172
124,-1.1965554,0.96952836,0.57417689,0.36852732,-1.4476601,0.67717754,0.67967245,0.42036565
125,-1.2061891,0.97051634,0.59163029,0.38186875,-1.4597911,0.68117078,0.69791472,0.43600651
126,-1.2156242,0.97113628,0.60936636,0.39567756,-1.4714642,0.68513365,0.71635998,0.45204519
127,-1.2248690,0.97137701,0.62737704,0.40995386,-1.4826838,0.68904553,0.73500295,0.46848181
128,-1.2339318,0.97122798,0.64565372,0.42469678,-1.4934554,0.69288577,0.75383784,0.48531567
129,-1.2428212,0.97067924,0.66418734,0.43990447,-1.5037851,0.69663375,0.77285839,0.50254519
130,-1.2515461,0.96972155,0.68296832,0.45557408,-1.5136796,0.70026893,0.79205782,0.52016798
131,-1.2601156,0.96834633,0.70198664,0.47170171,-1.5231463,0.70377095,0.81142888,0.53818073
132,-1.2685389,0.96654575,0.72123181,0.48828251,-1.5321933,0.70711963,0.83096379,0.55657927
133,-1.2768252,0.96431272,0.74069288,0.50531055,-1.5408292,0.71029509,0.85065428,0.57535852
134,-1.2849840,0.96164090,0.76035847,0.52277894,-1.5490631,0.71327776,0.87049159,0.59451248
135,-1.2930248,0.95852477,0.78021680,0.54067976,-1.5569049,0.71604844,0.89046645,0.61403427
136,-1.3009571,0.95495962,0.80025567,0.55900407,-1.5643646,0.71858838,0.91056909,0.63391606
137,-1.3087903,0.95094156,0.82046248,0.57774197,-1.5714531,0.72087933,0.93078926,0.65414910
138,-1.3165340,0.94646755,0.84082428,0.59688254,-1.5781813,0.72290356,0.95111624,0.67472374
139,-1.3241974,0.94153541,0.86132775,0.61641393,-1.5845607,0.72464394,0.97153882,0.69562939
140,-1.3317899,0.93614381,0.88195926,0.63632331,-1.5906033,0.72608397,0.99204531,0.71685457
141,-1.3393207,0.93029231,0.90270483,0.65659690,-1.5963210,0.72720786,1.0126236,0.73838685
142,-1.3467986,0.92398136,0.92355020,0.67722005,-1.6017262,0.72800051,1.0332611,0.76021296
143,-1.3542326,0.91721227,0.94448083,0.69817718,-1.6068317,0.72844761,1.0539448,0.78231870
144,-1.3616311,0.90998725,0.96548194,0.71945185,-1.6116501,0.72853567,1.0746614,0.80468902
145,-1.3690026,0.90230938,0.98653849,0.74102680,-1.6161946,0.72825204,1.0953969,0.82730800
146,-1.3763549,0.89418264,1.0076352,0.76288394,-1.6204780,0.72758493,1.1161371,0.85015890
147,-1.3836959,0.88561184,1.0287567,0.78500440,-1.6245135,0.72652348,1.1368675,0.87322415
148,-1.3910328,0.87660270,1.0498874,0.80736859,-1.6283143,0.72505777,1.1575732,0.89648539
149,-1.3983728,0.86716177,1.0710115,0.82995618,-1.6318935,0.72317886,1.1782389,0.91992350
150,-1.4057225,0.85729642,1.0921131,0.85274619,-1.6352642,0.72087877,1.1988490,0.94351861
151,-1.4130880,0.84701487,1.1131763,0.87571699,-1.6384394,0.71815055,1.2193876,0.96725014
152,-1.4204752,0.83632613,1.1341850,0.89884638,-1.6414319,0.71498830,1.2398387,0.99109684
153,-1.4278894,0.82523999,1.1551232,0.92211157,-1.6442545,0.71138712,1.2601859,1.0150368
154,-1.4353354,0.81376700,1.1759746,0.94548931,-1.6469196,0.70734320,1.2804126,1.0390475
155,-1.4428177,0.80191846,1.1967232,0.96895585,-1.6494395,0.70285378,1.3005021,1.0631058
156,-1.4503401,0.78970637,1.2173529,0.99248705,-1.6518261,0.69791717,1.3204374,1.0871882
157,-1.4579059,0.77714340,1.2378475,1.0160584,-1.6540912,0.69253276,1.3402014,1.1112704
158,-1.4655180,0.76424289,1.2581911,1.0396450,-1.6562460,0.68670102,1.3597770,1.1353280
159,-1.4731785,0.75101879,1.2783678,1.0632218,-1.6583015,0.68042345,1.3791470,1.1593359
160,-1.4808892,0.73748562,1.2983616,1.0867635,-1.6602683,0.67370265,1.3982939,1.1832687
161,-1.4886512,0.72365848,1.3181571,1.1102445,-1.6621564,0.66654226,1.4172005,1.2071009
162,-1.4964650,0.70955295,1.3377386,1.1336392,-1.6639755,0.65894696,1.4358495,1.2308064
163,-1.5043306,0.69518512,1.3570908,1.1569219,-1.6657349,0.65092245,1.4542235,1.2543590
164,-1.5122473,0.68057147,1.3761986,1.1800669,-1.6674430,0.64247544,1.4723054,1.2777324
165,-1.5202139,0.66572891,1.3950470,1.2030486,-1.6691082,0.63361361,1.4900780,1.3009002
166,-1.5282286,0.65067470,1.4136214,1.2258412,-1.6707379,0.62434562,1.5075243,1.3238357
167,-1.5362890,0.63542638,1.4319074,1.2484194,-1.6723391,0.61468106,1.5246274,1.3465123
168,-1.5443920,0.62000180,1.4498909,1.2707579,-1.6739183,0.60463041,1.5413709,1.3689036
169,-1.5525341,0.60441899,1.4675580,1.2928317,-1.6754812,0.59420504,1.5577381,1.3909830
170,-1.5607112,0.58869619,1.4848952,1.3146159,-1.6770331,0.58341715,1.5737129,1.4127242
171,-1.5689183,0.57285175,1.5018894,1.3360863,-1.6785785,0.57227973,1.5892795,1.4341009
172,-1.5771503,0.55690412,1.5185278,1.3572187,-1.6801214,0.56080657,1.6044223,1.4550873
173,-1.5854013,0.54087178,1.5347979,1.3779896,-1.6816649,0.54901213,1.6191259,1.4756577
174,-1.5936649,0.52477322,1.5506876,1.3983760,-1.6832117,0.53691160,1.6333756,1.4957868
175,-1.6019341,0.50862686,1.5661854,1.4183551,-1.6847637,0.52452078,1.6471568,1.5154496
176,-1.6102015,0.49245105,1.5812800,1.4379051,-1.6863223,0.51185606,1.6604555,1.5346216
177,-1.6184591,0.47626397,1.5959606,1.4570046,-1.6878881,0.49893438,1.6732581,1.5532789
178,-1.6266985,0.46008364,1.6102168,1.4756327,-1.6894610,0.48577316,1.6855515,1.5713979
179,-1.6349108,0.44392783,1.6240388,1.4937696,-1.6910404,0.47239029,1.6973231,1.5889558
180,-1.6430866,0.42781404,1.6374171,1.5113959,-1.6926250,0.45880402,1.7085608,1.6059304
181,-1.6512163,0.41175947,1.6503428,1.5284932,-1.6942128,0.44503296,1.7192531,1.6223000
182,-1.6592896,0.39578094,1.6628073,1.5450437,-1.6958011,0.43109598,1.7293889,1.6380438
183,-1.6672961,0.37989489,1.6748026,1.5610305,-1.6973868,0.41701223,1.7389581,1.6531418
184,-1.6752249,0.36411729,1.6863213,1.5764378,-1.6989661,0.40280098,1.7479508,1.6675746
185,-1.6830647,0.34846368,1.6973565,1.5912504,-1.7005346,0.38848166,1.7563580,1.6813238
186,-1.6908042,0.33294904,1.7079015,1.6054542,-1.7020872,0.37407377,1.7641712,1.6943720
187,-1.6984315,0.31758783,1.7179504,1.6190360,-1.7036185,0.35959679,1.7713827,1.7067025
188,-1.7059347,0.30239392,1.7274979,1.6319837,-1.7051223,0.34507019,1.7779855,1.7182996
189,-1.7133015,0.28738056,1.7365388,1.6442860,-1.7065921,0.33051333,1.7839732,1.7291487
190,-1.7205196,0.27256035,1.7450689,1.6559328,-1.7080208,0.31594543,1.7893402,1.7392362
191,-1.7275765,0.25794522,1.7530842,1.6669148,-1.7094009,0.30138550,1.7940816,1.7485495
192,-1.7344596,0.24354640,1.7605814,1.6772241,-1.7107243,0.28685228,1.7981932,1.7570772
193,-1.7411561,0.22937440,1.7675575,1.6868536,-1.7119828,0.27236424,1.8016718,1.7648087
194,-1.7476532,0.21543897,1.7740103,1.6957973,-1.7131676,0.25793945,1.8045146,1.7717350
195,-1.7539382,0.20174910,1.7799379,1.7040503,-1.7142694,0.24359560,1.8067199,1.7778478
196,-1.7599982,0.18831297,1.7853390,1.7116089,-1.7152789,0.22934992,1.8082864,1.7831403
197,-1.7658205,0.17513799,1.7902126,1.7184702,-1.7161864,0.21521913,1.8092140,1.7876066
198,-1.7713925,0.16223072,1.7945586,1.7246326,-1.7169817,0.20121941,1.8095031,1.7912422
199,-1.7767016,0.14959692,1.7983771,1.7300956,-1.7176548,0.18736635,1.8091550,1.7940438
200,-1.7817353,0.13724148,1.8016686,1.7348596,-1.7181952,0.17367491,1.8081716,1.7960092
201,-1.7864814,0.12516848,1.8044344,1.7389262,-1.7185922,0.16015937,1.8065559,1.7971375
202,-1.7909279,0.11338113,1.8066760,1.7422979,-1.7188353,0.14683332,1.8043113,1.7974289
203,-1.7950629,0.10188178,1.8083954,1.7449784,-1.7189136,0.13370959,1.8014422,1.7968849
204,-1.7988749,0.090671957,1.8095951,1.7469722,-1.7188162,0.12080026,1.7979538,1.7955083
205,-1.8023525,0.079752311,1.8102780,1.7482852,-1.7185324,0.10811659,1.7938518,1.7933031
206,-1.8054850,0.069122668,1.8104475,1.7489238,-1.7180512,0.095668995,1.7891428,1.7902742
207,-1.8082615,0.058782013,1.8101073,1.7488956,-1.7173618,0.083467065,1.7838341,1.7864281
208,-1.8106720,0.048728508,1.8092616,1.7482091,-1.7164536,0.071519490,1.7779339,1.7817723
209,-1.8127065,0.038959501,1.8079148,1.7468738,-1.7153159,0.059834067,1.7714506,1.7763153
210,-1.8143557,0.029471544,1.8060719,1.7448999,-1.7139383,0.048417678,1.7643938,1.7700671
211,-1.8156107,0.020260408,1.8037381,1.7422986,-1.7123105,0.037276275,1.7567735,1.7630386
212,-1.8164628,0.011321103,1.8009191,1.7390817,-1.7104226,0.026414872,1.7486004,1.7552417
213,-1.8169043,0.0026478997,1.7976208,1.7352621,-1.7082647,0.015837534,1.7398858,1.7466896
214,-1.8169276,-0.0057656469,1.7938494,1.7308532,-1.7058274,0.0055473716,1.7306416,1.7373964
215,-1.8165257,-0.013926673,1.7896114,1.7258691,-1.7031015,-0.0044534582,1.7208803,1.7273774
216,-1.8156923,-0.021842977,1.7849138,1.7203248,-1.7000781,-0.014163755,1.7106149,1.7166486
217,-1.8144216,-0.029522992,1.7797635,1.7142356,-1.6967490,-0.023583268,1.6998591,1.7052272
218,-1.8127083,-0.036975751,1.7741680,1.7076177,-1.6931059,-0.032712692,1.6886269,1.6931311
219,-1.8105479,-0.044210856,1.7681348,1.7004876,-1.6891413,-0.041553659,1.6769329,1.6803794
220,-1.8079362,-0.051238446,1.7616718,1.6928624,-1.6848481,-0.050108720,1.6647920,1.6669917
221,-1.8048701,-0.058069154,1.7547869,1.6847598,-1.6802196,-0.058381337,1.6522197,1.6529885
222,-1.8013465,-0.064714077,1.7474883,1.6761976,-1.6752496,-0.066375860,1.6392318,1.6383912
223,-1.7973636,-0.071184730,1.7397845,1.6671942,-1.6699326,-0.074097508,1.6258446,1.6232218
224,-1.7929197,-0.077493012,1.7316839,1.6577684,-1.6642634,-0.081552346,1.6120744,1.6075028
225,-1.7880141,-0.083651159,1.7231952,1.6479390,-1.6582375,-0.088747258,1.5979380,1.5912577
226,-1.7826465,-0.089671705,1.7143272,1.6377252,-1.6518511,-0.095689919,1.5834527,1.5745102
227,-1.7768175,-0.095567440,1.7050889,1.6271463,-1.6451006,-0.10238876,1.5686356,1.5572846
228,-1.7705283,-0.10135136,1.6954892,1.6162219,-1.6379836,-0.10885295,1.5535042,1.5396059
229,-1.7637805,-0.10703663,1.6855373,1.6049716,-1.6304977,-0.11509233,1.5380763,1.5214993
230,-1.7565767,-0.11263654,1.6752422,1.5934149,-1.6226416,-0.12111741,1.5223697,1.5029904
231,-1.7489199,-0.11816444,1.6646132,1.5815715,-1.6144145,-0.12693930,1.5064022,1.4841050
232,-1.7408139,-0.12363372,1.6536595,1.5694610,-1.6058161,-0.13256969,1.4901919,1.4648695
233,-1.7322630,-0.12905775,1.6423905,1.5571028,-1.5968470,-0.13802079,1.4737567,1.4453101
234,-1.7232721,-0.13444983,1.6308154,1.5445163,-1.5875083,-0.14330530,1.4571147,1.4254535
235,-1.7138469,-0.13982318,1.6189434,1.5317207,-1.5778017,-0.14843634,1.4402840,1.4053262
236,-1.7039936,-0.14519082,1.6067839,1.5187349,-1.5677297,-0.15342743,1.4232823,1.3849550
237,-1.6937188,-0.15056561,1.5943461,1.5055775,-1.5572955,-0.15829241,1.4061276,1.3643665
238,-1.6830300,-0.15596014,1.5816393,1.4922670,-1.5465026,-0.16304542,1.3888376,1.3435875
239,-1.6719349,-0.16138673,1.5686725,1.4788214,-1.5353556,-0.16770083,1.3714299,1.3226443
240,-1.6604420,-0.16685736,1.5554550,1.4652583,-1.5238594,-0.17227318,1.3539217,1.3015633
241,-1.6485603,-0.17238364,1.5419957,1.4515949,-1.5120198,-0.17677716,1.3363304,1.2803707
242,-1.6362990,-0.17797675,1.5283037,1.4378481,-1.4998428,-0.18122750,1.3186727,1.2590923
243,-1.6236682,-0.18364744,1.5143879,1.4240341,-1.4873354,-0.18563898,1.3009653,1.2377537
244,-1.6106781,-0.18940594,1.5002571,1.4101687,-1.4745051,-0.19002632,1.2832246,1.2163801
245,-1.5973396,-0.19526198,1.4859199,1.3962672,-1.4613598,-0.19440416,1.2654665,1.1949963
246,-1.5836636,-0.20122468,1.4713850,1.3823441,-1.4479080,-0.19878701,1.2477068,1.1736265
247,-1.5696618,-0.20730260,1.4566609,1.3684135,-1.4341589,-0.20318915,1.2299606,1.1522947
248,-1.5553461,-0.21350364,1.4417560,1.3544889,-1.4201220,-0.20762463,1.2122428,1.1310241
249,-1.5407287,-0.21983504,1.4266786,1.3405829,-1.4058074,-0.21210718,1.1945678,1.1098374
250,-1.5258220,-0.22630333,1.4114367,1.3267078,-1.3912256,-0.21665019,1.1769497,1.0887566
251,-1.5106388,-0.23291435,1.3960385,1.3128749,-1.3763877,-0.22126663,1.1594018,1.0678032
252,-1.4951921,-0.23967316,1.3804917,1.2990950,-1.3613049,-0.22596899,1.1419374,1.0469979
253,-1.4794952,-0.24658406,1.3648042,1.2853780,-1.3459890,-0.23076929,1.1245688,1.0263607
254,-1.4635613,-0.25365057,1.3489835,1.2717332,-1.3304522,-0.23567896,1.1073081,1.0059108
255,-1.4474041,-0.26087537,1.3330371,1.2581692,-1.3147069,-0.24070884,1.0901666,0.98566649
256,-1.4310372,-0.26826033,1.3169725,1.2446936,-1.2987657,-0.24586912,1.0731554,0.96564550
257,-1.4144744,-0.27580649,1.3007966,1.2313137,-1.2826418,-0.25116930,1.0562847,0.94586453
258,-1.3977294,-0.28351401,1.2845168,1.2180355,-1.2663484,-0.25661813,1.0395642,0.92633944
259,-1.3808161,-0.29138219,1.2681397,1.2048647,-1.2498988,-0.26222363,1.0230032,0.90708520
260,-1.3637483,-0.29940949,1.2516724,1.1918061,-1.2333066,-0.26799297,1.0066102,0.88811586
261,-1.3465400,-0.30759345,1.2351213,1.1788636,-1.2165856,-0.27393249,0.99039316,0.86944453
262,-1.3292047,-0.31593077,1.2184930,1.1660406,-1.1997497,-0.28004766,0.97435942,0.85108339
263,-1.3117563,-0.32441725,1.2017940,1.1533395,-1.1828127,-0.28634305,0.95851573,0.83304365
264,-1.2942081,-0.33304783,1.1850304,1.1407622,-1.1657885,-0.29282229,0.94286824,0.81533556
265,-1.2765738,-0.34181658,1.1682085,1.1283099,-1.1486910,-0.29948805,0.92742243,0.79796838
266,-1.2588665,-0.35071670,1.1513342,1.1159829,-1.1315343,-0.30634204,0.91218323,0.78095040
267,-1.2410993,-0.35974056,1.1344134,1.1037809,-1.1143320,-0.31338495,0.89715489,0.76428891
268,-1.2232850,-0.36887967,1.1174519,1.0917030,-1.0970979,-0.32061647,0.88234111,0.74799025
269,-1.2054363,-0.37812474,1.1004554,1.0797476,-1.0798457,-0.32803528,0.86774494,0.73205974
270,-1.1875654,-0.38746566,1.0834295,1.0679125,-1.0625886,-0.33563900,0.85336885,0.71650174
271,-1.1696844,-0.39689154,1.0663796,1.0561950,-1.0453401,-0.34342421,0.83921473,0.70131965
272,-1.1518050,-0.40639075,1.0493111,1.0445915,-1.0281130,-0.35138646,0.82528386,0.68651589
273,-1.1339386,-0.41595089,1.0322293,1.0330982,-1.0109202,-0.35952025,0.81157696,0.67209195
274,-1.1160963,-0.42555889,1.0151394,1.0217106,-0.99377405,-0.36781902,0.79809420,0.65804835
275,-1.0982887,-0.43520095,0.99804655,1.0104237,-0.97668671,-0.37627519,0.78483518,0.64438474
276,-1.0805261,-0.44486267,0.98095575,0.99923222,-0.95967000,-0.38488014,0.77179898,0.63109984
277,-1.0628184,-0.45452901,0.96387200,0.98813020,-0.94273533,-0.39362423,0.75898416,0.61819149
278,-1.0451751,-0.46418434,0.94680021,0.97711143,-0.92589375,-0.40249682,0.74638877,0.60565666
279,-1.0276051,-0.47381251,0.92974525,0.96616929,-0.90915587,-0.41148628,0.73401038,0.59349152
280,-1.0101171,-0.48339685,0.91271192,0.95529684,-0.89253186,-0.42058004,0.72184608,0.58169141
281,-0.99271920,-0.49292021,0.89570497,0.94448685,-0.87603144,-0.42976454,0.70989252,0.57025087
282,-0.97541905,-0.50236505,0.87872913,0.93373182,-0.85966382,-0.43902535,0.69814592,0.55916372
283,-0.95822387,-0.51171341,0.86178908,0.92302403,-0.84343774,-0.44834714,0.68660209,0.54842305
284,-0.94114037,-0.52094701,0.84488945,0.91235557,-0.82736141,-0.45771372,0.67525645,0.53802126
285,-0.92417479,-0.53004728,0.82803488,0.90171839,-0.81144249,-0.46710810,0.66410407,0.52795008
286,-0.90733288,-0.53899541,0.81122994,0.89110432,-0.79568811,-0.47651250,0.65313967,0.51820064
287,-0.89061993,-0.54777236,0.79447923,0.88050511,-0.78010485,-0.48590839,0.64235764,0.50876348
288,-0.87404070,-0.55635898,0.77778729,0.86991250,-0.76469871,-0.49527658,0.63175209,0.49962861
289,-0.85759949,-0.56473598,0.76115869,0.85931819,-0.74947509,-0.50459719,0.62131686,0.49078549
290,-0.84130011,-0.57288403,0.74459796,0.84871395,-0.73443885,-0.51384975,0.61104554,0.48222317
291,-0.82514591,-0.58078381,0.72810963,0.83809161,-0.71959423,-0.52301325,0.60093151,0.47393023
292,-0.80913973,-0.58841602,0.71169825,0.82744311,-0.70494489,-0.53206616,0.59096795,0.46589487
293,-0.79328398,-0.59576148,0.69536834,0.81676054,-0.69049388,-0.54098651,0.58114787,0.45810496
294,-0.77758058,-0.60280114,0.67912444,0.80603617,-0.67624367,-0.54975193,0.57146415,0.45054805
295,-0.76203104,-0.60951615,0.66297109,0.79526249,-0.66219615,-0.55833971,0.56190955,0.44321144
296,-0.74663639,-0.61588790,0.64691284,0.78443222,-0.64835260,-0.56672687,0.55247672,0.43608220
297,-0.73139726,-0.62189808,0.63095423,0.77353838,-0.63471374,-0.57489020,0.54315829,0.42914724
298,-0.71631387,-0.62752872,0.61509984,0.76257429,-0.62127969,-0.58280633,0.53394680,0.42239331
299,-0.70138604,-0.63276224,0.59935421,0.75153364,-0.60805003,-0.59045179,0.52483481,0.41580709
300,-0.68661319,-0.63758151,0.58372193,0.74041045,-0.59502379,-0.59780307,0.51581489,0.40937519
301,-0.67199441,-0.64196985,0.56820758,0.72919917,-0.58219943,-0.60483670,0.50687964,0.40308423
302,-0.65752841,-0.64591115,0.55281572,0.71789467,-0.56957492,-0.61152928,0.49802172,0.39692086
303,-0.64321359,-0.64938984,0.53755096,0.70649225,-0.55714769,-0.61785756,0.48923388,0.39087178
304,-0.62904805,-0.65239100,0.52241787,0.69498772,-0.54491471,-0.62379851,0.48050898,0.38492382
305,-0.61502958,-0.65490033,0.50742105,0.68337736,-0.53287245,-0.62932938,0.47184000,0.37906397
306,-0.60115574,-0.65690424,0.49256507,0.67165796,-0.52101694,-0.63442776,0.46322008,0.37327940
307,-0.58742380,-0.65838990,0.47785452,0.65982687,-0.50934378,-0.63907163,0.45464256,0.36755749
308,-0.57383085,-0.65934521,0.46329395,0.64788196,-0.49784816,-0.64323946,0.44610093,0.36188592
309,-0.56037378,-0.65975892,0.44888793,0.63582170,-0.48652490,-0.64691022,0.43758893,0.35625262
310,-0.54704927,-0.65962057,0.43464097,0.62364510,-0.47536845,-0.65006347,0.42910052,0.35064590
311,-0.53385390,-0.65892062,0.42055759,0.61135178,-0.46437294,-0.65267944,0.42062992,0.34505441
312,-0.52078411,-0.65765039,0.40664227,0.59894195,-0.45353220,-0.65473903,0.41217162,0.33946719
313,-0.50783622,-0.65580215,0.39289947,0.58641642,-0.44283978,-0.65622391,0.40372039,0.33387370
314,-0.49500650,-0.65336910,0.37933357,0.57377663,-0.43228900,-0.65711659,0.39527132,0.32826388
315,-0.48229117,-0.65034543,0.36594896,0.56102462,-0.42187296,-0.65740042,0.38681978,0.32262813
316,-0.46968642,-0.64672631,0.35274994,0.54816302,-0.41158458,-0.65705968,0.37836150,0.31695734
317,-0.45718847,-0.64250792,0.33974076,0.53519511,-0.40141664,-0.65607961,0.36989255,0.31124294
318,-0.44479352,-0.63768745,0.32692561,0.52212475,-0.39136180,-0.65444648,0.36140934,0.30547691
319,-0.43249787,-0.63226316,0.31430862,0.50895642,-0.38141265,-0.65214761,0.35290865,0.29965178
320,-0.42029787,-0.62623431,0.30189382,0.49569519,-0.37156171,-0.64917144,0.34438763,0.29376068
321,-0.40818999,-0.61960125,0.28968516,0.48234673,-0.36180150,-0.64550752,0.33584380,0.28779733
322,-0.39617082,-0.61236537,0.27768651,0.46891727,-0.35212456,-0.64114662,0.32727508,0.28175606
323,-0.38423711,-0.60452910,0.26590163,0.45541362,-0.34252347,-0.63608071,0.31867976,0.27563182
324,-0.37238577,-0.59609597,0.25433416,0.44184312,-0.33299091,-0.63030299,0.31005654,0.26942019
325,-0.36061392,-0.58707051,0.24298764,0.42821367,-0.32351968,-0.62380797,0.30140451,0.26311741
326,-0.34891889,-0.57745836,0.23186549,0.41453368,-0.31410271,-0.61659143,0.29272316,0.25672034
327,-0.33729826,-0.56726613,0.22097099,0.40081202,-0.30473314,-0.60865049,0.28401238,0.25022650
328,-0.32574985,-0.55650152,0.21030728,0.38705810,-0.29540432,-0.59998361,0.27527245,0.24363406
329,-0.31427179,-0.54517321,0.19987735,0.37328172,-0.28610984,-0.59059061,0.26650405,0.23694183
330,-0.30286247,-0.53329089,0.18968405,0.35949314,-0.27684359,-0.58047268,0.25770826,0.23014929
331,-0.29152063,-0.52086521,0.17973005,0.34570302,-0.26759976,-0.56963241,0.24888653,0.22325653
332,-0.28024532,-0.50790781,0.17001788,0.33192239,-0.25837288,-0.55807374,0.24004071,0.21626431
333,-0.26903594,-0.49443124,0.16054986,0.31816262,-0.24915785,-0.54580204,0.23117302,0.20917399
334,-0.25789226,-0.48044897,0.15132815,0.30443540,-0.23994997,-0.53282405,0.22228605,0.20198756
335,-0.24681441,-0.46597534,0.14235471,0.29075271,-0.23074496,-0.51914789,0.21338275,0.19470761
336,-0.23580290,-0.45102556,0.13363132,0.27712679,-0.22153899,-0.50478307,0.20446642,0.18733734
337,-0.22485866,-0.43561564,0.12515954,0.26357008,-0.21232869,-0.48974046,0.19554070,0.17988050
338,-0.21398300,-0.41976237,0.11694073,0.25009522,-0.20311122,-0.47403230,0.18660956,0.17234142
339,-0.20317765,-0.40348331,0.10897604,0.23671501,-0.19388421,-0.45767212,0.17767730,0.16472497
340,-0.19244475,-0.38679671,0.10126640,0.22344236,-0.18464587,-0.44067481,0.16874850,0.15703654
341,-0.18178686,-0.36972150,0.093812511,0.21029027,-0.17539493,-0.42305653,0.15982805,0.14928200
342,-0.17120699,-0.35227723,0.086614860,0.19727177,-0.16613072,-0.40483470,0.15092111,0.14146773
343,-0.16070854,-0.33448403,0.079673693,0.18439993,-0.15685312,-0.38602795,0.14203309,0.13360054
344,-0.15029536,-0.31636258,0.072989028,0.17168778,-0.14756265,-0.36665615,0.13316966,0.12568769
345,-0.13997173,-0.29793406,0.066560642,0.15914828,-0.13826042,-0.34674029,0.12433673,0.11773681
346,-0.12974233,-0.27922008,0.060388074,0.14679432,-0.12894815,-0.32630249,0.11554038,0.10975593
347,-0.11961227,-0.26024267,0.054470624,0.13463863,-0.11962820,-0.30536594,0.10678692,0.10175341
348,-0.10958709,-0.24102420,0.048807346,0.12269380,-0.11030358,-0.28395487,0.098082818,0.093737944
349,-0.099672722,-0.22158733,0.043397054,0.11097219,-0.10097790,-0.26209447,0.089434718,0.085718498
350,-0.089875489,-0.20195498,0.038238317,0.099485930,-0.091655443,-0.23981089,0.080849387,0.077704297
351,-0.080202114,-0.18215029,0.033329459,0.088246886,-0.082341120,-0.21713113,0.072333718,0.069704792
352,-0.070659697,-0.16219652,0.028668566,0.077266610,-0.073040482,-0.19408301,0.063894705,0.061729627
353,-0.061255700,-0.14211704,0.024253480,0.066556314,-0.063759712,-0.17069514,0.055539426,0.053788607
354,-0.051997937,-0.12193525,0.020081805,0.056126840,-0.054505627,-0.14699680,0.047275022,0.045891666
355,-0.042894558,-0.10167458,0.016150910,0.045988629,-0.045285660,-0.12301792,0.039108678,0.038048834
356,-0.033954033,-0.081358353,0.012457932,0.036151687,-0.036107862,-0.098789030,0.031047603,0.030270204
357,-0.025185132,-0.061009821,0.0089997774,0.026625559,-0.026980879,-0.074341143,0.023099014,0.022565903
358,-0.016596911,-0.040652060,0.0057731308,0.017419302,-0.017913948,-0.049705735,0.015270115,0.014946054
359,-0.0081986877,-0.020307936,0.0027744568,0.0085414566,-0.0089168757,-0.024914656,0.0075680766,0.0074207511
360,-2.2576259e-08,-5.6561078e-08,7.4280706e-09,2.3343318e-08,-2.4744480e-08,-6.9621244e-08,2.0911585e-08,2.0539062e-08
