deg,XRT_AX,XRT_BX,XRT_AY,XRT_BY,SOT_AX,SOT_BX,SOT_AY,SOT_BY
valid,1,1,1,1,1,1,1,1,revB
offset,119.64600,92.548804,1976.6062,1979.5705,49.373632,21.727214,91.355915,94.516982
0,0.0000000,0.0000000,0.0000000,0.0000000,0.0000000,0.0000000,0.0000000,0.0000000
1,0.011636309,0.017289373,-0.011662805,-0.0080634090,0.0037722987,0.0098075765,-0.0049989380,-0.0049863644
2,0.022711121,0.034799054,-0.023031601,-0.016075768,0.0066717172,0.019303894,-0.0098672591,-0.0099890315
3,0.033194086,0.052512788,-0.034084382,-0.024029405,0.0086797449,0.028487761,-0.014598647,-0.015005626
4,0.043055926,0.070414091,-0.044799662,-0.031916455,0.0097794720,0.037358674,-0.019186803,-0.020033527
5,0.052268502,0.088486293,-0.055156532,-0.039728881,0.0099556300,0.045916810,-0.023625464,-0.025069882
6,0.060804885,0.10671256,-0.065134721,-0.047458498,0.0091946292,0.054163016,-0.027908412,-0.030111608
7,0.068639421,0.12507596,-0.074714645,-0.055096998,0.0074845906,0.062098798,-0.032029490,-0.035155407
8,0.075747791,0.14355943,-0.083877464,-0.062635969,0.0048153756,0.069726308,-0.035982612,-0.040197770
9,0.082107070,0.16214591,-0.092605133,-0.070066924,0.0011786094,0.077048330,-0.039761777,-0.045234990
10,0.087695781,0.18081829,-0.10088045,-0.077381317,-0.0034322981,0.084068267,-0.043361083,-0.050263169
11,0.092493945,0.19955948,-0.10868709,-0.084570576,-0.0090221371,0.090790117,-0.046774732,-0.055278229
12,0.096483130,0.21835246,-0.11600967,-0.091626116,-0.015593886,0.097218461,-0.049997048,-0.060275919
13,0.099646490,0.23718027,-0.12283377,-0.098539368,-0.023148704,0.10335844,-0.053022482,-0.065251829
14,0.10196881,0.25602609,-0.12914600,-0.10530180,-0.031685931,0.10921573,-0.055845623,-0.070201394
15,0.10343653,0.27487325,-0.13493397,-0.11190494,-0.041203085,0.11479654,-0.058461209,-0.075119908
16,0.10403779,0.29370526,-0.14018639,-0.11834040,-0.051695871,0.12010756,-0.060864134,-0.080002532
17,0.10376243,0.31250584,-0.14489309,-0.12459988,-0.063158193,0.12515593,-0.063049452,-0.084844303
18,0.10260206,0.33125897,-0.14904498,-0.13067521,-0.075582164,0.12994927,-0.065012393,-0.089640143
19,0.10055002,0.34994890,-0.15263414,-0.13655838,-0.088958131,0.13449561,-0.066748360,-0.094384869
20,0.097601433,0.36856018,-0.15565384,-0.14224152,-0.10327469,0.13880333,-0.068252941,-0.099073204
21,0.093753182,0.38707769,-0.15809849,-0.14771694,-0.11851873,0.14288122,-0.069521911,-0.10369978
22,0.089003946,0.40548669,-0.15996372,-0.15297717,-0.13467544,0.14673838,-0.070551240,-0.10825916
23,0.083354178,0.42377278,-0.16124634,-0.15801493,-0.15172836,0.15038422,-0.071337092,-0.11274583
24,0.076806106,0.44192203,-0.16194438,-0.16282318,-0.16965943,0.15382840,-0.071875832,-0.11715421
25,0.069363720,0.45992088,-0.16205707,-0.16739514,-0.18844901,0.15708085,-0.072164027,-0.12147867
26,0.061032761,0.47775626,-0.16158483,-0.17172428,-0.20807593,0.16015169,-0.072198448,-0.12571356
27,0.051820702,0.49541557,-0.16052929,-0.17580435,-0.22851758,0.16305124,-0.071976070,-0.12985315
28,0.041736722,0.51288669,-0.15889327,-0.17962937,-0.24974991,0.16578996,-0.071494076,-0.13389171
29,0.030791682,0.53015801,-0.15668075,-0.18319368,-0.27174749,0.16837840,-0.070749853,-0.13782349
30,0.018998090,0.54721845,-0.15389687,-0.18649193,-0.29448364,0.17082724,-0.069740994,-0.14164270
31,0.0063700701,0.56405748,-0.15054792,-0.18951907,-0.31793039,0.17314719,-0.068465293,-0.14534357
32,-0.0070766800,0.58066509,-0.14664128,-0.19227039,-0.34205863,0.17534896,-0.066920749,-0.14892030
33,-0.021324932,0.59703186,-0.14218545,-0.19474150,-0.36683815,0.17744329,-0.065105559,-0.15236712
34,-0.036355975,0.61314894,-0.13718996,-0.19692837,-0.39223768,0.17944085,-0.063018115,-0.15567825
35,-0.052149662,0.62900805,-0.13166538,-0.19882730,-0.41822501,0.18135226,-0.060657003,-0.15884794
36,-0.068684469,0.64460151,-0.12562328,-0.20043493,-0.44476705,0.18318801,-0.058020996,-0.16187045
37,-0.085937551,0.65992221,-0.11907616,-0.20174827,-0.47182989,0.18495849,-0.055109054,-0.16474007
38,-0.10388480,0.67496365,-0.11203746,-0.20276467,-0.49937889,0.18667390,-0.051920312,-0.16745112
39,-0.12250091,0.68971992,-0.10452148,-0.20348183,-0.52737876,0.18834428,-0.048454083,-0.16999795
40,-0.14175944,0.70418572,-0.096543328,-0.20389780,-0.55579366,0.18997941,-0.044709844,-0.17237495
41,-0.16163290,0.71835631,-0.088118915,-0.20401098,-0.58458724,0.19158888,-0.040687236,-0.17457656
42,-0.18209279,0.73222758,-0.079264862,-0.20382012,-0.61372276,0.19318196,-0.036386056,-0.17659726
43,-0.20310969,0.74579597,-0.069998467,-0.20332431,-0.64316315,0.19476766,-0.031806247,-0.17843157
44,-0.22465337,0.75905853,-0.060337651,-0.20252297,-0.67287111,0.19635466,-0.026947896,-0.18007407
45,-0.24669280,0.77201284,-0.050300896,-0.20141585,-0.70280919,0.19795128,-0.021811223,-0.18151939
46,-0.26919627,0.78465708,-0.039907194,-0.20000303,-0.73293985,0.19956549,-0.016396575,-0.18276223
47,-0.29213146,0.79698996,-0.029175984,-0.19828490,-0.76322559,0.20120490,-0.010704420,-0.18379734
48,-0.31546555,0.80901074,-0.018127095,-0.19626215,-0.79362899,0.20287666,-0.0047353351,-0.18461952
49,-0.33916524,0.82071917,-0.0067806851,-0.19393577,-0.82411282,0.20458755,0.0015099967,-0.18522365
50,-0.36319690,0.83211555,0.0048428229,-0.19130704,-0.85464010,0.20634389,0.0080307972,-0.18560467
51,-0.38752659,0.84320064,0.016722801,-0.18837749,-0.88517419,0.20815153,0.014826200,-0.18575757
52,-0.41212020,0.85397570,0.028838478,-0.18514894,-0.91567887,0.21001588,0.021895257,-0.18567744
53,-0.43694352,0.86444243,0.041169005,-0.18162344,-0.94611842,0.21194185,0.029236949,-0.18535941
54,-0.46196227,0.87460297,0.053693519,-0.17780328,-0.97645768,0.21393386,0.036850191,-0.18479868
55,-0.48714227,0.88445986,0.066391200,-0.17369095,-1.0066621,0.21599584,0.044733840,-0.18399054
56,-0.51244945,0.89401606,0.079241343,-0.16928918,-1.0366980,0.21813119,0.052886703,-0.18293034
57,-0.53784996,0.90327489,0.092223409,-0.16460084,-1.0665323,0.22034281,0.061307544,-0.18161350
58,-0.56331028,0.91224000,0.10531710,-0.15962902,-1.0961328,0.22263308,0.069995091,-0.18003552
59,-0.58879723,0.92091540,0.11850240,-0.15437693,-1.1254683,0.22500382,0.078948041,-0.17819196
60,-0.61427810,0.92930536,0.13175967,-0.14884795,-1.1545085,0.22745638,0.088165069,-0.17607847
61,-0.63972071,0.93741444,0.14506966,-0.14304556,-1.1832241,0.22999152,0.097644833,-0.17369076
62,-0.66509350,0.94524745,0.15841359,-0.13697336,-1.2115871,0.23260953,0.10738598,-0.17102463
63,-0.69036556,0.95280943,0.17177323,-0.13063502,-1.2395703,0.23531013,0.11738714,-0.16807596
64,-0.71550674,0.96010559,0.18513090,-0.12403431,-1.2671481,0.23809254,0.12764696,-0.16484069
65,-0.74048771,0.96714132,0.19846957,-0.11717504,-1.2942957,0.24095547,0.13816408,-0.16131484
66,-0.76528000,0.97392216,0.21177289,-0.11006104,-1.3209898,0.24389712,0.14893714,-0.15749454
67,-0.78985609,0.98045375,0.22502523,-0.10269619,-1.3472084,0.24691517,0.15996481,-0.15337595
68,-0.81418945,0.98674184,0.23821173,-0.095084368,-1.3729310,0.25000683,0.17124574,-0.14895536
69,-0.83825461,0.99279220,0.25131838,-0.087229420,-1.3981380,0.25316883,0.18277864,-0.14422911
70,-0.86202718,0.99861066,0.26433199,-0.079135182,-1.4228118,0.25639744,0.19456219,-0.13919365
71,-0.88548396,1.0042031,0.27724029,-0.070805436,-1.4469357,0.25968845,0.20659513,-0.13384550
72,-0.90860292,1.0095752,0.29003193,-0.062243908,-1.4704948,0.26303725,0.21887620,-0.12818128
73,-0.93136327,1.0147329,0.30269654,-0.053454247,-1.4934755,0.26643878,0.23140415,-0.12219769
74,-0.95374550,1.0196818,0.31522471,-0.044440011,-1.5158657,0.26988759,0.24417777,-0.11589154
75,-0.97573141,1.0244275,0.32760808,-0.035204655,-1.5376547,0.27337784,0.25719587,-0.10925971
76,-0.99730413,1.0289756,0.33983932,-0.025751518,-1.5588334,0.27690333,0.27045725,-0.10229921
77,-1.0184482,1.0333313,0.35191216,-0.016083809,-1.5793941,0.28045751,0.28396076,-0.095007138
78,-1.0391494,1.0374998,0.36382142,-0.0062045958,-1.5993306,0.28403352,0.29770523,-0.087380689
79,-1.0593952,1.0414861,0.37556298,0.0038832072,-1.6186382,0.28762417,0.31168953,-0.079417180
80,-1.0791742,1.0452951,0.38713385,0.014176846,-1.6373134,0.29122203,0.32591252,-0.071114039
81,-1.0984766,1.0489312,0.39853214,0.024673741,-1.6553544,0.29481938,0.34037305,-0.062468808
82,-1.1172939,1.0523988,0.40975705,0.035371489,-1.6727608,0.29840828,0.35506999,-0.053479155
83,-1.1356191,1.0557019,0.42080891,0.046267878,-1.6895335,0.30198061,0.37000218,-0.044142870
84,-1.1534468,1.0588443,0.43168914,0.057360888,-1.7056746,0.30552804,0.38516847,-0.034457878
85,-1.1707727,1.0618294,0.44240025,0.068648699,-1.7211878,0.30904209,0.40056765,-0.024422239
86,-1.1875942,1.0646604,0.45294585,0.080129696,-1.7360779,0.31251417,0.41619853,-0.014034156
87,-1.2039098,1.0673402,0.46333061,0.091802471,-1.7503511,0.31593558,0.43205984,-0.0032919793
88,-1.2197198,1.0698713,0.47356023,0.10366582,-1.7640147,0.31929753,0.44815028,0.0078057863
89,-1.2350255,1.0722557,0.48364148,0.11571877,-1.7770771,0.32259121,0.46446852,0.019260476
90,-1.2498296,1.0744954,0.49358210,0.12796053,-1.7895480,0.32580777,0.48101313,0.031073259
91,-1.2641362,1.0765918,0.50339082,0.14039054,-1.8014380,0.32893838,0.49778264,0.043245131
92,-1.2779506,1.0785459,0.51307730,0.15300845,-1.8127588,0.33197422,0.51477549,0.055776906
93,-1.2912794,1.0803584,0.52265213,0.16581410,-1.8235230,0.33490655,0.53199003,0.068669214
94,-1.3041302,1.0820297,0.53212676,0.17880753,-1.8337443,0.33772670,0.54942450,0.081922486
95,-1.3165120,1.0835598,0.54151347,0.19198901,-1.8434369,0.34042613,0.56707705,0.095536955
96,-1.3284348,1.0849481,0.55082533,0.20535895,-1.8526160,0.34299642,0.58494569,0.10951264
97,-1.3399094,1.0861940,0.56007615,0.21891798,-1.8612976,0.34542932,0.60302830,0.12384935
98,-1.3509481,1.0872963,0.56928045,0.23266689,-1.8694981,0.34771675,0.62132264,0.13854667
99,-1.3615636,1.0882534,0.57845338,0.24660662,-1.8772347,0.34985086,0.63982629,0.15360393
100,-1.3717698,1.0890634,0.58761068,0.26073829,-1.8845250,0.35182402,0.65853668,0.16902024
101,-1.3815814,1.0897240,0.59676862,0.27506314,-1.8913871,0.35362885,0.67745105,0.18479446
102,-1.3910138,1.0902328,0.60594397,0.28958255,-1.8978395,0.35525826,0.69656647,0.20092519
103,-1.4000830,1.0905867,0.61515390,0.30429801,-1.9039011,0.35670544,0.71587979,0.21741076
104,-1.4088058,1.0907824,0.62441594,0.31921111,-1.9095908,0.35796390,0.73538768,0.23424922
105,-1.4171994,1.0908165,0.63374794,0.33432353,-1.9149280,0.35902750,0.75508656,0.25143836
106,-1.4252817,1.0906849,0.64316796,0.34963702,-1.9199319,0.35989043,0.77497264,0.26897567
107,-1.4330708,1.0903836,0.65269423,0.36515338,-1.9246219,0.36054725,0.79504188,0.28685832
108,-1.4405851,1.0899082,0.66234510,0.38087445,-1.9290174,0.36099293,0.81528999,0.30508322
109,-1.4478437,1.0892539,0.67213894,0.39680208,-1.9331377,0.36122279,0.83571241,0.32364693
110,-1.4548653,1.0884158,0.68209412,0.41293812,-1.9370019,0.36123260,0.85630433,0.34254570
111,-1.4616693,1.0873888,0.69222888,0.42928441,-1.9406288,0.36101854,0.87706064,0.36177546
112,-1.4682747,1.0861676,0.70256133,0.44584274,-1.9440371,0.36057721,0.89797594,0.38133179
113,-1.4747009,1.0847467,0.71310932,0.46261484,-1.9472449,0.35990566,0.91904455,0.40120995
114,-1.4809668,1.0831204,0.72389043,0.47960235,-1.9502701,0.35900139,0.94026048,0.42140484
115,-1.4870914,1.0812830,0.73492187,0.49680683,-1.9531301,0.35786236,0.96161741,0.44191101
116,-1.4930935,1.0792285,0.74622041,0.51422969,-1.9558417,0.35648698,0.98310873,0.46272264
117,-1.4989914,1.0769511,0.75780235,0.53187222,-1.9584210,0.35487411,1.0047275,0.48383356
118,-1.5048033,1.0744446,0.76968341,0.54973552,-1.9608837,0.35302311,1.0264664,0.50523722
119,-1.5105467,1.0717031,0.78187869,0.56782053,-1.9632447,0.35093377,1.0483178,0.52692671
120,-1.5162388,1.0687206,0.79440264,0.58612795,-1.9655181,0.34860637,1.0702738,0.54889472
121,-1.5218962,1.0654909,0.80726893,0.60465826,-1.9677174,0.34604164,1.0923260,0.57113358
122,-1.5275347,1.0620080,0.82049045,0.62341171,-1.9698551,0.34324078,1.1144659,0.59363522
123,-1.5331696,1.0582662,0.83407922,0.64238824,-1.9719428,0.34020544,1.1366845,0.61639119
124,-1.5388155,1.0542595,0.84804638,0.66158753,-1.9739914,0.33693771,1.1589723,0.63939267
125,-1.5444861,1.0499823,0.86240206,0.68100892,-1.9760107,0.33344013,1.1813197,0.66263040
126,-1.5501943,1.0454291,0.87715543,0.70065143,-1.9780096,0.32971568,1.2037168,0.68609478
127,-1.5559520,1.0405944,0.89231456,0.72051372,-1.9799961,0.32576775,1.2261530,0.70977580
128,-1.5617704,1.0354732,0.90788643,0.74059408,-1.9819769,0.32160016,1.2486177,0.73366305
129,-1.5676594,1.0300604,0.92387687,0.76089041,-1.9839581,0.31721710,1.2710998,0.75774574
130,-1.5736281,1.0243515,0.94029055,0.78140021,-1.9859443,0.31262316,1.2935880,0.78201270
131,-1.5796846,1.0183420,0.95713087,0.80212055,-1.9879393,0.30782332,1.3160704,0.80645237
132,-1.5858356,1.0120278,0.97440003,0.82304804,-1.9899458,0.30282290,1.3385351,0.83105280
133,-1.5920870,1.0054052,0.99209892,0.84417887,-1.9919655,0.29762753,1.3609697,0.85580168
134,-1.5984434,0.99847079,1.0102271,0.86550874,-1.9939988,0.29224322,1.3833614,0.88068632
135,-1.6049082,0.99122144,1.0287829,0.88703286,-1.9960451,0.28667623,1.4056974,0.90569367
136,-1.6114837,0.98365453,1.0477632,0.90874597,-1.9981030,0.28093313,1.4279644,0.93081030
137,-1.6181711,0.97576780,1.0671634,0.93064229,-2.0001696,0.27502075,1.4501489,0.95602246
138,-1.6249701,0.96755943,1.0869779,0.95271552,-2.0022413,0.26894615,1.4722369,0.98131603
139,-1.6318793,0.95902805,1.1071994,0.97495884,-2.0043133,0.26271662,1.4942145,1.0066766
140,-1.6388963,0.95017275,1.1278192,0.99736492,-2.0063799,0.25633964,1.5160674,1.0320893
141,-1.6460172,0.94099310,1.1488274,1.0199259,-2.0084342,0.24982287,1.5377811,1.0575391
142,-1.6532370,0.93148916,1.1702127,1.0426332,-2.0104687,0.24317412,1.5593408,1.0830107
143,-1.6605494,0.92166151,1.1919621,1.0654781,-2.0124745,0.23640132,1.5807315,1.1084883
144,-1.6679472,0.91151123,1.2140618,1.0884509,-2.0144422,0.22951253,1.6019383,1.1339559
145,-1.6754217,0.90103995,1.2364961,1.1115416,-2.0163614,0.22251586,1.6229458,1.1593975
146,-1.6829631,0.89024982,1.2592484,1.1347396,-2.0182208,0.21541947,1.6437386,1.1847963
147,-1.6905607,0.87914354,1.2823004,1.1580338,-2.0200084,0.20823159,1.6643012,1.2101358
148,-1.6982025,0.86772437,1.3056328,1.1814124,-2.0217114,0.20096042,1.6846180,1.2353990
149,-1.7058754,0.85599613,1.3292250,1.2048632,-2.0233164,0.19361415,1.7046733,1.2605688
150,-1.7135654,0.84396318,1.3530550,1.2283736,-2.0248093,0.18620094,1.7244512,1.2856278
151,-1.7212574,0.83163045,1.3771000,1.2519301,-2.0261754,0.17872886,1.7439361,1.3105585
152,-1.7289355,0.81900345,1.4013356,1.2755191,-2.0273995,0.17120590,1.7631121,1.3353433
153,-1.7365828,0.80608822,1.4257367,1.2991262,-2.0284659,0.16363996,1.7819634,1.3599643
154,-1.7441815,0.79289137,1.4502769,1.3227367,-2.0293584,0.15603875,1.8004742,1.3844038
155,-1.7517131,0.77942006,1.4749288,1.3463354,-2.0300605,0.14840987,1.8186288,1.4086436
156,-1.7591582,0.76568200,1.4996643,1.3699066,-2.0305554,0.14076070,1.8364115,1.4326658
157,-1.7664969,0.75168543,1.5244541,1.3934342,-2.0308260,0.13309845,1.8538069,1.4564521
158,-1.7737084,0.73743912,1.5492682,1.4169016,-2.0308552,0.12543007,1.8707994,1.4799845
159,-1.7807718,0.72295235,1.5740760,1.4402918,-2.0306256,0.11776229,1.8873739,1.5032448
160,-1.7876651,0.70823491,1.5988460,1.4635877,-2.0301196,0.11010157,1.9035153,1.5262148
161,-1.7943663,0.69329708,1.6235460,1.4867714,-2.0293201,0.10245408,1.9192087,1.5488765
162,-1.8008528,0.67814962,1.6481434,1.5098250,-2.0282095,0.094825706,1.9344394,1.5712118
163,-1.8071019,0.66280374,1.6726050,1.5327301,-2.0267707,0.087221997,1.9491931,1.5932028
164,-1.8130904,0.64727109,1.6968973,1.5554683,-2.0249867,0.079648185,1.9634556,1.6148315
165,-1.8187951,0.63156373,1.7209862,1.5780205,-2.0228408,0.072109154,1.9772131,1.6360804
166,-1.8241928,0.61569414,1.7448376,1.6003678,-2.0203166,0.064609424,1.9904522,1.6569318
167,-1.8292600,0.59967517,1.7684171,1.6224908,-2.0173980,0.057153149,2.0031596,1.6773683
168,-1.8339736,0.58352000,1.7916901,1.6443702,-2.0140696,0.049744097,2.0153227,1.6973727
169,-1.8383103,0.56724217,1.8146220,1.6659863,-2.0103163,0.042385648,2.0269291,1.7169282
170,-1.8422473,0.55085551,1.8371783,1.6873194,-2.0061235,0.035080779,2.0379668,1.7360180
171,-1.8457619,0.53437411,1.8593245,1.7083499,-2.0014776,0.027832062,2.0484243,1.7546257
172,-1.8488318,0.51781235,1.8810264,1.7290579,-1.9963654,0.020641656,2.0582907,1.7727352
173,-1.8514352,0.50118478,1.9022499,1.7494237,-1.9907745,0.013511303,2.0675553,1.7903307
174,-1.8535506,0.48450618,1.9229615,1.7694274,-1.9846933,0.0064423250,2.0762082,1.8073967
175,-1.8551572,0.46779148,1.9431281,1.7890494,-1.9781110,-0.00056437594,2.0842399,1.8239182
176,-1.8562349,0.45105573,1.9627168,1.8082700,-1.9710179,-0.0075083207,2.0916414,1.8398805
177,-1.8567643,0.43431408,1.9816956,1.8270699,-1.9634051,-0.014389450,2.0984044,1.8552693
178,-1.8567267,0.41758178,2.0000331,1.8454296,-1.9552645,-0.021208123,2.1045211,1.8700709
179,-1.8561042,0.40087407,2.0176986,1.8633302,-1.9465894,-0.027965111,2.1099842,1.8842719
180,-1.8548800,0.38420622,2.0346622,1.8807528,-1.9373740,-0.034661597,2.1147873,1.8978593
181,-1.8530380,0.36759346,2.0508949,1.8976788,-1.9276135,-0.041299161,2.1189243,1.9108209
182,-1.8505634,0.35105097,2.0663687,1.9140900,-1.9173044,-0.047879782,2.1223902,1.9231447
183,-1.8474423,0.33459383,2.0810566,1.9299684,-1.9064441,-0.054405820,2.1251801,1.9348196
184,-1.8436620,0.31823699,2.0949327,1.9452966,-1.8950316,-0.060880010,2.1272903,1.9458347
185,-1.8392110,0.30199523,2.1079721,1.9600574,-1.8830668,-0.067305448,2.1287174,1.9561800
186,-1.8340790,0.28588317,2.1201515,1.9742342,-1.8705509,-0.073685579,2.1294589,1.9658458
187,-1.8282571,0.26991516,2.1314484,1.9878108,-1.8574862,-0.080024185,2.1295129,1.9748233
188,-1.8217374,0.25410532,2.1418420,2.0007716,-1.8438766,-0.086325361,2.1288784,1.9831041
189,-1.8145138,0.23846749,2.1513128,2.0131014,-1.8297270,-0.092593510,2.1275550,1.9906806
190,-1.8065812,0.22301518,2.1598425,2.0247859,-1.8150436,-0.098833316,2.1255428,1.9975458
191,-1.7979362,0.20776154,2.1674146,2.0358110,-1.7998338,-0.10504973,2.1228431,2.0036933
192,-1.7885767,0.19271935,2.1740141,2.0461635,-1.7841065,-0.11124795,2.1194575,2.0091176
193,-1.7785022,0.17790100,2.1796272,2.0558308,-1.7678716,-0.11743339,2.1153885,2.0138137
194,-1.7677135,0.16331842,2.1842422,2.0648011,-1.7511403,-0.12361168,2.1106394,2.0177774
195,-1.7562131,0.14898310,2.1878488,2.0730632,-1.7339251,-0.12978863,2.1052142,2.0210052
196,-1.7440048,0.13490602,2.1904382,2.0806067,-1.7162397,-0.13597020,2.0991174,2.0234943
197,-1.7310943,0.12109767,2.1920035,2.0874218,-1.6980990,-0.14216249,2.0923547,2.0252427
198,-1.7174883,0.10756798,2.1925395,2.0934999,-1.6795189,-0.14837171,2.0849320,2.0262490
199,-1.7031956,0.094326357,2.1920428,2.0988328,-1.6605167,-0.15460416,2.0768562,2.0265127
200,-1.6882260,0.081381599,2.1905114,2.1034133,-1.6411105,-0.16086619,2.0681349,2.0260340
201,-1.6725911,0.068741919,2.1879454,2.1072352,-1.6213197,-0.16716418,2.0587763,2.0248137
202,-1.6563040,0.056414912,2.1843465,2.1102929,-1.6011647,-0.17350454,2.0487892,2.0228537
203,-1.6393792,0.044407540,2.1797183,2.1125819,-1.5806668,-0.17989364,2.0381834,2.0201562
204,-1.6218326,0.032726116,2.1740658,2.1140985,-1.5598481,-0.18633783,2.0269690,2.0167245
205,-1.6036817,0.021376294,2.1673961,2.1148398,-1.5387320,-0.19284335,2.0151569,2.0125626
206,-1.5849451,0.010363052,2.1597178,2.1148041,-1.5173424,-0.19941639,2.0027587,2.0076750
207,-1.5656431,-0.00030931594,2.1510415,2.1139904,-1.4957040,-0.20606297,1.9897864,2.0020672
208,-1.5457972,-0.010637206,2.1413791,2.1123987,-1.4738424,-0.21278900,1.9762529,1.9957454
209,-1.5254300,-0.020617715,2.1307444,2.1100300,-1.4517837,-0.21960018,1.9621712,1.9887163
210,-1.5045657,-0.030248646,2.1191529,2.1068860,-1.4295547,-0.22650203,1.9475554,1.9809876
211,-1.4832292,-0.039528506,2.1066216,2.1029696,-1.4071828,-0.23349983,1.9324198,1.9725675
212,-1.4614471,-0.048456516,2.0931689,2.0982846,-1.3846958,-0.24059862,1.9167792,1.9634651
213,-1.4392466,-0.057032605,2.0788151,2.0928356,-1.3621219,-0.24780315,1.9006490,1.9536900
214,-1.4166561,-0.065257408,2.0635818,2.0866283,-1.3394896,-0.25511788,1.8840452,1.9432525
215,-1.3937050,-0.073132265,2.0474920,2.0796691,-1.3168278,-0.26254693,1.8669838,1.9321637
216,-1.3704236,-0.080659217,2.0305700,2.0719655,-1.2941655,-0.27009409,1.8494817,1.9204351
217,-1.3468429,-0.087840993,2.0128418,2.0635259,-1.2715319,-0.27776277,1.8315559,1.9080790
218,-1.3229947,-0.094681006,1.9943343,2.0543595,-1.2489564,-0.28555600,1.8132238,1.8951084
219,-1.2989115,-0.10118334,1.9750758,2.0444764,-1.2264680,-0.29347640,1.7945032,1.8815366
220,-1.2746264,-0.10735274,1.9550958,2.0338875,-1.2040959,-0.30152616,1.7754121,1.8673777
221,-1.2501731,-0.11319459,1.9344248,2.0226047,-1.1818691,-0.30970704,1.7559690,1.8526462
222,-1.2255857,-0.11871491,1.9130942,2.0106406,-1.1598164,-0.31802030,1.7361922,1.8373574
223,-1.2008984,-0.12392033,1.8911367,1.9980086,-1.1379661,-0.32646676,1.7161008,1.8215267
224,-1.1761462,-0.12881807,1.8685855,1.9847230,-1.1163464,-0.33504675,1.6957136,1.8051703
225,-1.1513638,-0.13341592,1.8454749,1.9707987,-1.0949848,-0.34376007,1.6750498,1.7883048
226,-1.1265864,-0.13772224,1.8218398,1.9562514,-1.0739085,-0.35260603,1.6541287,1.7709471
227,-1.1018491,-0.14174589,1.7977158,1.9410975,-1.0531438,-0.36158339,1.6329696,1.7531147
228,-1.0771868,-0.14549625,1.7731390,1.9253540,-1.0327166,-0.37069041,1.6115919,1.7348253
229,-1.0526345,-0.14898316,1.7481461,1.9090387,-1.0126521,-0.37992478,1.5900151,1.7160972
230,-1.0282269,-0.15221692,1.7227741,1.8921699,-0.99297440,-0.38928365,1.5682587,1.6969488
231,-1.0039983,-0.15520826,1.6970603,1.8747664,-0.97370701,-0.39876363,1.5463420,1.6773988
232,-0.97998279,-0.15796827,1.6710425,1.8568478,-0.95487240,-0.40836077,1.5242845,1.6574665
233,-0.95621379,-0.16050844,1.6447584,1.8384339,-0.93649208,-0.41807056,1.5021055,1.6371711
234,-0.93272433,-0.16284055,1.6182458,1.8195451,-0.91858652,-0.42788794,1.4798240,1.6165321
235,-0.90954672,-0.16497669,1.5915426,1.8002025,-0.90117508,-0.43780730,1.4574591,1.5955694
236,-0.88671260,-0.16692922,1.5646867,1.7804271,-0.88427596,-0.44782247,1.4350297,1.5743027
237,-0.86425280,-0.16871073,1.5377155,1.7602407,-0.86790617,-0.45792675,1.4125543,1.5527522
238,-0.84219726,-0.17033397,1.5106664,1.7396652,-0.85208148,-0.46811289,1.3900515,1.5309380
239,-0.82057502,-0.17181190,1.4835765,1.7187228,-0.83681634,-0.47837313,1.3675392,1.5088803
240,-0.79941407,-0.17315756,1.4564824,1.6974360,-0.82212389,-0.48869915,1.3450354,1.4865994
241,-0.77874132,-0.17438410,1.4294201,1.6758275,-0.80801589,-0.49908218,1.3225575,1.4641156
242,-0.75858254,-0.17550470,1.4024251,1.6539202,-0.79450270,-0.50951289,1.3001228,1.4414491
243,-0.73896228,-0.17653258,1.3755324,1.6317370,-0.78159324,-0.51998152,1.2777482,1.4186202
244,-0.71990379,-0.17748093,1.3487761,1.6093009,-0.76929499,-0.53047782,1.2554499,1.3956491
245,-0.70142900,-0.17836285,1.3221896,1.5866352,-0.75761391,-0.54099110,1.2332441,1.3725558
246,-0.68355846,-0.17919139,1.2958053,1.5637628,-0.74655450,-0.55151022,1.2111464,1.3493603
247,-0.66631125,-0.17997945,1.2696548,1.5407069,-0.73611971,-0.56202365,1.1891719,1.3260824
248,-0.64970497,-0.18073974,1.2437688,1.5174905,-0.72631100,-0.57251947,1.1673352,1.3027416
249,-0.63375567,-0.18148481,1.2181766,1.4941363,-0.71712825,-0.58298537,1.1456506,1.2793575
250,-0.61847786,-0.18222694,1.1929066,1.4706672,-0.70856986,-0.59340873,1.1241316,1.2559491
251,-0.60388439,-0.18297815,1.1679862,1.4471056,-0.70063264,-0.60377659,1.1027915,1.2325354
252,-0.58998650,-0.18375015,1.1434412,1.4234739,-0.69331192,-0.61407569,1.0816429,1.2091350
253,-0.57679373,-0.18455432,1.1192964,1.3997940,-0.68660148,-0.62429252,1.0606977,1.1857662
254,-0.56431394,-0.18540166,1.0955751,1.3760876,-0.68049361,-0.63441333,1.0399675,1.1624471
255,-0.55255326,-0.18630276,1.0722993,1.3523761,-0.67497910,-0.64442414,1.0194631,1.1391951
256,-0.54151610,-0.18726781,1.0494897,1.3286805,-0.67004728,-0.65431081,0.99919483,1.1160276
257,-0.53120513,-0.18830650,1.0271655,1.3050213,-0.66568606,-0.66405905,0.97917245,1.0929614
258,-0.52162124,-0.18942806,1.0053442,1.2814187,-0.66188190,-0.67365442,0.95940501,1.0700130
259,-0.51276359,-0.19064118,0.98404201,1.2578922,-0.65861992,-0.68308244,0.93990100,1.0471982
260,-0.50462961,-0.19195404,0.96327368,1.2344611,-0.65588389,-0.69232854,0.92066828,1.0245327
261,-0.49721496,-0.19337422,0.94305226,1.2111438,-0.65365626,-0.70137812,0.90171410,1.0020315
262,-0.49051358,-0.19490874,0.92338929,1.1879584,-0.65191827,-0.71021662,0.88304507,0.97970908
263,-0.48451770,-0.19656400,0.90429473,1.1649224,-0.65064990,-0.71882949,0.86466718,0.95757954
264,-0.47921785,-0.19834577,0.88577695,1.1420525,-0.64983003,-0.72720229,0.84658580,0.93565636
265,-0.47460290,-0.20025918,0.86784275,1.1193650,-0.64943641,-0.73532064,0.82880565,0.91395252
266,-0.47066010,-0.20230869,0.85049732,1.0968753,-0.64944574,-0.74317035,0.81133087,0.89248044
267,-0.46737506,-0.20449811,0.83374428,1.0745982,-0.64983377,-0.75073739,0.79416495,0.87125198
268,-0.46473184,-0.20683051,0.81758567,1.0525479,-0.65057531,-0.75800791,0.77731077,0.85027841
269,-0.46271300,-0.20930832,0.80202197,1.0307377,-0.65164432,-0.76496834,0.76077061,0.82957043
270,-0.46129959,-0.21193322,0.78705210,1.0091804,-0.65301399,-0.77160537,0.74454617,0.80913814
271,-0.46047126,-0.21470618,0.77267347,0.98788776,-0.65465679,-0.77790599,0.72863851,0.78899106
272,-0.46020626,-0.21762746,0.75888197,0.96687104,-0.65654455,-0.78385752,0.71304817,0.76913808
273,-0.46048155,-0.22069659,0.74567203,0.94614061,-0.65864853,-0.78944768,0.69777507,0.74958750
274,-0.46127283,-0.22391237,0.73303662,0.92570606,-0.66093953,-0.79466456,0.68281860,0.73034699
275,-0.46255459,-0.22727287,0.72096732,0.90557621,-0.66338791,-0.79949669,0.66817761,0.71142361
276,-0.46430023,-0.23077545,0.70945431,0.88575910,-0.66596371,-0.80393306,0.65385041,0.69282382
277,-0.46648207,-0.23441673,0.69848647,0.86626196,-0.66863674,-0.80796313,0.63983480,0.67455344
278,-0.46907147,-0.23819263,0.68805138,0.84709124,-0.67137663,-0.81157690,0.62612808,0.65661769
279,-0.47203888,-0.24209835,0.67813538,0.82825259,-0.67415291,-0.81476488,0.61272707,0.63902117
280,-0.47535392,-0.24612842,0.66872365,0.80975088,-0.67693513,-0.81751817,0.59962812,0.62176785
281,-0.47898548,-0.25027664,0.65980021,0.79159018,-0.67969293,-0.81982844,0.58682717,0.60486114
282,-0.48290178,-0.25453617,0.65134802,0.77377379,-0.68239608,-0.82168797,0.57431968,0.58830380
283,-0.48707046,-0.25889951,0.64334901,0.75630423,-0.68501464,-0.82308969,0.56210076,0.57209803
284,-0.49145868,-0.26335850,0.63578419,0.73918326,-0.68751896,-0.82402716,0.55016511,0.55624542
285,-0.49603319,-0.26790438,0.62863365,0.72241191,-0.68987983,-0.82449462,0.53850705,0.54074701
286,-0.50076042,-0.27252778,0.62187666,0.70599044,-0.69206854,-0.82448699,0.52712061,0.52560323
287,-0.50560658,-0.27721873,0.61549174,0.68991839,-0.69405692,-0.82399990,0.51599945,0.51081398
288,-0.51053775,-0.28196672,0.60945672,0.67419462,-0.69581749,-0.82302970,0.50513698,0.49637861
289,-0.51551996,-0.28676072,0.60374882,0.65881726,-0.69732347,-0.82157344,0.49452630,0.48229594
290,-0.52051928,-0.29158916,0.59834471,0.64378380,-0.69854890,-0.81962896,0.48416028,0.46856424
291,-0.52550193,-0.29644001,0.59322058,0.62909106,-0.69946872,-0.81719479,0.47403157,0.45518130
292,-0.53043434,-0.30130079,0.58835224,0.61473523,-0.70005878,-0.81427026,0.46413262,0.44214441
293,-0.53528326,-0.30615859,0.58371515,0.60071190,-0.70029597,-0.81085544,0.45445569,0.42945036
294,-0.54001587,-0.31100012,0.57928456,0.58701608,-0.70015829,-0.80695118,0.44499289,0.41709552
295,-0.54459980,-0.31581171,0.57503551,0.57364220,-0.69962487,-0.80255907,0.43573622,0.40507578
296,-0.54900331,-0.32057939,0.57094297,0.56058418,-0.69867605,-0.79768150,0.42667756,0.39338661
297,-0.55319528,-0.32528889,0.56698186,0.54783542,-0.69729346,-0.79232160,0.41780871,0.38202307
298,-0.55714538,-0.32992568,0.56312717,0.53538884,-0.69546004,-0.78648328,0.40912143,0.37097983
299,-0.56082407,-0.33447501,0.55935402,0.52323692,-0.69316014,-0.78017121,0.40060742,0.36025120
300,-0.56420277,-0.33892195,0.55563771,0.51137173,-0.69037951,-0.77339080,0.39225839,0.34983111
301,-0.56725384,-0.34325141,0.55195383,0.49978492,-0.68710538,-0.76614821,0.38406607,0.33971316
302,-0.56995074,-0.34744820,0.54827831,0.48846780,-0.68332652,-0.75845034,0.37602221,0.32989067
303,-0.57226806,-0.35149705,0.54458748,0.47741137,-0.67903323,-0.75030479,0.36811863,0.32035663
304,-0.57418158,-0.35538265,0.54085818,0.46660630,-0.67421741,-0.74171990,0.36034723,0.31110377
305,-0.57566837,-0.35908971,0.53706776,0.45604301,-0.66887257,-0.73270468,0.35270000,0.30212457
306,-0.57670682,-0.36260296,0.53319421,0.44571171,-0.66299387,-0.72326883,0.34516908,0.29341128
307,-0.57727673,-0.36590721,0.52921620,0.43560237,-0.65657813,-0.71342270,0.33774673,0.28495593
308,-0.57735933,-0.36898739,0.52511312,0.42570483,-0.64962386,-0.70317728,0.33042538,0.27675039
309,-0.57693738,-0.37182858,0.52086516,0.41600878,-0.64213126,-0.69254419,0.32319764,0.26878632
310,-0.57599516,-0.37441605,0.51645337,0.40650382,-0.63410224,-0.68153564,0.31605632,0.26105528
311,-0.57451858,-0.37673531,0.51185970,0.39717946,-0.62554040,-0.67016439,0.30899445,0.25354867
312,-0.57249515,-0.37877209,0.50706704,0.38802520,-0.61645107,-0.65844378,0.30200529,0.24625780
313,-0.56991408,-0.38051248,0.50205930,0.37903051,-0.60684128,-0.64638766,0.29508236,0.23917391
314,-0.56676627,-0.38194285,0.49682144,0.37018492,-0.59671975,-0.63401035,0.28821941,0.23228816
315,-0.56304436,-0.38304996,0.49133948,0.36147799,-0.58609688,-0.62132666,0.28141052,0.22559167
316,-0.55874273,-0.38382097,0.48560060,0.35289937,-0.57498473,-0.60835183,0.27465002,0.21907556
317,-0.55385755,-0.38424347,0.47959312,0.34443884,-0.56339702,-0.59510148,0.26793256,0.21273092
318,-0.54838675,-0.38430552,0.47330655,0.33608634,-0.55134907,-0.58159163,0.26125310,0.20654888
319,-0.54233008,-0.38399566,0.46673162,0.32783194,-0.53885779,-0.56783862,0.25460692,0.20052061
320,-0.53568908,-0.38330298,0.45986031,0.31966597,-0.52594164,-0.55385910,0.24798965,0.19463731
321,-0.52846709,-0.38221709,0.45268586,0.31157895,-0.51262060,-0.53966999,0.24139724,0.18889029
322,-0.52066924,-0.38072820,0.44520279,0.30356168,-0.49891611,-0.52528845,0.23482601,0.18327092
323,-0.51230245,-0.37882711,0.43740690,0.29560522,-0.48485103,-0.51073184,0.22827262,0.17777072
324,-0.50337540,-0.37650526,0.42929532,0.28770095,-0.47044962,-0.49601768,0.22173410,0.17238129
325,-0.49389853,-0.37375472,0.42086647,0.27984057,-0.45573743,-0.48116362,0.21520783,0.16709441
326,-0.48388402,-0.37056826,0.41212007,0.27201613,-0.44074128,-0.46618742,0.20869158,0.16190200
327,-0.47334573,-0.36693931,0.40305717,0.26422005,-0.42548920,-0.45110688,0.20218348,0.15679616
328,-0.46229919,-0.36286201,0.39368011,0.25644514,-0.41001037,-0.43593983,0.19568202,0.15176918
329,-0.45076159,-0.35833124,0.38399252,0.24868461,-0.39433500,-0.42070407,0.18918608,0.14681356
330,-0.43875166,-0.35334259,0.37399933,0.24093210,-0.37849435,-0.40541738,0.18269490,0.14192199
331,-0.42628974,-0.34789241,0.36370670,0.23318166,-0.36252058,-0.39009743,0.17620810,0.13708740
332,-0.41339761,-0.34197782,0.35312206,0.22542783,-0.34644672,-0.37476176,0.16972565,0.13230297
333,-0.40009853,-0.33559668,0.34225405,0.21766559,-0.33030656,-0.35942778,0.16324789,0.12756212
334,-0.38641714,-0.32874765,0.33111251,0.20989038,-0.31413462,-0.34411269,0.15677552,0.12285853
335,-0.37237940,-0.32143015,0.31970844,0.20209815,-0.29796600,-0.32883347,0.15030960,0.11818615
336,-0.35801254,-0.31364439,0.30805395,0.19428532,-0.28183637,-0.31360683,0.14385153,0.11353920
337,-0.34334500,-0.30539136,0.29616228,0.18644882,-0.26578183,-0.29844919,0.13740305,0.10891219
338,-0.32840634,-0.29667283,0.28404768,0.17858607,-0.24983885,-0.28337666,0.13096622,0.10429994
339,-0.31322716,-0.28749135,0.27172545,0.17069500,-0.23404418,-0.26840498,0.12454346,0.099697545
340,-0.29783908,-0.27785025,0.25921183,0.16277405,-0.21843475,-0.25354950,0.11813746,0.095100414
341,-0.28227457,-0.26775362,0.24652397,0.15482217,-0.20304761,-0.23882517,0.11175124,0.090504266
342,-0.26656698,-0.25720632,0.23367993,0.14683879,-0.18791982,-0.22424649,0.10538811,0.085905135
343,-0.25075035,-0.24621395,0.22069853,0.13882389,-0.17308835,-0.20982748,0.099051665,0.081299368
344,-0.23485940,-0.23478287,0.20759938,0.13077790,-0.15859002,-0.19558167,0.092745764,0.076683635
345,-0.21892943,-0.22292014,0.19440279,0.12270179,-0.14446141,-0.18152208,0.086474529,0.072054926
346,-0.20299620,-0.21063354,0.18112971,0.11459700,-0.13073873,-0.16766117,0.080242325,0.067410554
347,-0.18709587,-0.19793157,0.16780167,0.10646544,-0.11745779,-0.15401084,0.074053753,0.062748155
348,-0.17126493,-0.18482337,0.15444073,0.098309508,-0.10465387,-0.14058242,0.067913630,0.058065688
349,-0.15554004,-0.17131876,0.14106940,0.090132064,-0.092361668,-0.12738660,0.061826978,0.053361434
350,-0.13995802,-0.15742819,0.12771059,0.081936414,-0.080615177,-0.11443349,0.055799010,0.048633996
351,-0.12455570,-0.14316272,0.11438753,0.073726302,-0.069447646,-0.10173254,0.049835114,0.043882293
352,-0.10936988,-0.12853402,0.10112372,0.065505899,-0.058891470,-0.089292540,0.043940840,0.039105561
353,-0.094437173,-0.11355429,0.087942867,0.057279783,-0.048978126,-0.077121639,0.038121883,0.034303349
354,-0.079793985,-0.098236299,0.074868783,0.049052927,-0.039738087,-0.065227296,0.032384069,0.029475513
355,-0.065476374,-0.082593316,0.061925356,0.040830683,-0.031200757,-0.053616291,0.026733338,0.024622214
356,-0.051519986,-0.066639093,0.049136470,0.032618761,-0.023394395,-0.042294716,0.021175731,0.019743912
357,-0.037959959,-0.050387835,0.036525932,0.024423212,-0.016346047,-0.031267960,0.015717375,0.014841361
358,-0.024830839,-0.033854169,0.024117415,0.016250408,-0.010081481,-0.020540718,0.010364464,0.0099155997
359,-0.012166494,-0.017053114,0.011934383,0.0081070265,-0.0046251265,-0.010116979,0.0051232477,0.0049679519
360,-3.3204088e-08,-4.7892613e-08,3.2913249e-08,2.2550466e-08,-1.1718576e-08,-2.7782722e-08,1.4116750e-08,1.3880666e-08
