XRT N-S vs UFSS-A
      175.655
      4.51467
     -3.64095
      1.50972
      2.56493
     -1.11489
     0.133962
XRT N-S vs UFSS-B
      147.884
      1.12308
     -1.76460
     0.497427
    0.0838963
    -0.120050
     0.121707
XRT E-W vs UFSS-A
      3977.35
     -2.12328
     0.514289
    -0.228905
    -0.744186
     0.235927
    0.0111246
XRT E-W vs UFSS-B
      3955.73
     0.592117
     -1.12210
     0.135677
     0.796782
    -0.123591
   -0.0905951
SOT N-S vs UFSS-A
      27.3238
      3.47779
     -4.37396
      2.45718
      2.34264
    -0.828153
     0.948512
SOT N-S vs UFSS-B
     -1.00886
    -0.235369
     -2.59120
      1.53117
    -0.399764
     0.285619
     0.956420
SOT E-W vs UFSS-A
      219.316
     -1.49126
     0.675120
    -0.647302
    -0.367240
     0.284448
    -0.267443
SOT E-W vs UFSS-B
      197.205
      1.17724
    -0.988446
    -0.298084
      1.15985
    -0.224977
    -0.276362
