XRT N-S vs UFSS-A
      244.852
     0.345418
     0.468301
     0.358141
    0.0138659
     0.188699
     0.185324
XRT N-S vs UFSS-B
      221.241
     0.463298
    -0.655312
    0.0144385
  0.000897430
     0.112720
     0.122530
XRT E-W vs UFSS-A
      3959.85
    -0.633772
    -0.592472
    0.0254712
     0.166862
   -0.0105773
   -0.0200378
XRT E-W vs UFSS-B
      3966.71
    -0.790495
    -0.457073
     0.133640
     0.249669
  -0.00227171
    0.0158205
SOT N-S vs UFSS-A
      113.253
   -0.0827221
     0.657868
     0.382355
   -0.0159413
    0.0807449
     0.116540
SOT N-S vs UFSS-B
      88.8554
    0.0834945
    -0.501428
     0.126316
  -0.00142448
   -0.0823330
    0.0747082
SOT E-W vs UFSS-A
      181.966
    -0.653557
    -0.616233
     0.121528
    0.0765498
   -0.0326801
   -0.0123155
SOT E-W vs UFSS-B
      188.986
    -0.823298
    -0.535968
     0.187613
    0.0875996
   -0.0895068
  -0.00410119
