deg,XRT_AX,XRT_BX,XRT_AY,XRT_BY,SOT_AX,SOT_BX,SOT_AY,SOT_BY
valid,1,1,1,1,1,1,1,1,revB
offset,127.35238,115.42897,1980.2737,1985.2789,74.918004,62.688329,78.263040,83.398597
0,0.0000000,0.0000000,0.0000000,0.0000000,0.0000000,0.0000000,0.0000000,0.0000000
1,-0.0039209429,0.0053494609,0.0024507151,-0.00095488201,-0.00026245663,0.0085659548,-0.00085577460,-0.0032366751
2,-0.0084759031,0.010448460,0.0052394978,-0.0016321537,-0.0010490806,0.016997400,-0.0015841672,-0.0064195475
3,-0.013662084,0.015305486,0.0083651761,-0.0020299611,-0.0023629210,0.025296804,-0.0021863245,-0.0095475074
4,-0.019476131,0.019928950,0.011826240,-0.0021469081,-0.0042063146,0.033466748,-0.0026632789,-0.012619320
5,-0.025914132,0.024327157,0.015620834,-0.0019820636,-0.0065808797,0.041509911,-0.0030159453,-0.015633623
6,-0.032971627,0.028508283,0.019746757,-0.0015349677,-0.0094875104,0.049429060,-0.0032451172,-0.018588927
7,-0.040643614,0.032480345,0.024201454,-0.00080563658,-0.012926373,0.057227042,-0.0033514640,-0.021483617
8,-0.048924551,0.036251189,0.028982013,0.00020543467,-0.016896905,0.064906768,-0.0033355279,-0.024315945
9,-0.057808368,0.039828458,0.034085166,0.0014972699,-0.021397814,0.072471205,-0.0031977215,-0.027084039
10,-0.067288473,0.043219579,0.039507283,0.0030684120,-0.026427080,0.079923365,-0.0029383255,-0.029785894
11,-0.077357759,0.046431742,0.045244376,0.0049169235,-0.031981957,0.087266296,-0.0025574866,-0.032419379
12,-0.088008616,0.049471883,0.051292094,0.0070403896,-0.038058979,0.094503064,-0.0020552158,-0.034982233
13,-0.099232938,0.052346670,0.057645730,0.0094359225,-0.044653969,0.10163675,-0.0014313875,-0.037472066
14,-0.11102213,0.055062487,0.064300218,0.012100166,-0.051762041,0.10867045,-0.00068573775,-0.039886360
15,-0.12336714,0.057625424,0.071250139,0.015029304,-0.059377616,0.11560723,0.00018213592,-0.042222472
16,-0.13625843,0.060041265,0.078489724,0.018219067,-0.067494430,0.12245015,0.0011727751,-0.044477632
17,-0.14968602,0.062315479,0.086012859,0.021664744,-0.076105547,0.12920226,0.0022868607,-0.046648943
18,-0.16363949,0.064453213,0.093813089,0.025361193,-0.085203376,0.13586654,0.0035252122,-0.048733387
19,-0.17810800,0.066459286,0.10188363,0.029302850,-0.094779682,0.14244595,0.0048887877,-0.050727823
20,-0.19308029,0.068338186,0.11021736,0.033483751,-0.10482561,0.14894340,0.0063786824,-0.052628992
21,-0.20854470,0.070094065,0.11880687,0.037897538,-0.11533169,0.15536171,0.0079961276,-0.054433514
22,-0.22448918,0.071730739,0.12764441,0.042537482,-0.12628789,0.16170367,0.0097424889,-0.056137896
23,-0.24090132,0.073251691,0.13672194,0.047396498,-0.13768359,0.16797197,0.011619264,-0.057738530
24,-0.25776834,0.074660070,0.14603116,0.052467163,-0.14950765,0.17416921,0.013628082,-0.059231700
25,-0.27507713,0.075958698,0.15556347,0.057741738,-0.16174838,0.18029792,0.015770698,-0.060613582
26,-0.29281424,0.077150070,0.16531001,0.063212186,-0.17439364,0.18636051,0.018048991,-0.061880248
27,-0.31096591,0.078236367,0.17526168,0.068870197,-0.18743081,0.19235930,0.020464963,-0.063027670
28,-0.32951810,0.079219462,0.18540915,0.074707209,-0.20084680,0.19829650,0.023020732,-0.064051722
29,-0.34845647,0.080100927,0.19574287,0.080714430,-0.21462816,0.20417421,0.025718529,-0.064948189
30,-0.36776642,0.080882048,0.20625307,0.086882865,-0.22876101,0.20999440,0.028560696,-0.065712765
31,-0.38743312,0.081563833,0.21692982,0.093203343,-0.24323116,0.21575892,0.031549677,-0.066341061
32,-0.40744150,0.082147030,0.22776301,0.099666535,-0.25802406,0.22146951,0.034688016,-0.066828611
33,-0.42777626,0.082632138,0.23874237,0.10626299,-0.27312490,0.22712775,0.037978353,-0.067170873
34,-0.44842193,0.083019425,0.24985751,0.11298315,-0.28851858,0.23273511,0.041423414,-0.067363238
35,-0.46936285,0.083308944,0.26109792,0.11981740,-0.30418980,0.23829292,0.045026010,-0.067401034
36,-0.49058318,0.083500548,0.27245300,0.12675605,-0.32012303,0.24380236,0.048789026,-0.067279531
37,-0.51206697,0.083593914,0.28391206,0.13378943,-0.33630261,0.24926449,0.052715421,-0.066993951
38,-0.53379811,0.083588558,0.29546436,0.14090785,-0.35271273,0.25468020,0.056808213,-0.066539466
39,-0.55576040,0.083483857,0.30709914,0.14810167,-0.36933748,0.26005027,0.061070479,-0.065911215
40,-0.57793753,0.083279070,0.31880562,0.15536133,-0.38616089,0.26537532,0.065505348,-0.065104303
41,-0.60031313,0.082973356,0.33057300,0.16267734,-0.40316695,0.27065584,0.070115985,-0.064113809
42,-0.62287077,0.082565801,0.34239054,0.17004034,-0.42033966,0.27589215,0.074905596,-0.062934797
43,-0.64559395,0.082055435,0.35424754,0.17744113,-0.43766305,0.28108447,0.079877409,-0.061562320
44,-0.66846618,0.081441259,0.36613335,0.18487068,-0.45512120,0.28623284,0.085034675,-0.059991427
45,-0.69147095,0.080722264,0.37803744,0.19232016,-0.47269830,0.29133720,0.090380651,-0.058217175
46,-0.71459175,0.079897455,0.38994938,0.19978097,-0.49037865,0.29639732,0.095918600,-0.056234630
47,-0.73781210,0.078965873,0.40185885,0.20724479,-0.50814674,0.30141285,0.10165178,-0.054038883
48,-0.76111557,0.077926619,0.41375573,0.21470354,-0.52598721,0.30638332,0.10758343,-0.051625052
49,-0.78448578,0.076778876,0.42563003,0.22214949,-0.54388493,0.31130812,0.11371676,-0.048988292
50,-0.80790641,0.075521930,0.43747198,0.22957519,-0.56182503,0.31618650,0.12005497,-0.046123806
51,-0.83136126,0.074155192,0.44927202,0.23697359,-0.57979289,0.32101762,0.12660121,-0.043026852
52,-0.85483421,0.072678222,0.46102083,0.24433798,-0.59777420,0.32580049,0.13335856,-0.039692749
53,-0.87830927,0.071090746,0.47270933,0.25166206,-0.61575499,0.33053404,0.14033006,-0.036116890
54,-0.90177059,0.069392679,0.48432873,0.25893994,-0.63372161,0.33521705,0.14751869,-0.032294749
55,-0.92520246,0.067584143,0.49587052,0.26616617,-0.65166082,0.33984823,0.15492733,-0.028221891
56,-0.94858933,0.065665485,0.50732651,0.27333573,-0.66955973,0.34442617,0.16255881,-0.023893980
57,-0.97191584,0.063637299,0.51868883,0.28044410,-0.68740592,0.34894938,0.17041582,-0.019306787
58,-0.99516683,0.061500438,0.52994994,0.28748720,-0.70518738,0.35341625,0.17850099,-0.014456203
59,-1.0183273,0.059256032,0.54110269,0.29446148,-0.72289255,0.35782512,0.18681680,-0.0093382436
60,-1.0413826,0.056905503,0.55214028,0.30136388,-0.74051037,0.36217422,0.19536565,-0.0039490612
61,-1.0643181,0.054450580,0.56305631,0.30819186,-0.75803025,0.36646173,0.20414978,0.0017150466
62,-1.0871196,0.051893309,0.57384477,0.31494340,-0.77544210,0.37068575,0.21317130,0.0076576286
63,-1.1097730,0.049236063,0.58450009,0.32161702,-0.79273638,0.37484430,0.22243218,0.013882070
64,-1.1322646,0.046481559,0.59501709,0.32821178,-0.80990405,0.37893537,0.23193422,0.020391585
65,-1.1545810,0.043632859,0.60539106,0.33472729,-0.82693662,0.38295687,0.24167909,0.027189205
66,-1.1767090,0.040693378,0.61561772,0.34116370,-0.84382615,0.38690670,0.25166826,0.034277774
67,-1.1986356,0.037666897,0.62569324,0.34752171,-0.86056524,0.39078267,0.26190303,0.041659935
68,-1.2203483,0.034557556,0.63561426,0.35380255,-0.87714709,0.39458260,0.27238452,0.049338126
69,-1.2418348,0.031369866,0.64537790,0.36000804,-0.89356543,0.39830425,0.28311365,0.057314568
70,-1.2630833,0.028108706,0.65498174,0.36614050,-0.90981456,0.40194536,0.29409114,0.065591261
71,-1.2840821,0.024779322,0.66442384,0.37220282,-0.92588936,0.40550366,0.30531753,0.074169972
72,-1.3048199,0.021387327,0.67370275,0.37819838,-0.94178528,0.40897686,0.31679311,0.083052227
73,-1.3252860,0.017938697,0.68281750,0.38413112,-0.95749833,0.41236266,0.32851796,0.092239307
74,-1.3454697,0.014439762,0.69176760,0.39000548,-0.97302507,0.41565876,0.34049197,0.10173224
75,-1.3653608,0.010897206,0.70055306,0.39582640,-0.98836264,0.41886286,0.35271476,0.11153179
76,-1.3849496,0.0073180528,0.70917436,0.40159928,-1.0035087,0.42197265,0.36518572,0.12163845
77,-1.4042267,0.0037096570,0.71763247,0.40733005,-1.0184615,0.42498586,0.37790402,0.13205244
78,-1.4231830,7.9694431e-05,0.72592881,0.41302503,-1.0332197,0.42790022,0.39086858,0.14277372
79,-1.4418098,-0.0035638529,0.73406533,0.41869103,-1.0477827,0.43071346,0.40407806,0.15380192
80,-1.4600989,-0.0072127112,0.74204438,0.42433525,-1.0621502,0.43342336,0.41753087,0.16513641
81,-1.4780425,-0.010858331,0.74986881,0.42996529,-1.0763224,0.43602772,0.43122517,0.17677625
82,-1.4956330,-0.014491905,0.75754191,0.43558914,-1.0903002,0.43852436,0.44515887,0.18872021
83,-1.5128634,-0.018104388,0.76506742,0.44121513,-1.1040847,0.44091114,0.45932960,0.20096674
84,-1.5297270,-0.021686516,0.77244948,0.44685191,-1.1176776,0.44318596,0.47373474,0.21351397
85,-1.5462177,-0.025228829,0.77969268,0.45250847,-1.1310809,0.44534675,0.48837140,0.22635974
86,-1.5623295,-0.028721694,0.78680201,0.45819402,-1.1442972,0.44739148,0.50323642,0.23950156
87,-1.5780570,-0.032155331,0.79378283,0.46391807,-1.1573292,0.44931819,0.51832639,0.25293661
88,-1.5933953,-0.035519835,0.80064090,0.46969032,-1.1701804,0.45112492,0.53363762,0.26666175
89,-1.6083397,-0.038805207,0.80738233,0.47552067,-1.1828541,0.45280981,0.54916613,0.28067353
90,-1.6228859,-0.042001377,0.81401359,0.48141918,-1.1953543,0.45437101,0.56490771,0.29496815
91,-1.6370303,-0.045098236,0.82054144,0.48739603,-1.2076852,0.45580673,0.58085787,0.30954150
92,-1.6507695,-0.048085668,0.82697298,0.49346151,-1.2198513,0.45711525,0.59701185,0.32438912
93,-1.6641004,-0.050953571,0.83331559,0.49962596,-1.2318572,0.45829488,0.61336462,0.33950625
94,-1.6770206,-0.053691898,0.83957692,0.50589977,-1.2437078,0.45934399,0.62991090,0.35488778
95,-1.6895279,-0.056290684,0.84576485,0.51229330,-1.2554082,0.46026101,0.64664515,0.37052827
96,-1.7016205,-0.058740076,0.85188751,0.51881691,-1.2669638,0.46104442,0.66356156,0.38642196
97,-1.7132971,-0.061030371,0.85795322,0.52548086,-1.2783799,0.46169274,0.68065409,0.40256277
98,-1.7245567,-0.063152045,0.86397047,0.53229534,-1.2896620,0.46220456,0.69791642,0.41894430
99,-1.7353988,-0.065095786,0.86994792,0.53927036,-1.3008157,0.46257853,0.71534201,0.43555981
100,-1.7458232,-0.066852528,0.87589437,0.54641581,-1.3118467,0.46281331,0.73292407,0.45240226
101,-1.7558302,-0.068413485,0.88181871,0.55374133,-1.3227606,0.46290766,0.75065558,0.46946429
102,-1.7654203,-0.069770182,0.88772993,0.56125636,-1.3335632,0.46286035,0.76852926,0.48673825
103,-1.7745945,-0.070914491,0.89363706,0.56897004,-1.3442600,0.46267022,0.78653765,0.50421615
104,-1.7833541,-0.071838661,0.89954918,0.57689123,-1.3548567,0.46233615,0.80467303,0.52188974
105,-1.7917009,-0.072535351,0.90547537,0.58502844,-1.3653588,0.46185706,0.82292750,0.53975045
106,-1.7996369,-0.072997661,0.91142469,0.59338981,-1.3757717,0.46123191,0.84129294,0.55778943
107,-1.8071645,-0.073219165,0.91740618,0.60198311,-1.3861007,0.46045971,0.85976101,0.57599757
108,-1.8142866,-0.073193940,0.92342877,0.61081565,-1.3963510,0.45953950,0.87832322,0.59436546
109,-1.8210061,-0.072916596,0.92950134,0.61989429,-1.4065274,0.45847036,0.89697086,0.61288344
110,-1.8273266,-0.072382305,0.93563261,0.62922543,-1.4166347,0.45725140,0.91569507,0.63154159
111,-1.8332518,-0.071586829,0.94183118,0.63881491,-1.4266775,0.45588175,0.93448680,0.65032974
112,-1.8387857,-0.070526545,0.94810547,0.64866808,-1.4366599,0.45436059,0.95333685,0.66923749
113,-1.8439329,-0.069198471,0.95446372,0.65878970,-1.4465861,0.45268710,0.97223589,0.68825420
114,-1.8486979,-0.067600294,0.96091393,0.66918394,-1.4564597,0.45086052,0.99117440,0.70736901
115,-1.8530857,-0.065730387,0.96746387,0.67985438,-1.4662841,0.44888006,1.0101428,0.72657087
116,-1.8571016,-0.063587833,0.97412104,0.69080394,-1.4760624,0.44674500,1.0291313,0.74584850
117,-1.8607512,-0.061172446,0.98089265,0.70203492,-1.4857974,0.44445459,1.0481300,0.76519045
118,-1.8640402,-0.058484787,0.98778560,0.71354893,-1.4954913,0.44200812,1.0671291,0.78458510
119,-1.8669747,-0.055526183,0.99480646,0.72534690,-1.5051463,0.43940488,1.0861184,0.80402065
120,-1.8695611,-0.052298738,1.0019614,0.73742907,-1.5147640,0.43664417,1.1050878,0.82348516
121,-1.8718058,-0.048805350,1.0092564,0.74979494,-1.5243455,0.43372530,1.1240271,0.84296654
122,-1.8737157,-0.045049720,1.0166967,0.76244332,-1.5338916,0.43064758,1.1429260,0.86245258
123,-1.8752977,-0.041036361,1.0242875,0.77537226,-1.5434029,0.42741030,1.1617743,0.88193095
124,-1.8765591,-0.036770607,1.0320333,0.78857908,-1.5528792,0.42401279,1.1805614,0.90138922
125,-1.8775073,-0.032258614,1.0399383,0.80206034,-1.5623201,0.42045434,1.1992771,0.92081487
126,-1.8781499,-0.027507367,1.0480062,0.81581185,-1.5717247,0.41673427,1.2179110,0.94019532
127,-1.8784945,-0.022524681,1.0562402,0.82982868,-1.5810916,0.41285185,1.2364525,0.95951790
128,-1.8785493,-0.017319195,1.0646431,0.84410512,-1.5904191,0.40880639,1.2548913,0.97876991
129,-1.8783223,-0.011900373,1.0732170,0.85863471,-1.5997050,0.40459716,1.2732170,0.99793863
130,-1.8778216,-0.0062784993,1.0819637,0.87341025,-1.6089467,0.40022343,1.2914192,1.0170113
131,-1.8770558,-0.00046466475,1.0908843,0.88842377,-1.6181409,0.39568446,1.3094874,1.0359752
132,-1.8760333,0.0055292378,1.0999797,0.90366660,-1.6272842,0.39097950,1.3274115,1.0548175
133,-1.8747627,0.011690528,1.1092497,0.91912929,-1.6363726,0.38610780,1.3451812,1.0735255
134,-1.8732528,0.018005753,1.1186941,0.93480170,-1.6454018,0.38106858,1.3627862,1.0920866
135,-1.8715123,0.024460702,1.1283118,0.95067297,-1.6543669,0.37586107,1.3802165,1.1104881
136,-1.8695502,0.031040428,1.1381014,0.96673155,-1.6632628,0.37048446,1.3974620,1.1287174
137,-1.8673754,0.037729267,1.1480606,0.98296522,-1.6720838,0.36493797,1.4145128,1.1467622
138,-1.8649970,0.044510862,1.1581870,0.99936107,-1.6808239,0.35922080,1.4313591,1.1646099
139,-1.8624239,0.051368188,1.1684772,1.0159056,-1.6894769,0.35333212,1.4479911,1.1822484
140,-1.8596654,0.058283578,1.1789274,1.0325846,-1.6980360,0.34727112,1.4643992,1.1996654
141,-1.8567305,0.065238757,1.1895335,1.0493834,-1.7064942,0.34103699,1.4805741,1.2168490
142,-1.8536284,0.072214868,1.2002904,1.0662866,-1.7148440,0.33462891,1.4965063,1.2337874
143,-1.8503682,0.079192508,1.2111928,1.0832785,-1.7230779,0.32804607,1.5121867,1.2504687
144,-1.8469591,0.086151762,1.2222347,1.1003425,-1.7311879,0.32128765,1.5276064,1.2668817
145,-1.8434101,0.093072241,1.2334095,1.1174618,-1.7391658,0.31435286,1.5427565,1.2830148
146,-1.8397304,0.099933122,1.2447104,1.1346192,-1.7470031,0.30724091,1.5576282,1.2988571
147,-1.8359290,0.10671318,1.2561297,1.1517968,-1.7546911,0.29995103,1.5722133,1.3143976
148,-1.8320149,0.11339085,1.2676595,1.1689764,-1.7622210,0.29248247,1.5865033,1.3296257
149,-1.8279969,0.11994424,1.2792911,1.1861397,-1.7695837,0.28483449,1.6004902,1.3445310
150,-1.8238841,0.12635120,1.2910157,1.2032677,-1.7767700,0.27700641,1.6141662,1.3591034
151,-1.8196850,0.13258936,1.3028237,1.2203413,-1.7837706,0.26899756,1.6275235,1.3733329
152,-1.8154085,0.13863617,1.3147052,1.2373411,-1.7905760,0.26080731,1.6405548,1.3872100
153,-1.8110630,0.14446897,1.3266499,1.2542476,-1.7971768,0.25243508,1.6532528,1.4007253
154,-1.8066570,0.15006501,1.3386471,1.2710409,-1.8035633,0.24388034,1.6656105,1.4138699
155,-1.8021988,0.15540151,1.3506856,1.2877011,-1.8097261,0.23514261,1.6776212,1.4266350
156,-1.7976966,0.16045572,1.3627540,1.3042083,-1.8156555,0.22622148,1.6892784,1.4390123
157,-1.7931584,0.16520498,1.3748402,1.3205424,-1.8213420,0.21711660,1.7005758,1.4509937
158,-1.7885920,0.16962674,1.3869323,1.3366832,-1.8267761,0.20782769,1.7115075,1.4625716
159,-1.7840053,0.17369862,1.3990177,1.3526107,-1.8319484,0.19835456,1.7220676,1.4737384
160,-1.7794058,0.17739849,1.4110835,1.3683050,-1.8368497,0.18869710,1.7322508,1.4844874
161,-1.7748007,0.18070449,1.4231169,1.3837460,-1.8414708,0.17885529,1.7420517,1.4948117
162,-1.7701972,0.18359512,1.4351044,1.3989141,-1.8458027,0.16882921,1.7514654,1.5047052
163,-1.7656024,0.18604922,1.4470327,1.4137896,-1.8498366,0.15861906,1.7604872,1.5141619
164,-1.7610228,0.18804612,1.4588880,1.4283533,-1.8535640,0.14822514,1.7691127,1.5231762
165,-1.7564651,0.18956561,1.4706565,1.4425860,-1.8569765,0.13764786,1.7773378,1.5317432
166,-1.7519355,0.19058803,1.4823243,1.4564690,-1.8600661,0.12688779,1.7851585,1.5398580
167,-1.7474401,0.19109431,1.4938772,1.4699837,-1.8628250,0.11594560,1.7925713,1.5475162
168,-1.7429847,0.19106603,1.5053012,1.4831123,-1.8652458,0.10482212,1.7995729,1.5547140
169,-1.7385748,0.19048546,1.5165821,1.4958369,-1.8673214,0.093518320,1.8061602,1.5614477
170,-1.7342157,0.18933559,1.5277055,1.5081405,-1.8690450,0.082035332,1.8123304,1.5677143
171,-1.7299126,0.18760022,1.5386573,1.5200063,-1.8704102,0.070374440,1.8180811,1.5735110
172,-1.7256700,0.18526395,1.5494233,1.5314181,-1.8714111,0.058537103,1.8234101,1.5788354
173,-1.7214926,0.18231227,1.5599893,1.5423604,-1.8720422,0.046524950,1.8283154,1.5836856
174,-1.7173845,0.17873159,1.5703413,1.5528180,-1.8722983,0.034339792,1.8327953,1.5880602
175,-1.7133496,0.17450928,1.5804652,1.5627767,-1.8721748,0.021983627,1.8368486,1.5919580
176,-1.7093916,0.16963367,1.5903474,1.5722226,-1.8716675,0.0094586450,1.8404740,1.5953782
177,-1.7055138,0.16409416,1.5999741,1.5811427,-1.8707728,-0.0032327657,1.8436708,1.5983207
178,-1.7017191,0.15788120,1.6093319,1.5895246,-1.8694875,-0.016088013,1.8464384,1.6007855
179,-1.6980102,0.15098634,1.6184074,1.5973566,-1.8678089,-0.029104296,1.8487766,1.6027731
180,-1.6943897,0.14340227,1.6271878,1.6046280,-1.8657348,-0.042278600,1.8506852,1.6042845
181,-1.6908595,0.13512282,1.6356602,1.6113285,-1.8632638,-0.055607692,1.8521645,1.6053209
182,-1.6874214,0.12614302,1.6438121,1.6174489,-1.8603946,-0.069088116,1.8532151,1.6058840
183,-1.6840768,0.11645913,1.6516315,1.6229807,-1.8571268,-0.082716191,1.8538376,1.6059760
184,-1.6808269,0.10606859,1.6591064,1.6279163,-1.8534605,-0.096488003,1.8540331,1.6055992
185,-1.6776724,0.094970141,1.6662255,1.6322488,-1.8493962,-0.11039941,1.8538028,1.6047566
186,-1.6746138,0.083163765,1.6729775,1.6359723,-1.8449351,-0.12444602,1.8531483,1.6034513
187,-1.6716512,0.070650733,1.6793520,1.6390818,-1.8400789,-0.13862323,1.8520713,1.6016869
188,-1.6687844,0.057433608,1.6853384,1.6415730,-1.8348300,-0.15292617,1.8505737,1.5994674
189,-1.6660130,0.043516254,1.6909270,1.6434427,-1.8291911,-0.16734973,1.8486579,1.5967969
190,-1.6633360,0.028903842,1.6961085,1.6446884,-1.8231658,-0.18188858,1.8463261,1.5936803
191,-1.6607522,0.013602853,1.7008737,1.6453088,-1.8167578,-0.19653713,1.8435812,1.5901223
192,-1.6582602,-0.0023789192,1.7052145,1.6453031,-1.8099718,-0.21128953,1.8404260,1.5861283
193,-1.6558582,-0.019032376,1.7091226,1.6446717,-1.8028128,-0.22613973,1.8368636,1.5817038
194,-1.6535439,-0.036347115,1.7125909,1.6434159,-1.7952863,-0.24108141,1.8328973,1.5768549
195,-1.6513148,-0.054311438,1.7156122,1.6415376,-1.7873985,-0.25610799,1.8285307,1.5715876
196,-1.6491683,-0.072912366,1.7181803,1.6390399,-1.7791559,-0.27121270,1.8237674,1.5659086
197,-1.6471012,-0.092135649,1.7202892,1.6359267,-1.7705657,-0.28638850,1.8186114,1.5598245
198,-1.6451100,-0.11196578,1.7219338,1.6322026,-1.7616353,-0.30162813,1.8130668,1.5533424
199,-1.6431910,-0.13238603,1.7231093,1.6278734,-1.7523729,-0.31692409,1.8071379,1.5464695
200,-1.6413402,-0.15337845,1.7238116,1.6229454,-1.7427869,-0.33226866,1.8008291,1.5392136
201,-1.6395533,-0.17492390,1.7240370,1.6174259,-1.7328862,-0.34765390,1.7941450,1.5315822
202,-1.6378256,-0.19700210,1.7237826,1.6113229,-1.7226801,-0.36307167,1.7870906,1.5235834
203,-1.6361523,-0.21959160,1.7230459,1.6046454,-1.7121783,-0.37851359,1.7796708,1.5152255
204,-1.6345281,-0.24266991,1.7218252,1.5974030,-1.7013908,-0.39397110,1.7718906,1.5065168
205,-1.6329477,-0.26621343,1.7201190,1.5896061,-1.6903282,-0.40943543,1.7637553,1.4974660
206,-1.6314052,-0.29019757,1.7179268,1.5812657,-1.6790010,-0.42489763,1.7552705,1.4880818
207,-1.6298948,-0.31459673,1.7152485,1.5723937,-1.6674204,-0.44034857,1.7464416,1.4783732
208,-1.6284101,-0.33938438,1.7120845,1.5630025,-1.6555976,-0.45577894,1.7372743,1.4683492
209,-1.6269448,-0.36453309,1.7084359,1.5531054,-1.6435441,-0.47117926,1.7277745,1.4580192
210,-1.6254921,-0.39001458,1.7043042,1.5427159,-1.6312717,-0.48653992,1.7179481,1.4473925
211,-1.6240451,-0.41579978,1.6996918,1.5318485,-1.6187923,-0.50185114,1.7078012,1.4364786
212,-1.6225967,-0.44185883,1.6946011,1.5205180,-1.6061181,-0.51710302,1.6973399,1.4252871
213,-1.6211396,-0.46816120,1.6890357,1.5087398,-1.5932613,-0.53228553,1.6865705,1.4138277
214,-1.6196663,-0.49467571,1.6829991,1.4965297,-1.5802342,-0.54738852,1.6754994,1.4021101
215,-1.6181690,-0.52137057,1.6764959,1.4839040,-1.5670493,-0.56240176,1.6641332,1.3901441
216,-1.6166398,-0.54821347,1.6695307,1.4708796,-1.5537191,-0.57731491,1.6524783,1.3779398
217,-1.6150709,-0.57517161,1.6621089,1.4574735,-1.5402560,-0.59211756,1.6405415,1.3655069
218,-1.6134539,-0.60221179,1.6542364,1.4437030,-1.5266726,-0.60679924,1.6283294,1.3528556
219,-1.6117807,-0.62930041,1.6459195,1.4295861,-1.5129812,-0.62134944,1.6158488,1.3399957
220,-1.6100427,-0.65640363,1.6371648,1.4151407,-1.4991945,-0.63575758,1.6031068,1.3269374
221,-1.6082315,-0.68348731,1.6279795,1.4003849,-1.4853245,-0.65001309,1.5901102,1.3136905
222,-1.6063385,-0.71051718,1.6183714,1.3853373,-1.4713835,-0.66410536,1.5768660,1.3002652
223,-1.6043549,-0.73745885,1.6083483,1.3700165,-1.4573836,-0.67802381,1.5633813,1.2866713
224,-1.6022719,-0.76427786,1.5979187,1.3544410,-1.4433366,-0.69175787,1.5496632,1.2729188
225,-1.6000809,-0.79093978,1.5870913,1.3386296,-1.4292542,-0.70529699,1.5357190,1.2590177
226,-1.5977728,-0.81741026,1.5758754,1.3226012,-1.4151477,-0.71863069,1.5215557,1.2449777
227,-1.5953389,-0.84365508,1.5642802,1.3063745,-1.4010285,-0.73174853,1.5071807,1.2308086
228,-1.5927702,-0.86964024,1.5523156,1.2899682,-1.3869073,-0.74464016,1.4926013,1.2165201
229,-1.5900579,-0.89533199,1.5399917,1.2734010,-1.3727947,-0.75729533,1.4778247,1.2021220
230,-1.5871931,-0.92069692,1.5273187,1.2566915,-1.3587012,-0.76970387,1.4628583,1.1876236
231,-1.5841669,-0.94570201,1.5143073,1.2398579,-1.3446364,-0.78185576,1.4477095,1.1730344
232,-1.5809707,-0.97031468,1.5009682,1.2229185,-1.3306101,-0.79374110,1.4323857,1.1583638
233,-1.5775956,-0.99450288,1.4873124,1.2058913,-1.3166314,-0.80535015,1.4168943,1.1436209
234,-1.5740331,-1.0182351,1.4733512,1.1887940,-1.3027090,-0.81667334,1.4012426,1.1288149
235,-1.5702746,-1.0414805,1.4590958,1.1716440,-1.2888513,-0.82770127,1.3854381,1.1139546
236,-1.5663116,-1.0642089,1.4445579,1.1544584,-1.2750662,-0.83842474,1.3694882,1.0990489
237,-1.5621360,-1.0863909,1.4297490,1.1372540,-1.2613610,-0.84883477,1.3534004,1.0841065
238,-1.5577395,-1.1079978,1.4146809,1.1200470,-1.2477428,-0.85892259,1.3371820,1.0691358
239,-1.5531141,-1.1290018,1.3993652,1.1028535,-1.2342181,-0.86867968,1.3208404,1.0541452
240,-1.5482519,-1.1493761,1.3838141,1.0856889,-1.2207927,-0.87809776,1.3043832,1.0391428
241,-1.5431454,-1.1690946,1.3680392,1.0685684,-1.2074722,-0.88716883,1.2878175,1.0241368
242,-1.5377871,-1.1881323,1.3520526,1.0515063,-1.1942616,-0.89588516,1.2711509,1.0091349
243,-1.5321697,-1.2064655,1.3358661,1.0345169,-1.1811653,-0.90423930,1.2543906,0.99414472
244,-1.5262863,-1.2240711,1.3194917,1.0176136,-1.1681872,-0.91222413,1.2375440,0.97917380
245,-1.5201300,-1.2409275,1.3029412,1.0008094,-1.1553307,-0.91983283,1.2206184,0.96422939
246,-1.5136944,-1.2570141,1.2862264,0.98411657,-1.1425986,-0.92705889,1.2036211,0.94931857
247,-1.5069732,-1.2723114,1.2693591,0.96754701,-1.1299933,-0.93389617,1.1865592,0.93444824
248,-1.4999605,-1.2868013,1.2523509,0.95111188,-1.1175165,-0.94033886,1.1694400,0.91962507
249,-1.4926506,-1.3004669,1.2352133,0.93482176,-1.1051696,-0.94638150,1.1522707,0.90485555
250,-1.4850382,-1.3132924,1.2179577,0.91868660,-1.0929532,-0.95201902,1.1350584,0.89014596
251,-1.4771183,-1.3252636,1.2005954,0.90271572,-1.0808676,-0.95724669,1.1178101,0.87550236
252,-1.4688861,-1.3363674,1.1831374,0.88691778,-1.0689124,-0.96206021,1.1005329,0.86093063
253,-1.4603374,-1.3465922,1.1655948,0.87130080,-1.0570868,-0.96645564,1.0832337,0.84643640
254,-1.4514681,-1.3559275,1.1479782,0.85587214,-1.0453896,-0.97042945,1.0659195,0.83202513
255,-1.4422747,-1.3643645,1.1302982,0.84063850,-1.0338190,-0.97397850,1.0485972,0.81770203
256,-1.4327539,-1.3718955,1.1125652,0.82560593,-1.0223726,-0.97710009,1.0312736,0.80347213
257,-1.4229028,-1.3785145,1.0947893,0.81077982,-1.0110477,-0.97979191,1.0139554,0.78934022
258,-1.4127191,-1.3842165,1.0769804,0.79616489,-0.99984129,-0.98205209,0.99664929,0.77531089
259,-1.4022006,-1.3889983,1.0591482,0.78176522,-0.98874963,-0.98387915,0.97936194,0.76138853
260,-1.3913458,-1.3928578,1.0413021,0.76758425,-0.97776876,-0.98527209,0.96209988,0.74757729
261,-1.3801535,-1.3957944,1.0234514,0.75362477,-0.96689429,-0.98623029,0.94486960,0.73388113
262,-1.3686228,-1.3978090,1.0056049,0.73988895,-0.95612144,-0.98675360,0.92767750,0.72030379
263,-1.3567536,-1.3989036,0.98777123,0.72637834,-0.94544511,-0.98684226,0.91052991,0.70684881
264,-1.3445459,-1.3990818,0.96995890,0.71309388,-0.93485986,-0.98649699,0.89343309,0.69351952
265,-1.3320002,-1.3983486,0.95217599,0.70003593,-0.92435994,-0.98571890,0.87639319,0.68031905
266,-1.3191177,-1.3967100,0.93443036,0.68720426,-0.91393934,-0.98450955,0.85941631,0.66725032
267,-1.3058998,-1.3941737,0.91672960,0.67459810,-0.90359178,-0.98287093,0.84250845,0.65431606
268,-1.2923485,-1.3907484,0.89908101,0.66221612,-0.89331076,-0.98080545,0.82567549,0.64151878
269,-1.2784662,-1.3864442,0.88149164,0.65005647,-0.88308957,-0.97831594,0.80892327,0.62886083
270,-1.2642558,-1.3812724,0.86396823,0.63811681,-0.87292134,-0.97540564,0.79225749,0.61634434
271,-1.2497207,-1.3752456,0.84651728,0.62639431,-0.86279905,-0.97207823,0.77568378,0.60397127
272,-1.2348646,-1.3683773,0.82914500,0.61488568,-0.85271554,-0.96833777,0.75920764,0.59174337
273,-1.2196921,-1.3606826,0.81185735,0.60358723,-0.84266360,-0.96418873,0.74283451,0.57966224
274,-1.2042078,-1.3521772,0.79466002,0.59249481,-0.83263593,-0.95963598,0.72656967,0.56772928
275,-1.1884170,-1.3428781,0.77755843,0.58160392,-0.82262520,-0.95468475,0.71041835,0.55594572
276,-1.1723255,-1.3328035,0.76055777,0.57090970,-0.81262409,-0.94934069,0.69438562,0.54431263
277,-1.1559395,-1.3219722,0.74366296,0.56040696,-0.80262532,-0.94360979,0.67847647,0.53283089
278,-1.1392657,-1.3104043,0.72687871,0.55009020,-0.79262162,-0.93749841,0.66269575,0.52150125
279,-1.1223112,-1.2981204,0.71020947,0.53995365,-0.78260586,-0.93101324,0.64704822,0.51032426
280,-1.1050837,-1.2851424,0.69365948,0.52999130,-0.77257100,-0.92416134,0.63153849,0.49930035
281,-1.0875912,-1.2714926,0.67723275,0.52019693,-0.76251014,-0.91695007,0.61617106,0.48842979
282,-1.0698423,-1.2571943,0.66093311,0.51056411,-0.75241657,-0.90938712,0.60095032,0.47771270
283,-1.0518458,-1.2422713,0.64476416,0.50108627,-0.74228377,-0.90148048,0.58588052,0.46714906
284,-1.0336113,-1.2267482,0.62872934,0.49175672,-0.73210546,-0.89323844,0.57096577,0.45673871
285,-1.0151485,-1.2106502,0.61283190,0.48256865,-0.72187559,-0.88466954,0.55621007,0.44648136
286,-0.99646777,-1.1940028,0.59707492,0.47351520,-0.71158844,-0.87578260,0.54161727,0.43637660
287,-0.97757970,-1.1768322,0.58146132,0.46458945,-0.70123856,-0.86658671,0.52719111,0.42642388
288,-0.95849540,-1.1591650,0.56599390,0.45578450,-0.69082084,-0.85709116,0.51293516,0.41662255
289,-0.93922632,-1.1410282,0.55067529,0.44709343,-0.68033055,-0.84730547,0.49885288,0.40697182
290,-0.91978433,-1.1224490,0.53550803,0.43850941,-0.66976333,-0.83723938,0.48494757,0.39747083
291,-0.90018165,-1.1034549,0.52049453,0.43002565,-0.65911520,-0.82690280,0.47122241,0.38811857
292,-0.88043087,-1.0840736,0.50563711,0.42163548,-0.64838265,-0.81630584,0.45768042,0.37891396
293,-0.86054493,-1.0643331,0.49093800,0.41333234,-0.63756257,-0.80545873,0.44432448,0.36985581
294,-0.84053708,-1.0442614,0.47639934,0.40510985,-0.62665236,-0.79437188,0.43115733,0.36094285
295,-0.82042092,-1.0238864,0.46202323,0.39696180,-0.61564986,-0.78305580,0.41818157,0.35217371
296,-0.80021036,-1.0032362,0.44781170,0.38888217,-0.60455344,-0.77152112,0.40539962,0.34354694
297,-0.77991957,-0.98233872,0.43376674,0.38086518,-0.59336197,-0.75977857,0.39281380,0.33506102
298,-0.75956303,-0.96122182,0.41989032,0.37290530,-0.58207483,-0.74783893,0.38042625,0.32671435
299,-0.73915546,-0.93991318,0.40618437,0.36499727,-0.57069197,-0.73571308,0.36823896,0.31850527
300,-0.71871184,-0.91844025,0.39265084,0.35713611,-0.55921387,-0.72341190,0.35625380,0.31043203
301,-0.69824738,-0.89683023,0.37929164,0.34931717,-0.54764158,-0.71094633,0.34447245,0.30249286
302,-0.67777750,-0.87511001,0.36610874,0.34153612,-0.53597671,-0.69832731,0.33289647,0.29468589
303,-0.65731780,-0.85330610,0.35310408,0.33378896,-0.52422144,-0.68556578,0.32152727,0.28700924
304,-0.63688408,-0.83144464,0.34027966,0.32607207,-0.51237853,-0.67267263,0.31036609,0.27946094
305,-0.61649229,-0.80955129,0.32763752,0.31838220,-0.50045133,-0.65965876,0.29941404,0.27203901
306,-0.59615852,-0.78765124,0.31517972,0.31071647,-0.48844376,-0.64653498,0.28867207,0.26474141
307,-0.57589900,-0.76576914,0.30290840,0.30307241,-0.47636032,-0.63331203,0.27814100,0.25756609
308,-0.55573004,-0.74392910,0.29082575,0.29544797,-0.46420610,-0.62000060,0.26782149,0.25051093
309,-0.53566805,-0.72215459,0.27893401,0.28784149,-0.45198676,-0.60661124,0.25771406,0.24357381
310,-0.51572950,-0.70046847,0.26723553,0.28025175,-0.43970853,-0.59315442,0.24781908,0.23675259
311,-0.49593092,-0.67889290,0.25573270,0.27267794,-0.42737821,-0.57964046,0.23813678,0.23004508
312,-0.47628885,-0.65744938,0.24442801,0.26511970,-0.41500315,-0.56607955,0.22866727,0.22344911
313,-0.45681986,-0.63615864,0.23332404,0.25757709,-0.40259124,-0.55248171,0.21941049,0.21696248
314,-0.43754049,-0.61504068,0.22242344,0.25005062,-0.39015092,-0.53885681,0.21036626,0.21058297
315,-0.41846726,-0.59411471,0.21172897,0.24254121,-0.37769115,-0.52521452,0.20153427,0.20430838
316,-0.39961663,-0.57339915,0.20124348,0.23505023,-0.36522138,-0.51156434,0.19291407,0.19813649
317,-0.38100499,-0.55291158,0.19096990,0.22757947,-0.35275156,-0.49791555,0.18450509,0.19206509
318,-0.36264865,-0.53266876,0.18091127,0.22013115,-0.34029212,-0.48427721,0.17630663,0.18609197
319,-0.34456381,-0.51268659,0.17107072,0.21270788,-0.32785394,-0.47065816,0.16831788,0.18021494
320,-0.32676653,-0.49298011,0.16145148,0.20531272,-0.31544834,-0.45706701,0.16053788,0.17443180
321,-0.30927272,-0.47356346,0.15205684,0.19794909,-0.30308703,-0.44351211,0.15296558,0.16874040
322,-0.29209814,-0.45444993,0.14289022,0.19062083,-0.29078215,-0.43000156,0.14559982,0.16313858
323,-0.27525834,-0.43565189,0.13395510,0.18333211,-0.27854618,-0.41654321,0.13843932,0.15762421
324,-0.25876868,-0.41718085,0.12525504,0.17608752,-0.26639193,-0.40314462,0.13148271,0.15219519
325,-0.24264429,-0.39904738,0.11679369,0.16889194,-0.25433257,-0.38981308,0.12472849,0.14684945
326,-0.22690005,-0.38126119,0.10857475,0.16175063,-0.24238150,-0.37655560,0.11817511,0.14158494
327,-0.21155059,-0.36383110,0.10060201,0.15466914,-0.23055243,-0.36337889,0.11182090,0.13639967
328,-0.19661025,-0.34676501,0.092879306,0.14765333,-0.21885929,-0.35028938,0.10566410,0.13129167
329,-0.18209308,-0.33006998,0.085410512,0.14070931,-0.20731618,-0.33729319,0.099702898,0.12625900
330,-0.16801282,-0.31375217,0.078199561,0.13384348,-0.19593742,-0.32439613,0.093935375,0.12129980
331,-0.15438286,-0.29781691,0.071250411,0.12706246,-0.18473744,-0.31160372,0.088359558,0.11641222
332,-0.14121626,-0.28226866,0.064567050,0.12037311,-0.17373078,-0.29892115,0.082973406,0.11159449
333,-0.12852571,-0.26711107,0.058153475,0.11378244,-0.16293206,-0.28635333,0.077774819,0.10684488
334,-0.11632353,-0.25234695,0.052013690,0.10729767,-0.15235597,-0.27390483,0.072761641,0.10216171
335,-0.10462162,-0.23797835,0.046151695,0.10092616,-0.14201717,-0.26157992,0.067931667,0.097543379
336,-0.093431509,-0.22400652,0.040571469,0.094675368,-0.13193032,-0.24938254,0.063282653,0.092988333
337,-0.082764274,-0.21043197,0.035276963,0.088552879,-0.12211003,-0.23731636,0.058812315,0.088495090
338,-0.072630567,-0.19725448,0.030272089,0.082566338,-0.11257082,-0.22538469,0.054518339,0.084062234
339,-0.063040591,-0.18447312,0.025560704,0.076723440,-0.10332709,-0.21359056,0.050398386,0.079688424
340,-0.054004084,-0.17208628,0.021146600,0.071031902,-0.094393069,-0.20193670,0.046450099,0.075372389
341,-0.045530314,-0.16009171,0.017033492,0.065499438,-0.085782826,-0.19042551,0.042671108,0.071112937
342,-0.037628063,-0.14848653,0.013225002,0.060133735,-0.077510196,-0.17905911,0.039059036,0.066908956
343,-0.030305618,-0.13726728,0.0097246491,0.054942422,-0.069588767,-0.16783933,0.035611507,0.062759416
344,-0.023570762,-0.12642991,0.0065358342,0.049933051,-0.062031842,-0.15676770,0.032326150,0.058663371
345,-0.017430762,-0.11596987,0.0036618276,0.045113066,-0.054852413,-0.14584547,0.029200608,0.054619964
346,-0.011892364,-0.10588209,0.0011057554,0.040489783,-0.048063125,-0.13507361,0.026232539,0.050628428
347,-0.0069617810,-0.096161038,-0.0011294139,0.036070359,-0.041676250,-0.12445281,0.023419630,0.046688090
348,-0.0026446894,-0.086800749,-0.0030408822,0.031861774,-0.035703656,-0.11398351,0.020759596,0.042798371
349,0.0010537799,-0.077794857,-0.0046260355,0.027870804,-0.030156779,-0.10366589,0.018250189,0.038958790
350,0.0041290464,-0.069136629,-0.0058824564,0.024103995,-0.025046596,-0.093499865,0.015889204,0.035168967
351,0.0065770860,-0.060819000,-0.0068079372,0.020567648,-0.020383597,-0.083485129,0.013674487,0.031428624
352,0.0083944347,-0.052834604,-0.0074004924,0.017267787,-0.016177764,-0.073621128,0.011603937,0.027737589
353,0.0095781931,-0.045175812,-0.0076583708,0.014210148,-0.012438540,-0.063907089,0.0096755131,0.024095797
354,0.010126029,-0.037834761,-0.0075800674,0.011400150,-0.0091748133,-0.054342023,0.0078872418,0.020503291
355,0.010036180,-0.030803391,-0.0071643353,0.0088428807,-0.0063948900,-0.044924736,0.0062372210,0.016960227
356,0.0093074545,-0.024073481,-0.0064101964,0.0065430767,-0.0041064766,-0.035653836,0.0047236261,0.013466873
357,0.0079392349,-0.017636673,-0.0053169521,0.0045051058,-0.0023166597,-0.026527749,0.0033447147,0.010023614
358,0.0059314749,-0.011484513,-0.0038841938,0.0027329505,-0.0010318889,-0.017544721,0.0020988321,0.0066309504
359,0.0032847009,-0.0056084803,-0.0021118122,0.0012301935,-0.00025795981,-0.0087028365,0.00098441640,0.0032895020
360,1.0048055e-08,-1.5275162e-08,-6.3621428e-09,3.0479441e-09,4.3627324e-12,-2.4077572e-08,2.5652440e-09,9.1001624e-09
