deg,XRT_AX,XRT_BX,XRT_AY,XRT_BY,SOT_AX,SOT_BX,SOT_AY,SOT_BY
valid,1,1,1,1,1,1,1,1,revB
offset,124.32157,108.35906,1979.4318,1983.6568,57.524109,41.016829,91.850724,96.059120
0,0.0000000,0.0000000,0.0000000,0.0000000,0.0000000,0.0000000,0.0000000,0.0000000
1,0.015086209,0.016635625,-6.8253700e-05,-0.00072535433,0.020592768,0.017215078,-0.0050099511,-0.0056486188
2,0.029798853,0.033398943,-9.5992793e-05,-0.0015703289,0.040439059,0.034355677,-0.0099527213,-0.011235627
3,0.044113672,0.050281120,-8.9813263e-05,-0.0025407498,0.059494448,0.051406559,-0.014820263,-0.016752854
4,0.058006697,0.067273173,-5.5876769e-05,-0.0036416146,0.077715892,0.068352780,-0.019604227,-0.022191752
5,0.071454305,0.084365977,1.0512099e-07,-0.0048770837,0.095061830,0.085179721,-0.024295986,-0.027543422
6,0.084433270,0.10155028,7.2885489e-05,-0.0062504738,0.11149229,0.10187311,-0.028886654,-0.032798644
7,0.096920819,0.11881673,0.00015769538,-0.0077642545,0.12696896,0.11841906,-0.033367112,-0.037947905
8,0.10889468,0.13615584,0.00025025583,-0.0094200461,0.14145533,0.13480408,-0.037728031,-0.042981431
9,0.12033313,0.15355806,0.00034678861,-0.011218620,0.15491671,0.15101513,-0.041959895,-0.047889214
10,0.13121507,0.17101376,0.00044402561,-0.013159903,0.16732038,0.16703959,-0.046053029,-0.052661049
11,0.14152002,0.18851323,0.00053921689,-0.015242977,0.17863563,0.18286534,-0.049997620,-0.057286560
12,0.15122822,0.20604673,0.00063013734,-0.017466095,0.18883382,0.19848077,-0.053783744,-0.061755238
13,0.16032066,0.22360446,0.00071509194,-0.019826682,0.19788849,0.21387478,-0.057401393,-0.066056469
14,0.16877910,0.24117660,0.00079291967,-0.022321349,0.20577540,0.22903679,-0.060840497,-0.070179570
15,0.17658615,0.25875332,0.00086299592,-0.024945909,0.21247258,0.24395680,-0.064090956,-0.074113824
16,0.18372529,0.27632481,0.00092523355,-0.027695389,0.21796038,0.25862539,-0.067142659,-0.077848506
17,0.19018092,0.29388124,0.00098008250,-0.030564049,0.22222154,0.27303370,-0.069985516,-0.081372925
18,0.19593839,0.31141282,0.0010285280,-0.033545401,0.22524119,0.28717348,-0.072609478,-0.084676449
19,0.20098402,0.32890982,0.0010720874,-0.036632232,0.22700694,0.30103712,-0.075004570,-0.087748547
20,0.20530517,0.34636254,0.0011128054,-0.039816624,0.22750885,0.31461759,-0.077160908,-0.090578810
21,0.20889026,0.36376134,0.0011532483,-0.043089980,0.22673947,0.32790853,-0.079068731,-0.093156994
22,0.21172878,0.38109669,0.0011964963,-0.046443052,0.22469388,0.34090418,-0.080718422,-0.095473044
23,0.21381132,0.39835912,0.0012461351,-0.049865966,0.22136968,0.35359944,-0.082100535,-0.097517129
24,0.21512961,0.41553927,0.0013062456,-0.053348257,0.21676697,0.36598988,-0.083205817,-0.099279670
25,0.21567656,0.43262792,0.0013813926,-0.056878891,0.21088839,0.37807167,-0.084025231,-0.10075137
26,0.21544623,0.44961594,0.0014766121,-0.060446308,0.20373909,0.38984166,-0.084549981,-0.10192324
27,0.21443386,0.46649437,0.0015973977,-0.064038447,0.19532671,0.40129735,-0.084771532,-0.10278664
28,0.21263594,0.48325437,0.0017496850,-0.067642784,0.18566136,0.41243685,-0.084681632,-0.10333329
29,0.21005013,0.49988729,0.0019398359,-0.071246370,0.17475560,0.42325895,-0.084272333,-0.10355528
30,0.20667534,0.51638463,0.0021746205,-0.074835864,0.16262439,0.43376305,-0.083536012,-0.10344515
31,0.20251173,0.53273807,0.0024611996,-0.078397572,0.14928508,0.44394916,-0.082465388,-0.10299585
32,0.19756066,0.54893950,0.0028071044,-0.081917485,0.13475735,0.45381792,-0.081053539,-0.10220081
33,0.19182475,0.56498098,0.0032202163,-0.085381320,0.11906313,0.46337059,-0.079293922,-0.10105391
34,0.18530786,0.58085481,0.0037087457,-0.088774557,0.10222659,0.47260899,-0.077180389,-0.099549566
35,0.17801507,0.59655348,0.0042812092,-0.092082478,0.084274046,0.48153552,-0.074707199,-0.097682682
36,0.16995268,0.61206972,0.0049464072,-0.095290214,0.065233922,0.49015316,-0.071869035,-0.095448707
37,0.16112820,0.62739649,0.0057133996,-0.098382775,0.045136647,0.49846542,-0.068661016,-0.092843632
38,0.15155037,0.64252697,0.0065914812,-0.10134510,0.024014597,0.50647633,-0.065078708,-0.089864007
39,0.14122907,0.65745461,0.0075901569,-0.10416209,0.0019020085,0.51419044,-0.061118136,-0.086506953
40,0.13017538,0.67217309,0.0087191155,-0.10681866,-0.021165104,0.52161277,-0.056775791,-0.082770172
41,0.11840151,0.68667636,0.0099882041,-0.10929977,-0.045149041,0.52874880,-0.052048642,-0.078651949
42,0.10592079,0.70095861,0.011407401,-0.11159045,-0.070010510,0.53560448,-0.046934139,-0.074151167
43,0.092747654,0.71501431,0.012986787,-0.11367588,-0.095708721,0.54218614,-0.041430224,-0.069267303
44,0.078897601,0.72883820,0.014736523,-0.11554140,-0.12220149,0.54850052,-0.035535330,-0.064000437
45,0.064387162,0.74242527,0.016666816,-0.11717253,-0.14944534,0.55455471,-0.029248387,-0.058351246
46,0.049233875,0.75577081,0.018787897,-0.11855506,-0.17739562,0.56035616,-0.022568824,-0.052321012
47,0.033456245,0.76887036,0.021109988,-0.11967505,-0.20600658,0.56591261,-0.015496570,-0.045911609
48,0.017073710,0.78171973,0.023643279,-0.12051886,-0.23523152,0.57123208,-0.0080320556,-0.039125508
49,0.00010659682,0.79431504,0.026397898,-0.12107322,-0.26502288,0.57632288,-0.00017620646,-0.031965764
50,-0.017423916,0.80665266,0.029383881,-0.12132523,-0.29533238,0.58119349,0.0080695547,-0.024436012
51,-0.035495844,0.81872923,0.032611151,-0.12126241,-0.32611110,0.58585263,0.016703314,-0.016540458
52,-0.054086438,0.83054168,0.036089482,-0.12087271,-0.35730962,0.59030916,0.025722672,-0.0082838632
53,-0.073172238,0.84208720,0.039828479,-0.12014459,-0.38887814,0.59457208,0.035124748,0.00032846278
54,-0.092729111,0.85336326,0.043837550,-0.11906698,-0.42076658,0.59865049,0.044906190,0.0092906799
55,-0.11273231,0.86436759,0.048125879,-0.11762936,-0.45292474,0.60255357,0.055063180,0.018596432
56,-0.13315652,0.87509820,0.052702398,-0.11582176,-0.48530234,0.60629054,0.065591447,0.028238865
57,-0.15397591,0.88555333,0.057575768,-0.11363481,-0.51784924,0.60987063,0.076486275,0.038210643
58,-0.17516418,0.89573149,0.062754349,-0.11105973,-0.55051547,0.61330306,0.087742517,0.048503972
59,-0.19669464,0.90563147,0.068246181,-0.10808835,-0.58325140,0.61659699,0.099354603,0.059110618
60,-0.21854022,0.91525225,0.074058958,-0.10471317,-0.61600780,0.61976150,0.11131656,0.070021931
61,-0.24067357,0.92459311,0.080200005,-0.10092733,-0.64873603,0.62280559,0.12362202,0.081228867
62,-0.26306709,0.93365351,0.086676263,-0.096724658,-0.68138808,0.62573809,0.13626424,0.092722017
63,-0.28569299,0.94243317,0.093494261,-0.092099667,-0.71391672,0.62856768,0.14923612,0.10449162
64,-0.30852336,0.95093203,0.10066010,-0.087047568,-0.74627558,0.63130286,0.16253021,0.11652762
65,-0.33153021,0.95915024,0.10817944,-0.081564284,-0.77841927,0.63395188,0.17613872,0.12881965
66,-0.35468551,0.96708814,0.11605748,-0.075646453,-0.81030349,0.63652277,0.19005359,0.14135709
67,-0.37796131,0.97474630,0.12429893,-0.069291438,-0.84188510,0.63902329,0.20426643,0.15412909
68,-0.40132971,0.98212544,0.13290800,-0.062497326,-0.87312220,0.64146090,0.21876859,0.16712460
69,-0.42476299,0.98922651,0.14188843,-0.055262935,-0.90397429,0.64384273,0.23355118,0.18033240
70,-0.44823362,0.99605058,0.15124339,-0.047587809,-0.93440229,0.64617559,0.24860507,0.19374112
71,-0.47171433,1.0025989,0.16097555,-0.039472220,-0.96436862,0.64846591,0.26392091,0.20733929
72,-0.49517817,1.0088730,0.17108704,-0.030917161,-0.99383733,0.65071976,0.27948918,0.22111535
73,-0.51859852,1.0148742,0.18157942,-0.021924340,-1.0227741,0.65294280,0.29530018,0.23505768
74,-0.54194923,1.0206045,0.19245370,-0.012496177,-1.0511464,0.65514026,0.31134405,0.24915468
75,-0.56520455,1.0260655,0.20371034,-0.0026357885,-1.0789235,0.65731696,0.32761081,0.26339473
76,-0.58833930,1.0312592,0.21534921,0.0076530208,-1.1060764,0.65947726,0.34409037,0.27776627
77,-0.61132883,1.0361876,0.22736963,0.018365771,-1.1325782,0.66162505,0.36077257,0.29225780
78,-0.63414909,1.0408530,0.23977033,0.029497320,-1.1584037,0.66376376,0.37764717,0.30685794
79,-0.65677670,1.0452575,0.25254946,0.041041886,-1.1835300,0.66589633,0.39470388,0.32155543
80,-0.67918895,1.0494034,0.26570461,0.052993058,-1.2079361,0.66802523,0.41193240,0.33633920
81,-0.70136388,1.0532932,0.27923280,0.065343818,-1.2316029,0.67015238,0.42932242,0.35119835
82,-0.72328029,1.0569292,0.29313045,0.078086564,-1.2545135,0.67227925,0.44686366,0.36612219
83,-0.74491780,1.0603139,0.30739346,0.091213129,-1.2766533,0.67440676,0.46454585,0.38110032
84,-0.76625684,1.0634500,0.32201713,0.10471481,-1.2980095,0.67653534,0.48235880,0.39612258
85,-0.78727874,1.0663398,0.33699624,0.11858237,-1.3185715,0.67866489,0.50029238,0.41117912
86,-0.80796573,1.0689861,0.35232499,0.13280611,-1.3383310,0.68079482,0.51833656,0.42626042
87,-0.82830096,1.0713913,0.36799707,0.14737586,-1.3572817,0.68292401,0.53648143,0.44135730
88,-0.84826853,1.0735582,0.38400565,0.16228099,-1.3754193,0.68505084,0.55471718,0.45646095
89,-0.86785353,1.0754892,0.40034337,0.17751050,-1.3927417,0.68717317,0.57303417,0.47156296
90,-0.88704204,1.0771869,0.41700238,0.19305299,-1.4092489,0.68928840,0.59142291,0.48665533
91,-0.90582116,1.0786540,0.43397434,0.20889673,-1.4249428,0.69139341,0.60987409,0.50173048
92,-0.92417901,1.0798929,0.45125044,0.22502965,-1.4398276,0.69348461,0.62837856,0.51678129
93,-0.94210476,1.0809061,0.46882141,0.24143943,-1.4539091,0.69555796,0.64692742,0.53180108
94,-0.95958863,1.0816961,0.48667757,0.25811347,-1.4671952,0.69760895,0.66551194,0.54678366
95,-0.97662189,1.0822653,0.50480878,0.27503896,-1.4796958,0.69963262,0.68412364,0.56172334
96,-0.99319689,1.0826160,0.52320452,0.29220290,-1.4914225,0.70162361,0.70275428,0.57661490
97,-1.0093070,1.0827506,0.54185390,0.30959214,-1.5023886,0.70357614,0.72139583,0.59145365
98,-1.0249468,1.0826711,0.56074564,0.32719342,-1.5126092,0.70548404,0.74004056,0.60623540
99,-1.0401117,1.0823799,0.57986813,0.34499335,-1.5221011,0.70734075,0.75868097,0.62095650
100,-1.0547983,1.0818789,0.59920947,0.36297854,-1.5308826,0.70913940,0.77730983,0.63561380
101,-1.0690044,1.0811701,0.61875741,0.38113552,-1.5389734,0.71087275,0.79592021,0.65020470
102,-1.0827284,1.0802555,0.63849948,0.39945086,-1.5463948,0.71253327,0.81450543,0.66472711
103,-1.0959702,1.0791368,0.65842292,0.41791115,-1.5531694,0.71411314,0.83305910,0.67917948
104,-1.1087305,1.0778159,0.67851476,0.43650308,-1.5593209,0.71560429,0.85157512,0.69356077
105,-1.1210109,1.0762943,0.69876182,0.45521340,-1.5648742,0.71699839,0.87004766,0.70787048
106,-1.1328141,1.0745737,0.71915076,0.47402902,-1.5698556,0.71828694,0.88847120,0.72210859
107,-1.1441437,1.0726553,0.73966805,0.49293699,-1.5742920,0.71946122,0.90684048,0.73627561
108,-1.1550043,1.0705407,0.76030007,0.51192454,-1.5782112,0.72051237,0.92515053,0.75037255
109,-1.1654012,1.0682311,0.78103305,0.53097914,-1.5816421,0.72143139,0.94339668,0.76440087
110,-1.1753408,1.0657276,0.80185319,0.55008847,-1.5846139,0.72220920,0.96157451,0.77836253
111,-1.1848303,1.0630313,0.82274659,0.56924049,-1.5871567,0.72283662,0.97967989,0.79225993
112,-1.1938775,1.0601432,0.84369933,0.58842344,-1.5893010,0.72330444,0.99770894,0.80609593
113,-1.2024911,1.0570642,0.86469750,0.60762588,-1.5910777,0.72360345,1.0156581,0.81987377
114,-1.2106806,1.0537950,0.88572719,0.62683668,-1.5925178,0.72372442,1.0335239,0.83359712
115,-1.2184561,1.0503363,0.90677452,0.64604508,-1.5936528,0.72365819,1.0513033,0.84727005
116,-1.2258285,1.0466889,0.92782570,0.66524069,-1.5945140,0.72339567,1.0689934,0.86089694
117,-1.2328090,1.0428531,0.94886701,0.68441348,-1.5951329,0.72292785,1.0865916,0.87448254
118,-1.2394098,1.0388296,0.96988483,0.70355385,-1.5955407,0.72224586,1.1040954,0.88803190
119,-1.2456433,1.0346185,0.99086569,0.72265260,-1.5957686,0.72134101,1.1215025,0.90155036
120,-1.2515226,1.0302203,1.0117963,0.74170096,-1.5958472,0.72020476,1.1388110,0.91504351
121,-1.2570610,1.0256351,1.0326634,0.76069060,-1.5958069,0.71882880,1.1560189,0.92851718
122,-1.2622725,1.0208632,1.0534541,0.77961365,-1.5956776,0.71720507,1.1731246,0.94197739
123,-1.2671713,1.0159046,1.0741557,0.79846266,-1.5954885,0.71532576,1.1901264,0.95543034
124,-1.2717718,1.0107595,1.0947556,0.81723068,-1.5952681,0.71318336,1.2070229,0.96888238
125,-1.2760890,1.0054278,1.1152415,0.83591119,-1.5950442,0.71077067,1.2238129,0.98233994
126,-1.2801378,0.99990954,1.1356015,0.85449817,-1.5948436,0.70808084,1.2404952,0.99580956
127,-1.2839333,0.99420464,1.1558239,0.87298604,-1.5946924,0.70510740,1.2570685,1.0092978
128,-1.2874909,0.98831303,1.1758971,0.89136971,-1.5946154,0.70184423,1.2735319,1.0228113
129,-1.2908260,0.98223461,1.1958101,0.90964452,-1.5946364,0.69828566,1.2898844,1.0363566
130,-1.2939540,0.97596926,1.2155522,0.92780632,-1.5947782,0.69442641,1.3061251,1.0499401
131,-1.2968902,0.96951686,1.2351127,0.94585137,-1.5950620,0.69026168,1.3222530,1.0635684
132,-1.2996501,0.96287729,1.2544817,0.96377639,-1.5955081,0.68578713,1.3382671,1.0772478
133,-1.3022488,0.95605045,1.2736494,0.98157856,-1.5961351,0.68099889,1.3541667,1.0909843
134,-1.3047016,0.94903624,1.2926064,0.99925545,-1.5969604,0.67589359,1.3699507,1.1047840
135,-1.3070232,0.94183458,1.3113437,1.0168051,-1.5979998,0.67046840,1.3856182,1.1186527
136,-1.3092284,0.93444544,1.3298526,1.0342258,-1.5992677,0.66472098,1.4011681,1.1325958
137,-1.3113316,0.92686880,1.3481249,1.0515165,-1.6007769,0.65864956,1.4165992,1.1466186
138,-1.3133468,0.91910472,1.3661528,1.0686763,-1.6025387,0.65225288,1.4319104,1.1607259
139,-1.3152879,0.91115329,1.3839288,1.0857046,-1.6045624,0.64553027,1.4471003,1.1749224
140,-1.3171682,0.90301466,1.4014458,1.1026014,-1.6068563,0.63848160,1.4621675,1.1892122
141,-1.3190006,0.89468905,1.4186972,1.1193669,-1.6094265,0.63110732,1.4771104,1.2035992
142,-1.3207977,0.88617677,1.4356767,1.1360014,-1.6122776,0.62340846,1.4919273,1.2180866
143,-1.3225714,0.87747820,1.4523785,1.1525057,-1.6154126,0.61538660,1.5066163,1.2326775
144,-1.3243332,0.86859379,1.4687970,1.1688807,-1.6188327,0.60704392,1.5211754,1.2473741
145,-1.3260942,0.85952412,1.4849272,1.1851277,-1.6225374,0.59838316,1.5356022,1.2621785
146,-1.3278647,0.85026984,1.5007645,1.2012481,-1.6265247,0.58940764,1.5498944,1.2770919
147,-1.3296544,0.84083173,1.5163044,1.2172434,-1.6307907,0.58012123,1.5640493,1.2921153
148,-1.3314725,0.83121068,1.5315431,1.2331154,-1.6353300,0.57052841,1.5780640,1.3072489
149,-1.3333276,0.82140769,1.5464770,1.2488658,-1.6401355,0.56063416,1.5919355,1.3224923
150,-1.3352275,0.81142390,1.5611030,1.2644967,-1.6451984,0.55044405,1.6056602,1.3378446
151,-1.3371794,0.80126055,1.5754181,1.2800099,-1.6505086,0.53996416,1.6192348,1.3533042
152,-1.3391899,0.79091905,1.5894199,1.2954077,-1.6560542,0.52920113,1.6326554,1.3688689
153,-1.3412647,0.78040094,1.6031062,1.3106919,-1.6618219,0.51816209,1.6459178,1.3845357
154,-1.3434090,0.76970789,1.6164752,1.3258647,-1.6677971,0.50685468,1.6590177,1.4003013
155,-1.3456272,0.75884172,1.6295253,1.3409280,-1.6739635,0.49528701,1.6719506,1.4161613
156,-1.3479229,0.74780442,1.6422554,1.3558837,-1.6803038,0.48346769,1.6847115,1.4321109
157,-1.3502990,0.73659812,1.6546644,1.3707337,-1.6867991,0.47140576,1.6972953,1.4481444
158,-1.3527578,0.72522510,1.6667517,1.3854797,-1.6934295,0.45911069,1.7096965,1.4642557
159,-1.3553009,0.71368781,1.6785169,1.4001231,-1.7001738,0.44659236,1.7219096,1.4804378
160,-1.3579288,0.70198884,1.6899598,1.4146653,-1.7070099,0.43386107,1.7339286,1.4966829
161,-1.3606418,0.69013099,1.7010805,1.4291075,-1.7139146,0.42092744,1.7457473,1.5129829
162,-1.3634392,0.67811716,1.7118792,1.4434507,-1.7208638,0.40780248,1.7573592,1.5293286
163,-1.3663196,0.66595046,1.7223564,1.4576953,-1.7278324,0.39449749,1.7687576,1.5457104
164,-1.3692810,0.65363414,1.7325126,1.4718419,-1.7347948,0.38102408,1.7799356,1.5621179
165,-1.3723207,0.64117162,1.7423489,1.4858905,-1.7417245,0.36739411,1.7908860,1.5785401
166,-1.3754354,0.62856648,1.7518659,1.4998409,-1.7485946,0.35361971,1.8016014,1.5949654
167,-1.3786210,0.61582247,1.7610650,1.5136924,-1.7553774,0.33971320,1.8120741,1.6113815
168,-1.3818731,0.60294349,1.7699471,1.5274441,-1.7620452,0.32568710,1.8222963,1.6277754
169,-1.3851862,0.58993360,1.7785137,1.5410947,-1.7685696,0.31155409,1.8322599,1.6441338
170,-1.3885548,0.57679700,1.7867661,1.5546424,-1.7749223,0.29732697,1.8419568,1.6604424
171,-1.3919725,0.56353806,1.7947057,1.5680851,-1.7810746,0.28301865,1.8513784,1.6766868
172,-1.3954323,0.55016130,1.8023340,1.5814202,-1.7869979,0.26864211,1.8605164,1.6928516
173,-1.3989271,0.53667137,1.8096525,1.5946447,-1.7926637,0.25421036,1.8693619,1.7089214
174,-1.4024490,0.52307307,1.8166627,1.6077551,-1.7980436,0.23973644,1.8779062,1.7248800
175,-1.4059898,0.50937133,1.8233662,1.6207474,-1.8031094,0.22523337,1.8861403,1.7407108
176,-1.4095408,0.49557120,1.8297645,1.6336173,-1.8078334,0.21071410,1.8940551,1.7563967
177,-1.4130930,0.48167789,1.8358590,1.6463599,-1.8121881,0.19619153,1.9016417,1.7719205
178,-1.4166371,0.46769669,1.8416513,1.6589697,-1.8161468,0.18167846,1.9088908,1.7872644
179,-1.4201634,0.45363302,1.8471425,1.6714410,-1.8196832,0.16718752,1.9157934,1.8024104
180,-1.4236621,0.43949241,1.8523342,1.6837674,-1.8227719,0.15273122,1.9223400,1.8173400
181,-1.4271230,0.42528048,1.8572275,1.6959421,-1.8253882,0.13832184,1.9285217,1.8320348
182,-1.4305358,0.41100296,1.8618235,1.7079578,-1.8275084,0.12397147,1.9343293,1.8464760
183,-1.4338899,0.39666565,1.8661232,1.7198066,-1.8291094,0.10969196,1.9397536,1.8606445
184,-1.4371747,0.38227443,1.8701277,1.7314804,-1.8301697,0.095494856,1.9447856,1.8745214
185,-1.4403796,0.36783525,1.8738377,1.7429705,-1.8306685,0.081391442,1.9494164,1.8880873
186,-1.4434939,0.35335415,1.8772538,1.7542675,-1.8305864,0.067392666,1.9536371,1.9013232
187,-1.4465066,0.33883718,1.8803765,1.7653620,-1.8299052,0.053509137,1.9574392,1.9142097
188,-1.4494072,0.32429046,1.8832063,1.7762439,-1.8286080,0.039751095,1.9608141,1.9267277
189,-1.4521850,0.30972015,1.8857433,1.7869026,-1.8266795,0.026128395,1.9637535,1.9388580
190,-1.4548293,0.29513244,1.8879876,1.7973274,-1.8241056,0.012650484,1.9662492,1.9505816
191,-1.4573299,0.28053353,1.8899391,1.8075070,-1.8208739,-0.00067361857,1.9682935,1.9618798
192,-1.4596763,0.26592964,1.8915976,1.8174297,-1.8169735,-0.013835339,1.9698788,1.9727337
193,-1.4618586,0.25132700,1.8929625,1.8270837,-1.8123950,-0.026826564,1.9709976,1.9831251
194,-1.4638670,0.23673181,1.8940334,1.8364566,-1.8071309,-0.039639659,1.9716429,1.9930359
195,-1.4656918,0.22215028,1.8948093,1.8455358,-1.8011752,-0.052267478,1.9718082,2.0024482
196,-1.4673240,0.20758859,1.8952895,1.8543086,-1.7945237,-0.064703381,1.9714869,2.0113448
197,-1.4687546,0.19305289,1.8954727,1.8627618,-1.7871738,-0.076941243,1.9706732,2.0197085
198,-1.4699750,0.17854928,1.8953576,1.8708822,-1.7791250,-0.088975465,1.9693614,2.0275229
199,-1.4709771,0.16408382,1.8949430,1.8786563,-1.7703782,-0.10080098,1.9675464,2.0347719
200,-1.4717533,0.14966251,1.8942271,1.8860705,-1.7609363,-0.11241326,1.9652234,2.0414401
201,-1.4722962,0.13529128,1.8932082,1.8931109,-1.7508041,-0.12380832,1.9623881,2.0475125
202,-1.4725990,0.12097600,1.8918844,1.8997639,-1.7399879,-0.13498273,1.9590366,2.0529748
203,-1.4726554,0.10672244,1.8902537,1.9060154,-1.7284961,-0.14593362,1.9551657,2.0578134
204,-1.4724597,0.092536288,1.8883140,1.9118515,-1.7163387,-0.15665865,1.9507724,2.0620152
205,-1.4720065,0.078423142,1.8860630,1.9172585,-1.7035277,-0.16715605,1.9458545,2.0655681
206,-1.4712912,0.064388487,1.8834982,1.9222223,-1.6900764,-0.17742460,1.9404101,2.0684604
207,-1.4703095,0.050437697,1.8806172,1.9267293,-1.6760004,-0.18746359,1.9344379,2.0706815
208,-1.4690580,0.036576032,1.8774175,1.9307659,-1.6613165,-0.19727291,1.9279372,2.0722213
209,-1.4675336,0.022808624,1.8738964,1.9343184,-1.6460436,-0.20685293,1.9209080,2.0730709
210,-1.4657340,0.0091404760,1.8700511,1.9373738,-1.6302017,-0.21620458,1.9133506,2.0732218
211,-1.4636573,-0.0044235459,1.8658789,1.9399188,-1.6138129,-0.22532927,1.9052661,2.0726669
212,-1.4613025,-0.017878717,1.8613770,1.9419408,-1.5969006,-0.23422895,1.8966562,2.0713997
213,-1.4586689,-0.031220459,1.8565426,1.9434273,-1.5794894,-0.24290603,1.8875229,2.0694145
214,-1.4557566,-0.044444346,1.8513729,1.9443661,-1.5616058,-0.25136342,1.8778692,2.0667069
215,-1.4525664,-0.057546106,1.8458651,1.9447457,-1.5432773,-0.25960447,1.8676985,2.0632732
216,-1.4490995,-0.070521628,1.8400163,1.9445545,-1.5245328,-0.26763298,1.8570149,2.0591108
217,-1.4453579,-0.083366963,1.8338238,1.9437819,-1.5054023,-0.27545319,1.8458231,2.0542179
218,-1.4413440,-0.096078328,1.8272850,1.9424174,-1.4859171,-0.28306973,1.8341283,2.0485941
219,-1.4370610,-0.10865211,1.8203972,1.9404513,-1.4661093,-0.29048762,1.8219364,2.0422395
220,-1.4325126,-0.12108486,1.8131579,1.9378742,-1.4460123,-0.29771225,1.8092540,2.0351555
221,-1.4277031,-0.13337330,1.8055647,1.9346775,-1.4256601,-0.30474934,1.7960882,2.0273446
222,-1.4226374,-0.14551434,1.7976154,1.9308532,-1.4050875,-0.31160496,1.7824468,2.0188100
223,-1.4173208,-0.15750506,1.7893078,1.9263938,-1.3843301,-0.31828544,1.7683380,2.0095563
224,-1.4117593,-0.16934269,1.7806399,1.9212927,-1.3634241,-0.32479740,1.7537708,1.9995887
225,-1.4059593,-0.18102467,1.7716100,1.9155440,-1.3424062,-0.33114769,1.7387547,1.9889137
226,-1.3999277,-0.19254858,1.7622165,1.9091423,-1.3213134,-0.33734339,1.7232997,1.9775387
227,-1.3936719,-0.20391220,1.7524580,1.9020832,-1.3001831,-0.34339177,1.7074164,1.9654721
228,-1.3871998,-0.21511346,1.7423334,1.8943631,-1.2790529,-0.34930026,1.6911161,1.9527232
229,-1.3805196,-0.22615047,1.7318419,1.8859791,-1.2579605,-0.35507643,1.6744105,1.9393024
230,-1.3736399,-0.23702151,1.7209827,1.8769293,-1.2369435,-0.36072794,1.6573116,1.9252209
231,-1.3665698,-0.24772500,1.7097557,1.8672123,-1.2160397,-0.36626255,1.6398323,1.9104909
232,-1.3593186,-0.25825955,1.6981606,1.8568281,-1.1952863,-0.37168805,1.6219856,1.8951256
233,-1.3518960,-0.26862390,1.6861980,1.8457771,-1.1747204,-0.37701227,1.6037853,1.8791388
234,-1.3443118,-0.27881697,1.6738682,1.8340610,-1.1543788,-0.38224302,1.5852454,1.8625454
235,-1.3365763,-0.28883780,1.6611724,1.8216821,-1.1342975,-0.38738807,1.5663804,1.8453610
236,-1.3286997,-0.29868560,1.6481118,1.8086438,-1.1145121,-0.39245513,1.5472052,1.8276022
237,-1.3206928,-0.30835968,1.6346881,1.7949505,-1.0950574,-0.39745180,1.5277350,1.8092861
238,-1.3125660,-0.31785952,1.6209033,1.7806073,-1.0759675,-0.40238558,1.5079854,1.7904307
239,-1.3043303,-0.32718471,1.6067599,1.7656205,-1.0572753,-0.40726380,1.4879724,1.7710546
240,-1.2959964,-0.33633496,1.5922607,1.7499971,-1.0390132,-0.41209362,1.4677121,1.7511772
241,-1.2875754,-0.34531009,1.5774091,1.7337453,-1.0212119,-0.41688200,1.4472210,1.7308185
242,-1.2790780,-0.35411003,1.5622086,1.7168740,-1.0039014,-0.42163564,1.4265159,1.7099990
243,-1.2705151,-0.36273481,1.5466634,1.6993932,-0.98711012,-0.42636101,1.4056136,1.6887398
244,-1.2618975,-0.37118457,1.5307779,1.6813138,-0.97086536,-0.43106429,1.3845313,1.6670626
245,-1.2532359,-0.37945949,1.5145573,1.6626475,-0.95519283,-0.43575135,1.3632863,1.6449894
246,-1.2445408,-0.38755988,1.4980068,1.6434072,-0.94011677,-0.44042774,1.3418959,1.6225429
247,-1.2358226,-0.39548607,1.4811323,1.6236063,-0.92565985,-0.44509862,1.3203776,1.5997459
248,-1.2270915,-0.40323850,1.4639402,1.6032593,-0.91184308,-0.44976884,1.2987489,1.5766217
249,-1.2183572,-0.41081762,1.4464371,1.5823816,-0.89868577,-0.45444279,1.2770276,1.5531938
250,-1.2096295,-0.41822395,1.4286302,1.5609893,-0.88620542,-0.45912450,1.2552310,1.5294861
251,-1.2009176,-0.42545804,1.4105272,1.5390994,-0.87441774,-0.46381754,1.2333768,1.5055226
252,-1.1922305,-0.43252047,1.3921362,1.5167297,-0.86333655,-0.46852505,1.2114825,1.4813275
253,-1.1835768,-0.43941185,1.3734657,1.4938987,-0.85297373,-0.47324968,1.1895655,1.4569251
254,-1.1749647,-0.44613277,1.3545246,1.4706258,-0.84333922,-0.47799364,1.1676430,1.4323397
255,-1.1664020,-0.45268387,1.3353224,1.4469308,-0.83444096,-0.48275863,1.1457323,1.4075958
256,-1.1578959,-0.45906575,1.3158687,1.4228344,-0.82628484,-0.48754586,1.1238503,1.3827176
257,-1.1494533,-0.46527901,1.2961738,1.3983581,-0.81887473,-0.49235603,1.1020137,1.3577296
258,-1.1410805,-0.47132423,1.2762484,1.3735236,-0.81221241,-0.49718932,1.0802390,1.3326558
259,-1.1327833,-0.47720196,1.2561035,1.3483534,-0.80629759,-0.50204539,1.0585426,1.3075203
260,-1.1245669,-0.48291272,1.2357503,1.3228706,-0.80112788,-0.50692337,1.0369403,1.2823469
261,-1.1164360,-0.48845697,1.2152008,1.2970986,-0.79669882,-0.51182187,1.0154479,1.2571591
262,-1.1083947,-0.49383515,1.1944670,1.2710614,-0.79300385,-0.51673895,0.99408048,1.2319802
263,-1.1004464,-0.49904760,1.1735613,1.2447834,-0.79003435,-0.52167214,0.97285310,1.2068331
264,-1.0925941,-0.50409464,1.1524966,1.2182893,-0.78777961,-0.52661846,0.95178025,1.1817404
265,-1.0848400,-0.50897649,1.1312859,1.1916042,-0.78622693,-0.53157438,0.93087602,1.1567241
266,-1.0771857,-0.51369330,1.1099426,1.1647534,-0.78536156,-0.53653585,0.91015406,1.1318059
267,-1.0696322,-0.51824514,1.0884803,1.1377624,-0.78516680,-0.54149830,0.88962755,1.1070071
268,-1.0621797,-0.52263198,1.0669130,1.1106569,-0.78562400,-0.54645667,0.86930920,1.0823481
269,-1.0548280,-0.52685372,1.0452547,1.0834630,-0.78671261,-0.55140538,0.84921118,1.0578491
270,-1.0475761,-0.53091013,1.0235198,1.0562065,-0.78841026,-0.55633835,0.82934515,1.0335296
271,-1.0404223,-0.53480089,1.0017229,1.0289134,-0.79069276,-0.56124906,0.80972224,1.0094082
272,-1.0333643,-0.53852560,0.97987851,1.0016098,-0.79353420,-0.56613050,0.79035299,0.98550329
273,-1.0263993,-0.54208369,0.95800157,0.97432157,-0.79690702,-0.57097522,0.77124739,0.96183219
274,-1.0195236,-0.54547454,0.93610701,0.94707460,-0.80078204,-0.57577532,0.75241483,0.93841166
275,-1.0127330,-0.54869736,0.91420987,0.91989455,-0.80512858,-0.58052253,0.73386409,0.91525769
276,-1.0060228,-0.55175128,0.89232526,0.89280693,-0.80991448,-0.58520813,0.71560336,0.89238549
277,-0.99938740,-0.55463528,0.87046834,0.86583698,-0.81510626,-0.58982308,0.69764018,0.86980948
278,-0.99282090,-0.55734823,0.84865427,0.83900964,-0.82066913,-0.59435796,0.67998148,0.84754327
279,-0.98631670,-0.55988888,0.82689822,0.81234952,-0.82656714,-0.59880302,0.66263356,0.82559965
280,-0.97986764,-0.56225586,0.80521533,0.78588083,-0.83276323,-0.60314821,0.64560206,0.80399054
281,-0.97346605,-0.56444765,0.78362068,0.75962735,-0.83921936,-0.60738321,0.62889197,0.78272703
282,-0.96710375,-0.56646265,0.76212924,0.73361240,-0.84589658,-0.61149744,0.61250767,0.76181933
283,-0.96077208,-0.56829909,0.74075589,0.70785874,-0.85275517,-0.61548009,0.59645284,0.74127678
284,-0.95446192,-0.56995511,0.71951538,0.68238859,-0.85975470,-0.61932016,0.58073057,0.72110783
285,-0.94816370,-0.57142874,0.69842228,0.65722358,-0.86685419,-0.62300647,0.56534325,0.70132004
286,-0.94186748,-0.57271786,0.67749097,0.63238465,-0.87401217,-0.62652769,0.55029267,0.68192008
287,-0.93556293,-0.57382026,0.65673563,0.60789211,-0.88118683,-0.62987242,0.53557996,0.66291376
288,-0.92923940,-0.57473363,0.63617019,0.58376550,-0.88833609,-0.63302914,0.52120564,0.64430596
289,-0.92288594,-0.57545553,0.61580831,0.56002365,-0.89541779,-0.63598628,0.50716960,0.62610069
290,-0.91649133,-0.57598343,0.59566337,0.53668456,-0.90238971,-0.63873228,0.49347112,0.60830111
291,-0.91004410,-0.57631472,0.57574842,0.51376544,-0.90920974,-0.64125557,0.48010887,0.59090948
292,-0.90353262,-0.57644668,0.55607619,0.49128263,-0.91583601,-0.64354463,0.46708094,0.57392722
293,-0.89694510,-0.57637651,0.53665905,0.46925160,-0.92222696,-0.64558802,0.45438487,0.55735488
294,-0.89026962,-0.57610133,0.51750898,0.44768691,-0.92834148,-0.64737439,0.44201760,0.54119222
295,-0.88349421,-0.57561821,0.49863754,0.42660221,-0.93413904,-0.64889256,0.42997555,0.52543816
296,-0.87660686,-0.57492413,0.48005591,0.40601017,-0.93957975,-0.65013148,0.41825461,0.51009083
297,-0.86959557,-0.57401602,0.46177478,0.38592251,-0.94462453,-0.65108035,0.40685017,0.49514757
298,-0.86244839,-0.57289076,0.44380440,0.36634995,-0.94923519,-0.65172856,0.39575712,0.48060501
299,-0.85515345,-0.57154521,0.42615454,0.34730222,-0.95337455,-0.65206578,0.38496989,0.46645900
300,-0.84769906,-0.56997617,0.40883447,0.32878803,-0.95700653,-0.65208198,0.37448247,0.45270472
301,-0.84007366,-0.56818043,0.39185294,0.31081504,-0.96009628,-0.65176744,0.36428843,0.43933666
302,-0.83226594,-0.56615477,0.37521819,0.29338991,-0.96261024,-0.65111280,0.35438092,0.42634867
303,-0.82426486,-0.56389595,0.35893788,0.27651825,-0.96451627,-0.65010907,0.34475275,0.41373398
304,-0.81605965,-0.56140076,0.34301917,0.26020460,-0.96578376,-0.64874768,0.33539635,0.40148522
305,-0.80763993,-0.55866599,0.32746861,0.24445248,-0.96638366,-0.64702048,0.32630385,0.38959447
306,-0.79899568,-0.55568844,0.31229219,0.22926437,-0.96628863,-0.64491979,0.31746707,0.37805331
307,-0.79011733,-0.55246498,0.29749533,0.21464169,-0.96547307,-0.64243839,0.30887757,0.36685281
308,-0.78099576,-0.54899248,0.28308284,0.20058483,-0.96391325,-0.63956960,0.30052665,0.35598358
309,-0.77162236,-0.54526792,0.26905894,0.18709315,-0.96158735,-0.63630724,0.29240543,0.34543586
310,-0.76198908,-0.54128830,0.25542724,0.17416502,-0.95847552,-0.63264570,0.28450482,0.33519945
311,-0.75208844,-0.53705072,0.24219075,0.16179777,-0.95455997,-0.62857991,0.27681557,0.32526387
312,-0.74191358,-0.53255237,0.22935189,0.14998776,-0.94982502,-0.62410542,0.26932833,0.31561829
313,-0.73145827,-0.52779052,0.21691244,0.13873039,-0.94425717,-0.61921835,0.26203362,0.30625164
314,-0.72071701,-0.52276256,0.20487360,0.12802008,-0.93784510,-0.61391548,0.25492192,0.29715263
315,-0.70968497,-0.51746600,0.19323594,0.11785036,-0.93057975,-0.60819419,0.24798364,0.28830977
316,-0.69835809,-0.51189848,0.18199944,0.10821382,-0.92245437,-0.60205252,0.24120921,0.27971143
317,-0.68673307,-0.50605777,0.17116350,0.099102184,-0.91346451,-0.59548916,0.23458906,0.27134588
318,-0.67480742,-0.49994181,0.16072690,0.090506334,-0.90360808,-0.58850347,0.22811367,0.26320131
319,-0.66257944,-0.49354867,0.15068786,0.082416318,-0.89288534,-0.58109549,0.22177359,0.25526589
320,-0.65004831,-0.48687663,0.14104399,0.074821398,-0.88129894,-0.57326593,0.21555948,0.24752780
321,-0.63721405,-0.47992410,0.13179239,0.067710079,-0.86885391,-0.56501618,0.20946214,0.23997527
322,-0.62407758,-0.47268972,0.12292956,0.061070143,-0.85555767,-0.55634834,0.20347250,0.23259660
323,-0.61064070,-0.46517231,0.11445148,0.054888688,-0.84142002,-0.54726518,0.19758171,0.22538024
324,-0.59690613,-0.45737090,0.10635361,0.049152164,-0.82645313,-0.53777016,0.19178111,0.21831477
325,-0.58287750,-0.44928473,0.098630885,0.043846412,-0.81067151,-0.52786743,0.18606227,0.21138900
326,-0.56855938,-0.44091326,0.091277749,0.038956706,-0.79409201,-0.51756182,0.18041703,0.20459195
327,-0.55395728,-0.43225620,0.084288174,0.034467792,-0.77673377,-0.50685884,0.17483751,0.19791289
328,-0.53907763,-0.42331348,0.077655671,0.030363934,-0.75861821,-0.49576466,0.16931614,0.19134142
329,-0.52392782,-0.41408528,0.071373313,0.026628955,-0.73976894,-0.48428612,0.16384568,0.18486744
330,-0.50851617,-0.40457202,0.065433754,0.023246285,-0.72021178,-0.47243071,0.15841923,0.17848122
331,-0.49285196,-0.39477440,0.059829253,0.020199002,-0.69997464,-0.46020654,0.15303025,0.17217341
332,-0.47694536,-0.38469336,0.054551694,0.017469878,-0.67908750,-0.44762237,0.14767262,0.16593510
333,-0.46080750,-0.37433012,0.049592610,0.015041431,-0.65758235,-0.43468755,0.14234060,0.15975779
334,-0.44445040,-0.36368618,0.044943208,0.012895966,-0.63549310,-0.42141202,0.13702886,0.15363345
335,-0.42788699,-0.35276330,0.040594395,0.011015622,-0.61285550,-0.40780632,0.13173253,0.14755456
336,-0.41113108,-0.34156352,0.036536800,0.0093824229,-0.58970710,-0.39388151,0.12644719,0.14151408
337,-0.39419733,-0.33008918,0.032760802,0.0079783228,-0.56608712,-0.37964921,0.12116886,0.13550553
338,-0.37710128,-0.31834288,0.029256558,0.0067852519,-0.54203640,-0.36512153,0.11589404,0.12952296
339,-0.35985925,-0.30632753,0.026014027,0.0057851645,-0.51759727,-0.35031108,0.11061974,0.12356098
340,-0.34248837,-0.29404631,0.023023001,0.0049600855,-0.49281350,-0.33523094,0.10534344,0.11761478
341,-0.32500656,-0.28150271,0.020273131,0.0042921565,-0.46773013,-0.31989460,0.10006311,0.11168016
342,-0.30743244,-0.26870048,0.017753954,0.0037636808,-0.44239346,-0.30431598,0.094777244,0.10575350
343,-0.28978536,-0.25564369,0.015454924,0.0033571690,-0.41685085,-0.28850940,0.089484841,0.099831784
344,-0.27208534,-0.24233667,0.013365439,0.0030553825,-0.39115067,-0.27248949,0.084185411,0.093912637
345,-0.25435303,-0.22878406,0.011474869,0.0028413770,-0.36534216,-0.25627123,0.078878979,0.087994288
346,-0.23660968,-0.21499075,0.0097725862,0.0026985448,-0.33947532,-0.23986989,0.073566086,0.082075596
347,-0.21887711,-0.20096194,0.0082479912,0.0026106557,-0.31360081,-0.22330100,0.068247786,0.076156045
348,-0.20117764,-0.18670310,0.0068905432,0.0025618972,-0.28776980,-0.20658032,0.062925643,0.070235745
349,-0.18353407,-0.17221996,0.0056897871,0.0025369129,-0.26203387,-0.18972382,0.057601730,0.064315426
350,-0.16596963,-0.15751854,0.0046353815,0.0025208398,-0.23644488,-0.17274761,0.052278623,0.058396439
351,-0.14850795,-0.14260511,0.0037171260,0.0024993444,-0.21105484,-0.15566795,0.046959390,0.052480743
352,-0.13117297,-0.12748618,0.0029249879,0.0024586567,-0.18591581,-0.13850119,0.041647589,0.046570903
353,-0.11398893,-0.11216855,0.0022491293,0.0023856029,-0.16107975,-0.12126376,0.036347256,0.040670073
354,-0.096980304,-0.096659237,0.0016799323,0.0022676361,-0.13659843,-0.10397211,0.031062894,0.034781993
355,-0.080171761,-0.080965496,0.0012080245,0.0020928659,-0.11252324,-0.086642668,0.025799462,0.028910967
356,-0.063588097,-0.065094817,0.00082430346,0.0018500851,-0.088905153,-0.069291863,0.020562363,0.023061852
357,-0.047254197,-0.049054911,0.00051996078,0.0015287956,-0.065794539,-0.051936031,0.015357426,0.017240043
358,-0.031194974,-0.032853699,0.00028650462,0.0011192313,-0.043241073,-0.034591412,0.010190898,0.011451449
359,-0.015435317,-0.016499305,0.00011578208,0.00061237988,-0.021293608,-0.017274106,0.0050694204,0.0057024790
360,-4.2568942e-08,-4.6205486e-08,2.5329427e-10,1.8619630e-09,-5.8425542e-08,-4.8097050e-08,1.4057619e-08,1.5830850e-08
