deg,XRT_AX,XRT_BX,XRT_AY,XRT_BY,SOT_AX,SOT_BX,SOT_AY,SOT_BY
valid,1,1,1,1,1,1,1,1,revB
offset,123.25345,113.67723,1982.2638,1985.4024,58.637886,48.886235,92.735076,95.964431
0,0.0000000,0.0000000,0.0000000,0.0000000,0.0000000,0.0000000,0.0000000,0.0000000
1,0.0067390722,0.018656051,0.0018899284,-0.0023645359,0.0097872997,0.019015806,-0.0090604879,-0.0043762106
2,0.012802541,0.037147031,0.0036717068,-0.0045816652,0.018842508,0.037883461,-0.018142187,-0.0087826707
3,0.018191294,0.055467668,0.0053303768,-0.0066568034,0.027148718,0.056588146,-0.027233060,-0.013217188
4,0.022907132,0.073612913,0.0068518293,-0.0085954493,0.034690457,0.075115357,-0.036320671,-0.017677134
5,0.026952740,0.091577931,0.0082228431,-0.010403169,0.041453719,0.093450927,-0.045392212,-0.022159445
6,0.030331668,0.10935810,0.0094311203,-0.012085580,0.047425992,0.11158106,-0.054434533,-0.026660637
7,0.033048299,0.12694899,0.010465321,-0.013648333,0.052596283,0.12949235,-0.063434168,-0.031176806
8,0.035107829,0.14434638,0.011315093,-0.015097098,0.056955141,0.14717181,-0.072377370,-0.035703644
9,0.036516231,0.16154623,0.011971102,-0.016437544,0.060494672,0.16460689,-0.081250135,-0.040236443
10,0.037280231,0.17854470,0.012425057,-0.017675323,0.063208549,0.18178550,-0.090038241,-0.044770111
11,0.037407271,0.19533812,0.012669731,-0.018816052,0.065092028,0.19869605,-0.098727271,-0.049299180
12,0.036905483,0.21192299,0.012698985,-0.019865294,0.066141948,0.21532742,-0.10730265,-0.053817819
13,0.035783655,0.22829598,0.012507784,-0.020828540,0.066356730,0.23166904,-0.11574968,-0.058319850
14,0.034051194,0.24445393,0.012092211,-0.021711194,0.065736378,0.24771088,-0.12405356,-0.062798759
15,0.031718097,0.26039385,0.011449478,-0.022518549,0.064282472,0.26344344,-0.13219943,-0.067247711
16,0.028794913,0.27611287,0.010577938,-0.023255774,0.061998151,0.27885782,-0.14017241,-0.071659569
17,0.025292710,0.29160831,0.0094770866,-0.023927893,0.058888105,0.29394569,-0.14795761,-0.076026904
18,0.021223037,0.30687761,0.0081475669,-0.024539768,0.054958550,0.30869931,-0.15554018,-0.080342017
19,0.016597894,0.32191837,0.0065911689,-0.025096080,0.050217209,0.32311155,-0.16290533,-0.084596952
20,0.011429689,0.33672832,0.0048108257,-0.025601314,0.044673284,0.33717591,-0.17003838,-0.088783517
21,0.0057312097,0.35130533,0.0028106076,-0.026059739,0.038337427,0.35088649,-0.17692478,-0.092893301
22,-0.00048441760,0.36564742,0.00059571224,-0.026475392,0.031221702,0.36423804,-0.18355011,-0.096917691
23,-0.0072037602,0.37975271,-0.0018275475,-0.026852061,0.023339552,0.37722593,-0.18990020,-0.10084789
24,-0.014413115,0.39361949,-0.0044517589,-0.027193271,0.014705759,0.38984616,-0.19596104,-0.10467495
25,-0.022098544,0.40724614,-0.0072684275,-0.027502265,0.0053363943,0.40209540,-0.20171892,-0.10838976
26,-0.030245906,0.42063121,-0.010267998,-0.027781992,-0.0047512226,0.41397093,-0.20716038,-0.11198309
27,-0.038840893,0.43377335,-0.013439879,-0.028035090,-0.015538577,0.42547067,-0.21227227,-0.11544563
28,-0.047869062,0.44667135,-0.016772469,-0.028263874,-0.027006012,0.43659317,-0.21704179,-0.11876796
29,-0.057315867,0.45932411,-0.020253183,-0.028470322,-0.039132782,0.44733764,-0.22145648,-0.12194061
30,-0.067166692,0.47173069,-0.023868492,-0.028656064,-0.051897113,0.45770386,-0.22550429,-0.12495405
31,-0.077406878,0.48389026,-0.027603948,-0.028822367,-0.065276262,0.46769228,-0.22917355,-0.12779875
32,-0.088021757,0.49580210,-0.031444226,-0.028970128,-0.079246580,0.47730392,-0.23245305,-0.13046516
33,-0.098996678,0.50746567,-0.035373165,-0.029099862,-0.093783575,0.48654040,-0.23533202,-0.13294375
34,-0.11031703,0.51888051,-0.039373803,-0.029211692,-0.10886198,0.49540394,-0.23780015,-0.13522503
35,-0.12196829,0.53004633,-0.043428427,-0.029305346,-0.12445583,0.50389731,-0.23984767,-0.13729958
36,-0.13393601,0.54096297,-0.047518615,-0.029380143,-0.14053850,0.51202386,-0.24146527,-0.13915803
37,-0.14620587,0.55163041,-0.051625283,-0.029434990,-0.15708283,0.51978745,-0.24264421,-0.14079111
38,-0.15876369,0.56204875,-0.055728738,-0.029468379,-0.17406114,0.52719248,-0.24337628,-0.14218969
39,-0.17159548,0.57221826,-0.059808722,-0.029478380,-0.19144533,0.53424385,-0.24365383,-0.14334474
40,-0.18468739,0.58213934,-0.063844474,-0.029462637,-0.20920697,0.54094696,-0.24346979,-0.14424740
41,-0.19802580,0.59181257,-0.067814773,-0.029418372,-0.22731734,0.54730764,-0.24281766,-0.14488898
42,-0.21159730,0.60123864,-0.071698002,-0.029342377,-0.24574751,0.55333219,-0.24169154,-0.14526096
43,-0.22538872,0.61041842,-0.075472197,-0.029231020,-0.26446846,0.55902733,-0.24008616,-0.14535504
44,-0.23938714,0.61935295,-0.079115110,-0.029080243,-0.28345107,0.56440015,-0.23799682,-0.14516313
45,-0.25357989,0.62804342,-0.082604263,-0.028885566,-0.30266628,0.56945814,-0.23541946,-0.14467738
46,-0.26795457,0.63649119,-0.085917007,-0.028642093,-0.32208511,0.57420911,-0.23235066,-0.14389018
47,-0.28249908,0.64469777,-0.089030582,-0.028344512,-0.34167874,0.57866123,-0.22878758,-0.14279419
48,-0.29720158,0.65266489,-0.091922177,-0.027987107,-0.36141859,0.58282291,-0.22472803,-0.14138235
49,-0.31205055,0.66039441,-0.094568985,-0.027563761,-0.38127641,0.58670287,-0.22017047,-0.13964789
50,-0.32703477,0.66788840,-0.096948270,-0.027067966,-0.40122431,0.59031005,-0.21511394,-0.13758435
51,-0.34214329,0.67514909,-0.099037419,-0.026492835,-0.42123482,0.59365359,-0.20955813,-0.13518557
52,-0.35736550,0.68217892,-0.10081401,-0.025831109,-0.44128104,0.59674284,-0.20350336,-0.13244573
53,-0.37269108,0.68898050,-0.10225585,-0.025075171,-0.46133659,0.59958728,-0.19695053,-0.12935934
54,-0.38811002,0.69555664,-0.10334108,-0.024217060,-0.48137575,0.60219652,-0.18990117,-0.12592126
55,-0.40361260,0.70191034,-0.10404816,-0.023248482,-0.50137350,0.60458026,-0.18235740,-0.12212670
56,-0.41918941,0.70804478,-0.10435600,-0.022160831,-0.52130555,0.60674829,-0.17432194,-0.11797123
57,-0.43483133,0.71396336,-0.10424396,-0.020945198,-0.54114846,0.60871039,-0.16579809,-0.11345080
58,-0.45052953,0.71966968,-0.10369195,-0.019592394,-0.56087960,0.61047639,-0.15678969,-0.10856174
59,-0.46627544,0.72516750,-0.10268044,-0.018092966,-0.58047728,0.61205609,-0.14730118,-0.10330074
60,-0.48206079,0.73046083,-0.10119055,-0.016437217,-0.59992077,0.61345921,-0.13733750,-0.097664894
61,-0.49787754,0.73555383,-0.099204052,-0.014615225,-0.61919030,0.61469544,-0.12690414,-0.091651680
62,-0.51371794,0.74045090,-0.096703482,-0.012616865,-0.63826719,0.61577431,-0.11600710,-0.085258970
63,-0.52957444,0.74515661,-0.093672138,-0.010431832,-0.65713381,0.61670527,-0.10465285,-0.078485031
64,-0.54543973,0.74967574,-0.090094141,-0.0080496597,-0.67577362,0.61749756,-0.092848373,-0.071328528
65,-0.56130673,0.75401325,-0.085954479,-0.0054597494,-0.69417126,0.61816027,-0.080601081,-0.063788522
66,-0.57716853,0.75817430,-0.081239046,-0.0026513892,-0.71231251,0.61870225,-0.067918836,-0.055864472
67,-0.59301843,0.76216425,-0.075934680,0.00038621887,-0.73018434,0.61913214,-0.054809914,-0.047556233
68,-0.60884989,0.76598864,-0.070029198,0.0036639341,-0.74777494,0.61945830,-0.041282990,-0.038864055
69,-0.62465651,0.76965316,-0.063511434,0.0071926513,-0.76507371,0.61968880,-0.027347117,-0.029788582
70,-0.64043205,0.77316373,-0.056371265,0.010983275,-0.78207129,0.61983143,-0.013011698,-0.020330844
71,-0.65617039,0.77652640,-0.048599643,0.015046692,-0.79875958,0.61989362,0.0017135274,-0.010492258
72,-0.67186548,0.77974739,-0.040188620,0.019393744,-0.81513172,0.61988248,0.016818513,-0.00027462369
73,-0.68751141,0.78283311,-0.031131369,0.024035204,-0.83118207,0.61980474,0.032292925,0.010319886
74,-0.70310231,0.78579009,-0.021422209,0.028981743,-0.84690630,0.61966674,0.048126166,0.021288728
75,-0.71863235,0.78862501,-0.011056619,0.034243907,-0.86230125,0.61947444,0.064307399,0.032628994
76,-0.73409578,0.79134470,-3.1252870e-05,0.039832086,-0.87736506,0.61923335,0.080825570,0.044337420
77,-0.74948682,0.79395609,0.011656046,0.045756490,-0.89209703,0.61894859,0.097669433,0.056410393
78,-0.76479974,0.79646626,0.024006239,0.052027117,-0.90649769,0.61862481,0.11482757,0.068843960
79,-0.78002877,0.79888238,0.037019084,0.058653730,-0.92056874,0.61826621,0.13228842,0.081633834
80,-0.79516811,0.80121172,0.050693135,0.065645825,-0.93431303,0.61787653,0.15004031,0.094775405
81,-0.81021193,0.80346163,0.065025737,0.073012607,-0.94773456,0.61745903,0.16807144,0.10826375
82,-0.82515435,0.80563954,0.080013035,0.080762961,-0.96083840,0.61701651,0.18636995,0.12209364
83,-0.83998938,0.80775293,0.095649975,0.088905428,-0.97363068,0.61655125,0.20492394,0.13625956
84,-0.85471099,0.80980936,0.11193031,0.097448176,-0.98611859,0.61606507,0.22372145,0.15075569
85,-0.86931301,0.81181638,0.12884664,0.10639898,-0.99831026,0.61555929,0.24275053,0.16557597
86,-0.88378920,0.81378159,0.14639036,0.11576518,-1.0102148,0.61503473,0.26199923,0.18071406
87,-0.89813318,0.81571259,0.16455175,0.12555369,-1.0218422,0.61449170,0.28145564,0.19616336
88,-0.91233842,0.81761697,0.18331996,0.13577094,-1.0332032,0.61393006,0.30110790,0.21191705
89,-0.92639829,0.81950230,0.20268303,0.14642286,-1.0443096,0.61334914,0.32094421,0.22796809
90,-0.94030598,0.82137610,0.22262792,0.15751488,-1.0551737,0.61274780,0.34095287,0.24430919
91,-0.95405455,0.82324584,0.24314056,0.16905190,-1.0658086,0.61212443,0.36112229,0.26093290
92,-0.96763688,0.82511894,0.26420584,0.18103823,-1.0762279,0.61147693,0.38144100,0.27783155
93,-0.98104571,0.82700268,0.28580767,0.19347764,-1.0864461,0.61080275,0.40189766,0.29499731
94,-0.99427358,0.82890429,0.30792899,0.20637328,-1.0964777,0.61009888,0.42248110,0.31242217
95,-1.0073129,0.83083083,0.33055186,0.21972770,-1.1063382,0.60936186,0.44318032,0.33009796
96,-1.0201559,0.83278926,0.35365743,0.23354281,-1.1160432,0.60858783,0.46398449,0.34801639
97,-1.0327946,0.83478636,0.37722604,0.24781991,-1.1256085,0.60777248,0.48488299,0.36616903
98,-1.0452208,0.83682873,0.40123721,0.26255960,-1.1350506,0.60691112,0.50586540,0.38454731
99,-1.0574265,0.83892279,0.42566975,0.27776183,-1.1443857,0.60599867,0.52692152,0.40314259
100,-1.0694030,0.84107474,0.45050173,0.29342587,-1.1536305,0.60502969,0.54804139,0.42194611
101,-1.0811418,0.84329057,0.47571059,0.30955031,-1.1628016,0.60399837,0.56921525,0.44094902
102,-1.0926342,0.84557599,0.50127317,0.32613301,-1.1719156,0.60289860,0.59043362,0.46014241
103,-1.1038713,0.84793648,0.52716573,0.34317116,-1.1809891,0.60172395,0.61168726,0.47951730
104,-1.1148442,0.85037723,0.55336407,0.36066121,-1.1900386,0.60046770,0.63296716,0.49906466
105,-1.1255437,0.85290311,0.57984350,0.37859890,-1.1990802,0.59912287,0.65426461,0.51877542
106,-1.1359606,0.85551870,0.60657896,0.39697925,-1.2081301,0.59768223,0.67557112,0.53864045
107,-1.1460857,0.85822825,0.63354504,0.41579657,-1.2172038,0.59613834,0.69687849,0.55865064
108,-1.1559096,0.86103564,0.66071604,0.43504444,-1.2263166,0.59448356,0.71817878,0.57879682
109,-1.1654228,0.86394441,0.68806603,0.45471571,-1.2354834,0.59271010,0.73946429,0.59906985
110,-1.1746161,0.86695771,0.71556892,0.47480253,-1.2447186,0.59081000,0.76072763,0.61946056
111,-1.1834798,0.87007828,0.74319846,0.49529632,-1.2540358,0.58877520,0.78196161,0.63995981
112,-1.1920046,0.87330850,0.77092839,0.51618782,-1.2634483,0.58659754,0.80315935,0.66055847
113,-1.2001810,0.87665027,0.79873238,0.53746703,-1.2729686,0.58426881,0.82431419,0.68124742
114,-1.2079996,0.88010509,0.82658420,0.55912330,-1.2826085,0.58178074,0.84541973,0.70201759
115,-1.2154512,0.88367402,0.85445767,0.58114526,-1.2923789,0.57912506,0.86646981,0.72285994
116,-1.2225265,0.88735763,0.88232680,0.60352091,-1.3022900,0.57629353,0.88745849,0.74376545
117,-1.2292164,0.89115603,0.91016578,0.62623756,-1.3123511,0.57327793,0.90838008,0.76472516
118,-1.2355121,0.89506888,0.93794907,0.64928189,-1.3225707,0.57007013,0.92922910,0.78573017
119,-1.2414046,0.89909531,0.96565145,0.67263997,-1.3329563,0.56666207,0.95000025,0.80677162
120,-1.2468855,0.90323397,0.99324804,0.69629723,-1.3435143,0.56304585,0.97068848,0.82784071
121,-1.2519464,0.90748300,1.0207144,0.72023853,-1.3542503,0.55921369,0.99128888,0.84892870
122,-1.2565792,0.91184004,1.0480264,0.74444815,-1.3651686,0.55515799,1.0117967,0.87002691
123,-1.2607761,0.91630220,1.0751607,0.76890983,-1.3762727,0.55087135,1.0322075,0.89112673
124,-1.2645296,0.92086606,1.1020943,0.79360677,-1.3875649,0.54634662,1.0525168,0.91221961
125,-1.2678325,0.92552769,1.1288047,0.81852167,-1.3990463,0.54157687,1.0727203,0.93329707
126,-1.2706780,0.93028262,1.1552702,0.84363674,-1.4107170,0.53655546,1.0928139,0.95435072
127,-1.2730597,0.93512587,1.1814699,0.86893374,-1.4225759,0.53127603,1.1127936,0.97537220
128,-1.2749717,0.94005189,1.2073831,0.89439401,-1.4346208,0.52573255,1.1326554,0.99635325
129,-1.2764084,0.94505465,1.2329904,0.91999848,-1.4468484,0.51991934,1.1523955,1.0172857
130,-1.2773648,0.95012755,1.2582729,0.94572769,-1.4592540,0.51383105,1.1720101,1.0381613
131,-1.2778363,0.95526349,1.2832124,0.97156185,-1.4718320,0.50746275,1.1914955,1.0589721
132,-1.2778189,0.96045484,1.3077918,0.99748085,-1.4845755,0.50080987,1.2108480,1.0797101
133,-1.2773092,0.96569346,1.3319947,1.0234643,-1.4974767,0.49386828,1.2300639,1.1003673
134,-1.2763043,0.97097069,1.3558054,1.0494916,-1.5105263,0.48663428,1.2491396,1.1209359
135,-1.2748019,0.97627738,1.3792095,1.0755417,-1.5237143,0.47910460,1.2680714,1.1414080
136,-1.2728004,0.98160390,1.4021932,1.1015938,-1.5370293,0.47127644,1.2868556,1.1617759
137,-1.2702989,0.98694010,1.4247437,1.1276265,-1.5504589,0.46314748,1.3054886,1.1820319
138,-1.2672970,0.99227541,1.4468492,1.1536184,-1.5639897,0.45471589,1.3239664,1.2021683
139,-1.2637952,0.99759876,1.4684988,1.1795482,-1.5776074,0.44598032,1.3422854,1.2221776
140,-1.2597946,1.0028987,1.4896826,1.2053943,-1.5912966,0.43693993,1.3604416,1.2420522
141,-1.2552970,1.0081632,1.5103916,1.2311353,-1.6050409,0.42759438,1.3784310,1.2617846
142,-1.2503051,1.0133800,1.5306178,1.2567495,-1.6188231,0.41794389,1.3962495,1.2813674
143,-1.2448222,1.0185364,1.5503542,1.2822155,-1.6326252,0.40798915,1.4138930,1.3007930
144,-1.2388525,1.0236192,1.5695947,1.3075119,-1.6464282,0.39773140,1.4313571,1.3200541
145,-1.2324009,1.0286149,1.5883341,1.3326173,-1.6602125,0.38717242,1.4486373,1.3391434
146,-1.2254733,1.0335099,1.6065684,1.3575107,-1.6739578,0.37631451,1.4657292,1.3580535
147,-1.2180761,1.0382899,1.6242942,1.3821709,-1.6876429,0.36516048,1.4826278,1.3767771
148,-1.2102167,1.0429405,1.6415093,1.4065773,-1.7012463,0.35371369,1.4993284,1.3953069
149,-1.2019034,1.0474470,1.6582122,1.4307093,-1.7147458,0.34197802,1.5158258,1.4136356
150,-1.1931452,1.0517945,1.6744024,1.4545466,-1.7281187,0.32995785,1.5321149,1.4317560
151,-1.1839519,1.0559678,1.6900802,1.4780692,-1.7413419,0.31765810,1.5481901,1.4496608
152,-1.1743343,1.0599516,1.7052469,1.5012574,-1.7543920,0.30508416,1.5640459,1.4673429
153,-1.1643038,1.0637304,1.7199045,1.5240921,-1.7672451,0.29224195,1.5796764,1.4847949
154,-1.1538728,1.0672884,1.7340557,1.5465542,-1.7798774,0.27913784,1.5950758,1.5020097
155,-1.1430544,1.0706100,1.7477041,1.5686252,-1.7922646,0.26577870,1.6102379,1.5189800
156,-1.1318625,1.0736791,1.7608541,1.5902872,-1.8043824,0.25217184,1.6251562,1.5356986
157,-1.1203120,1.0764800,1.7735106,1.6115226,-1.8162067,0.23832505,1.6398242,1.5521584
158,-1.1084182,1.0789966,1.7856792,1.6323142,-1.8277130,0.22424651,1.6542352,1.5683521
159,-1.0961976,1.0812130,1.7973664,1.6526456,-1.8388774,0.20994483,1.6683823,1.5842725
160,-1.0836670,1.0831133,1.8085790,1.6725007,-1.8496758,0.19542904,1.6822583,1.5999124
161,-1.0708444,1.0846817,1.8193244,1.6918641,-1.8600844,0.18070853,1.6958560,1.6152647
162,-1.0577481,1.0859023,1.8296106,1.7107209,-1.8700800,0.16579304,1.7091679,1.6303220
163,-1.0443972,1.0867595,1.8394460,1.7290569,-1.8796394,0.15069266,1.7221863,1.6450773
164,-1.0308116,1.0872379,1.8488396,1.7468584,-1.8887401,0.13541783,1.7349035,1.6595233
165,-1.0170117,1.0873222,1.8578005,1.7641125,-1.8973600,0.11997923,1.7473115,1.6736529
166,-1.0030185,1.0869974,1.8663384,1.7808068,-1.9054776,0.10438786,1.7594023,1.6874588
167,-0.98885362,1.0862486,1.8744633,1.7969297,-1.9130722,0.088654959,1.7711676,1.7009339
168,-0.97453918,1.0850613,1.8821852,1.8124702,-1.9201237,0.072791987,1.7825992,1.7140712
169,-0.96009781,1.0834213,1.8895147,1.8274181,-1.9266127,0.056810616,1.7936886,1.7268633
170,-0.94555261,1.0813147,1.8964621,1.8417639,-1.9325206,0.040722693,1.8044272,1.7393033
171,-0.93092709,1.0787281,1.9030384,1.8554986,-1.9378300,0.024540221,1.8148065,1.7513841
172,-0.91624518,1.0756484,1.9092541,1.8686142,-1.9425242,0.0082753289,1.8248178,1.7630987
173,-0.90153111,1.0720630,1.9151202,1.8811033,-1.9465874,-0.0080597497,1.8344525,1.7744400
174,-0.88680946,1.0679597,1.9206474,1.8929594,-1.9500052,-0.024452707,1.8437018,1.7854010
175,-0.87210503,1.0633267,1.9258465,1.9041764,-1.9527640,-0.040891183,1.8525569,1.7959751
176,-0.85744285,1.0581531,1.9307281,1.9147493,-1.9548515,-0.057362796,1.8610091,1.8061551
177,-0.84284813,1.0524281,1.9353028,1.9246738,-1.9562565,-0.073855164,1.8690498,1.8159345
178,-0.82834619,1.0461418,1.9395810,1.9339460,-1.9569692,-0.090355937,1.8766702,1.8253066
179,-0.81396240,1.0392848,1.9435727,1.9425632,-1.9569808,-0.10685281,1.8838619,1.8342646
180,-0.79972220,1.0318482,1.9472879,1.9505231,-1.9562840,-0.12333358,1.8906162,1.8428022
181,-0.78565096,1.0238239,1.9507361,1.9578244,-1.9548727,-0.13978612,1.8969248,1.8509128
182,-0.77177400,1.0152046,1.9539266,1.9644664,-1.9527425,-0.15619845,1.9027794,1.8585903
183,-0.75811649,1.0059833,1.9568684,1.9704490,-1.9498898,-0.17255875,1.9081720,1.8658283
184,-0.74470345,0.99615418,1.9595698,1.9757731,-1.9463130,-0.18885536,1.9130946,1.8726210
185,-0.73155965,0.98571182,1.9620390,1.9804399,-1.9420114,-0.20507684,1.9175395,1.8789623
186,-0.71870957,0.97465171,1.9642837,1.9844518,-1.9369861,-0.22121196,1.9214991,1.8848465
187,-0.70617738,0.96297009,1.9663108,1.9878115,-1.9312396,-0.23724976,1.9249662,1.8902681
188,-0.69398685,0.95066399,1.9681272,1.9905224,-1.9247755,-0.25317952,1.9279337,1.8952215
189,-0.68216131,0.93773123,1.9697388,1.9925888,-1.9175993,-0.26899083,1.9303951,1.8997017
190,-0.67072362,0.92417046,1.9711511,1.9940153,-1.9097176,-0.28467358,1.9323437,1.9037036
191,-0.65969607,0.90998118,1.9723692,1.9948074,-1.9011387,-0.30021799,1.9337737,1.9072222
192,-0.64910040,0.89516369,1.9733974,1.9949711,-1.8918721,-0.31561462,1.9346791,1.9102532
193,-0.63895769,0.87971918,1.9742394,1.9945129,-1.8819287,-0.33085441,1.9350547,1.9127920
194,-0.62928833,0.86364967,1.9748984,1.9934399,-1.8713211,-0.34592864,1.9348956,1.9148346
195,-0.62011200,0.84695806,1.9753768,1.9917599,-1.8600629,-0.36082902,1.9341971,1.9163770
196,-0.61144757,0.82964812,1.9756766,1.9894810,-1.8481692,-0.37554765,1.9329551,1.9174158
197,-0.60331312,0.81172447,1.9757988,1.9866120,-1.8356563,-0.39007705,1.9311660,1.9179475
198,-0.59572584,0.79319264,1.9757441,1.9831619,-1.8225421,-0.40441016,1.9288267,1.9179692
199,-0.58870200,0.77405899,1.9755123,1.9791405,-1.8088454,-0.41854037,1.9259343,1.9174781
200,-0.58225695,0.75433078,1.9751027,1.9745578,-1.7945863,-0.43246151,1.9224868,1.9164718
201,-0.57640502,0.73401613,1.9745139,1.9694243,-1.7797860,-0.44616787,1.9184824,1.9149483
202,-0.57115953,0.71312403,1.9737438,1.9637508,-1.7644670,-0.45965419,1.9139200,1.9129057
203,-0.56653273,0.69166431,1.9727898,1.9575485,-1.7486527,-0.47291568,1.9087991,1.9103427
204,-0.56253576,0.66964767,1.9716485,1.9508290,-1.7323675,-0.48594802,1.9031197,1.9072583
205,-0.55917867,0.64708563,1.9703162,1.9436041,-1.7156369,-0.49874736,1.8968823,1.9036517
206,-0.55647031,0.62399055,1.9687882,1.9358859,-1.6984870,-0.51131031,1.8900880,1.8995226
207,-0.55441837,0.60037560,1.9670594,1.9276868,-1.6809451,-0.52363396,1.8827387,1.8948712
208,-0.55302931,0.57625475,1.9651244,1.9190195,-1.6630391,-0.53571587,1.8748367,1.8896978
209,-0.55230838,0.55164277,1.9629768,1.9098968,-1.6447974,-0.54755405,1.8663851,1.8840035
210,-0.55225956,0.52655518,1.9606100,1.9003316,-1.6262494,-0.55914698,1.8573873,1.8777894
211,-0.55288557,0.50100826,1.9580169,1.8903370,-1.6074248,-0.57049359,1.8478477,1.8710573
212,-0.55418783,0.47501903,1.9551899,1.8799265,-1.5883539,-0.58159326,1.8377711,1.8638093
213,-0.55616648,0.44860519,1.9521208,1.8691133,-1.5690674,-0.59244579,1.8271631,1.8560479
214,-0.55882035,0.42178516,1.9488013,1.8579109,-1.5495964,-0.60305143,1.8160298,1.8477761
215,-0.56214694,0.39457800,1.9452226,1.8463328,-1.5299722,-0.61341084,1.8043778,1.8389974
216,-0.56614244,0.36700343,1.9413755,1.8343926,-1.5102263,-0.62352507,1.7922148,1.8297156
217,-0.57080173,0.33908176,1.9372507,1.8221038,-1.4903904,-0.63339558,1.7795486,1.8199350
218,-0.57611835,0.31083390,1.9328385,1.8094799,-1.4704960,-0.64302421,1.7663880,1.8096604
219,-0.58208454,0.28228131,1.9281289,1.7965344,-1.4505750,-0.65241314,1.7527422,1.7988970
220,-0.58869122,0.25344598,1.9231120,1.7832808,-1.4306588,-0.66156490,1.7386211,1.7876504
221,-0.59592802,0.22435039,1.9177775,1.7697324,-1.4107787,-0.67048238,1.7240352,1.7759268
222,-0.60378329,0.19501750,1.9121152,1.7559024,-1.3909659,-0.67916873,1.7089956,1.7637327
223,-0.61224408,0.16547069,1.9061147,1.7418041,-1.3712510,-0.68762744,1.6935139,1.7510751
224,-0.62129622,0.13573375,1.8997658,1.7274502,-1.3516644,-0.69586224,1.6776024,1.7379614
225,-0.63092428,0.10583082,1.8930580,1.7128538,-1.3322359,-0.70387713,1.6612739,1.7243996
226,-0.64111163,0.075786399,1.8859811,1.6980273,-1.3129946,-0.71167631,1.6445416,1.7103980
227,-0.65184047,0.045625263,1.8785252,1.6829834,-1.2939693,-0.71926423,1.6274194,1.6959653
228,-0.66309183,0.015372460,1.8706801,1.6677342,-1.2751878,-0.72664550,1.6099216,1.6811107
229,-0.67484561,-0.014946737,1.8624363,1.6522918,-1.2566772,-0.73382490,1.5920631,1.6658438
230,-0.68708063,-0.045306867,1.8537842,1.6366679,-1.2384637,-0.74080736,1.5738590,1.6501747
231,-0.69977467,-0.075682312,1.8447147,1.6208741,-1.2205727,-0.74759791,1.5553252,1.6341138
232,-0.71290447,-0.10604734,1.8352189,1.6049217,-1.2030285,-0.75420169,1.5364777,1.6176718
233,-0.72644580,-0.13637613,1.8252883,1.5888216,-1.1858544,-0.76062390,1.5173330,1.6008601
234,-0.74037351,-0.16664283,1.8149151,1.5725847,-1.1690727,-0.76686980,1.4979079,1.5836901
235,-0.75466155,-0.19682157,1.8040915,1.5562214,-1.1527044,-0.77294465,1.4782198,1.5661739
236,-0.76928305,-0.22688653,1.7928106,1.5397418,-1.1367694,-0.77885374,1.4582861,1.5483237
237,-0.78421034,-0.25681193,1.7810658,1.5231557,-1.1212862,-0.78460231,1.4381246,1.5301521
238,-0.79941500,-0.28657211,1.7688512,1.5064728,-1.1062721,-0.79019556,1.4177532,1.5116721
239,-0.81486794,-0.31614156,1.7561616,1.4897021,-1.0917432,-0.79563863,1.3971904,1.4928970
240,-0.83053944,-0.34549493,1.7429921,1.4728527,-1.0777139,-0.80093654,1.3764545,1.4738403
241,-0.84639918,-0.37460709,1.7293389,1.4559332,-1.0641974,-0.80609422,1.3555642,1.4545158
242,-0.86241636,-0.40345316,1.7151987,1.4389517,-1.0512054,-0.81111645,1.3345381,1.4349377
243,-0.87855970,-0.43200854,1.7005690,1.4219162,-1.0387482,-0.81600784,1.3133952,1.4151202
244,-0.89479750,-0.46024894,1.6854479,1.4048344,-1.0268344,-0.82077284,1.2921542,1.3950780
245,-0.91109776,-0.48815044,1.6698347,1.3877136,-1.0154712,-0.82541567,1.2708342,1.3748257
246,-0.92742819,-0.51568949,1.6537291,1.3705608,-1.0046643,-0.82994035,1.2494540,1.3543784
247,-0.94375626,-0.54284295,1.6371319,1.3533826,-0.99441768,-0.83435066,1.2280325,1.3337511
248,-0.96004931,-0.56958814,1.6200446,1.3361854,-0.98473398,-0.83865011,1.2065885,1.3129591
249,-0.97627460,-0.59590284,1.6024697,1.3189753,-0.97561412,-0.84284193,1.1851407,1.2920177
250,-0.99239935,-0.62176536,1.5844105,1.3017581,-0.96705749,-0.84692909,1.1637077,1.2709426
251,-1.0083908,-0.64715452,1.5658713,1.2845391,-0.95906192,-0.85091421,1.1423078,1.2497492
252,-1.0242164,-0.67204972,1.5468573,1.2673237,-0.95162368,-0.85479961,1.1209593,1.2284532
253,-1.0398435,-0.69643095,1.5273746,1.2501166,-0.94473750,-0.85858728,1.0996800,1.2070702
254,-1.0552401,-0.72027878,1.5074301,1.2329227,-0.93839658,-0.86227887,1.0784876,1.1856159
255,-1.0703741,-0.74357447,1.4870319,1.2157461,-0.93259262,-0.86587564,1.0573996,1.1641061
256,-1.0852139,-0.76629989,1.4661888,1.1985911,-0.92731581,-0.86937851,1.0364329,1.1425564
257,-1.0997285,-0.78843763,1.4449106,1.1814615,-0.92255492,-0.87278802,1.0156042,1.1209823
258,-1.1138870,-0.80997095,1.4232080,1.1643610,-0.91829728,-0.87610434,0.99492973,1.0993994
259,-1.1276595,-0.83088386,1.4010927,1.1472930,-0.91452881,-0.87932721,0.97442541,1.0778231
260,-1.1410162,-0.85116108,1.3785772,1.1302607,-0.91123413,-0.88245603,0.95410659,1.0562689
261,-1.1539284,-0.87078810,1.3556750,1.1132672,-0.90839650,-0.88548976,0.93398820,1.0347517
262,-1.1663679,-0.88975119,1.3324002,1.0963154,-0.90599797,-0.88842700,0.91408463,1.0132867
263,-1.1783072,-0.90803737,1.3087682,1.0794078,-0.90401934,-0.89126591,0.89440975,0.99188858
264,-1.1897198,-0.92563449,1.2847948,1.0625470,-0.90244027,-0.89400429,0.87497689,0.97057207
265,-1.2005801,-0.94253118,1.2604969,1.0457353,-0.90123933,-0.89663952,0.85579875,0.94935153
266,-1.2108632,-0.95871689,1.2358920,1.0289750,-0.90039402,-0.89916859,0.83688748,0.92824108
267,-1.2205454,-0.97418190,1.2109985,1.0122683,-0.89988089,-0.90158812,0.81825458,0.90725460
268,-1.2296039,-0.98891730,1.1858353,0.99561696,-0.89967555,-0.90389432,0.79991091,0.88640564
269,-1.2380170,-1.0029150,1.1604224,0.97902304,-0.89975279,-0.90608306,0.78186665,0.86570748
270,-1.2457642,-1.0161679,1.1347800,0.96248832,-0.90008658,-0.90814980,0.76413134,0.84517303
271,-1.2528259,-1.0286694,1.1089292,0.94601454,-0.90065023,-0.91008970,0.74671380,0.82481489
272,-1.2591840,-1.0404141,1.0828917,0.92960339,-0.90141637,-0.91189752,0.72962215,0.80464526
273,-1.2648215,-1.0513973,1.0566894,0.91325650,-0.90235710,-0.91356773,0.71286378,0.78467595
274,-1.2697225,-1.0616150,1.0303452,0.89697547,-0.90344402,-0.91509446,0.69644536,0.76491841
275,-1.2738726,-1.0710642,1.0038821,0.88076189,-0.90464834,-0.91647153,0.68037283,0.74538361
276,-1.2772586,-1.0797427,0.97732361,0.86461731,-0.90594093,-0.91769251,0.66465137,0.72608215
277,-1.2798687,-1.0876490,0.95069362,0.84854329,-0.90729243,-0.91875065,0.64928541,0.70702412
278,-1.2816925,-1.0947827,0.92401633,0.83254142,-0.90867330,-0.91963899,0.63427863,0.68821918
279,-1.2827208,-1.1011438,0.89731620,0.81661327,-0.91005392,-0.92035031,0.61963395,0.66967653
280,-1.2829460,-1.1067335,0.87061790,0.80076046,-0.91140467,-0.92087719,0.60535353,0.65140484
281,-1.2823618,-1.1115535,0.84394626,0.78498465,-0.91269600,-0.92121201,0.59143877,0.63341231
282,-1.2809633,-1.1156063,0.81732625,0.76928752,-0.91389854,-0.92134699,0.57789032,0.61570662
283,-1.2787470,-1.1188952,0.79078286,0.75367084,-0.91498314,-0.92127418,0.56470809,0.59829495
284,-1.2757111,-1.1214244,0.76434112,0.73813640,-0.91592098,-0.92098553,0.55189123,0.58118393
285,-1.2718548,-1.1231986,0.73802600,0.72268609,-0.91668365,-0.92047288,0.53943817,0.56437967
286,-1.2671791,-1.1242233,0.71186235,0.70732185,-0.91724320,-0.91972799,0.52734659,0.54788773
287,-1.2616863,-1.1245046,0.68587491,0.69204570,-0.91757227,-0.91874257,0.51561348,0.53171315
288,-1.2553800,-1.1240495,0.66008816,0.67685975,-0.91764411,-0.91750830,0.50423513,0.51586040
289,-1.2482655,-1.1228654,0.63452635,0.66176620,-0.91743269,-0.91601687,0.49320712,0.50033340
290,-1.2403491,-1.1209604,0.60921341,0.64676731,-0.91691275,-0.91425999,0.48252437,0.48513553
291,-1.2316388,-1.1183433,0.58417290,0.63186548,-0.91605989,-0.91222942,0.47218116,0.47026961
292,-1.2221439,-1.1150235,0.55942794,0.61706315,-0.91485064,-0.90991699,0.46217112,0.45573791
293,-1.2118749,-1.1110109,0.53500120,0.60236289,-0.91326251,-0.90731465,0.45248726,0.44154215
294,-1.2008439,-1.1063158,0.51091484,0.58776736,-0.91127406,-0.90441448,0.44312202,0.42768349
295,-1.1890640,-1.1009494,0.48719040,0.57327930,-0.90886497,-0.90120870,0.43406726,0.41416256
296,-1.1765497,-1.0949230,0.46384886,0.55890155,-0.90601608,-0.89768975,0.42531428,0.40097944
297,-1.1633167,-1.0882486,0.44091048,0.54463705,-0.90270947,-0.89385023,0.41685388,0.38813369
298,-1.1493820,-1.0809386,0.41839484,0.53048881,-0.89892848,-0.88968303,0.40867636,0.37562434
299,-1.1347635,-1.0730058,0.39632075,0.51645995,-0.89465780,-0.88518126,0.40077157,0.36344988
300,-1.1194806,-1.0644634,0.37470624,0.50255364,-0.88988347,-0.88033833,0.39312891,0.35160832
301,-1.1035536,-1.0553251,0.35356847,0.48877316,-0.88459297,-0.87514797,0.38573737,0.34009715
302,-1.0870036,-1.0456048,0.33292374,0.47512185,-0.87877520,-0.86960425,0.37858557,0.32891338
303,-1.0698532,-1.0353167,0.31278745,0.46160310,-0.87242057,-0.86370157,0.37166180,0.31805355
304,-1.0521255,-1.0244753,0.29317404,0.44822039,-0.86552101,-0.85743474,0.36495403,0.30751372
305,-1.0338447,-1.0130956,0.27409695,0.43497723,-0.85806997,-0.85079895,0.35844995,0.29728952
306,-1.0150360,-1.0011926,0.25556864,0.42187717,-0.85006249,-0.84378985,0.35213701,0.28737613
307,-0.99572508,-0.98878164,0.23760052,0.40892384,-0.84149519,-0.83640350,0.34600245,0.27776832
308,-0.97593864,-0.97587815,0.22020295,0.39612084,-0.83236629,-0.82863643,0.34003332,0.26846045
309,-0.95570396,-0.96249783,0.20338518,0.38347184,-0.82267560,-0.82048566,0.33421656,0.25944650
310,-0.93504899,-0.94865649,0.18715539,0.37098050,-0.81242458,-0.81194872,0.32853898,0.25072009
311,-0.91400228,-0.93437006,0.17152061,0.35865048,-0.80161627,-0.80302362,0.32298734,0.24227448
312,-0.89259290,-0.91965459,0.15648676,0.34648544,-0.79025537,-0.79370894,0.31754833,0.23410260
313,-0.87085040,-0.90452618,0.14205858,0.33448902,-0.77834814,-0.78400378,0.31220869,0.22619708
314,-0.84880478,-0.88900100,0.12823971,0.32266482,-0.76590248,-0.77390780,0.30695516,0.21855025
315,-0.82648635,-0.87309524,0.11503257,0.31101642,-0.75292786,-0.76342122,0.30177456,0.21115419
316,-0.80392579,-0.85682509,0.10243845,0.29954733,-0.73943530,-0.75254486,0.29665383,0.20400072
317,-0.78115396,-0.84020675,0.090457471,0.28826101,-0.72543738,-0.74128010,0.29158003,0.19708143
318,-0.75820197,-0.82325637,0.079088596,0.27716085,-0.71094818,-0.72962892,0.28654040,0.19038772
319,-0.73510102,-0.80599005,0.068329630,0.26625015,-0.69598329,-0.71759390,0.28152241,0.18391082
320,-0.71188241,-0.78842381,0.058177230,0.25553212,-0.68055972,-0.70517823,0.27651375,0.17764178
321,-0.68857743,-0.77057359,0.048626923,0.24500985,-0.66469591,-0.69238569,0.27150239,0.17157154
322,-0.66521734,-0.75245520,0.039673113,0.23468633,-0.64841166,-0.67922066,0.26647659,0.16569091
323,-0.64183332,-0.73408436,0.031309105,0.22456442,-0.63172810,-0.66568815,0.26142499,0.15999063
324,-0.61845637,-0.71547660,0.023527118,0.21464683,-0.61466763,-0.65179375,0.25633655,0.15446137
325,-0.59511731,-0.69664733,0.016318312,0.20493614,-0.59725388,-0.63754366,0.25120065,0.14909377
326,-0.57184665,-0.67761176,0.0096728150,0.19543474,-0.57951163,-0.62294468,0.24600709,0.14387843
327,-0.54867465,-0.65838492,0.0035797464,0.18614489,-0.56146678,-0.60800419,0.24074612,0.13880600
328,-0.52563115,-0.63898164,-0.0019727493,0.17706864,-0.54314628,-0.59273015,0.23540846,0.13386713
329,-0.50274560,-0.61941654,-0.0069974700,0.16820786,-0.52457806,-0.57713110,0.22998535,0.12905253
330,-0.48004698,-0.59970401,-0.011508121,0.15956424,-0.50579097,-0.56121615,0.22446853,0.12435299
331,-0.45756374,-0.57985820,-0.015519276,0.15113924,-0.48681469,-0.54499494,0.21885029,0.11975941
332,-0.43532381,-0.55989301,-0.019046339,0.14293412,-0.46767971,-0.52847765,0.21312351,0.11526279
333,-0.41335447,-0.53982210,-0.022105499,0.13494991,-0.44841718,-0.51167500,0.20728164,0.11085431
334,-0.39168239,-0.51965886,-0.024713692,0.12718744,-0.42905892,-0.49459819,0.20131872,0.10652529
335,-0.37033354,-0.49941641,-0.026888545,0.11964727,-0.40963729,-0.47725892,0.19522943,0.10226724
336,-0.34933317,-0.47910758,-0.028648340,0.11232975,-0.39018511,-0.45966937,0.18900908,0.098071885
337,-0.32870575,-0.45874494,-0.030011953,0.10523497,-0.37073561,-0.44184216,0.18265362,0.093931172
338,-0.30847497,-0.43834075,-0.030998813,0.098362775,-0.35132233,-0.42379033,0.17615967,0.089837298
339,-0.28866371,-0.41790698,-0.031628842,0.091712768,-0.33197907,-0.40552734,0.16952451,0.085782727
340,-0.26929395,-0.39745532,-0.031922406,0.085284290,-0.31273974,-0.38706702,0.16274610,0.081760205
341,-0.25038680,-0.37699715,-0.031900257,0.079076427,-0.29363836,-0.36842358,0.15582308,0.077762779
342,-0.23196248,-0.35654355,-0.031583479,0.073088009,-0.27470893,-0.34961154,0.14875478,0.073783814
343,-0.21404024,-0.33610529,-0.030993432,0.067317610,-0.25598535,-0.33064575,0.14154123,0.069817008
344,-0.19663839,-0.31569285,-0.030151691,0.061763544,-0.23750137,-0.31154134,0.13418314,0.065856407
345,-0.17977425,-0.29531641,-0.029079994,0.056423873,-0.21929047,-0.29231366,0.12668193,0.061896418
346,-0.16346417,-0.27498582,-0.027800176,0.051296401,-0.20138580,-0.27297834,0.11903968,0.057931824
347,-0.14772345,-0.25471067,-0.026334118,0.046378684,-0.18382011,-0.25355116,0.11125919,0.053957794
348,-0.13256642,-0.23450021,-0.024703682,0.041668031,-0.16662564,-0.23404809,0.10334393,0.049969895
349,-0.11800634,-0.21436343,-0.022930658,0.037161506,-0.14983409,-0.21448525,0.095298047,0.045964105
350,-0.10405546,-0.19430899,-0.021036699,0.032855937,-0.13347650,-0.19487883,0.087126343,0.041936815
351,-0.090724960,-0.17434529,-0.019043270,0.028747922,-0.11758321,-0.17524512,0.078834291,0.037884846
352,-0.078025004,-0.15448042,-0.016971583,0.024833832,-0.10218375,-0.15560047,0.070428004,0.033805450
353,-0.065964696,-0.13472220,-0.014842548,0.021109823,-0.087306835,-0.13596123,0.061914227,0.029696319
354,-0.054552098,-0.11507816,-0.012676709,0.017571844,-0.072980217,-0.11634371,0.053300324,0.025555589
355,-0.043794234,-0.095555578,-0.010494194,0.014215645,-0.059230683,-0.096764228,0.044594259,0.021381843
356,-0.033697096,-0.076161434,-0.0083146587,0.011036785,-0.046083968,-0.077238975,0.035804580,0.017174117
357,-0.024265651,-0.056902463,-0.0061572352,0.0080306499,-0.033564698,-0.057784057,0.026940400,0.012931901
358,-0.015503853,-0.037785137,-0.0040404783,0.0051924559,-0.021696333,-0.038415437,0.018011377,0.0086551376
359,-0.0074146540,-0.018815675,-0.0019823170,0.0025172672,-0.010501118,-0.019148904,0.0090276913,0.0043442245
360,-1.9735396e-08,-5.2251096e-08,-5.4067186e-09,6.8043846e-09,-2.8297862e-08,-5.3221818e-08,2.5226441e-08,1.2160001e-08
