deg,XRT_AX,XRT_BX,XRT_AY,XRT_BY,SOT_AX,SOT_BX,SOT_AY,SOT_BY
valid,1,1,1,1,1,1,1,1,revB
offset,106.27509,108.56828,1989.4665,1983.5828,39.404408,41.651896,103.45708,97.351525
0,0.0000000,0.0000000,0.0000000,0.0000000,0.0000000,0.0000000,0.0000000,0.0000000
1,0.058457107,0.025237121,-0.023879643,-0.0012085358,0.064426495,0.020814523,-0.029147377,-0.0018612744
2,0.11593474,0.048874570,-0.047869541,-0.0021353043,0.12873975,0.041613394,-0.058002375,-0.0034676529
3,0.17233660,0.070884968,-0.071943274,-0.0028017477,0.19284449,0.062373760,-0.086538616,-0.0048337522
4,0.22757092,0.091245983,-0.096074640,-0.0032292286,0.25664751,0.083073676,-0.11473075,-0.0059740241
5,0.28155064,0.10994037,-0.12023771,-0.0034389780,0.32005783,0.10369213,-0.14255448,-0.0069027252
6,0.33419360,0.12695600,-0.14440687,-0.0034520458,0.38298684,0.12420909,-0.16998662,-0.0076338883
7,0.38542267,0.14228585,-0.16855689,-0.0032892508,0.44534850,0.14460547,-0.19700514,-0.0081812946
8,0.43516590,0.15592802,-0.19266294,-0.0029711326,0.50705940,0.16486323,-0.22358913,-0.0085584466
9,0.48335666,0.16788571,-0.21670065,-0.0025179037,0.56803898,0.18496532,-0.24971893,-0.0087785425
10,0.52993369,0.17816717,-0.24064618,-0.0019494043,0.62820960,0.20489574,-0.27537607,-0.0088544514
11,0.57484128,0.18678568,-0.26447621,-0.0012850565,0.68749666,0.22463953,-0.30054332,-0.0087986899
12,0.61802928,0.19375948,-0.28816803,-0.00054382197,0.74582874,0.24418279,-0.32520473,-0.0086233995
13,0.65945321,0.19911168,-0.31169953,0.00025584077,0.80313768,0.26351267,-0.34934562,-0.0083403259
14,0.69907428,0.20287021,-0.33504929,0.0010960159,0.85935869,0.28261741,-0.37295259,-0.0079607987
15,0.73685942,0.20506770,-0.35819657,0.0019593690,0.91443039,0.30148627,-0.39601354,-0.0074957134
16,0.77278133,0.20574138,-0.38112138,0.0028291838,0.96829496,0.32010962,-0.41851768,-0.0069555139
17,0.80681846,0.20493294,-0.40380446,0.0036893967,1.0208981,0.33847885,-0.44045551,-0.0063501767
18,0.83895500,0.20268842,-0.42622736,0.0045246300,1.0721893,0.35658642,-0.46181883,-0.0056891966
19,0.86918085,0.19905803,-0.44837243,0.0053202223,1.1221216,0.37442581,-0.48260074,-0.0049815737
20,0.89749158,0.19409605,-0.47022286,0.0060622577,1.1706517,0.39199155,-0.50279564,-0.0042358012
21,0.92388837,0.18786060,-0.49176270,0.0067375920,1.2177403,0.40927916,-0.52239918,-0.0034598561
22,0.94837795,0.18041350,-0.51297687,0.0073338774,1.2633517,0.42628516,-0.54140829,-0.0026611896
23,0.97097248,0.17182009,-0.53385117,0.0078395848,1.3074540,0.44300705,-0.55982114,-0.0018467201
24,0.99168948,0.16214899,-0.55437231,0.0082440232,1.3500192,0.45944327,-0.57763711,-0.0010228272
25,1.0105517,0.15147195,-0.57452792,0.0085373579,1.3910231,0.47559319,-0.59485680,-0.00019534710
26,1.0275870,0.13986359,-0.59430654,0.0087106257,1.4304450,0.49145708,-0.61148196,0.00063043050
27,1.0428283,0.12740124,-0.61369765,0.0087557475,1.4682683,0.50703608,-0.62751549,0.0014497641
28,1.0563131,0.11416463,-0.63269164,0.0086655391,1.5044799,0.52233219,-0.64296140,0.0022584609
29,1.0680837,0.10023573,-0.65127985,0.0084337196,1.5390706,0.53734820,-0.65782477,0.0030528754
30,1.0781870,0.085698493,-0.66945452,0.0080549168,1.5720345,0.55208768,-0.67211172,0.0038299076
31,1.0866738,0.070638585,-0.68720885,0.0075246709,1.6033695,0.56655495,-0.68582938,0.0045869990
32,1.0935994,0.055143170,-0.70453692,0.0068394358,1.6330771,0.58075503,-0.69898582,0.0053221276
33,1.0990228,0.039300645,-0.72143375,0.0059965772,1.6611620,0.59469361,-0.71159003,0.0060338019
34,1.1030066,0.023200392,-0.73789523,0.0049943697,1.6876323,0.60837702,-0.72365185,0.0067210534
35,1.1056168,0.0069325162,-0.75391815,0.0038319906,1.7124996,0.62181217,-0.73518196,0.0073834280
36,1.1069227,-0.0094124028,-0.76950015,0.0025095117,1.7357784,0.63500651,-0.74619180,0.0080209764
37,1.1069967,-0.025743574,-0.78463973,0.0010278890,1.7574865,0.64796801,-0.75669353,0.0086342428
38,1.1059136,-0.041970250,-0.79933621,-0.00061104994,1.7776445,0.66070512,-0.76669998,0.0092242536
39,1.1037508,-0.058001985,-0.81358973,-0.0024046204,1.7962761,0.67322668,-0.77622458,0.0097925043
40,1.1005880,-0.073748890,-0.82740118,-0.0043492975,1.8134074,0.68554196,-0.78528133,0.010340946
41,1.0965067,-0.089121883,-0.84077223,-0.0064407350,1.8290674,0.69766051,-0.79388473,0.010871969
42,1.0915901,-0.10403294,-0.85370528,-0.0086737859,1.8432876,0.70959222,-0.80204973,0.011388389
43,1.0859228,-0.11839536,-0.86620341,-0.011042525,1.8561018,0.72134721,-0.80979166,0.011893432
44,1.0795907,-0.13212397,-0.87827038,-0.013540273,1.8675460,0.73293582,-0.81712620,0.012390714
45,1.0726803,-0.14513539,-0.88991057,-0.016159625,1.8776585,0.74436856,-0.82406929,0.012884223
46,1.0652789,-0.15734827,-0.90112899,-0.018892472,1.8864794,0.75565603,-0.83063709,0.013378304
47,1.0574741,-0.16868350,-0.91193119,-0.021730039,1.8940506,0.76680896,-0.83684595,0.013877639
48,1.0493535,-0.17906445,-0.92232325,-0.024662908,1.9004158,0.77783809,-0.84271228,0.014387225
49,1.0410044,-0.18841713,-0.93231176,-0.027681054,1.9056202,0.78875416,-0.84825257,0.014912355
50,1.0325138,-0.19667049,-0.94190376,-0.030773880,1.9097104,0.79956789,-0.85348330,0.015458602
51,1.0239680,-0.20375652,-0.95110670,-0.033930246,1.9127342,0.81028991,-0.85842088,0.016031791
52,1.0154520,-0.20961049,-0.95992841,-0.037138509,1.9147405,0.82093072,-0.86308160,0.016637984
53,1.0070499,-0.21417112,-0.96837707,-0.040386559,1.9157793,0.83150069,-0.86748159,0.017283456
54,0.99884419,-0.21738075,-0.97646114,-0.043661856,1.9159010,0.84201000,-0.87163676,0.017974677
55,0.99091551,-0.21918547,-0.98418935,-0.046951468,1.9151572,0.85246859,-0.87556273,0.018718285
56,0.98334267,-0.21953531,-0.99157065,-0.050242108,1.9135995,0.86288617,-0.87927481,0.019521070
57,0.97620225,-0.21838436,-0.99861416,-0.053520178,1.9112802,0.87327215,-0.88278796,0.020389951
58,0.96956841,-0.21569087,-1.0053291,-0.056771806,1.9082517,0.88363563,-0.88611668,0.021331956
59,0.96351270,-0.21141739,-1.0117249,-0.059982884,1.9045664,0.89398538,-0.88927506,0.022354197
60,0.95810386,-0.20553089,-1.0178110,-0.063139113,1.9002768,0.90432978,-0.89227665,0.023463856
61,0.95340761,-0.19800278,-1.0235967,-0.066226038,1.8954350,0.91467684,-0.89513449,0.024668157
62,0.94948650,-0.18880907,-1.0290915,-0.069229094,1.8900930,0.92503414,-0.89786102,0.025974352
63,0.94639970,-0.17793035,-1.0343047,-0.072133642,1.8843022,0.93540885,-0.90046807,0.027389699
64,0.94420289,-0.16535191,-1.0392457,-0.074925010,1.8781135,0.94580766,-0.90296684,0.028921441
65,0.94294808,-0.15106376,-1.0439234,-0.077588535,1.8715770,0.95623681,-0.90536783,0.030576793
66,0.94268349,-0.13506060,-1.0483470,-0.080109597,1.8647420,0.96670205,-0.90768086,0.032362914
67,0.94345343,-0.11734191,-1.0525251,-0.082473664,1.8576570,0.97720864,-0.90991499,0.034286900
68,0.94529818,-0.097911894,-1.0564663,-0.084666323,1.8503694,0.98776133,-0.91207856,0.036355759
69,0.94825390,-0.076779499,-1.0601789,-0.086673326,1.8429253,0.99836437,-0.91417911,0.038576398
70,0.95235257,-0.053958353,-1.0636708,-0.088480616,1.8353700,1.0090215,-0.91622340,0.040955608
71,0.95762188,-0.029466748,-1.0669496,-0.090074371,1.8277470,1.0197358,-0.91821740,0.043500047
72,0.96408520,-0.0033275780,-1.0700228,-0.091441033,1.8200987,1.0305101,-0.92016624,0.046216226
73,0.97176153,0.024431730,-1.0728972,-0.092567344,1.8124661,1.0413465,-0.92207424,0.049110495
74,0.98066549,0.053779290,-1.0755793,-0.093440377,1.8048883,1.0522466,-0.92394489,0.052189035
75,0.99080726,0.084678854,-1.0780753,-0.094047568,1.7974031,1.0632115,-0.92578084,0.055457840
76,1.0021926,0.11708991,-1.0803909,-0.094376743,1.7900466,1.0742417,-0.92758393,0.058922707
77,1.0148230,0.15096781,-1.0825312,-0.094416147,1.7828531,1.0853375,-0.92935513,0.062589230
78,1.0286954,0.18626386,-1.0845011,-0.094154472,1.7758552,1.0964983,-0.93109463,0.066462788
79,1.0438024,0.22292552,-1.0863047,-0.093580881,1.7690836,1.1077233,-0.93280178,0.070548535
80,1.0601325,0.26089649,-1.0879460,-0.092685029,1.7625674,1.1190111,-0.93447512,0.074851395
81,1.0776699,0.30011690,-1.0894281,-0.091457089,1.7563337,1.1303599,-0.93611243,0.079376056
82,1.0963946,0.34052347,-1.0907538,-0.089887768,1.7504076,1.1417674,-0.93771067,0.084126961
83,1.1162826,0.38204969,-1.0919253,-0.087968329,1.7448126,1.1532309,-0.93926610,0.089108306
84,1.1373059,0.42462600,-1.0929444,-0.085690603,1.7395701,1.1647474,-0.94077421,0.094324037
85,1.1594328,0.46818000,-1.0938122,-0.083047008,1.7346997,1.1763133,-0.94222979,0.099777843
86,1.1826279,0.51263662,-1.0945295,-0.080030559,1.7302192,1.1879249,-0.94362696,0.10547316
87,1.2068520,0.55791834,-1.0950964,-0.076634881,1.7261443,1.1995779,-0.94495918,0.11141316
88,1.2320627,0.60394544,-1.0955124,-0.072854218,1.7224892,1.2112679,-0.94621928,0.11760076
89,1.2582143,0.65063616,-1.0957768,-0.068683436,1.7192659,1.2229901,-0.94739951,0.12403862
90,1.2852581,0.69790697,-1.0958882,-0.064118035,1.7164850,1.2347396,-0.94849158,0.13072914
91,1.3131423,0.74567278,-1.0958448,-0.059154149,1.7141550,1.2465109,-0.94948666,0.13767448
92,1.3418124,0.79384720,-1.0956441,-0.053788548,1.7122831,1.2582988,-0.95037546,0.14487652
93,1.3712116,0.84234272,-1.0952836,-0.048018638,1.7108744,1.2700975,-0.95114825,0.15233692
94,1.4012805,0.89107102,-1.0947598,-0.041842459,1.7099328,1.2819012,-0.95179489,0.16005708
95,1.4319577,0.93994316,-1.0940693,-0.035258683,1.7094603,1.2937041,-0.95230491,0.16803817
96,1.4631798,0.98886985,-1.0932079,-0.028266606,1.7094577,1.3055001,-0.95266752,0.17628111
97,1.4948819,1.0377617,-1.0921713,-0.020866141,1.7099243,1.3172832,-0.95287168,0.18478662
98,1.5269974,1.0865294,-1.0909546,-0.013057812,1.7108581,1.3290473,-0.95290610,0.19355517
99,1.5594586,1.1350840,-1.0895529,-0.0048427411,1.7122556,1.3407863,-0.95275937,0.20258703
100,1.5921968,1.1833372,-1.0879606,0.0037773644,1.7141123,1.3524942,-0.95241991,0.21188227
101,1.6251424,1.2312017,-1.0861722,0.012800223,1.7164227,1.3641650,-0.95187610,0.22144076
102,1.6582254,1.2785910,-1.0841816,0.022222996,1.7191800,1.3757927,-0.95111630,0.23126217
103,1.6913754,1.3254201,-1.0819828,0.032042303,1.7223767,1.3873716,-0.95012885,0.24134599
104,1.7245221,1.3716054,-1.0795695,0.042254241,1.7260043,1.3988960,-0.94890221,0.25169156
105,1.7575951,1.4170653,-1.0769351,0.052854402,1.7300535,1.4103604,-0.94742494,0.26229803
106,1.7905245,1.4617200,-1.0740732,0.063837894,1.7345143,1.4217596,-0.94568576,0.27316443
107,1.8232413,1.5054919,-1.0709769,0.075199362,1.7393764,1.4330885,-0.94367362,0.28428960
108,1.8556770,1.5483060,-1.0676397,0.086933012,1.7446287,1.4443423,-0.94137773,0.29567231
109,1.8877644,1.5900896,-1.0640548,0.099032634,1.7502596,1.4555164,-0.93878762,0.30731114
110,1.9194377,1.6307731,-1.0602154,0.11149162,1.7562577,1.4666066,-0.93589315,0.31920461
111,1.9506323,1.6702896,-1.0561150,0.12430301,1.7626107,1.4776090,-0.93268460,0.33135112
112,1.9812859,1.7085756,-1.0517469,0.13745948,1.7693067,1.4885199,-0.92915269,0.34374896
113,2.0113377,1.7455708,-1.0471048,0.15095341,1.7763334,1.4993361,-0.92528862,0.35639636
114,2.0407293,1.7812183,-1.0421823,0.16477688,1.7836789,1.5100547,-0.92108411,0.36929146
115,2.0694045,1.8154649,-1.0369734,0.17892172,1.7913310,1.5206731,-0.91653146,0.38243236
116,2.0973100,1.8482611,-1.0314724,0.19337952,1.7992780,1.5311893,-0.91162356,0.39581707
117,2.1243948,1.8795614,-1.0256735,0.20814167,1.8075085,1.5416016,-0.90635393,0.40944357
118,2.1506112,1.9093241,-1.0195716,0.22319936,1.8160113,1.5519085,-0.90071676,0.42330981
119,2.1759143,1.9375117,-1.0131617,0.23854368,1.8247757,1.5621094,-0.89470697,0.43741370
120,2.2002625,1.9640909,-1.0064393,0.25416554,1.8337916,1.5722036,-0.88832017,0.45175313
121,2.2236176,1.9890325,-0.99940018,0.27005581,1.8430494,1.5821912,-0.88155275,0.46632597
122,2.2459449,2.0123117,-0.99204072,0.28620525,1.8525402,1.5920726,-0.87440188,0.48113007
123,2.2672132,2.0339082,-0.98435762,0.30260462,1.8622557,1.6018486,-0.86686551,0.49616332
124,2.2873952,2.0538058,-0.97634812,0.31924465,1.8721886,1.6115206,-0.85894245,0.51142355
125,2.3064673,2.0719931,-0.96800996,0.33611607,1.8823321,1.6210903,-0.85063233,0.52690866
126,2.3244098,2.0884628,-0.95934144,0.35320969,1.8926806,1.6305598,-0.84193563,0.54261651
127,2.3412070,2.1032123,-0.95034143,0.37051634,1.9032292,1.6399316,-0.83285371,0.55854500
128,2.3568473,2.1162433,-0.94100937,0.38802699,1.9139740,1.6492088,-0.82338880,0.57469205
129,2.3713229,2.1275620,-0.93134534,0.40573268,1.9249120,1.6583947,-0.81354400,0.59105560
130,2.3846305,2.1371790,-0.92135001,0.42362461,1.9360413,1.6674931,-0.80332332,0.60763359
131,2.3967707,2.1451091,-0.91102473,0.44169413,1.9473611,1.6765081,-0.79273163,0.62442402
132,2.4077482,2.1513714,-0.90037150,0.45993277,1.9588714,1.6854442,-0.78177471,0.64142489
133,2.4175720,2.1559893,-0.88939299,0.47833227,1.9705735,1.6943061,-0.77045919,0.65863421
134,2.4262550,2.1589902,-0.87809257,0.49688456,1.9824697,1.7030992,-0.75879260,0.67605004
135,2.4338143,2.1604056,-0.86647430,0.51558182,1.9945632,1.7118287,-0.74678332,0.69367045
136,2.4402710,2.1602709,-0.85454293,0.53441649,2.0068584,1.7205004,-0.73444058,0.71149351
137,2.4456502,2.1586252,-0.84230395,0.55338125,2.0193607,1.7291202,-0.72177443,0.72951733
138,2.4499808,2.1555113,-0.82976353,0.57246906,2.0320766,1.7376944,-0.70879574,0.74774001
139,2.4532956,2.1509756,-0.81692856,0.59167318,2.0450135,1.7462292,-0.69551619,0.76615965
140,2.4556312,2.1450677,-0.80380667,0.61098715,2.0581797,1.7547313,-0.68194821,0.78477437
141,2.4570274,2.1378406,-0.79040615,0.63040483,2.0715846,1.7632072,-0.66810497,0.80358225
142,2.4575279,2.1293501,-0.77673603,0.64992039,2.0852384,1.7716637,-0.65400035,0.82258139
143,2.4571797,2.1196551,-0.76280601,0.66952831,2.0991521,1.7801078,-0.63964894,0.84176983
144,2.4560326,2.1088171,-0.74862648,0.68922339,2.1133376,1.7885462,-0.62506594,0.86114562
145,2.4541400,2.0968999,-0.73420850,0.70900077,2.1278076,1.7969858,-0.61026719,0.88070673
146,2.4515578,2.0839698,-0.71956380,0.72885590,2.1425752,1.8054336,-0.59526909,0.90045109
147,2.4483446,2.0700952,-0.70470471,0.74878456,2.1576545,1.8138962,-0.58008858,0.92037659
148,2.4445618,2.0553462,-0.68964422,0.76878283,2.1730597,1.8223804,-0.56474308,0.94048104
149,2.4402727,2.0397945,-0.67439590,0.78884715,2.1888060,1.8308928,-0.54925048,0.96076214
150,2.4355431,2.0235136,-0.65897390,0.80897422,2.2049084,1.8394396,-0.53362906,0.98121754
151,2.4304405,2.0065777,-0.64339290,0.82916107,2.2213828,1.8480270,-0.51789746,1.0018447
152,2.4250342,1.9890623,-0.62766813,0.84940503,2.2382449,1.8566610,-0.50207462,1.0226412
153,2.4193947,1.9710436,-0.61181529,0.86970371,2.2555107,1.8653472,-0.48617975,1.0436041
154,2.4135941,1.9525981,-0.59585057,0.89005498,2.2731962,1.8740909,-0.47023226,1.0647306
155,2.4077053,1.9338028,-0.57979056,0.91045698,2.2913175,1.8828971,-0.45425172,1.0860178
156,2.4018018,1.9147347,-0.56365226,0.93090809,2.3098905,1.8917702,-0.43825780,1.1074623
157,2.3959579,1.8954704,-0.54745303,0.95140692,2.3289306,1.9007144,-0.42227023,1.1290609
158,2.3902481,1.8760863,-0.53121056,0.97195230,2.3484533,1.9097335,-0.40630872,1.1508099
159,2.3847468,1.8566581,-0.51494281,0.99254325,2.3684733,1.9188305,-0.39039295,1.1727055
160,2.3795281,1.8372603,-0.49866799,1.0131790,2.3890049,1.9280080,-0.37454246,1.1947438
161,2.3746660,1.8179667,-0.48240451,1.0338588,2.4100619,1.9372683,-0.35877664,1.2169204
162,2.3702332,1.7988495,-0.46617095,1.0545822,2.4316570,1.9466127,-0.34311466,1.2392310
163,2.3663018,1.7799793,-0.44998600,1.0753487,2.4538024,1.9560421,-0.32757541,1.2616706
164,2.3629427,1.7614250,-0.43386843,1.0961581,2.4765091,1.9655568,-0.31217745,1.2842343
165,2.3602249,1.7432533,-0.41783703,1.1170101,2.4997872,1.9751562,-0.29693897,1.3069167
166,2.3582162,1.7255291,-0.40191059,1.1379045,2.5236456,1.9848392,-0.28187772,1.3297121
167,2.3569819,1.7083145,-0.38610783,1.1588410,2.5480920,1.9946040,-0.26701098,1.3526147
168,2.3565855,1.6916690,-0.37044737,1.1798194,2.5731325,2.0044479,-0.25235547,1.3756181
169,2.3570878,1.6756496,-0.35494766,1.2008395,2.5987721,2.0143675,-0.23792735,1.3987157
170,2.3585470,1.6603101,-0.33962698,1.2219009,2.6250140,2.0243586,-0.22374214,1.4219006
171,2.3610184,1.6457013,-0.32450333,1.2430032,2.6518600,2.0344163,-0.20981468,1.4451653
172,2.3645543,1.6318705,-0.30959444,1.2641459,2.6793099,2.0445348,-0.19615909,1.4685022
173,2.3692034,1.6188617,-0.29491771,1.2853283,2.7073620,2.0547075,-0.18278874,1.4919033
174,2.3750112,1.6067155,-0.28049015,1.3065494,2.7360125,2.0649268,-0.16971615,1.5153600
175,2.3820193,1.5954684,-0.26632832,1.3278083,2.7652558,2.0751847,-0.15695306,1.5388636
176,2.3902655,1.5851534,-0.25244836,1.3491037,2.7950841,2.0854719,-0.14451027,1.5624047
177,2.3997836,1.5757994,-0.23886584,1.3704340,2.8254876,2.0957784,-0.13239771,1.5859737
178,2.4106029,1.5674313,-0.22559582,1.3917974,2.8564546,2.1060935,-0.12062432,1.6095606
179,2.4227488,1.5600700,-0.21265274,1.4131917,2.8879708,2.1164055,-0.10919809,1.6331550
180,2.4362418,1.5537320,-0.20005040,1.4346145,2.9200199,2.1267019,-0.098126009,1.6567458
181,2.4510981,1.5484298,-0.18780194,1.4560630,2.9525832,2.1369694,-0.087414014,1.6803219
182,2.4673289,1.5441714,-0.17591977,1.4775341,2.9856397,2.1471939,-0.077067006,1.7038715
183,2.4849408,1.5409606,-0.16441557,1.4990240,3.0191660,2.1573604,-0.067088814,1.7273825
184,2.5039353,1.5387969,-0.15330021,1.5205288,3.0531365,2.1674531,-0.057482182,1.7508424
185,2.5243090,1.5376752,-0.14258378,1.5420441,3.0875230,2.1774557,-0.048248755,1.7742383
186,2.5460536,1.5375864,-0.13227550,1.5635649,3.1222948,2.1873507,-0.039389068,1.7975567
187,2.5691556,1.5385168,-0.12238372,1.5850859,3.1574192,2.1971202,-0.030902544,1.8207841
188,2.5935962,1.5404485,-0.11291590,1.6066012,3.1928606,2.2067456,-0.022787485,1.8439061
189,2.6193518,1.5433593,-0.10387856,1.6281043,3.2285813,2.2162074,-0.015041073,1.8669084
190,2.6463936,1.5472229,-0.095277280,1.6495885,3.2645410,2.2254857,-0.0076593740,1.8897761
191,2.6746875,1.5520088,-0.087116678,1.6710461,3.3006974,2.2345598,-0.00063734307,1.9124938
192,2.7041946,1.5576824,-0.079400383,1.6924694,3.3370055,2.2434085,0.0060311684,1.9350460
193,2.7348706,1.5642051,-0.072131024,1.7138496,3.3734181,2.2520100,0.012353399,1.9574168
194,2.7666667,1.5715347,-0.065310219,1.7351777,3.4098860,2.2603422,0.018337664,1.9795898
195,2.7995288,1.5796248,-0.058938565,1.7564441,3.4463574,2.2683822,0.023993334,2.0015485
196,2.8333982,1.5884258,-0.053015627,1.7776384,3.4827788,2.2761070,0.029330817,2.0232761
197,2.8682114,1.5978845,-0.047539935,1.7987499,3.5190944,2.2834931,0.034361533,2.0447552
198,2.9039002,1.6079442,-0.042508983,1.8197671,3.5552464,2.2905166,0.039097886,2.0659687
199,2.9403923,1.6185453,-0.037919227,1.8406782,3.5911752,2.2971534,0.043553233,2.0868987
200,2.9776107,1.6296249,-0.033766090,1.8614705,3.6268195,2.3033791,0.047741854,2.1075275
201,3.0154744,1.6411174,-0.030043964,1.8821310,3.6621161,2.3091694,0.051678913,2.1278369
202,3.0538983,1.6529548,-0.026746222,1.9026461,3.6970003,2.3144994,0.055380422,2.1478087
203,3.0927938,1.6650662,-0.023865228,1.9230014,3.7314058,2.3193446,0.058863197,2.1674246
204,3.1320683,1.6773787,-0.021392348,1.9431824,3.7652652,2.3236802,0.062144819,2.1866660
205,3.1716260,1.6898175,-0.019317972,1.9631738,3.7985094,2.3274815,0.065243580,2.2055143
206,3.2113678,1.7023057,-0.017631524,1.9829598,3.8310687,2.3307240,0.068178443,2.2239509
207,3.2511918,1.7147649,-0.016321491,2.0025242,3.8628720,2.3333831,0.070968988,2.2419569
208,3.2909932,1.7271154,-0.015375445,2.0218502,3.8938475,2.3354348,0.073635359,2.2595138
209,3.3306648,1.7392763,-0.014780068,2.0409208,3.9239227,2.3368551,0.076198208,2.2766026
210,3.3700972,1.7511658,-0.014521179,2.0597183,3.9530245,2.3376203,0.078678644,2.2932048
211,3.4091790,1.7627015,-0.014583771,2.0782248,3.9810795,2.3377074,0.081098170,2.3093018
212,3.4477972,1.7738005,-0.014952039,2.0964219,4.0080140,2.3370934,0.083478626,2.3248749
213,3.4858371,1.7843797,-0.015609418,2.1142909,4.0337541,2.3357562,0.085842127,2.3399059
214,3.5231834,1.7943562,-0.016538621,2.1318127,4.0582260,2.3336742,0.088211003,2.3543765
215,3.5597194,1.8036474,-0.017721677,2.1489682,4.0813564,2.3308262,0.090607736,2.3682688
216,3.5953283,1.8121712,-0.019139977,2.1657377,4.1030720,2.3271919,0.093054893,2.3815649
217,3.6298929,1.8198462,-0.020774312,2.1821014,4.1233003,2.3227516,0.095575067,2.3942472
218,3.6632959,1.8265923,-0.022604924,2.1980394,4.1419696,2.3174867,0.098190806,2.4062987
219,3.6954206,1.8323307,-0.024611548,2.2135316,4.1590090,2.3113790,0.10092455,2.4177024
220,3.7261508,1.8369839,-0.026773465,2.2285578,4.1743488,2.3044116,0.10379858,2.4284417
221,3.7553716,1.8404764,-0.029069551,2.2430977,4.1879204,2.2965683,0.10683492,2.4385005
222,3.7829689,1.8427346,-0.031478327,2.2571309,4.1996568,2.2878341,0.11005530,2.4478631
223,3.8088305,1.8436873,-0.033978011,2.2706372,4.2094926,2.2781949,0.11348108,2.4565143
224,3.8328461,1.8432656,-0.036546576,2.2835963,4.2173640,2.2676379,0.11713319,2.4644392
225,3.8549075,1.8414034,-0.039161799,2.2959881,4.2232094,2.2561512,0.12103207,2.4716236
226,3.8749090,1.8380375,-0.041801321,2.3077926,4.2269693,2.2437244,0.12519758,2.4780538
227,3.8927476,1.8331076,-0.044442700,2.3189899,4.2285862,2.2303480,0.12964900,2.4837167
228,3.9083236,1.8265571,-0.047063469,2.3295604,4.2280053,2.2160141,0.13440488,2.4885998
229,3.9215404,1.8183325,-0.049641192,2.3394848,4.2251745,2.2007160,0.13948306,2.4926913
230,3.9323052,1.8083843,-0.052153521,2.3487441,4.2200441,2.1844482,0.14490059,2.4959798
231,3.9405290,1.7966665,-0.054578254,2.3573196,4.2125678,2.1672068,0.15067365,2.4984550
232,3.9461270,1.7831374,-0.056893393,2.3651931,4.2027019,2.1489892,0.15681751,2.5001071
233,3.9490188,1.7677592,-0.059077198,2.3723468,4.1904062,2.1297943,0.16334649,2.5009269
234,3.9491286,1.7504987,-0.061108246,2.3787634,4.1756438,2.1096224,0.17027391,2.5009064
235,3.9463856,1.7313269,-0.062965485,2.3844261,4.1583811,2.0884753,0.17761201,2.5000379
236,3.9407240,1.7102193,-0.064628293,2.3893188,4.1385883,2.0663564,0.18537196,2.4983150
237,3.9320834,1.6871561,-0.066076527,2.3934259,4.1162392,2.0432704,0.19356375,2.4957317
238,3.9204087,1.6621224,-0.067290582,2.3967325,4.0913114,2.0192239,0.20219622,2.4922831
239,3.9056509,1.6351079,-0.068251442,2.3992245,4.0637866,1.9942246,0.21127697,2.4879653
240,3.8877664,1.6061073,-0.068940728,2.4008884,4.0336504,1.9682821,0.22081236,2.4827749
241,3.8667180,1.5751200,-0.069340753,2.4017116,4.0008924,1.9414073,0.23080744,2.4767099
242,3.8424744,1.5421508,-0.069434568,2.4016822,3.9655067,1.9136128,0.24126598,2.4697687
243,3.8150108,1.5072092,-0.069206009,2.4007894,3.9274913,1.8849126,0.25219038,2.4619511
244,3.7843088,1.4703098,-0.068639743,2.3990231,3.8868489,1.8553225,0.26358170,2.4532576
245,3.7503564,1.4314722,-0.067721312,2.3963742,3.8435862,1.8248595,0.27543962,2.4436897
246,3.7131483,1.3907211,-0.066437171,2.3928345,3.7977147,1.7935423,0.28776242,2.4332499
247,3.6726858,1.3480860,-0.064774732,2.3883969,3.7492502,1.7613911,0.30054698,2.4219417
248,3.6289771,1.3036016,-0.062722400,2.3830552,3.6982129,1.7284274,0.31378878,2.4097694
249,3.5820369,1.2573073,-0.060269604,2.3768045,3.6446275,1.6946743,0.32748186,2.3967384
250,3.5318869,1.2092474,-0.057406836,2.3696406,3.5885236,1.6601564,0.34161887,2.3828552
251,3.4785555,1.1594709,-0.054125676,2.3615608,3.5299348,1.6248994,0.35619102,2.3681271
252,3.4220778,1.1080315,-0.050418821,2.3525632,3.4688995,1.5889307,0.37118814,2.3525625
253,3.3624959,1.0549875,-0.046280112,2.3426472,3.4054605,1.5522787,0.38659865,2.3361706
254,3.2998583,1.0004016,-0.041704555,2.3318133,3.3396652,1.5149733,0.40240958,2.3189617
255,3.2342203,0.94434078,-0.036688338,2.3200632,3.2715651,1.4770456,0.41860661,2.3009470
256,3.1656437,0.88687618,-0.031228851,2.3073998,3.2012163,1.4385278,0.43517406,2.2821387
257,3.0941969,0.82808301,-0.025324700,2.2938273,3.1286792,1.3994534,0.45209493,2.2625499
258,3.0199544,0.76804028,-0.018975717,2.2793508,3.0540183,1.3598567,0.46935095,2.2421947
259,2.9429972,0.70683071,-0.012182965,2.2639768,2.9773023,1.3197735,0.48692256,2.2210878
260,2.8634122,0.64454050,-0.0049487493,2.2477130,2.8986039,1.2792401,0.50478897,2.1992452
261,2.7812923,0.58125915,0.0027233848,2.2305684,2.8179999,1.2382941,0.52292824,2.1766836
262,2.6967361,0.51707925,0.010828652,2.2125530,2.7355709,1.1969737,0.54131723,2.1534204
263,2.6098478,0.45209627,0.019361030,2.1936781,2.6514011,1.1553182,0.55993172,2.1294741
264,2.5207371,0.38640835,0.028313267,2.1739563,2.5655783,1.1133673,0.57874644,2.1048637
265,2.4295186,0.32011607,0.037676891,2.1534011,2.4781941,1.0711617,0.59773508,2.0796092
266,2.3363120,0.25332218,0.047442225,2.1320274,2.3893429,1.0287424,0.61687040,2.0537314
267,2.2412416,0.18613142,0.057598399,2.1098513,2.2991228,0.98615128,0.63612425,2.0272516
268,2.1444362,0.11865021,0.068133370,2.0868897,2.2076346,0.94343040,0.65546764,2.0001920
269,2.0460287,0.050986432,0.079033946,2.0631611,2.1149819,0.90062236,0.67487077,1.9725752
270,1.9461559,-0.016750820,0.090285806,2.0386846,2.0212712,0.85777006,0.69430315,1.9444248
271,1.8449584,-0.084451527,0.10187353,2.0134808,1.9266113,0.81491665,0.71373362,1.9157646
272,1.7425798,-0.15200500,0.11378063,1.9875709,1.8311135,0.77210546,0.73313041,1.8866193
273,1.6391669,-0.21930013,0.12598958,1.9609775,1.7348911,0.72937993,0.75246124,1.8570140
274,1.5348692,-0.28622568,0.13848186,1.9337240,1.6380593,0.68678353,0.77169338,1.8269742
275,1.4298385,-0.35267055,0.15123796,1.9058347,1.5407350,0.64435968,0.79079371,1.7965260
276,1.3242288,-0.41852404,0.16423746,1.8773349,1.4430366,0.60215168,0.80972878,1.7656957
277,1.2181958,-0.48367611,0.17745908,1.8482506,1.3450840,0.56020265,0.82846492,1.7345103
278,1.1118964,-0.54801767,0.19088066,1.8186089,1.2469980,0.51855542,0.84696829,1.7029968
279,1.0054888,-0.61144083,0.20447929,1.7884375,1.1489002,0.47725248,0.86520494,1.6711828
280,0.89913180,-0.67383919,0.21823127,1.7577647,1.0509131,0.43633590,0.88314092,1.6390958
281,0.79298466,-0.73510804,0.23211225,1.7266198,0.95315928,0.39584727,0.90074234,1.6067638
282,0.68720660,-0.79514470,0.24609721,1.6950326,0.85576177,0.35582761,0.91797543,1.5742149
283,0.58195656,-0.85384871,0.26016056,1.6630334,0.75884350,0.31631730,0.93480665,1.5414772
284,0.47739279,-0.91112210,0.27427617,1.6306531,0.66252710,0.27735602,0.95120271,1.5085791
285,0.37367256,-0.96686963,0.28841744,1.5979233,0.56693476,0.23898267,0.96713072,1.4755489
286,0.27095181,-1.0209990,0.30255735,1.5648757,0.47218792,0.20123532,0.98255820,1.4424147
287,0.16938476,-1.0734212,0.31666850,1.5315425,0.37840711,0.16415113,0.99745317,1.4092050
288,0.069123629,-1.1240504,0.33072323,1.4979564,0.28571167,0.12776629,1.0117843,1.3759479
289,-0.029681709,-1.1728047,0.34469361,1.4641501,0.19421956,0.092115973,1.0255207,1.3426714
290,-0.12688407,-1.2196058,0.35855155,1.4301567,0.10404713,0.057234238,1.0386325,1.3094034
291,-0.22233925,-1.2643795,0.37226883,1.3960095,0.015308900,0.023154017,1.0510905,1.2761716
292,-0.31590636,-1.3070558,0.38581718,1.3617417,-0.071882648,-0.010092964,1.0628661,1.2430032
293,-0.40744813,-1.3475689,0.39916836,1.3273867,-0.15741730,-0.042476231,1.0739321,1.2099255
294,-0.49683120,-1.3858579,0.41229416,1.2929778,-0.24118728,-0.073966614,1.0842620,1.1769651
295,-0.58392639,-1.4218662,0.42516653,1.2585483,-0.32308750,-0.10453629,1.0938303,1.1441484
296,-0.66860900,-1.4555423,0.43775762,1.2241312,-0.40301573,-0.13415883,1.1026127,1.1115013
297,-0.75075907,-1.4868394,0.45003982,1.1897595,-0.48087278,-0.16280924,1.1105860,1.0790494
298,-0.83026164,-1.5157160,0.46198584,1.1554660,-0.55656271,-0.19046400,1.1177284,1.0468177
299,-0.90700699,-1.5421357,0.47356878,1.1212829,-0.62999297,-0.21710110,1.1240191,1.0148305
300,-0.98089084,-1.5660671,0.48476216,1.0872424,-0.70107463,-0.24270005,1.1294389,0.98311184
301,-1.0518146,-1.5874845,0.49554000,1.0533759,-0.76972251,-0.26724195,1.1339696,0.95168498
302,-1.1196857,-1.6063673,0.50587688,1.0197146,-0.83585531,-0.29070948,1.1375947,0.92057258
303,-1.1844174,-1.6227005,0.51574799,0.98628907,-0.89939581,-0.31308695,1.1402990,0.88979667
304,-1.2459294,-1.6364744,0.52512917,0.95312938,-0.96027100,-0.33436029,1.1420689,0.85937856
305,-1.3041478,-1.6476849,0.53399699,0.92026487,-1.0184122,-0.35451709,1.1428922,0.82933884
306,-1.3590051,-1.6563335,0.54232877,0.88772426,-1.0737551,-0.37354659,1.1427582,0.79969737
307,-1.4104408,-1.6624269,0.55010268,0.85553549,-1.1262401,-0.39143971,1.1416578,0.77047323
308,-1.4584010,-1.6659773,0.55729772,0.82372576,-1.1758122,-0.40818904,1.1395836,0.74168469
309,-1.5028386,-1.6670027,0.56389382,0.79232144,-1.2224211,-0.42378885,1.1365296,0.71334924
310,-1.5437136,-1.6655259,0.56987186,0.76134801,-1.2660215,-0.43823508,1.1324917,0.68548348
311,-1.5809932,-1.6615755,0.57521373,0.73083006,-1.3065730,-0.45152534,1.1274671,0.65810321
312,-1.6146514,-1.6551850,0.57990232,0.70079123,-1.3440399,-0.46365893,1.1214548,0.63122331
313,-1.6446696,-1.6463932,0.58392163,0.67125417,-1.3783920,-0.47463674,1.1144554,0.60485780
314,-1.6710361,-1.6352438,0.58725674,0.64224050,-1.4096038,-0.48446136,1.1064712,0.57901978
315,-1.6937464,-1.6217856,0.58989389,0.61377079,-1.4376552,-0.49313695,1.0975062,0.55372144
316,-1.7128032,-1.6060721,0.59182046,0.58586451,-1.4625311,-0.50066929,1.0875657,0.52897407
317,-1.7282162,-1.5881613,0.59302505,0.55854004,-1.4842216,-0.50706571,1.0766570,0.50478800
318,-1.7400022,-1.5681160,0.59349747,0.53181459,-1.5027219,-0.51233509,1.0647888,0.48117263
319,-1.7481847,-1.5460030,0.59322874,0.50570421,-1.5180323,-0.51648784,1.0519713,0.45813643
320,-1.7527945,-1.5218935,0.59221117,0.48022377,-1.5301584,-0.51953582,1.0382165,0.43568691
321,-1.7538687,-1.4958625,0.59043833,0.45538694,-1.5391107,-0.52149233,1.0235378,0.41383065
322,-1.7514512,-1.4679890,0.58790506,0.43120613,-1.5449049,-0.52237211,1.0079501,0.39257328
323,-1.7455927,-1.4383552,0.58460750,0.40769257,-1.5475617,-0.52219120,0.99146967,0.37191949
324,-1.7363497,-1.4070470,0.58054309,0.38485618,-1.5471066,-0.52096701,0.97411442,0.35187305
325,-1.7237854,-1.3741533,0.57571057,0.36270569,-1.5435700,-0.51871818,0.95590354,0.33243678
326,-1.7079688,-1.3397657,0.57010997,0.34124852,-1.5369871,-0.51546460,0.93685758,0.31361259
327,-1.6889746,-1.3039789,0.56374263,0.32049084,-1.5273980,-0.51122730,0.91699842,0.29540149
328,-1.6668832,-1.2668897,0.55661117,0.30043758,-1.5148470,-0.50602844,0.89634918,0.27780359
329,-1.6417806,-1.2285970,0.54871951,0.28109238,-1.4993831,-0.49989124,0.87493421,0.26081810
330,-1.6137577,-1.1892019,0.54007283,0.26245765,-1.4810597,-0.49283992,0.85277900,0.24444339
331,-1.5829104,-1.1488069,0.53067757,0.24453454,-1.4599344,-0.48489964,0.82991015,0.22867695
332,-1.5493394,-1.1075160,0.52054142,0.22732297,-1.4360687,-0.47609645,0.80635530,0.21351547
333,-1.5131496,-1.0654344,0.50967326,0.21082164,-1.4095284,-0.46645721,0.78214308,0.19895480
334,-1.4744502,-1.0226679,0.49808321,0.19502805,-1.3803827,-0.45600958,0.75730304,0.18499002
335,-1.4333541,-0.97932323,0.48578254,0.17993850,-1.3487049,-0.44478186,0.73186557,0.17161542
336,-1.3899779,-0.93550711,0.47278366,0.16554814,-1.3145714,-0.43280303,0.70586188,0.15882456
337,-1.3444416,-0.89132648,0.45910011,0.15185098,-1.2780620,-0.42010263,0.67932388,0.14661028
338,-1.2968677,-0.84688798,0.44474651,0.13883990,-1.2392596,-0.40671067,0.65228415,0.13496473
339,-1.2473819,-0.80229779,0.42973853,0.12650670,-1.1982503,-0.39265764,0.62477584,0.12387938
340,-1.1961120,-0.75766127,0.41409282,0.11484214,-1.1551226,-0.37797438,0.59683264,0.11334509
341,-1.1431876,-0.71308278,0.39782706,0.10383594,-1.1099678,-0.36269203,0.56848866,0.10335208
342,-1.0887406,-0.66866535,0.38095980,0.093476823,-1.0628794,-0.34684199,0.53977840,0.093890021
343,-1.0329036,-0.62451046,0.36351052,0.083752589,-1.0139531,-0.33045581,0.51073664,0.084948031
344,-0.97581078,-0.58071778,0.34549953,0.074650104,-0.96328669,-0.31356516,0.48139840,0.076514713
345,-0.91759682,-0.53738490,0.32694792,0.066155367,-0.91097956,-0.29620176,0.45179885,0.068578190
346,-0.85839686,-0.49460713,0.30787756,0.058253546,-0.85713270,-0.27839729,0.42197324,0.061126141
347,-0.79834612,-0.45247720,0.28831098,0.050929023,-0.80184842,-0.26018336,0.39195683,0.054145830
348,-0.73757959,-0.41108509,0.26827141,0.044165440,-0.74523013,-0.24159143,0.36178480,0.047624145
349,-0.67623171,-0.37051778,0.24778262,0.037945741,-0.68738218,-0.22265275,0.33149222,0.041547630
350,-0.61443602,-0.33085904,0.22686897,0.032252224,-0.62840957,-0.20339831,0.30111394,0.035902517
351,-0.55232491,-0.29218922,0.20555528,0.027066588,-0.56841780,-0.18385876,0.27068452,0.030674770
352,-0.49002924,-0.25458509,0.18386682,0.022369985,-0.50751262,-0.16406438,0.24023819,0.025850111
353,-0.42767810,-0.21811960,0.16182925,0.018143066,-0.44579984,-0.14404501,0.20980876,0.021414060
354,-0.36539849,-0.18286174,0.13946854,0.014366038,-0.38338511,-0.12382999,0.17942957,0.017351969
355,-0.30331502,-0.14887638,0.11681093,0.011018712,-0.32037370,-0.10344813,0.14913342,0.013649059
356,-0.24154964,-0.11622410,0.093882896,0.0080805556,-0.25687033,-0.082927626,0.11895248,0.010290452
357,-0.18022138,-0.084961063,0.070711048,0.0055307496,-0.19297894,-0.062296055,0.088918276,0.0072612062
358,-0.11944607,-0.055138877,0.047322113,0.0033482370,-0.12880247,-0.041580297,0.059061605,0.0045463531
359,-0.059336097,-0.026804488,0.023742864,0.0015117783,-0.064442741,-0.020806503,0.029412480,0.0021309282
360,-1.6429202e-07,-7.2580107e-08,6.6414486e-08,3.7830432e-09,-1.7973364e-07,-5.8045259e-08,8.1665533e-08,5.5596132e-09
