deg,XRT_AX,XRT_BX,XRT_AY,XRT_BY,SOT_AX,SOT_BX,SOT_AY,SOT_BY
valid,1,1,1,1,1,1,1,1,revB
offset,124.47091,101.89693,1975.8962,1981.2769,74.306334,50.877757,72.994115,78.500311
0,0.0000000,0.0000000,0.0000000,0.0000000,0.0000000,0.0000000,0.0000000,0.0000000
1,0.014558848,0.0082667585,-0.012969100,-0.011148390,0.019077579,0.010505140,-0.0082541208,-0.0057137814
2,0.028557025,0.016514405,-0.025755166,-0.022061361,0.037670646,0.021119838,-0.016572612,-0.011434484
3,0.041990948,0.024751396,-0.038350409,-0.032734815,0.055766977,0.031840125,-0.024953084,-0.017167082
4,0.054858182,0.032986532,-0.050747102,-0.043165068,0.073355000,0.042662009,-0.033392661,-0.022916257
5,0.067157425,0.041228916,-0.062937599,-0.053348858,0.090423803,0.053581474,-0.041887991,-0.028686383
6,0.078888496,0.049487918,-0.074914357,-0.063283357,0.10696314,0.064594475,-0.050435257,-0.034481517
7,0.090052314,0.057773132,-0.086669945,-0.072966173,0.12296344,0.075696941,-0.059030184,-0.040305389
8,0.10065087,0.066094333,-0.098197069,-0.082395353,0.13841580,0.086884771,-0.067668054,-0.046161397
9,0.11068723,0.074461440,-0.10948859,-0.091569395,0.15331200,0.098153836,-0.076343718,-0.052052594
10,0.12016545,0.082884467,-0.12053752,-0.10048724,0.16764451,0.10949998,-0.085051607,-0.057981683
11,0.12909062,0.091373492,-0.13133709,-0.10914828,0.18140647,0.12091900,-0.093785756,-0.063951014
12,0.13746877,0.099938603,-0.14188069,-0.11755237,0.19459169,0.13240669,-0.10253981,-0.069962572
13,0.14530689,0.10858986,-0.15216197,-0.12569978,0.20719468,0.14395879,-0.11130705,-0.076017982
14,0.15261284,0.11733727,-0.16217479,-0.13359125,0.21921061,0.15557101,-0.12008040,-0.082118496
15,0.15939534,0.12619072,-0.17191326,-0.14122798,0.23063532,0.16723905,-0.12885248,-0.088264998
16,0.16566395,0.13515993,-0.18137176,-0.14861156,0.24146531,0.17895856,-0.13761556,-0.094457999
17,0.17142897,0.14425447,-0.19054494,-0.15574404,0.25169774,0.19072516,-0.14636164,-0.10069764
18,0.17670146,0.15348364,-0.19942776,-0.16262791,0.26133042,0.20253445,-0.15508248,-0.10698368
19,0.18149316,0.16285650,-0.20801546,-0.16926603,0.27036179,0.21438200,-0.16376955,-0.11331551
20,0.18581645,0.17238179,-0.21630363,-0.17566170,0.27879092,0.22626334,-0.17241412,-0.11969217
21,0.18968428,0.18206791,-0.22428815,-0.18181861,0.28661751,0.23817399,-0.18100726,-0.12611231
22,0.19311017,0.19192289,-0.23196528,-0.18774081,0.29384183,0.25010944,-0.18953988,-0.13257421
23,0.19610811,0.20195433,-0.23933160,-0.19343274,0.30046478,0.26206516,-0.19800271,-0.13907583
24,0.19869256,0.21216940,-0.24638407,-0.19889918,0.30648781,0.27403660,-0.20638637,-0.14561475
25,0.20087834,0.22257480,-0.25312001,-0.20414527,0.31191295,0.28601917,-0.21468139,-0.15218819
26,0.20268062,0.23317670,-0.25953710,-0.20917645,0.31674277,0.29800831,-0.22287819,-0.15879307
27,0.20411484,0.24398075,-0.26563344,-0.21399847,0.32098035,0.30999940,-0.23096718,-0.16542594
28,0.20519669,0.25499204,-0.27140749,-0.21861736,0.32462932,0.32198783,-0.23893872,-0.17208305
29,0.20594204,0.26621506,-0.27685810,-0.22303944,0.32769378,0.33396900,-0.24678316,-0.17876033
30,0.20636686,0.27765372,-0.28198455,-0.22727126,0.33017831,0.34593828,-0.25449090,-0.18545340
31,0.20648722,0.28931127,-0.28678647,-0.23131959,0.33208795,0.35789104,-0.26205238,-0.19215760
32,0.20631919,0.30119032,-0.29126395,-0.23519142,0.33342819,0.36982267,-0.26945809,-0.19886796
33,0.20587882,0.31329283,-0.29541743,-0.23889391,0.33420493,0.38172856,-0.27669864,-0.20557926
34,0.20518208,0.32562006,-0.29924778,-0.24243438,0.33442447,0.39360412,-0.28376476,-0.21228603
35,0.20424479,0.33817259,-0.30275626,-0.24582030,0.33409349,0.40544475,-0.29064732,-0.21898253
36,0.20308260,0.35095028,-0.30594455,-0.24905924,0.33321904,0.41724589,-0.29733734,-0.22566280
37,0.20171093,0.36395229,-0.30881469,-0.25215885,0.33180850,0.42900301,-0.30382606,-0.23232065
38,0.20014492,0.37717707,-0.31136914,-0.25512685,0.32986957,0.44071158,-0.31010491,-0.23894970
39,0.19839938,0.39062233,-0.31361074,-0.25797102,0.32741026,0.45236715,-0.31616554,-0.24554337
40,0.19648876,0.40428507,-0.31554270,-0.26069911,0.32443883,0.46396527,-0.32199988,-0.25209490
41,0.19442711,0.41816157,-0.31716861,-0.26331890,0.32096383,0.47550154,-0.32760010,-0.25859737
42,0.19222800,0.43224737,-0.31849241,-0.26583811,0.31699403,0.48697162,-0.33295869,-0.26504372
43,0.18990454,0.44653731,-0.31951842,-0.26826438,0.31253843,0.49837122,-0.33806841,-0.27142675
44,0.18746928,0.46102553,-0.32025127,-0.27060530,0.30760620,0.50969610,-0.34292236,-0.27773915
45,0.18493425,0.47570546,-0.32069595,-0.27286832,0.30220672,0.52094211,-0.34751399,-0.28397351
46,0.18231084,0.49056984,-0.32085776,-0.27506076,0.29634951,0.53210514,-0.35183707,-0.29012233
47,0.17960985,0.50561076,-0.32074230,-0.27718978,0.29004422,0.54318117,-0.35588576,-0.29617804
48,0.17684141,0.52081963,-0.32035547,-0.27926233,0.28330065,0.55416627,-0.35965460,-0.30213302
49,0.17401497,0.53618724,-0.31970345,-0.28128517,0.27612868,0.56505656,-0.36313848,-0.30797963
50,0.17113928,0.55170375,-0.31879268,-0.28326482,0.26853826,0.57584830,-0.36633275,-0.31371019
51,0.16822236,0.56735872,-0.31762985,-0.28520754,0.26053945,0.58653781,-0.36923310,-0.31931700
52,0.16527150,0.58314116,-0.31622186,-0.28711931,0.25214232,0.59712153,-0.37183568,-0.32479240
53,0.16229321,0.59903952,-0.31457586,-0.28900579,0.24335699,0.60759599,-0.37413704,-0.33012874
54,0.15929325,0.61504173,-0.31269916,-0.29087235,0.23419360,0.61795786,-0.37613417,-0.33531841
55,0.15627659,0.63113522,-0.31059926,-0.29272399,0.22466230,0.62820389,-0.37782446,-0.34035385
56,0.15324740,0.64730700,-0.30828380,-0.29456535,0.21477320,0.63833099,-0.37920577,-0.34522758
57,0.15020908,0.66354360,-0.30576058,-0.29640070,0.20453643,0.64833616,-0.38027636,-0.34993219
58,0.14716420,0.67983119,-0.30303750,-0.29823390,0.19396205,0.65821656,-0.38103493,-0.35446037
59,0.14411457,0.69615558,-0.30012256,-0.30006839,0.18306008,0.66796946,-0.38148063,-0.35880493
60,0.14106117,0.71250225,-0.29702383,-0.30190720,0.17184049,0.67759229,-0.38161302,-0.36295880
61,0.13800423,0.72885640,-0.29374944,-0.30375290,0.16031316,0.68708261,-0.38143208,-0.36691502
62,0.13494316,0.74520296,-0.29030754,-0.30560760,0.14848791,0.69643814,-0.38093823,-0.37066681
63,0.13187663,0.76152669,-0.28670631,-0.30747296,0.13637445,0.70565674,-0.38013229,-0.37420753
64,0.12880254,0.77781214,-0.28295389,-0.30935012,0.12398242,0.71473641,-0.37901548,-0.37753072
65,0.12571808,0.79404376,-0.27905842,-0.31123978,0.11132133,0.72367533,-0.37758943,-0.38063009
66,0.12261968,0.81020590,-0.27502796,-0.31314211,0.098400596,0.73247183,-0.37585617,-0.38349955
67,0.11950311,0.82628287,-0.27087052,-0.31505679,0.085229501,0.74112440,-0.37381807,-0.38613320
68,0.11636343,0.84225896,-0.26659398,-0.31698298,0.071817215,0.74963170,-0.37147791,-0.38852536
69,0.11319508,0.85811850,-0.26220614,-0.31891934,0.058172783,0.75799254,-0.36883880,-0.39067055
70,0.10999186,0.87384591,-0.25771463,-0.32086400,0.044305116,0.76620590,-0.36590418,-0.39256352
71,0.10674698,0.88942571,-0.25312693,-0.32281459,0.030222995,0.77427095,-0.36267785,-0.39419927
72,0.10345311,0.90484260,-0.24845036,-0.32476822,0.015935063,0.78218700,-0.35916389,-0.39557301
73,0.10010238,0.92008146,-0.24369202,-0.32672147,0.0014498318,0.78995354,-0.35536668,-0.39668019
74,0.096686423,0.93512741,-0.23885879,-0.32867044,-0.013224328,0.79757024,-0.35129090,-0.39751655
75,0.093196434,0.94996588,-0.23395733,-0.33061070,-0.028079179,0.80503691,-0.34694146,-0.39807803
76,0.089623188,0.96458260,-0.22899405,-0.33253733,-0.043106621,0.81235356,-0.34232352,-0.39836085
77,0.085957089,0.97896364,-0.22397506,-0.33444491,-0.058298688,0.81952035,-0.33744248,-0.39836150
78,0.082188210,0.99309550,-0.21890621,-0.33632756,-0.073647545,0.82653760,-0.33230394,-0.39807671
79,0.078306335,1.0069651,-0.21379303,-0.33817890,-0.089145490,0.83340581,-0.32691366,-0.39750349
80,0.074301004,1.0205598,-0.20864074,-0.33999212,-0.10478494,0.84012563,-0.32127759,-0.39663910
81,0.070161558,1.0338675,-0.20345422,-0.34175992,-0.12055845,0.84669787,-0.31540182,-0.39548107
82,0.065877184,1.0468766,-0.19823801,-0.34347462,-0.13645868,0.85312350,-0.30929255,-0.39402721
83,0.061436958,1.0595761,-0.19299630,-0.34512808,-0.15247840,0.85940365,-0.30295611,-0.39227557
84,0.056829900,1.0719556,-0.18773288,-0.34671180,-0.16861051,0.86553958,-0.29639888,-0.39022448
85,0.052045012,1.0840052,-0.18245119,-0.34821686,-0.18484799,0.87153270,-0.28962731,-0.38787253
86,0.047071331,1.0957159,-0.17715427,-0.34963401,-0.20118395,0.87738458,-0.28264791,-0.38521856
87,0.041897973,1.1070790,-0.17184475,-0.35095365,-0.21761156,0.88309691,-0.27546719,-0.38226167
88,0.036514183,1.1180870,-0.16652487,-0.35216585,-0.23412409,0.88867151,-0.26809166,-0.37900123
89,0.030909379,1.1287326,-0.16119645,-0.35326040,-0.25071489,0.89411033,-0.26052781,-0.37543683
90,0.025073201,1.1390096,-0.15586090,-0.35422681,-0.26737739,0.89941544,-0.25278209,-0.37156832
91,0.018995554,1.1489123,-0.15051920,-0.35505435,-0.28410508,0.90458902,-0.24486088,-0.36739580
92,0.012666656,1.1584360,-0.14517191,-0.35573207,-0.30089151,0.90963337,-0.23677048,-0.36291960
93,0.0060770827,1.1675766,-0.13981917,-0.35624881,-0.31773028,0.91455087,-0.22851709,-0.35814026
94,-0.00078219210,1.1763308,-0.13446068,-0.35659326,-0.33461504,0.91934401,-0.22010680,-0.35305858
95,-0.0079197514,1.1846963,-0.12909574,-0.35675396,-0.35153950,0.92401536,-0.21154555,-0.34767553
96,-0.015343695,1.1926713,-0.12372321,-0.35671935,-0.36849736,0.92856758,-0.20283912,-0.34199234
97,-0.023061599,1.2002550,-0.11834154,-0.35647777,-0.38548239,0.93300337,-0.19399314,-0.33601042
98,-0.031080478,1.2074473,-0.11294874,-0.35601753,-0.40248836,0.93732554,-0.18501303,-0.32973137
99,-0.039406749,1.2142491,-0.10754245,-0.35532691,-0.41950904,0.94153692,-0.17590401,-0.32315699
100,-0.048046195,1.2206618,-0.10211988,-0.35439418,-0.43653825,0.94564039,-0.16667110,-0.31628927
101,-0.057003934,1.2266878,-0.096677857,-0.35320767,-0.45356977,0.94963889,-0.15731907,-0.30913036
102,-0.066284384,1.2323303,-0.091212815,-0.35175578,-0.47059740,0.95353537,-0.14785247,-0.30168259
103,-0.075891239,1.2375932,-0.085720820,-0.35002700,-0.48761492,0.95733280,-0.13827556,-0.29394844
104,-0.085827438,1.2424811,-0.080197571,-0.34800994,-0.50461612,0.96103417,-0.12859238,-0.28593053
105,-0.096095142,1.2469995,-0.074638416,-0.34569341,-0.52159475,0.96464248,-0.11880666,-0.27763166
106,-0.10669571,1.2511546,-0.069038365,-0.34306637,-0.53854455,0.96816070,-0.10892187,-0.26905472
107,-0.11762968,1.2549532,-0.063392105,-0.34011803,-0.55545923,0.97159181,-0.098941167,-0.26020276
108,-0.12889676,1.2584028,-0.057694016,-0.33683784,-0.57233248,0.97493876,-0.088867442,-0.25107893
109,-0.14049579,1.2615117,-0.051938185,-0.33321554,-0.58915796,0.97820444,-0.078703269,-0.24168650
110,-0.15242475,1.2642888,-0.046118426,-0.32924118,-0.60592931,0.98139173,-0.068450920,-0.23202885
111,-0.16468075,1.2667435,-0.040228297,-0.32490514,-0.62264010,0.98450344,-0.058112362,-0.22210944
112,-0.17726001,1.2688859,-0.034261120,-0.32019819,-0.63928392,0.98754234,-0.047689254,-0.21193182
113,-0.19015786,1.2707267,-0.028209998,-0.31511148,-0.65585429,0.99051109,-0.037182949,-0.20149964
114,-0.20336874,1.2722768,-0.022067842,-0.30963659,-0.67234471,0.99341231,-0.026594490,-0.19081659
115,-0.21688622,1.2735480,-0.015827383,-0.30376554,-0.68874864,0.99624851,-0.015924620,-0.17988647
116,-0.23070296,1.2745524,-0.0094812030,-0.29749085,-0.70505953,0.99902212,-0.0051737782,-0.16871311
117,-0.24481075,1.2753023,-0.0030217516,-0.29080551,-0.72127079,1.0017354,0.0056578905,-0.15730039
118,-0.25920051,1.2758108,0.0035586288,-0.28370304,-0.73737580,1.0043907,0.016570532,-0.14565227
119,-0.27386232,1.2760909,0.010267679,-0.27617752,-0.75336793,1.0069899,0.027564574,-0.13377271
120,-0.28878538,1.2761562,0.017113202,-0.26822358,-0.76924052,1.0095351,0.038640720,-0.12166574
121,-0.30395810,1.2760204,0.024103034,-0.25983644,-0.78498693,1.0120281,0.049799938,-0.10933541
122,-0.31936805,1.2756975,0.031245023,-0.25101191,-0.80060047,1.0144705,0.061043450,-0.096785789
123,-0.33500206,1.2752015,0.038547005,-0.24174644,-0.81607448,1.0168638,0.072372724,-0.084020989
124,-0.35084615,1.2745468,0.046016778,-0.23203711,-0.83140229,1.0192095,0.083789456,-0.071045123
125,-0.36688565,1.2737476,0.053662073,-0.22188165,-0.84657727,1.0215087,0.095295558,-0.057862328
126,-0.38310517,1.2728184,0.061490537,-0.21127846,-0.86159277,1.0237625,0.10689315,-0.044476751
127,-0.39948864,1.2717734,0.069509701,-0.20022661,-0.87644221,1.0259716,0.11858453,-0.030892549
128,-0.41601938,1.2706270,0.077726958,-0.18872586,-0.89111902,1.0281368,0.13037217,-0.017113887
129,-0.43268009,1.2693933,0.086149538,-0.17677667,-0.90561668,1.0302586,0.14225870,-0.0031449368
130,-0.44945291,1.2680864,0.094784484,-0.16438019,-0.91992876,1.0323373,0.15424689,0.011010127
131,-0.46631948,1.2667202,0.10363863,-0.15153830,-0.93404885,1.0343729,0.16633960,0.025347126
132,-0.48326094,1.2653083,0.11271856,-0.13825356,-0.94797064,1.0363655,0.17853981,0.039861876
133,-0.50025801,1.2638640,0.12203062,-0.12452929,-0.96168793,1.0383146,0.19085059,0.054550193
134,-0.51729101,1.2624004,0.13158085,-0.11036949,-0.97519459,1.0402198,0.20327502,0.069407888
135,-0.53433993,1.2609302,0.14137502,-0.095778896,-0.98848461,1.0420804,0.21581627,0.084430768
136,-0.55138445,1.2594656,0.15141853,-0.080762944,-1.0015521,1.0438955,0.22847747,0.099614633
137,-0.56840403,1.2580183,0.16171646,-0.065327788,-1.0143914,1.0456639,0.24126180,0.11495528
138,-0.58537793,1.2565999,0.17227351,-0.049480287,-1.0269967,1.0473845,0.25417235,0.13044849
139,-0.60228525,1.2552211,0.18309401,-0.033227995,-1.0393628,1.0490556,0.26721220,0.14609004
140,-0.61910503,1.2538921,0.19418186,-0.016579157,-1.0514843,1.0506755,0.28038435,0.16187568
141,-0.63581626,1.2526226,0.20554054,0.00045730568,-1.0633563,1.0522422,0.29369167,0.17780117
142,-0.65239794,1.2514218,0.21717309,0.017871802,-1.0749737,1.0537537,0.30713694,0.19386221
143,-0.66882916,1.2502978,0.22908210,0.035654086,-1.0863319,1.0552076,0.32072279,0.21005451
144,-0.68508912,1.2492586,0.24126966,0.053793276,-1.0974265,1.0566012,0.33445169,0.22637374
145,-0.70115721,1.2483110,0.25373741,0.072277862,-1.1082534,1.0579320,0.34832589,0.24281552
146,-0.71701307,1.2474613,0.26648646,0.091095731,-1.1188085,1.0591969,0.36234747,0.25937545
147,-0.73263659,1.2467150,0.27951740,0.11023418,-1.1290882,1.0603929,0.37651826,0.27604909
148,-0.74800804,1.2460767,0.29283032,0.12967994,-1.1390891,1.0615165,0.39083982,0.29283195
149,-0.76310805,1.2455504,0.30642477,0.14941921,-1.1488081,1.0625644,0.40531347,0.30971947
150,-0.77791773,1.2451391,0.32029974,0.16943762,-1.1582422,1.0635328,0.41994020,0.32670705
151,-0.79241867,1.2448451,0.33445369,0.18972037,-1.1673892,1.0644180,0.43472070,0.34379003
152,-0.80659302,1.2446697,0.34888451,0.21025212,-1.1762466,1.0652159,0.44965534,0.36096367
153,-0.82042350,1.2446134,0.36358954,0.23101712,-1.1848128,1.0659223,0.46474410,0.37822315
154,-0.83389351,1.2446759,0.37856555,0.25199918,-1.1930861,1.0665331,0.47998664,0.39556357
155,-0.84698712,1.2448559,0.39380875,0.27318173,-1.2010654,1.0670437,0.49538218,0.41297997
156,-0.85968915,1.2451512,0.40931477,0.29454782,-1.2087500,1.0674496,0.51092957,0.43046727
157,-0.87198519,1.2455590,0.42507868,0.31608018,-1.2161393,1.0677461,0.52662723,0.44802029
158,-0.88386165,1.2460752,0.44109500,0.33776122,-1.2232333,1.0679285,0.54247316,0.46563376
159,-0.89530580,1.2466952,0.45735767,0.35957309,-1.2300323,1.0679917,0.55846490,0.48330229
160,-0.90630582,1.2474133,0.47386007,0.38149767,-1.2365371,1.0679308,0.57459954,0.50102040
161,-0.91685081,1.2482230,0.49059504,0.40351665,-1.2427486,1.0677408,0.59087371,0.51878246
162,-0.92693083,1.2491170,0.50755489,0.42561155,-1.2486685,1.0674165,0.60728354,0.53658273
163,-0.93653696,1.2500871,0.52473135,0.44776371,-1.2542986,1.0669526,0.62382470,0.55441533
164,-0.94566127,1.2511244,0.54211567,0.46995439,-1.2596412,1.0663440,0.64049236,0.57227425
165,-0.95429690,1.2522191,0.55969856,0.49216476,-1.2646990,1.0655852,0.65728118,0.59015336
166,-0.96243806,1.2533605,0.57747023,0.51437592,-1.2694751,1.0646711,0.67418535,0.60804635
167,-0.97008005,1.2545375,0.59542040,0.53656899,-1.2739730,1.0635961,0.69119852,0.62594680
168,-0.97721925,1.2557380,0.61353832,0.55872508,-1.2781967,1.0623551,0.70831386,0.64384811
169,-0.98385321,1.2569492,0.63181276,0.58082539,-1.2821505,1.0609425,0.72552402,0.66174355
170,-0.98998058,1.2581579,0.65023208,0.60285116,-1.2858391,1.0593532,0.74282114,0.67962622
171,-0.99560115,1.2593499,0.66878419,0.62478378,-1.2892675,1.0575817,0.76019689,0.69748907
172,-1.0007159,1.2605106,0.68745659,0.64660478,-1.2924414,1.0556230,0.77764240,0.71532489
173,-1.0053269,1.2616249,0.70623640,0.66829587,-1.2953666,1.0534716,0.79514834,0.73312630
174,-1.0094373,1.2626771,0.72511038,0.68983897,-1.2980494,1.0511227,0.81270488,0.75088578
175,-1.0130517,1.2636510,0.74406493,0.71121627,-1.3004963,1.0485710,0.83030171,0.76859562
176,-1.0161754,1.2645299,0.76308614,0.73241020,-1.3027146,1.0458116,0.84792807,0.78624797
177,-1.0188152,1.2652969,0.78215979,0.75340351,-1.3047114,1.0428398,0.86557274,0.80383481
178,-1.0209788,1.2659345,0.80127138,0.77417928,-1.3064945,1.0396507,0.88322404,0.82134797
179,-1.0226751,1.2664251,0.82040617,0.79472096,-1.3080718,1.0362397,0.90086989,0.83877911
180,-1.0239140,1.2667507,0.83954919,0.81501237,-1.3094518,1.0326025,0.91849776,0.85611975
181,-1.0247065,1.2668933,0.85868525,0.83503777,-1.3106431,1.0287347,0.93609477,0.87336125
182,-1.0250647,1.2668343,0.87779902,0.85478181,-1.3116546,1.0246321,0.95364762,0.89049481
183,-1.0250015,1.2665555,0.89687498,0.87422966,-1.3124955,1.0202908,0.97114267,0.90751152
184,-1.0245310,1.2660384,0.91589752,0.89336693,-1.3131752,1.0157070,0.98856596,0.92440231
185,-1.0236682,1.2652643,0.93485092,0.91217975,-1.3137035,1.0108772,1.0059032,0.94115797
186,-1.0224289,1.2642149,0.95371940,0.93065479,-1.3140902,1.0057979,1.0231397,0.95776917
187,-1.0208297,1.2628718,0.97248712,0.94877924,-1.3143455,1.0004660,1.0402607,0.97422648
188,-1.0188884,1.2612167,0.99113826,0.96654088,-1.3144796,0.99487852,1.0572511,0.99052032
189,-1.0166231,1.2592317,1.0096570,0.98392803,-1.3145030,0.98903285,1.0740956,1.0066411
190,-1.0140530,1.2568988,1.0280275,1.0009296,-1.3144262,0.98292649,1.0907786,1.0225789
191,-1.0111977,1.2542007,1.0462342,1.0175353,-1.3142600,0.97655727,1.1072844,1.0383240
192,-1.0080778,1.2511201,1.0642613,1.0337351,-1.3140151,0.96992324,1.1235972,1.0538665
193,-1.0047142,1.2476403,1.0820934,1.0495198,-1.3137025,0.96302274,1.1397011,1.0691963
194,-1.0011284,1.2437451,1.0997152,1.0648809,-1.3133330,0.95585440,1.1555801,1.0843035
195,-0.99734234,1.2394186,1.1171115,1.0798105,-1.3129175,0.94841711,1.1712182,1.0991778
196,-0.99337852,1.2346456,1.1342673,1.0943013,-1.3124670,0.94071006,1.1865991,1.1138093
197,-0.98925971,1.2294114,1.1511680,1.1083467,-1.3119923,0.93273274,1.2017070,1.1281877
198,-0.98500900,1.2237020,1.1677991,1.1219408,-1.3115044,0.92448494,1.2165258,1.1423030
199,-0.98064971,1.2175041,1.1841463,1.1350781,-1.3110140,0.91596675,1.2310395,1.1561449
200,-0.97620539,1.2108050,1.2001959,1.1477542,-1.3105318,0.90717858,1.2452322,1.1697033
201,-0.97169967,1.2035929,1.2159342,1.1599650,-1.3100683,0.89812113,1.2590885,1.1829682
202,-0.96715628,1.1958567,1.2313480,1.1717073,-1.3096339,0.88879545,1.2725926,1.1959295
203,-0.96259891,1.1875864,1.2464246,1.1829783,-1.3092388,0.87920289,1.2857293,1.2085772
204,-0.95805122,1.1787725,1.2611514,1.1937761,-1.3088931,0.86934512,1.2984835,1.2209015
205,-0.95353672,1.1694066,1.2755164,1.2040993,-1.3086065,0.85922414,1.3108404,1.2328924
206,-0.94907874,1.1594814,1.2895081,1.2139471,-1.3083885,0.84884227,1.3227855,1.2445403
207,-0.94470037,1.1489903,1.3031153,1.2233195,-1.3082485,0.83820215,1.3343046,1.2558357
208,-0.94042437,1.1379279,1.3163273,1.2322169,-1.3081952,0.82730673,1.3453840,1.2667691
209,-0.93627312,1.1262897,1.3291338,1.2406405,-1.3082374,0.81615932,1.3560101,1.2773311
210,-0.93226859,1.1140724,1.3415253,1.2485918,-1.3083833,0.80476351,1.3661700,1.2875128
211,-0.92843221,1.1012736,1.3534925,1.2560732,-1.3086409,0.79312322,1.3758512,1.2973051
212,-0.92478489,1.0878921,1.3650267,1.2630875,-1.3090175,0.78124270,1.3850414,1.3066994
213,-0.92134692,1.0739278,1.3761198,1.2696379,-1.3095203,0.76912649,1.3937293,1.3156872
214,-0.91813791,1.0593817,1.3867642,1.2757284,-1.3101560,0.75677944,1.4019037,1.3242602
215,-0.91517675,1.0442560,1.3969529,1.2813632,-1.3109306,0.74420672,1.4095542,1.3324104
216,-0.91248157,1.0285538,1.4066794,1.2865473,-1.3118499,0.73141377,1.4166708,1.3401300
217,-0.91006963,1.0122796,1.4159378,1.2912859,-1.3129191,0.71840636,1.4232443,1.3474117
218,-0.90795735,0.99543899,1.4247228,1.2955848,-1.3141429,0.70519051,1.4292660,1.3542483
219,-0.90616021,0.97803858,1.4330295,1.2994500,-1.3155254,0.69177253,1.4347279,1.3606329
220,-0.90469273,0.96008622,1.4408539,1.3028881,-1.3170702,0.67815901,1.4396226,1.3665590
221,-0.90356839,0.94159087,1.4481923,1.3059060,-1.3187803,0.66435679,1.4439434,1.3720205
222,-0.90279964,0.92256260,1.4550417,1.3085110,-1.3206583,0.65037300,1.4476844,1.3770117
223,-0.90239784,0.90301259,1.4613997,1.3107106,-1.3227059,0.63621496,1.4508403,1.3815270
224,-0.90237322,0.88295311,1.4672645,1.3125126,-1.3249244,0.62189029,1.4534066,1.3855614
225,-0.90273484,0.86239753,1.4726348,1.3139251,-1.3273146,0.60740681,1.4553796,1.3891103
226,-0.90349059,0.84136025,1.4775098,1.3149566,-1.3298763,0.59277254,1.4567561,1.3921694
227,-0.90464713,0.81985672,1.4818895,1.3156155,-1.3326091,0.57799575,1.4575340,1.3947351
228,-0.90620990,0.79790339,1.4857742,1.3159107,-1.3355117,0.56308488,1.4577117,1.3968038
229,-0.90818308,0.77551770,1.4891649,1.3158511,-1.3385822,0.54804858,1.4572886,1.3983727
230,-0.91056955,0.75271803,1.4920633,1.3154456,-1.3418181,0.53289565,1.4562648,1.3994394
231,-0.91337095,0.72952369,1.4944712,1.3147035,-1.3452162,0.51763509,1.4546410,1.4000017
232,-0.91658757,0.70595486,1.4963912,1.3136340,-1.3487729,0.50227602,1.4524189,1.4000582
233,-0.92021844,0.68203258,1.4978265,1.3122465,-1.3524835,0.48682772,1.4496010,1.3996079
234,-0.92426125,0.65777870,1.4987806,1.3105502,-1.3563431,0.47129960,1.4461905,1.3986501
235,-0.92871238,0.63321582,1.4992575,1.3085545,-1.3603459,0.45570118,1.4421913,1.3971849
236,-0.93356692,0.60836728,1.4992618,1.3062688,-1.3644855,0.44004210,1.4376083,1.3952126
237,-0.93881866,0.58325710,1.4987985,1.3037024,-1.3687550,0.42433208,1.4324470,1.3927342
238,-0.94446006,0.55790993,1.4978728,1.3008644,-1.3731467,0.40858091,1.4267137,1.3897511
239,-0.95048236,0.53235099,1.4964906,1.2977640,-1.3776525,0.39279848,1.4204154,1.3862653
240,-0.95687548,0.50660607,1.4946582,1.2944102,-1.3822635,0.37699470,1.4135600,1.3822792
241,-0.96362813,0.48070140,1.4923821,1.2908120,-1.3869704,0.36117955,1.4061558,1.3777958
242,-0.97072779,0.45466369,1.4896693,1.2869780,-1.3917631,0.34536301,1.3982122,1.3728187
243,-0.97816074,0.42852000,1.4865269,1.2829169,-1.3966312,0.32955509,1.3897390,1.3673518
244,-0.98591210,0.40229772,1.4829628,1.2786371,-1.4015635,0.31376582,1.3807467,1.3613996
245,-0.99396584,0.37602452,1.4789846,1.2741466,-1.4065486,0.29800519,1.3712467,1.3549671
246,-1.0023049,0.34972829,1.4746006,1.2694536,-1.4115742,0.28228319,1.3612508,1.3480599
247,-1.0109110,0.32343707,1.4698193,1.2645656,-1.4166279,0.26660976,1.3507714,1.3406839
248,-1.0197649,0.29717900,1.4646492,1.2594902,-1.4216966,0.25099481,1.3398215,1.3328458
249,-1.0288466,0.27098227,1.4590993,1.2542345,-1.4267668,0.23544817,1.3284149,1.3245524
250,-1.0381349,0.24487508,1.4531786,1.2488054,-1.4318246,0.21997961,1.3165655,1.3158112
251,-1.0476077,0.21888554,1.4468963,1.2432095,-1.4368558,0.20459882,1.3042881,1.3066302
252,-1.0572423,0.19304164,1.4402619,1.2374532,-1.4418457,0.18931540,1.2915978,1.2970178
253,-1.0670149,0.16737120,1.4332847,1.2315424,-1.4467793,0.17413882,1.2785101,1.2869828
254,-1.0769014,0.14190180,1.4259745,1.2254828,-1.4516414,0.15907846,1.2650410,1.2765346
255,-1.0868766,0.11666072,1.4183407,1.2192797,-1.4564163,0.14414355,1.2512070,1.2656827
256,-1.0969149,0.091674911,1.4103933,1.2129382,-1.4610884,0.12934321,1.2370246,1.2544374
257,-1.1069902,0.066970920,1.4021419,1.2064628,-1.4656414,0.11468638,1.2225109,1.2428092
258,-1.1170757,0.042574837,1.3935964,1.1998579,-1.4700593,0.10018186,1.2076834,1.2308090
259,-1.1271445,0.018512253,1.3847665,1.1931275,-1.4743256,0.085838291,1.1925595,1.2184480
260,-1.1371689,-0.0051917976,1.3756619,1.1862752,-1.4784238,0.071664118,1.1771571,1.2057379
261,-1.1471213,-0.028512881,1.3662923,1.1793043,-1.4823374,0.057667613,1.1614941,1.1926906
262,-1.1569737,-0.051427214,1.3566674,1.1722177,-1.4860496,0.043856854,1.1455887,1.1793185
263,-1.1666980,-0.073911711,1.3467968,1.1650180,-1.4895439,0.030239716,1.1294591,1.1656341
264,-1.1762658,-0.095944027,1.3366898,1.1577075,-1.4928035,0.016823869,1.1131237,1.1516503
265,-1.1856490,-0.11750260,1.3263559,1.1502882,-1.4958119,0.0036167646,1.0966008,1.1373801
266,-1.1948193,-0.13856669,1.3158041,1.1427616,-1.4985524,-0.0093743629,1.0799088,1.1228371
267,-1.2037486,-0.15911642,1.3050436,1.1351291,-1.5010087,-0.022142509,1.0630660,1.1080347
268,-1.2124089,-0.17913282,1.2940832,1.1273915,-1.5031645,-0.034680900,1.0460908,1.0929867
269,-1.2207727,-0.19859784,1.2829316,1.1195497,-1.5050037,-0.046983002,1.0290013,1.0777071
270,-1.2288124,-0.21749439,1.2715973,1.1116040,-1.5065104,-0.059042522,1.0118155,1.0622101
271,-1.2365011,-0.23580641,1.2600887,1.1035546,-1.5076690,-0.070853414,0.99455141,1.0465099
272,-1.2438122,-0.25351881,1.2484137,1.0954012,-1.5084642,-0.082409881,0.97722665,1.0306208
273,-1.2507197,-0.27061760,1.2365802,1.0871436,-1.5088809,-0.093706382,0.95985868,1.0145574
274,-1.2571981,-0.28708981,1.2245959,1.0787810,-1.5089044,-0.10473763,0.94246468,0.99833407
275,-1.2632226,-0.30292360,1.2124681,1.0703127,-1.5085205,-0.11549859,0.92506155,0.98196550
276,-1.2687691,-0.31810820,1.2002038,1.0617375,-1.5077152,-0.12598451,0.90766584,0.96546624
277,-1.2738141,-0.33263398,1.1878100,1.0530543,-1.5064752,-0.13619086,0.89029375,0.94885088
278,-1.2783352,-0.34649245,1.1752932,1.0442616,-1.5047875,-0.14611342,0.87296111,0.93213399
279,-1.2823105,-0.35967623,1.1626597,1.0353579,-1.5026397,-0.15574818,0.85568332,0.91533009
280,-1.2857194,-0.37217912,1.1499155,1.0263414,-1.5000197,-0.16509144,0.83847533,0.89845361
281,-1.2885421,-0.38399604,1.1370664,1.0172103,-1.4969164,-0.17413974,0.82135164,0.88151892
282,-1.2907597,-0.39512308,1.1241179,1.0079627,-1.4933188,-0.18288987,0.80432626,0.86454023
283,-1.2923546,-0.40555747,1.1110750,0.99859658,-1.4892169,-0.19133891,0.78741267,0.84753166
284,-1.2933102,-0.41529760,1.0979428,0.98910987,-1.4846012,-0.19948417,0.77062384,0.83050713
285,-1.2936110,-0.42434298,1.0847258,0.97950045,-1.4794628,-0.20732323,0.75397216,0.81348038
286,-1.2932429,-0.43269424,1.0714284,0.96976620,-1.4737935,-0.21485391,0.73746946,0.79646497
287,-1.2921927,-0.44035315,1.0580546,0.95990496,-1.4675859,-0.22207430,0.72112697,0.77947422
288,-1.2904489,-0.44732256,1.0446083,0.94991461,-1.4608332,-0.22898274,0.70495533,0.76252119
289,-1.2880008,-0.45360640,1.0310929,0.93979307,-1.4535295,-0.23557777,0.68896454,0.74561869
290,-1.2848395,-0.45920967,1.0175118,0.92953830,-1.4456695,-0.24185823,0.67316397,0.72877925
291,-1.2809570,-0.46413840,1.0038679,0.91914834,-1.4372488,-0.24782315,0.65756235,0.71201508
292,-1.2763471,-0.46839964,0.99016401,0.90862134,-1.4282637,-0.25347182,0.64216774,0.69533808
293,-1.2710045,-0.47200143,0.97640267,0.89795553,-1.4187113,-0.25880373,0.62698757,0.67875980
294,-1.2649258,-0.47495275,0.96258617,0.88714929,-1.4085897,-0.26381861,0.61202856,0.66229144
295,-1.2581086,-0.47726351,0.94871660,0.87620114,-1.3978975,-0.26851641,0.59729679,0.64594383
296,-1.2505521,-0.47894453,0.93479584,0.86510978,-1.3866344,-0.27289728,0.58279764,0.62972740
297,-1.2422569,-0.48000747,0.92082555,0.85387407,-1.3748008,-0.27696157,0.56853582,0.61365219
298,-1.2332250,-0.48046479,0.90680724,0.84249309,-1.3623980,-0.28070983,0.55451537,0.59772782
299,-1.2234598,-0.48032976,0.89274223,0.83096610,-1.3494281,-0.28414283,0.54073965,0.58196347
300,-1.2129661,-0.47961638,0.87863168,0.81929263,-1.3358941,-0.28726149,0.52721134,0.56636791
301,-1.2017501,-0.47833934,0.86447660,0.80747242,-1.3217998,-0.29006693,0.51393246,0.55094943
302,-1.1898194,-0.47651397,0.85027786,0.79550547,-1.3071499,-0.29256044,0.50090437,0.53571588
303,-1.1771830,-0.47415625,0.83603625,0.78339205,-1.2919498,-0.29474347,0.48812778,0.52067462
304,-1.1638512,-0.47128267,0.82175240,0.77113273,-1.2762059,-0.29661766,0.47560275,0.50583254
305,-1.1498356,-0.46791026,0.80742690,0.75872832,-1.2599253,-0.29818477,0.46332873,0.49119605
306,-1.1351490,-0.46405653,0.79306023,0.74617998,-1.2431160,-0.29944671,0.45130453,0.47677108
307,-1.1198058,-0.45973938,0.77865283,0.73348914,-1.2257869,-0.30040557,0.43952837,0.46256305
308,-1.1038214,-0.45497710,0.76420509,0.72065756,-1.2079474,-0.30106353,0.42799787,0.44857688
309,-1.0872123,-0.44978828,0.74971736,0.70768731,-1.1896079,-0.30142291,0.41671011,0.43481699
310,-1.0699963,-0.44419179,0.73519001,0.69458081,-1.1707796,-0.30148617,0.40566158,0.42128731
311,-1.0521924,-0.43820673,0.72062337,0.68134077,-1.1514744,-0.30125586,0.39484827,0.40799125
312,-1.0338206,-0.43185235,0.70601781,0.66797028,-1.1317048,-0.30073466,0.38426565,0.39493173
313,-1.0149019,-0.42514801,0.69137372,0.65447272,-1.1114843,-0.29992534,0.37390868,0.38211116
314,-0.99545824,-0.41811316,0.67669156,0.64085184,-1.0908269,-0.29883075,0.36377188,0.36953145
315,-0.97551267,-0.41076726,0.66197182,0.62711171,-1.0697473,-0.29745387,0.35384932,0.35719402
316,-0.95508899,-0.40312973,0.64721509,0.61325673,-1.0482608,-0.29579774,0.34413465,0.34509980
317,-0.93421188,-0.39521991,0.63242204,0.59929164,-1.0263835,-0.29386546,0.33462114,0.33324923
318,-0.91290677,-0.38705702,0.61759343,0.58522152,-1.0041320,-0.29166023,0.32530167,0.32164227
319,-0.89119984,-0.37866010,0.60273015,0.57105174,-0.98152340,-0.28918531,0.31616882,0.31027842
320,-0.86911789,-0.37004795,0.58783323,0.55678802,-0.95857555,-0.28644401,0.30721482,0.29915670
321,-0.84668835,-0.36123913,0.57290381,0.54243637,-0.93530666,-0.28343971,0.29843165,0.28827569
322,-0.82393918,-0.35225185,0.55794322,0.52800311,-0.91173550,-0.28017583,0.28981102,0.27763352
323,-0.80089880,-0.34310401,0.54295292,0.51349485,-0.88788129,-0.27665585,0.28134444,0.26722789
324,-0.77759608,-0.33381308,0.52793456,0.49891850,-0.86376368,-0.27288328,0.27302319,0.25705610
325,-0.75406018,-0.32439610,0.51288997,0.48428121,-0.83940274,-0.26886167,0.26483842,0.24711501
326,-0.73032060,-0.31486963,0.49782117,0.46959041,-0.81481891,-0.26459460,0.25678114,0.23740110
327,-0.70640702,-0.30524973,0.48273039,0.45485378,-0.79003295,-0.26008569,0.24884225,0.22791049
328,-0.68234930,-0.29555190,0.46762006,0.44007922,-0.76506595,-0.25533858,0.24101257,0.21863891
329,-0.65817735,-0.28579107,0.45249282,0.42527486,-0.73993925,-0.25035692,0.23328291,0.20958176
330,-0.63392116,-0.27598155,0.43735153,0.41044902,-0.71467445,-0.24514440,0.22564404,0.20073410
331,-0.60961062,-0.26613700,0.42219930,0.39561021,-0.68929335,-0.23970473,0.21808676,0.19209069
332,-0.58527554,-0.25627045,0.40703943,0.38076711,-0.66381790,-0.23404160,0.21060191,0.18364598
333,-0.56094558,-0.24639419,0.39187549,0.36592856,-0.63827022,-0.22815875,0.20318041,0.17539415
334,-0.53665013,-0.23651984,0.37671125,0.35110352,-0.61267251,-0.22205991,0.19581329,0.16732912
335,-0.51241830,-0.22665824,0.36155075,0.33630106,-0.58704704,-0.21574882,0.18849171,0.15944457
336,-0.48827887,-0.21681951,0.34639824,0.32153035,-0.56141611,-0.20922923,0.18120699,0.15173395
337,-0.46426015,-0.20701300,0.33125823,0.30680063,-0.53580203,-0.20250490,0.17395065,0.14419053
338,-0.44039004,-0.19724726,0.31613543,0.29212121,-0.51022706,-0.19557956,0.16671439,0.13680739
339,-0.41669585,-0.18753006,0.30103483,0.27750141,-0.48471341,-0.18845700,0.15949020,0.12957744
340,-0.39320436,-0.17786837,0.28596162,0.26295057,-0.45928317,-0.18114095,0.15227030,0.12249347
341,-0.36994167,-0.16826834,0.27092121,0.24847802,-0.43395830,-0.17363520,0.14504720,0.11554814
342,-0.34693321,-0.15873533,0.25591926,0.23409306,-0.40876060,-0.16594349,0.13781373,0.10873402
343,-0.32420367,-0.14927388,0.24096161,0.21980495,-0.38371166,-0.15806960,0.13056306,0.10204358
344,-0.30177695,-0.13988772,0.22605433,0.20562284,-0.35883283,-0.15001728,0.12328869,0.095469275
345,-0.27967612,-0.13057976,0.21120370,0.19155583,-0.33414522,-0.14179030,0.11598451,0.089003490
346,-0.25792339,-0.12135213,0.19641617,0.17761286,-0.30966964,-0.13339244,0.10864479,0.082638614
347,-0.23654004,-0.11220616,0.18169839,0.16380276,-0.28542657,-0.12482745,0.10126421,0.076367037
348,-0.21554641,-0.10314241,0.16705716,0.15013420,-0.26143615,-0.11609912,0.093837878,0.070181177
349,-0.19496185,-0.094160659,0.15249948,0.13661565,-0.23771815,-0.10721121,0.086361336,0.064073502
350,-0.17480470,-0.085259937,0.13803247,0.12325539,-0.21429191,-0.098167516,0.078830575,0.058036543
351,-0.15509227,-0.076438542,0.12366340,0.11006150,-0.19117637,-0.088971819,0.071242046,0.052062922
352,-0.13584076,-0.067694059,0.10939966,0.097041796,-0.16839002,-0.079627914,0.063592677,0.046145365
353,-0.11706531,-0.059023377,0.095248779,0.084203836,-0.14595084,-0.070139606,0.055879872,0.040276724
354,-0.098779940,-0.050422716,0.081218347,0.071554910,-0.12387634,-0.060510706,0.048101528,0.034449994
355,-0.080997524,-0.041887654,0.067316063,0.059102013,-0.10218351,-0.050745039,0.040256034,0.028658334
356,-0.063729805,-0.033413150,0.053549687,0.046851825,-0.080888788,-0.040846443,0.032342278,0.022895078
357,-0.046987365,-0.024993577,0.039927035,0.034810701,-0.060008067,-0.030818768,0.024359652,0.017153759
358,-0.030779620,-0.016622753,0.026455959,0.022984653,-0.039556657,-0.020665882,0.016308050,0.011428121
359,-0.015114820,-0.0082939677,0.013144333,0.011379336,-0.019549281,-0.010391668,0.0081878733,0.0057121350
360,-4.1377774e-08,-2.3087694e-08,3.6414804e-08,3.1413492e-08,-5.3865264e-08,-2.9139173e-08,2.2926571e-08,1.5929146e-08
