XRT N-S vs UFSS-A
      194.371
      1.89239
     -4.01471
      2.65254
     0.528057
    0.0297256
      1.05079
XRT N-S vs UFSS-B
      192.895
     0.478600
     -1.81627
     0.557579
    -0.191513
     0.112537
     0.188992
XRT E-W vs UFSS-A
      3981.87
     -1.47702
     0.861303
    -0.599343
    -0.250218
     0.109433
    -0.305408
XRT E-W vs UFSS-B
      3964.69
     0.206747
     -1.27003
     0.583495
     0.744658
    -0.314699
     0.186357
SOT N-S vs UFSS-A
      52.8689
      2.59162
     -4.32099
      3.06402
      1.43298
    -0.538613
      1.24179
SOT N-S vs UFSS-B
      52.2659
     0.397469
     -1.96884
     0.744452
    0.0291209
    0.0272760
     0.142983
SOT E-W vs UFSS-A
      218.013
     -2.10706
     0.760819
    -0.417030
    -0.859042
     0.369707
   0.00796508
SOT E-W vs UFSS-B
      201.007
     -1.10022
     -1.54638
     0.928763
    -0.326360
     0.246908
     0.682690
