XRT N-S vs UFSS-A
      204.319
      2.72170
     -2.68763
      1.85871
      1.44987
    -0.905628
     0.825602
XRT N-S vs UFSS-B
      190.291
     0.657464
     -1.50043
     0.402435
    0.0307635
    -0.233577
     0.218443
XRT E-W vs UFSS-A
      3971.86
     -1.41417
     0.461588
    -0.298035
    -0.107692
    0.0805883
    -0.249015
XRT E-W vs UFSS-B
      3961.17
    -0.648853
     -1.05186
     0.646855
     0.295320
    -0.123867
     0.193025
SOT N-S vs UFSS-A
      70.1997
     0.571618
     -2.35175
      1.67768
     0.105648
     0.115032
     0.378198
SOT N-S vs UFSS-B
      53.4248
     0.574303
     -1.38492
     0.626655
     0.308864
    -0.191501
     0.160857
SOT E-W vs UFSS-A
      199.853
    -0.357894
     0.412506
    -0.233717
     0.478600
    -0.208691
    -0.246193
SOT E-W vs UFSS-B
      189.428
    -0.321951
    -0.933183
     0.376347
     0.340341
    -0.141037
    0.0476942
