deg,XRT_AX,XRT_BX,XRT_AY,XRT_BY,SOT_AX,SOT_BX,SOT_AY,SOT_BY
valid,1,1,1,1,1,1,1,1,revB
offset,126.45526,97.637589,1974.0639,1980.3896,85.777643,56.138360,59.819360,66.424663
0,0.0000000,0.0000000,0.0000000,0.0000000,0.0000000,0.0000000,0.0000000,0.0000000
1,0.013462791,0.017708707,-0.0090386995,-0.011766008,0.011054389,0.013329918,-0.0049783361,-0.0045054496
2,0.026852319,0.035915593,-0.017996175,-0.023353139,0.021868280,0.026851405,-0.0096709425,-0.0087994725
3,0.040158911,0.054609308,-0.026862679,-0.034749509,0.032427260,0.040553926,-0.014079907,-0.012882983
4,0.053372557,0.073777570,-0.035628310,-0.045943310,0.042716742,0.054426559,-0.018207872,-0.016757225
5,0.066482920,0.093407183,-0.044283039,-0.056922838,0.052721993,0.068458007,-0.022058026,-0.020423777
6,0.079479353,0.11348406,-0.052816741,-0.067676530,0.062428160,0.082636618,-0.025634096,-0.023884547
7,0.092350915,0.13399323,-0.061219219,-0.078192994,0.071820311,0.096950404,-0.028940341,-0.027141777
8,0.10508639,0.15491889,-0.069480238,-0.088461036,0.080883456,0.11138706,-0.031981536,-0.030198041
9,0.11767431,0.17624438,-0.077589552,-0.098469697,0.089602591,0.12593397,-0.034762963,-0.033056240
10,0.13010295,0.19795228,-0.085536929,-0.10820828,0.097962720,0.14057826,-0.037290396,-0.035719599
11,0.14236041,0.22002435,-0.093312187,-0.11766637,0.10594890,0.15530679,-0.039570081,-0.038191664
12,0.15443454,0.24244166,-0.10090522,-0.12683389,0.11354626,0.17010619,-0.041608722,-0.040476293
13,0.16631306,0.26518454,-0.10830601,-0.13570109,0.12074006,0.18496287,-0.043413463,-0.042577653
14,0.17798351,0.28823265,-0.11550469,-0.14425862,0.12751569,0.19986307,-0.044991862,-0.044500207
15,0.18943333,0.31156505,-0.12249155,-0.15249749,0.13385873,0.21479285,-0.046351871,-0.046248706
16,0.20064983,0.33516015,-0.12925704,-0.16040918,0.13975499,0.22973814,-0.047501816,-0.047828182
17,0.21162026,0.35899583,-0.13579185,-0.16798559,0.14519051,0.24468476,-0.048450365,-0.049243933
18,0.22233181,0.38304946,-0.14208690,-0.17521909,0.15015164,0.25961844,-0.049206510,-0.050501510
19,0.23277163,0.40729793,-0.14813335,-0.18210256,0.15462502,0.27452485,-0.049779531,-0.051606705
20,0.24292689,0.43171769,-0.15392268,-0.18862937,0.15859768,0.28938962,-0.050178974,-0.052565539
21,0.25278476,0.45628480,-0.15944666,-0.19479343,0.16205699,0.30419839,-0.050414620,-0.053384239
22,0.26233249,0.48097501,-0.16469738,-0.20058920,0.16499078,0.31893679,-0.050496452,-0.054069231
23,0.27155737,0.50576374,-0.16966731,-0.20601168,0.16738729,0.33359051,-0.050434626,-0.054627115
24,0.28044683,0.53062618,-0.17434928,-0.21105648,0.16923527,0.34814532,-0.050239439,-0.055064653
25,0.28898840,0.55553734,-0.17873649,-0.21571977,0.17052397,0.36258706,-0.049921297,-0.055388744
26,0.29716979,0.58047206,-0.18282258,-0.21999832,0.17124317,0.37690174,-0.049490678,-0.055606411
27,0.30497888,0.60540508,-0.18660160,-0.22388950,0.17138322,0.39107547,-0.048958100,-0.055724775
28,0.31240377,0.63031110,-0.19006805,-0.22739131,0.17093507,0.40509457,-0.048334092,-0.055751039
29,0.31943279,0.65516483,-0.19321686,-0.23050236,0.16989029,0.41894556,-0.047629149,-0.055692461
30,0.32605453,0.67994100,-0.19604347,-0.23322188,0.16824108,0.43261517,-0.046853708,-0.055556340
31,0.33225788,0.70461448,-0.19854376,-0.23554971,0.16598032,0.44609042,-0.046018106,-0.055349986
32,0.33803204,0.72916025,-0.20071410,-0.23748634,0.16310157,0.45935856,-0.045132547,-0.055080700
33,0.34336655,0.75355353,-0.20255139,-0.23903286,0.15959912,0.47240718,-0.044207070,-0.054755753
34,0.34825130,0.77776976,-0.20405299,-0.24019098,0.15546797,0.48522418,-0.043251511,-0.054382361
35,0.35267658,0.80178468,-0.20521679,-0.24096303,0.15070388,0.49779782,-0.042275471,-0.053967659
36,0.35663310,0.82557440,-0.20604119,-0.24135194,0.14530337,0.51011671,-0.041288281,-0.053518683
37,0.36011197,0.84911540,-0.20652511,-0.24136123,0.13926374,0.52216988,-0.040298971,-0.053042342
38,0.36310479,0.87238461,-0.20666797,-0.24099502,0.13258308,0.53394676,-0.039316234,-0.052545394
39,0.36560361,0.89535943,-0.20646970,-0.24025799,0.12526030,0.54543720,-0.038348397,-0.052034427
40,0.36760099,0.91801780,-0.20593076,-0.23915538,0.11729509,0.55663151,-0.037403389,-0.051515831
41,0.36908999,0.94033825,-0.20505212,-0.23769298,0.10868800,0.56752049,-0.036488710,-0.050995777
42,0.37006420,0.96229988,-0.20383522,-0.23587711,0.099440379,0.57809540,-0.035611403,-0.050480192
43,0.37051778,0.98388249,-0.20228202,-0.23371459,0.089554432,0.58834800,-0.034778027,-0.049974740
44,0.37044543,1.0050665,-0.20039497,-0.23121274,0.079033186,0.59827059,-0.033994626,-0.049484799
45,0.36984244,1.0258332,-0.19817699,-0.22837932,0.067880510,0.60785597,-0.033266708,-0.049015435
46,0.36870469,1.0461645,-0.19563147,-0.22522257,0.056101108,0.61709752,-0.032599220,-0.048571389
47,0.36702867,1.0660432,-0.19276223,-0.22175113,0.043700518,0.62598915,-0.031996521,-0.048157048
48,0.36481146,1.0854529,-0.18957357,-0.21797404,0.030685106,0.63452532,-0.031462367,-0.047776432
49,0.36205081,1.1043780,-0.18607019,-0.21390070,0.017062063,0.64270110,-0.030999887,-0.047433174
50,0.35874506,1.1228039,-0.18225720,-0.20954087,0.0028393927,0.65051210,-0.030611564,-0.047130498
51,0.35489321,1.1407168,-0.17814011,-0.20490461,-0.011974093,0.65795456,-0.030299224,-0.046871205
52,0.35049492,1.1581039,-0.17372480,-0.20000226,-0.027368792,0.66502526,-0.030064016,-0.046657660
53,0.34555047,1.1749534,-0.16901750,-0.19484443,-0.043334319,0.67172163,-0.029906401,-0.046491769
54,0.34006083,1.1912544,-0.16402477,-0.18944193,-0.059859525,0.67804166,-0.029826144,-0.046374972
55,0.33402759,1.2069971,-0.15875350,-0.18380579,-0.076932513,0.68398394,-0.029822298,-0.046308226
56,0.32745304,1.2221726,-0.15321084,-0.17794716,-0.094540653,0.68954768,-0.029893207,-0.046291996
57,0.32034008,1.2367729,-0.14740424,-0.17187737,-0.11267061,0.69473268,-0.030036489,-0.046326241
58,0.31269230,1.2507914,-0.14134137,-0.16560778,-0.13130835,0.69953931,-0.030249045,-0.046410408
59,0.30451392,1.2642223,-0.13503011,-0.15914987,-0.15043918,0.70396856,-0.030527048,-0.046543422
60,0.29580981,1.2770607,-0.12847857,-0.15251511,-0.17004778,0.70802200,-0.030865951,-0.046723681
61,0.28658547,1.2893030,-0.12169497,-0.14571497,-0.19011818,0.71170175,-0.031260487,-0.046949048
62,0.27684706,1.3009466,-0.11468774,-0.13876089,-0.21063385,0.71501054,-0.031704674,-0.047216849
63,0.26660133,1.3119898,-0.10746536,-0.13166424,-0.23157769,0.71795162,-0.032191824,-0.047523871
64,0.25585565,1.3224322,-0.10003643,-0.12443626,-0.25293207,0.72052883,-0.032714550,-0.047866359
65,0.24461799,1.3322740,-0.092409622,-0.11708807,-0.27467887,0.72274652,-0.033264781,-0.048240018
66,0.23289692,1.3415168,-0.084593619,-0.10963062,-0.29679948,0.72460957,-0.033833772,-0.048640013
67,0.22070155,1.3501631,-0.076597124,-0.10207465,-0.31927487,0.72612338,-0.034412121,-0.049060975
68,0.20804159,1.3582164,-0.068428817,-0.094430668,-0.34208562,0.72729384,-0.034989788,-0.049497003
69,0.19492726,1.3656811,-0.060097333,-0.086708911,-0.36521192,0.72812731,-0.035556112,-0.049941675
70,0.18136931,1.3725625,-0.051611237,-0.078919326,-0.38863365,0.72863064,-0.036099833,-0.050388047
71,0.16737898,1.3788671,-0.042978992,-0.071071535,-0.41233038,0.72881110,-0.036609116,-0.050828674
72,0.15296803,1.3846021,-0.034208940,-0.063174806,-0.43628142,0.72867639,-0.037071578,-0.051255610
73,0.13814865,1.3897755,-0.025309271,-0.055238031,-0.46046588,0.72823463,-0.037474309,-0.051660427
74,0.12293348,1.3943964,-0.016288005,-0.047269692,-0.48486266,0.72749431,-0.037803910,-0.052034228
75,0.10733558,1.3984747,-0.0071529610,-0.039277845,-0.50945053,0.72646429,-0.038046513,-0.052367659
76,0.091368417,1.4020208,0.0020882629,-0.031270088,-0.53420815,0.72515377,-0.038187821,-0.052650929
77,0.075045812,1.4050462,0.011428312,-0.023253547,-0.55911410,0.72357227,-0.038213137,-0.052873825
78,0.058381941,1.4075629,0.020860096,-0.015234851,-0.58414694,0.72172961,-0.038107402,-0.053025734
79,0.041391299,1.4095838,0.030376812,-0.0072201095,-0.60928524,0.71963586,-0.037855228,-0.053095663
80,0.024088674,1.4111223,0.039971964,0.00078509682,-0.63450759,0.71730136,-0.037440937,-0.053072259
81,0.0064891230,1.4121925,0.049639379,0.0087757397,-0.65979269,0.71473665,-0.036848601,-0.052943835
82,-0.011392056,1.4128089,0.059373227,0.016747354,-0.68511936,0.71195250,-0.036062082,-0.052698392
83,-0.029539354,1.4129868,0.069168037,0.024696053,-0.71046654,0.70895980,-0.035065067,-0.052323646
84,-0.047937076,1.4127419,0.079018712,0.032618537,-0.73581342,0.70576963,-0.033841119,-0.051807055
85,-0.066569371,1.4120901,0.088920543,0.040512104,-0.76113936,0.70239317,-0.032373712,-0.051135842
86,-0.085420258,1.4110480,0.098869222,0.048374658,-0.78642404,0.69884168,-0.030646278,-0.050297030
87,-0.10447366,1.4096325,0.10886085,0.056204712,-0.81164740,0.69512650,-0.028642249,-0.049277469
88,-0.12371342,1.4078608,0.11889196,0.064001396,-0.83678972,0.69125901,-0.026345103,-0.048063862
89,-0.14312336,1.4057502,0.12895950,0.071764454,-0.86183168,0.68725059,-0.023738404,-0.046642805
90,-0.16268726,1.4033185,0.13906087,0.079494251,-0.88675431,0.68311261,-0.020805856,-0.045000808
91,-0.18238894,1.4005834,0.14919390,0.087191763,-0.91153909,0.67885643,-0.017531336,-0.043124336
92,-0.20221224,1.3975630,0.15935687,0.094858578,-0.93616797,0.67449329,-0.013898950,-0.040999838
93,-0.22214109,1.3942751,0.16954852,0.10249689,-0.96062337,0.67003439,-0.0098930708,-0.038613781
94,-0.24215951,1.3907379,0.17976803,0.11010950,-0.98488824,0.66549078,-0.0054983848,-0.035952684
95,-0.26225164,1.3869695,0.19001503,0.11769978,-1.0089461,0.66087340,-0.00069993687,-0.033003150
96,-0.28240180,1.3829877,0.20028961,0.12527170,-1.0327809,0.65619301,0.0045168264,-0.029751903
97,-0.30259445,1.3788105,0.21059227,0.13282979,-1.0563773,0.65146018,0.010166013,-0.026185823
98,-0.32281428,1.3744556,0.22092400,0.14037911,-1.0797206,0.64668527,0.016261245,-0.022291976
99,-0.34304620,1.3699405,0.23128617,0.14792528,-1.1027966,0.64187842,0.022815611,-0.018057653
100,-0.36327538,1.3652824,0.24168060,0.15547443,-1.1255920,0.63704952,0.029841634,-0.013470404
101,-0.38348727,1.3604985,0.25210954,0.16303318,-1.1480937,0.63220816,0.037351222,-0.0085180671
102,-0.40366760,1.3556052,0.26257559,0.17060863,-1.1702898,0.62736366,0.045355638,-0.0031888093
103,-0.42380245,1.3506189,0.27308180,0.17820832,-1.1921688,0.62252502,0.053865454,0.0025288446
104,-0.44387822,1.3455556,0.28363155,0.18584024,-1.2137200,0.61770091,0.062890521,0.0086459771
105,-0.46388169,1.3404307,0.29422859,0.19351275,-1.2349332,0.61289966,0.072439934,0.015173246
106,-0.48380001,1.3352591,0.30487704,0.20123461,-1.2557994,0.60812922,0.082521992,0.022120853
107,-0.50362074,1.3300554,0.31558131,0.20901492,-1.2763098,0.60339717,0.093144176,0.029498510
108,-0.52333185,1.3248333,0.32634612,0.21686308,-1.2964567,0.59871070,0.10431311,0.037315412
109,-0.54292174,1.3196064,0.33717649,0.22478878,-1.3162330,0.59407659,0.11603454,0.045580207
110,-0.56237927,1.3143872,0.34807769,0.23280198,-1.3356324,0.58950122,0.12831330,0.054300963
111,-0.58169374,1.3091879,0.35905524,0.24091283,-1.3546492,0.58499050,0.14115330,0.063485146
112,-0.60085495,1.3040200,0.37011487,0.24913168,-1.3732786,0.58054996,0.15455748,0.073139590
113,-0.61985315,1.2988941,0.38126248,0.25746904,-1.3915164,0.57618463,0.16852782,0.083270474
114,-0.63867912,1.2938203,0.39250418,0.26593551,-1.4093594,0.57189912,0.18306530,0.093883293
115,-0.65732412,1.2888079,0.40384617,0.27454178,-1.4268047,0.56769757,0.19816989,0.10498284
116,-0.67577992,1.2838655,0.41529479,0.28329859,-1.4438504,0.56358366,0.21384055,0.11657319
117,-0.69403881,1.2790009,0.42685646,0.29221666,-1.4604954,0.55956061,0.23007518,0.12865766
118,-0.71209359,1.2742212,0.43853764,0.30130671,-1.4767389,0.55563116,0.24687066,0.14123880
119,-0.72993761,1.2695325,0.45034483,0.31057935,-1.4925811,0.55179757,0.26422280,0.15431840
120,-0.74756471,1.2649404,0.46228452,0.32004511,-1.5080228,0.54806166,0.28212636,0.16789744
121,-0.76496928,1.2604494,0.47436316,0.32971436,-1.5230654,0.54442476,0.30057506,0.18197607
122,-0.78214622,1.2560635,0.48658715,0.33959729,-1.5377109,0.54088774,0.31956153,0.19655366
123,-0.79909096,1.2517857,0.49896277,0.34970387,-1.5519620,0.53745100,0.33907738,0.21162870
124,-0.81579946,1.2476183,0.51149621,0.36004381,-1.5658219,0.53411449,0.35911315,0.22719886
125,-0.83226818,1.2435626,0.52419347,0.37062651,-1.5792945,0.53087772,0.37965833,0.24326095
126,-0.84849409,1.2396193,0.53706039,0.38146105,-1.5923840,0.52773974,0.40070140,0.25981095
127,-0.86447467,1.2357883,0.55010258,0.39255615,-1.6050953,0.52469917,0.42222980,0.27684394
128,-0.88020789,1.2320686,0.56332540,0.40392010,-1.6174338,0.52175420,0.44422999,0.29435416
129,-0.89569222,1.2284586,0.57673395,0.41556079,-1.6294053,0.51890261,0.46668741,0.31233500
130,-0.91092658,1.2249557,0.59033301,0.42748560,-1.6410161,0.51614178,0.48958657,0.33077895
131,-0.92591038,1.2215568,0.60412705,0.43970143,-1.6522728,0.51346868,0.51291099,0.34967769
132,-0.94064347,1.2182580,0.61812016,0.45221465,-1.6631824,0.51087993,0.53664330,0.36902202
133,-0.95512613,1.2150545,0.63231605,0.46503103,-1.6737524,0.50837177,0.56076522,0.38880191
134,-0.96935907,1.2119412,0.64671801,0.47815580,-1.6839905,0.50594008,0.58525760,0.40900648
135,-0.98334342,1.2089119,0.66132891,0.49159352,-1.6939048,0.50358042,0.61010046,0.42962405
136,-0.99708069,1.2059602,0.67615112,0.50534813,-1.7035034,0.50128805,0.63527301,0.45064210
137,-1.0105728,1.2030787,0.69118656,0.51942290,-1.7127950,0.49905790,0.66075369,0.47204735
138,-1.0238219,1.2002597,0.70643663,0.53382038,-1.7217882,0.49688464,0.68652020,0.49382570
139,-1.0368307,1.1974948,0.72190218,0.54854244,-1.7304920,0.49476267,0.71254954,0.51596233
140,-1.0496020,1.1947752,0.73758355,0.56359019,-1.7389152,0.49268615,0.73881806,0.53844164
141,-1.0621390,1.1920915,0.75348046,0.57896400,-1.7470672,0.49064902,0.76530149,0.56124734
142,-1.0744453,1.1894338,0.76959209,0.59466345,-1.7549570,0.48864501,0.79197498,0.58436242
143,-1.0865246,1.1867920,0.78591700,0.61068737,-1.7625939,0.48666768,0.81881316,0.60776921
144,-1.0983808,1.1841555,0.80245312,0.62703376,-1.7699871,0.48471041,0.84579017,0.63144940
145,-1.1100182,1.1815132,0.81919778,0.64369984,-1.7771459,0.48276645,0.87287971,0.65538403
146,-1.1214411,1.1788539,0.83614763,0.66068200,-1.7840795,0.48082895,0.90005509,0.67955359
147,-1.1326541,1.1761661,0.85329872,0.67797583,-1.7907970,0.47889093,0.92728927,0.70393798
148,-1.1436619,1.1734380,0.87064640,0.69557608,-1.7973073,0.47694535,0.95455493,0.72851658
149,-1.1544694,1.1706577,0.88818539,0.71347666,-1.8036194,0.47498513,0.98182449,0.75326828
150,-1.1650815,1.1678130,0.90590971,0.73167070,-1.8097419,0.47300314,1.0090702,0.77817151
151,-1.1755032,1.1648917,0.92381272,0.75015045,-1.8156833,0.47099224,1.0362642,0.80320426
152,-1.1857396,1.1618815,0.94188713,0.76890739,-1.8214520,0.46894532,1.0633784,0.82834413
153,-1.1957959,1.1587702,0.96012495,0.78793215,-1.8270559,0.46685527,1.0903848,0.85356839
154,-1.2056771,1.1555453,0.97851753,0.80721458,-1.8325029,0.46471507,1.1172555,0.87885396
155,-1.2153884,1.1521947,0.99705557,0.82674372,-1.8378004,0.46251775,1.1439624,0.90417751
156,-1.2249350,1.1487062,1.0157291,0.84650784,-1.8429556,0.46025644,1.1704778,0.92951544
157,-1.2343218,1.1450677,1.0345275,0.86649444,-1.8479754,0.45792439,1.1967739,0.95484398
158,-1.2435538,1.1412673,1.0534395,0.88669027,-1.8528663,0.45551499,1.2228235,0.98013919
159,-1.2526360,1.1372935,1.0724532,0.90708134,-1.8576343,0.45302177,1.2485992,1.0053770
160,-1.2615731,1.1331348,1.0915562,0.92765296,-1.8622854,0.45043844,1.2740742,1.0305333
161,-1.2703698,1.1287800,1.1107353,0.94838976,-1.8668246,0.44775889,1.2992222,1.0555839
162,-1.2790305,1.1242184,1.1299768,0.96927568,-1.8712571,0.44497723,1.3240170,1.0805046
163,-1.2875597,1.1194394,1.1492666,0.99029405,-1.8755874,0.44208779,1.3484331,1.1052713
164,-1.2959615,1.1144330,1.1685898,1.0114276,-1.8798193,0.43908513,1.3724455,1.1298600
165,-1.3042398,1.1091896,1.1879310,1.0326584,-1.8839567,0.43596408,1.3960295,1.1542467
166,-1.3123984,1.1036999,1.2072746,1.0539680,-1.8880026,0.43271972,1.4191615,1.1784077
167,-1.3204408,1.0979552,1.2266043,1.0753376,-1.8919597,0.42934743,1.4418181,1.2023195
168,-1.3283703,1.0919473,1.2459032,1.0967477,-1.8958302,0.42584287,1.4639768,1.2259587
169,-1.3361898,1.0856685,1.2651543,1.1181785,-1.8996159,0.42220202,1.4856158,1.2493024
170,-1.3439022,1.0791116,1.2843400,1.1396096,-1.9033181,0.41842115,1.5067141,1.2723280
171,-1.3515100,1.0722702,1.3034424,1.1610204,-1.9069375,0.41449690,1.5272514,1.2950130
172,-1.3590152,1.0651382,1.3224434,1.1823900,-1.9104745,0.41042619,1.5472084,1.3173356
173,-1.3664199,1.0577105,1.3413243,1.2036971,-1.9139288,0.40620634,1.5665666,1.3392744
174,-1.3737255,1.0499822,1.3600665,1.2249201,-1.9173000,0.40183497,1.5853083,1.3608082
175,-1.3809334,1.0419495,1.3786509,1.2460373,-1.9205869,0.39731008,1.6034169,1.3819167
176,-1.3880444,1.0336089,1.3970583,1.2670269,-1.9237879,0.39263002,1.6208767,1.4025799
177,-1.3950594,1.0249579,1.4152694,1.2878667,-1.9269011,0.38779352,1.6376730,1.4227785
178,-1.4019785,1.0159944,1.4332647,1.3085348,-1.9299240,0.38279966,1.6537921,1.4424936
179,-1.4088017,1.0067173,1.4510246,1.3290089,-1.9328538,0.37764788,1.6692213,1.4617072
180,-1.4155288,0.99712601,1.4685297,1.3492669,-1.9356872,0.37233801,1.6839489,1.4804018
181,-1.4221590,0.98722068,1.4857603,1.3692868,-1.9384205,0.36687023,1.6979646,1.4985606
182,-1.4286913,0.97700224,1.5026969,1.3890465,-1.9410497,0.36124509,1.7112587,1.5161676
183,-1.4351245,0.96647230,1.5193199,1.4085243,-1.9435703,0.35546350,1.7238228,1.5332075
184,-1.4414569,0.95563320,1.5356101,1.4276984,-1.9459775,0.34952673,1.7356497,1.5496657
185,-1.4476865,0.94448799,1.5515483,1.4465475,-1.9482661,0.34343642,1.7467333,1.5655285
186,-1.4538111,0.93304042,1.5671154,1.4650504,-1.9504308,0.33719454,1.7570683,1.5807830
187,-1.4598281,0.92129494,1.5822926,1.4831862,-1.9524658,0.33080341,1.7666508,1.5954169
188,-1.4657347,0.90925669,1.5970616,1.5009345,-1.9543651,0.32426569,1.7754780,1.6094191
189,-1.4715276,0.89693149,1.6114041,1.5182752,-1.9561223,0.31758435,1.7835480,1.6227790
190,-1.4772036,0.88432580,1.6253023,1.5351887,-1.9577311,0.31076270,1.7908603,1.6354872
191,-1.4827588,0.87144677,1.6387387,1.5516558,-1.9591845,0.30380434,1.7974152,1.6475349
192,-1.4881892,0.85830213,1.6516964,1.5676579,-1.9604759,0.29671319,1.8032142,1.6589143
193,-1.4934908,0.84490025,1.6641588,1.5831769,-1.9615980,0.28949342,1.8082600,1.6696185
194,-1.4986591,0.83125008,1.6761099,1.5981954,-1.9625437,0.28214952,1.8125560,1.6796415
195,-1.5036894,0.81736114,1.6875342,1.6126966,-1.9633056,0.27468619,1.8161069,1.6889782
196,-1.5085768,0.80324349,1.6984166,1.6266641,-1.9638764,0.26710843,1.8189185,1.6976243
197,-1.5133164,0.78890770,1.7087430,1.6400827,-1.9642486,0.25942142,1.8209972,1.7055765
198,-1.5179028,0.77436483,1.7184995,1.6529375,-1.9644148,0.25163060,1.8223509,1.7128325
199,-1.5223308,0.75962642,1.7276732,1.6652146,-1.9643673,0.24374160,1.8229879,1.7193907
200,-1.5265947,0.74470443,1.7362516,1.6769007,-1.9640987,0.23576023,1.8229178,1.7252505
201,-1.5306891,0.72961120,1.7442233,1.6879836,-1.9636017,0.22769248,1.8221509,1.7304121
202,-1.5346080,0.71435947,1.7515772,1.6984516,-1.9628687,0.21954449,1.8206985,1.7348767
203,-1.5383457,0.69896230,1.7583033,1.7082940,-1.9618926,0.21132255,1.8185725,1.7386463
204,-1.5418963,0.68343306,1.7643923,1.7175012,-1.9606662,0.20303305,1.8157858,1.7417237
205,-1.5452539,0.66778538,1.7698357,1.7260641,-1.9591824,0.19468251,1.8123519,1.7441126
206,-1.5484123,0.65203313,1.7746257,1.7339748,-1.9574345,0.18627753,1.8082851,1.7458175
207,-1.5513657,0.63619038,1.7787557,1.7412263,-1.9554158,0.17782475,1.8036004,1.7468438
208,-1.5541081,0.62027135,1.7822197,1.7478125,-1.9531199,0.16933092,1.7983133,1.7471975
209,-1.5566335,0.60429039,1.7850125,1.7537282,-1.9505406,0.16080277,1.7924401,1.7468854
210,-1.5589360,0.58826195,1.7871302,1.7589692,-1.9476719,0.15224709,1.7859973,1.7459152
211,-1.5610096,0.57220052,1.7885694,1.7635322,-1.9445083,0.14367064,1.7790024,1.7442953
212,-1.5628488,0.55612060,1.7893278,1.7674152,-1.9410444,0.13508017,1.7714730,1.7420346
213,-1.5644477,0.54003669,1.7894040,1.7706167,-1.9372751,0.12648243,1.7634272,1.7391428
214,-1.5658009,0.52396320,1.7887975,1.7731365,-1.9331959,0.11788406,1.7548835,1.7356303
215,-1.5669029,0.50791447,1.7875088,1.7749752,-1.9288024,0.10929170,1.7458609,1.7315080
216,-1.5677485,0.49190469,1.7855393,1.7761345,-1.9240907,0.10071185,1.7363783,1.7267875
217,-1.5683326,0.47594792,1.7828913,1.7766170,-1.9190573,0.092150950,1.7264553,1.7214810
218,-1.5686502,0.46005796,1.7795680,1.7764262,-1.9136990,0.083615316,1.7161114,1.7156009
219,-1.5686968,0.44424844,1.7755736,1.7755665,-1.9080130,0.075111136,1.7053662,1.7091606
220,-1.5684679,0.42853267,1.7709131,1.7740433,-1.9019972,0.066644460,1.6942398,1.7021736
221,-1.5679592,0.41292369,1.7655926,1.7718631,-1.8956497,0.058221182,1.6827519,1.6946539
222,-1.5671668,0.39743419,1.7596189,1.7690329,-1.8889690,0.049847029,1.6709224,1.6866160
223,-1.5660870,0.38207651,1.7529998,1.7655607,-1.8819543,0.041527551,1.6587714,1.6780748
224,-1.5647163,0.36686260,1.7457439,1.7614556,-1.8746051,0.033268106,1.6463186,1.6690454
225,-1.5630516,0.35180398,1.7378606,1.7567273,-1.8669214,0.025073850,1.6335837,1.6595433
226,-1.5610901,0.33691172,1.7293602,1.7513862,-1.8589036,0.016949729,1.6205864,1.6495842
227,-1.5588293,0.32219644,1.7202539,1.7454437,-1.8505528,0.0089004695,1.6073459,1.6391841
228,-1.5562670,0.30766824,1.7105534,1.7389119,-1.8418703,0.00093056710,1.5938815,1.6283592
229,-1.5534014,0.29333673,1.7002716,1.7318034,-1.8328581,-0.0069557175,1.5802121,1.6171258
230,-1.5502308,0.27921096,1.6894216,1.7241318,-1.8235185,-0.014754367,1.5663561,1.6055005
231,-1.5467542,0.26529943,1.6780176,1.7159111,-1.8138544,-0.022461613,1.5523319,1.5934998
232,-1.5429708,0.25161008,1.6660744,1.7071561,-1.8038692,-0.030073941,1.5381573,1.5811404
233,-1.5388800,0.23815025,1.6536074,1.6978821,-1.7935667,-0.037588094,1.5238498,1.5684391
234,-1.5344819,0.22492666,1.6406325,1.6881048,-1.7829510,-0.045001076,1.5094263,1.5554124
235,-1.5297766,0.21194546,1.6271664,1.6778406,-1.7720269,-0.052310157,1.4949034,1.5420772
236,-1.5247649,0.19921213,1.6132263,1.6671064,-1.7607995,-0.059512867,1.4802971,1.5284500
237,-1.5194477,0.18673156,1.5988297,1.6559194,-1.7492744,-0.066607006,1.4656229,1.5145474
238,-1.5138265,0.17450797,1.5839949,1.6442972,-1.7374576,-0.073590636,1.4508957,1.5003858
239,-1.5079030,0.16254495,1.5687403,1.6322578,-1.7253554,-0.080462082,1.4361301,1.4859815
240,-1.5016792,0.15084546,1.5530851,1.6198194,-1.7129747,-0.087219933,1.4213396,1.4713506
241,-1.4951578,0.13941179,1.5370486,1.6070007,-1.7003225,-0.093863034,1.4065375,1.4565090
242,-1.4883416,0.12824562,1.5206503,1.5938203,-1.6874064,-0.10039048,1.3917363,1.4414724
243,-1.4812337,0.11734797,1.5039103,1.5802972,-1.6742342,-0.10680163,1.3769480,1.4262562
244,-1.4738377,0.10671924,1.4868487,1.5664506,-1.6608140,-0.11309607,1.3621837,1.4108756
245,-1.4661575,0.096359196,1.4694860,1.5522996,-1.6471544,-0.11927363,1.3474539,1.3953455
246,-1.4581973,0.086267000,1.4518427,1.5378633,-1.6332641,-0.12533436,1.3327686,1.3796803
247,-1.4499617,0.076441207,1.4339394,1.5231612,-1.6191520,-0.13127855,1.3181370,1.3638943
248,-1.4414555,0.066879785,1.4157970,1.5082123,-1.6048275,-0.13710670,1.3035674,1.3480013
249,-1.4326839,0.057580126,1.3974362,1.4930359,-1.5902999,-0.14281949,1.2890678,1.3320149
250,-1.4236524,0.048539067,1.3788778,1.4776509,-1.5755790,-0.14841781,1.2746452,1.3159480
251,-1.4143667,0.039752907,1.3601425,1.4620762,-1.5606745,-0.15390275,1.2603061,1.2998134
252,-1.4048327,0.031217427,1.3412510,1.4463305,-1.5455964,-0.15927553,1.2460560,1.2836233
253,-1.3950568,0.022927911,1.3222238,1.4304323,-1.5303549,-0.16453756,1.2319001,1.2673895
254,-1.3850455,0.014879172,1.3030812,1.4143998,-1.5149601,-0.16969039,1.2178427,1.2511234
255,-1.3748055,0.0070655752,1.2838435,1.3982507,-1.4994223,-0.17473569,1.2038874,1.2348359
256,-1.3643437,-0.00051893557,1.2645304,1.3820027,-1.4837517,-0.17967527,1.1900373,1.2185374
257,-1.3536672,-0.0078808102,1.2451618,1.3656730,-1.4679589,-0.18451102,1.1762946,1.2022381
258,-1.3427833,-0.015026863,1.2257567,1.3492782,-1.4520539,-0.18924494,1.1626612,1.1859473
259,-1.3316995,-0.021964245,1.2063343,1.3328348,-1.4360473,-0.19387911,1.1491380,1.1696741
260,-1.3204234,-0.028700409,1.1869130,1.3163584,-1.4199493,-0.19841566,1.1357256,1.1534271
261,-1.3089626,-0.035243080,1.1675111,1.2998646,-1.4037700,-0.20285677,1.1224240,1.1372144
262,-1.2973251,-0.041600224,1.1481461,1.2833681,-1.3875196,-0.20720464,1.1092323,1.1210435
263,-1.2855186,-0.047780012,1.1288354,1.2668832,-1.3712080,-0.21146151,1.0961495,1.1049216
264,-1.2735513,-0.053790787,1.1095956,1.2504236,-1.3548450,-0.21562961,1.0831739,1.0888553
265,-1.2614310,-0.059641027,1.0904428,1.2340024,-1.3384404,-0.21971115,1.0703031,1.0728508
266,-1.2491658,-0.065339315,1.0713926,1.2176320,-1.3220036,-0.22370831,1.0575347,1.0569138
267,-1.2367639,-0.070894296,1.0524600,1.2013245,-1.3055439,-0.22762324,1.0448653,1.0410495
268,-1.2242332,-0.076314649,1.0336595,1.1850908,-1.2890702,-0.23145800,1.0322915,1.0252627
269,-1.2115817,-0.081609046,1.0150046,1.1689416,-1.2725915,-0.23521462,1.0198095,1.0095578
270,-1.1988175,-0.086786117,0.99650852,1.1528867,-1.2561161,-0.23889500,1.0074148,0.99393868
271,-1.1859484,-0.091854415,0.97818360,1.1369354,-1.2396524,-0.24250094,0.99510302,0.97840884
272,-1.1729823,-0.096822381,0.96004155,1.1210959,-1.2232083,-0.24603415,0.98286915,0.96297136
273,-1.1599269,-0.10169831,0.94209335,1.1053762,-1.2067913,-0.24949618,0.97070808,0.94762893
274,-1.1467897,-0.10649030,0.92434927,1.0897833,-1.1904087,-0.25288845,0.95861443,0.93238386
275,-1.1335783,-0.11120625,0.90681885,1.0743235,-1.1740675,-0.25621220,0.94658262,0.91723807
276,-1.1203000,-0.11585380,0.88951088,1.0590024,-1.1577742,-0.25946854,0.93460692,0.90219315
277,-1.1069619,-0.12044030,0.87243342,1.0438250,-1.1415349,-0.26265836,0.92268145,0.88725035
278,-1.0935710,-0.12497279,0.85559374,1.0287954,-1.1253555,-0.26578238,0.91080024,0.87241060
279,-1.0801340,-0.12945795,0.83899839,1.0139172,-1.1092413,-0.26884111,0.89895724,0.85767453
280,-1.0666576,-0.13390211,0.82265315,0.99919311,-1.0931974,-0.27183484,0.88714637,0.84304247
281,-1.0531479,-0.13831115,0.80656303,0.98462534,-1.0772283,-0.27476366,0.87536157,0.82851450
282,-1.0396113,-0.14269056,0.79073230,0.97021531,-1.0613383,-0.27762740,0.86359677,0.81409046
283,-1.0260533,-0.14704532,0.77516448,0.95596377,-1.0455310,-0.28042568,0.85184598,0.79976996
284,-1.0124797,-0.15137996,0.75986234,0.94187088,-1.0298098,-0.28315786,0.84010330,0.78555239
285,-0.99889582,-0.15569847,0.74482790,0.92793611,-1.0141776,-0.28582306,0.82836295,0.77143696
286,-0.98530656,-0.16000434,0.73006249,0.91415835,-0.99863687,-0.28842015,0.81661930,0.75742272
287,-0.97171670,-0.16430047,0.71556668,0.90053589,-0.98318975,-0.29094771,0.80486689,0.74350856
288,-0.95813069,-0.16858921,0.70134039,0.88706643,-0.96783784,-0.29340411,0.79310047,0.72969326
289,-0.94455266,-0.17287230,0.68738280,0.87374712,-0.95258240,-0.29578741,0.78131503,0.71597547
290,-0.93098643,-0.17715089,0.67369246,0.86057459,-0.93742425,-0.29809544,0.76950580,0.70235377
291,-0.91743551,-0.18142549,0.66026725,0.84754496,-0.92236382,-0.30032575,0.75766832,0.68882666
292,-0.90390309,-0.18569600,0.64710442,0.83465389,-0.90740116,-0.30247561,0.74579841,0.67539260
293,-0.89039205,-0.18996167,0.63420063,0.82189656,-0.89253593,-0.30454206,0.73389223,0.66205002
294,-0.87690494,-0.19422109,0.62155192,0.80926774,-0.87776741,-0.30652186,0.72194627,0.64879733
295,-0.86344399,-0.19847220,0.60915379,0.79676182,-0.86309454,-0.30841152,0.70995742,0.63563296
296,-0.85001111,-0.20271228,0.59700119,0.78437282,-0.84851590,-0.31020730,0.69792293,0.62255536
297,-0.83660789,-0.20693797,0.58508856,0.77209443,-0.83402974,-0.31190521,0.68584044,0.60956301
298,-0.82323561,-0.21114520,0.57340987,0.75992004,-0.81963400,-0.31350102,0.67370805,0.59665446
299,-0.80989524,-0.21532930,0.56195861,0.74784278,-0.80532632,-0.31499027,0.66152424,0.58382833
300,-0.79658742,-0.21948489,0.55072787,0.73585555,-0.79110407,-0.31636829,0.64928795,0.57108334
301,-0.78331252,-0.22360599,0.53971032,0.72395105,-0.77696434,-0.31763018,0.63699858,0.55841830
302,-0.77007059,-0.22768595,0.52889828,0.71212181,-0.76290399,-0.31877084,0.62465598,0.54583215
303,-0.75686142,-0.23171751,0.51828373,0.70036023,-0.74891966,-0.31978497,0.61226044,0.53332394
304,-0.74368450,-0.23569279,0.50785837,0.68865862,-0.73500779,-0.32066711,0.59981277,0.52089290
305,-0.73053907,-0.23960330,0.49761359,0.67700924,-0.72116465,-0.32141161,0.58731421,0.50853836
306,-0.71742410,-0.24343998,0.48754060,0.66540430,-0.70738633,-0.32201268,0.57476648,0.49625987
307,-0.70433832,-0.24719321,0.47763036,0.65383603,-0.69366882,-0.32246438,0.56217180,0.48405712
308,-0.69128023,-0.25085279,0.46787371,0.64229671,-0.68000800,-0.32276065,0.54953282,0.47192998
309,-0.67824812,-0.25440806,0.45826131,0.63077867,-0.66639965,-0.32289532,0.53685268,0.45987851
310,-0.66524006,-0.25784780,0.44878376,0.61927438,-0.65283951,-0.32286213,0.52413500,0.44790299
311,-0.65225394,-0.26116036,0.43943158,0.60777641,-0.63932329,-0.32265473,0.51138381,0.43600388
312,-0.63928748,-0.26433364,0.43019526,0.59627755,-0.62584668,-0.32226673,0.49860362,0.42418182
313,-0.62633824,-0.26735512,0.42106530,0.58477076,-0.61240542,-0.32169169,0.48579936,0.41243770
314,-0.61340364,-0.27021189,0.41203223,0.57324924,-0.59899527,-0.32092315,0.47297640,0.40077260
315,-0.60048097,-0.27289071,0.40308665,0.56170645,-0.58561207,-0.31995463,0.46014049,0.38918780
316,-0.58756742,-0.27537801,0.39421927,0.55013617,-0.57225177,-0.31877968,0.44729780,0.37768480
317,-0.57466012,-0.27765994,0.38542093,0.53853245,-0.55891044,-0.31739190,0.43445487,0.36626531
318,-0.56175609,-0.27972241,0.37668263,0.52688973,-0.54558430,-0.31578491,0.42161860,0.35493125
319,-0.54885234,-0.28155112,0.36799558,0.51520279,-0.53226974,-0.31395243,0.40879623,0.34368472
320,-0.53594583,-0.28313160,0.35935119,0.50346682,-0.51896337,-0.31188827,0.39599532,0.33252805
321,-0.52303352,-0.28444925,0.35074115,0.49167743,-0.50566200,-0.30958635,0.38322375,0.32146374
322,-0.51011239,-0.28548939,0.34215741,0.47983064,-0.49236272,-0.30704072,0.37048964,0.31049448
323,-0.49717944,-0.28623727,0.33359226,0.46792295,-0.47906287,-0.30424560,0.35780138,0.29962316
324,-0.48423172,-0.28667816,0.32503828,0.45595134,-0.46576010,-0.30119537,0.34516761,0.28885281
325,-0.47126638,-0.28679735,0.31648844,0.44391326,-0.45245239,-0.29788462,0.33259715,0.27818666
326,-0.45828064,-0.28658020,0.30793609,0.43180668,-0.43913803,-0.29430815,0.32009899,0.26762806
327,-0.44527185,-0.28601220,0.29937497,0.41963008,-0.42581569,-0.29046098,0.30768229,0.25718052
328,-0.43223747,-0.28507901,0.29079924,0.40738246,-0.41248443,-0.28633841,0.29535631,0.24684768
329,-0.41917514,-0.28376647,0.28220352,0.39506339,-0.39914370,-0.28193600,0.28313044,0.23663330
330,-0.40608266,-0.28206070,0.27358287,0.38267296,-0.38579336,-0.27724959,0.27101410,0.22654124
331,-0.39295802,-0.27994808,0.26493284,0.37021181,-0.37243371,-0.27227535,0.25901676,0.21657546
332,-0.37979944,-0.27741534,0.25624946,0.35768117,-0.35906551,-0.26700976,0.24714789,0.20673999
333,-0.36660536,-0.27444957,0.24752927,0.34508280,-0.34568996,-0.26144965,0.23541695,0.19703894
334,-0.35337444,-0.27103830,0.23876932,0.33241903,-0.33230875,-0.25559222,0.22383335,0.18747646
335,-0.34010566,-0.26716948,0.22996719,0.31969275,-0.31892406,-0.24943503,0.21240640,0.17805674
336,-0.32679823,-0.26283159,0.22112098,0.30690740,-0.30553856,-0.24297605,0.20114531,0.16878398
337,-0.31345169,-0.25801362,0.21222933,0.29406698,-0.29215543,-0.23621362,0.19005916,0.15966238
338,-0.30006587,-0.25270514,0.20329144,0.28117604,-0.27877836,-0.22914653,0.17915684,0.15069616
339,-0.28664094,-0.24689632,0.19430704,0.26823967,-0.26541155,-0.22177400,0.16844706,0.14188947
340,-0.27317741,-0.24057799,0.18527640,0.25526346,-0.25205975,-0.21409566,0.15793830,0.13324642
341,-0.25967615,-0.23374163,0.17620035,0.24225355,-0.23872821,-0.20611164,0.14763879,0.12477109
342,-0.24613837,-0.22637946,0.16708027,0.22921656,-0.22542271,-0.19782249,0.13755648,0.11646743
343,-0.23256567,-0.21848443,0.15791806,0.21615963,-0.21214957,-0.18922926,0.12769901,0.10833934
344,-0.21896005,-0.21005025,0.14871617,0.20309033,-0.19891562,-0.18033345,0.11807369,0.10039059
345,-0.20532389,-0.20107145,0.13947759,0.19001672,-0.18572823,-0.17113708,0.10868748,0.092624803
346,-0.19165996,-0.19154335,0.13020580,0.17694727,-0.17259526,-0.16164263,0.099546973,0.085045485
347,-0.17797146,-0.18146217,0.12090481,0.16389088,-0.15952510,-0.15185308,0.090658343,0.077655967
348,-0.16426199,-0.17082494,0.11157914,0.15085685,-0.14652664,-0.14177193,0.082027353,0.070459408
349,-0.15053557,-0.15962964,0.10223378,0.13785483,-0.13360924,-0.13140316,0.073659326,0.063458774
350,-0.13679666,-0.14787513,0.092874183,0.12489483,-0.12078277,-0.12075125,0.065559126,0.056656828
351,-0.12305012,-0.13556119,0.083506280,0.11198717,-0.10805754,-0.10982119,0.057731140,0.050056111
352,-0.10930124,-0.12268857,0.074136429,0.099142468,-0.095444336,-0.098618454,0.050179266,0.043658935
353,-0.095555749,-0.10925893,0.064771412,0.086371613,-0.082954366,-0.087149033,0.042906894,0.037467363
354,-0.081819776,-0.095274932,0.055418409,0.073685727,-0.070599261,-0.075419397,0.035916899,0.031483204
355,-0.068099885,-0.080740187,0.046084984,0.061096139,-0.058391054,-0.063436506,0.029211624,0.025707995
356,-0.054403052,-0.065659283,0.036779058,0.048614358,-0.046342157,-0.051207801,0.022792875,0.020142997
357,-0.040736663,-0.050037787,0.027508888,0.036252043,-0.034465344,-0.038741196,0.016661912,0.014789180
358,-0.027108509,-0.033882242,0.018283044,0.024020968,-0.022773723,-0.026045070,0.010819441,0.0096472174
359,-0.013526776,-0.017200166,0.0091103835,0.011932993,-0.011280715,-0.013128257,0.0052656119,0.0047174767
360,-3.7636994e-08,-4.8679595e-08,2.5310555e-08,3.3050128e-08,-3.1149369e-08,-3.6896417e-08,1.4283003e-08,1.2859729e-08
