deg,XRT_AX,XRT_BX,XRT_AY,XRT_BY,SOT_AX,SOT_BX,SOT_AY,SOT_BY
valid,1,1,1,1,1,1,1,1,revB
offset,86.885441,72.383005,1988.4563,1977.4491,12.579091,-2.5389741,109.69843,98.497543
0,0.0000000,0.0000000,0.0000000,0.0000000,0.0000000,0.0000000,0.0000000,0.0000000
1,0.071939945,0.030728323,-0.032337787,0.0084103531,0.10104717,0.063604887,-0.033242321,-0.0018089562
2,0.14157078,0.061548893,-0.063969357,0.016449079,0.19797367,0.12576300,-0.065516422,-0.0039339660
3,0.20897060,0.092453102,-0.094908914,0.024125546,0.29079042,0.18637922,-0.096831312,-0.0063371104
4,0.27422126,0.12343317,-0.12517148,0.031449441,0.37951812,0.24536513,-0.12719833,-0.0089811128
5,0.33740799,0.15448213,-0.15477281,0.038430730,0.46418695,0.30263915,-0.15663106,-0.011829432
6,0.39861905,0.18559379,-0.18372933,0.045079618,0.54483638,0.35812665,-0.18514521,-0.014846349
7,0.45794534,0.21676269,-0.21205802,0.051406514,0.62151480,0.41176008,-0.21275855,-0.017997052
8,0.51548003,0.24798410,-0.23977638,0.057421994,0.69427927,0.46347903,-0.23949077,-0.021247713
9,0.57131818,0.27925396,-0.26690230,0.063136765,0.76319514,0.51323031,-0.26536339,-0.024565562
10,0.62555635,0.31056887,-0.29345405,0.068561632,0.82833576,0.56096797,-0.29039964,-0.027918957
11,0.67829225,0.34192603,-0.31945011,0.073707464,0.88978206,0.60665333,-0.31462436,-0.031277445
12,0.72962437,0.37332319,-0.34490919,0.078585164,0.94762223,0.65025500,-0.33806385,-0.034611822
13,0.77965158,0.40475864,-0.36985007,0.083205639,1.0019513,0.69174883,-0.36074575,-0.037894183
14,0.82847279,0.43623117,-0.39429158,0.087579772,1.0528706,0.73111790,-0.38269897,-0.041097972
15,0.87618661,0.46773998,-0.41825251,0.091718394,1.1004878,0.76835244,-0.40395346,-0.044198021
16,0.92289095,0.49928470,-0.44175154,0.095632260,1.1449159,0.80344976,-0.42454018,-0.047170585
17,0.96868274,0.53086529,-0.46480715,0.099332027,1.1862731,0.83641416,-0.44449092,-0.049993374
18,1.0136575,0.56248205,-0.48743759,0.10282823,1.2246823,0.86725680,-0.46383816,-0.052645576
19,1.0579093,0.59413551,-0.50966081,0.10613127,1.2602710,0.89599558,-0.48261497,-0.055107874
20,1.1015298,0.62582644,-0.53149435,0.10925137,1.2931700,0.92265497,-0.50085484,-0.057362460
21,1.1446089,0.65755577,-0.55295534,0.11219861,1.3235139,0.94726584,-0.51859161,-0.059393042
22,1.1872335,0.68932458,-0.57406042,0.11498285,1.3514400,0.96986532,-0.53585925,-0.061184842
23,1.2294879,0.72113401,-0.59482568,0.11761377,1.3770882,0.99049653,-0.55269181,-0.062724596
24,1.2714532,0.75298525,-0.61526662,0.12010085,1.4006001,1.0092084,-0.56912323,-0.064000541
25,1.3132073,0.78487948,-0.63539811,0.12245332,1.4221193,1.0260554,-0.58518728,-0.065002398
26,1.3548243,0.81681782,-0.65523432,0.12468020,1.4417900,1.0410975,-0.60091737,-0.065721357
27,1.3963746,0.84880132,-0.67478870,0.12679029,1.4597573,1.0543994,-0.61634645,-0.066150044
28,1.4379247,0.88083088,-0.69407395,0.12879214,1.4761665,1.0660309,-0.63150690,-0.066282495
29,1.4795367,0.91290721,-0.71310197,0.13069408,1.4911626,1.0760662,-0.64643042,-0.066114116
30,1.5212686,0.94503084,-0.73188384,0.13250421,1.5048899,1.0845836,-0.66114790,-0.065641649
31,1.5631738,0.97720201,-0.75042980,0.13423039,1.5174916,1.0916656,-0.67568930,-0.064863117
32,1.6053011,1.0094207,-0.76874920,0.13588025,1.5291093,1.0973979,-0.69008360,-0.063777786
33,1.6476946,1.0416865,-0.78685053,0.13746122,1.5398829,1.1018699,-0.70435862,-0.062386102
34,1.6903935,1.0739988,-0.80474135,0.13898051,1.5499498,1.1051737,-0.71854099,-0.060689640
35,1.7334321,1.1063564,-0.82242835,0.14044510,1.5594449,1.1074040,-0.73265604,-0.058691040
36,1.7768400,1.1387579,-0.83991727,0.14186183,1.5684998,1.1086579,-0.74672770,-0.056393943
37,1.8206416,1.1712011,-0.85721293,0.14323731,1.5772430,1.1090343,-0.76077845,-0.053802926
38,1.8648562,1.2036838,-0.87431926,0.14457802,1.5857991,1.1086339,-0.77482922,-0.050923431
39,1.9094984,1.2362030,-0.89123924,0.14589025,1.5942887,1.1075583,-0.78889932,-0.047761690
40,1.9545777,1.2687551,-0.90797498,0.14718019,1.6028282,1.1059105,-0.80300641,-0.044324656
41,2.0000985,1.3013363,-0.92452768,0.14845388,1.6115293,1.1037936,-0.81716641,-0.040619919
42,2.0460606,1.3339421,-0.94089765,0.14971727,1.6204988,1.1013110,-0.83139349,-0.036655633
43,2.0924588,1.3665672,-0.95708438,0.15097621,1.6298384,1.0985661,-0.84569998,-0.032440436
44,2.1392832,1.3992061,-0.97308649,0.15223650,1.6396446,1.0956618,-0.86009636,-0.027983366
45,2.1865195,1.4318525,-0.98890180,0.15350388,1.6500084,1.0927000,-0.87459125,-0.023293783
46,2.2341487,1.4644997,-1.0045274,0.15478406,1.6610149,1.0897816,-0.88919135,-0.018381286
47,2.2821475,1.4971401,-1.0199595,0.15608275,1.6727435,1.0870061,-0.90390144,-0.013255632
48,2.3304884,1.5297658,-1.0351937,0.15740567,1.6852676,1.0844710,-0.91872439,-0.0079266502
49,2.3791401,1.5623681,-1.0502249,0.15875855,1.6986545,1.0822718,-0.93366114,-0.0024041678
50,2.4280673,1.5949380,-1.0650475,0.16014721,1.7129653,1.0805015,-0.94871069,0.0033020759
51,2.4772310,1.6274657,-1.0796550,0.16157752,1.7282549,1.0792507,-0.96387016,0.0091825066
52,2.5265889,1.6599409,-1.0940405,0.16305545,1.7445718,1.0786067,-0.97913474,0.015227793
53,2.5760956,1.6923527,-1.1081968,0.16458708,1.7619581,1.0786536,-0.99449778,0.021428922
54,2.6257026,1.7246897,-1.1221159,0.16617861,1.7804498,1.0794721,-1.0099508,0.027777276
55,2.6753588,1.7569401,-1.1357896,0.16783643,1.8000764,1.0811391,-1.0254835,0.034264699
56,2.7250106,1.7890914,-1.1492094,0.16956705,1.8208612,1.0837276,-1.0410839,0.040883570
57,2.7746022,1.8211307,-1.1623662,0.17137721,1.8428211,1.0873062,-1.0567382,0.047626870
58,2.8240758,1.8530448,-1.1752509,0.17327383,1.8659672,1.0919392,-1.0724310,0.054488242
59,2.8733722,1.8848199,-1.1878543,0.17526406,1.8903042,1.0976864,-1.0881455,0.061462052
60,2.9224307,1.9164418,-1.2001667,0.17735526,1.9158310,1.1046026,-1.1038630,0.068543447
61,2.9711894,1.9478960,-1.2121787,0.17955508,1.9425408,1.1127381,-1.1195638,0.075728406
62,3.0195860,1.9791678,-1.2238806,0.18187139,1.9704212,1.1221376,-1.1352264,0.083013788
63,3.0675572,2.0102419,-1.2352629,0.18431234,1.9994541,1.1328410,-1.1508285,0.090397379
64,3.1150400,2.0411031,-1.2463161,0.18688639,2.0296163,1.1448828,-1.1663462,0.097877929
65,3.1619713,2.0717357,-1.2570308,0.18960223,2.0608797,1.1582921,-1.1817547,0.10545519
66,3.2082883,2.1021238,-1.2673978,0.19246889,2.0932110,1.1730926,-1.1970282,0.11312994
67,3.2539292,2.1322517,-1.2774083,0.19549569,2.1265726,1.1893025,-1.2121399,0.12090403
68,3.2988328,2.1621033,-1.2870537,0.19869222,2.1609225,1.2069345,-1.2270623,0.12878037
69,3.3429395,2.1916625,-1.2963257,0.20206841,2.1962146,1.2259956,-1.2417671,0.13676298
70,3.3861912,2.2209132,-1.3052165,0.20563447,2.2323989,1.2464875,-1.2562255,0.14485698
71,3.4285315,2.2498394,-1.3137186,0.20940091,2.2694221,1.2684063,-1.2704082,0.15306859
72,3.4699063,2.2784252,-1.3218252,0.21337853,2.3072275,1.2917424,-1.2842856,0.16140515
73,3.5102639,2.3066546,-1.3295299,0.21757843,2.3457555,1.3164810,-1.2978276,0.16987512
74,3.5495550,2.3345121,-1.3368270,0.22201198,2.3849441,1.3426019,-1.3110044,0.17848804
75,3.5877333,2.3619821,-1.3437113,0.22669081,2.4247289,1.3700798,-1.3237858,0.18725452
76,3.6247559,2.3890495,-1.3501783,0.23162681,2.4650433,1.3988838,-1.3361419,0.19618626
77,3.6605828,2.4156994,-1.3562244,0.23683212,2.5058195,1.4289784,-1.3480428,0.20529597
78,3.6951778,2.4419174,-1.3618464,0.24231909,2.5469883,1.4603230,-1.3594593,0.21459735
79,3.7285085,2.4676892,-1.3670421,0.24810029,2.5884793,1.4928724,-1.3703623,0.22410510
80,3.7605465,2.4930012,-1.3718101,0.25418845,2.6302217,1.5265767,-1.3807234,0.23383482
81,3.7912673,2.5178403,-1.3761496,0.26059649,2.6721444,1.5613816,-1.3905149,0.24380299
82,3.8206508,2.5421937,-1.3800610,0.26733746,2.7141764,1.5972288,-1.3997098,0.25402690
83,3.8486815,2.5660495,-1.3835452,0.27442451,2.7562469,1.6340559,-1.4082822,0.26452464
84,3.8753483,2.5893962,-1.3866042,0.28187088,2.7982860,1.6717968,-1.4162069,0.27531498
85,3.9006448,2.6122229,-1.3892408,0.28968987,2.8402247,1.7103819,-1.4234601,0.28641734
86,3.9245694,2.6345196,-1.3914587,0.29789479,2.8819954,1.7497382,-1.4300190,0.29785171
87,3.9471253,2.6562769,-1.3932624,0.30649896,2.9235323,1.7897900,-1.4358622,0.30963859
88,3.9683208,2.6774863,-1.3946576,0.31551563,2.9647712,1.8304586,-1.4409697,0.32179889
89,3.9881690,2.6981397,-1.3956506,0.32495797,3.0056506,1.8716631,-1.4453229,0.33435386
90,4.0066879,2.7182304,-1.3962487,0.33483906,3.0461113,1.9133201,-1.4489050,0.34732500
91,4.0239008,2.7377522,-1.3964600,0.34517178,3.0860968,1.9553446,-1.4517006,0.36073400
92,4.0398357,2.7566998,-1.3962936,0.35596885,3.1255538,1.9976500,-1.4536962,0.37460261
93,4.0545257,2.7750688,-1.3957593,0.36724270,3.1644325,2.0401483,-1.4548799,0.38895256
94,4.0680088,2.7928559,-1.3948679,0.37900553,3.2026862,2.0827506,-1.4552420,0.40380549
95,4.0803278,2.8100586,-1.3936309,0.39126918,3.2402724,2.1253675,-1.4547743,0.41918281
96,4.0915304,2.8266753,-1.3920604,0.40404513,3.2771524,2.1679089,-1.4534710,0.43510564
97,4.1016687,2.8427056,-1.3901697,0.41734445,3.3132915,2.2102851,-1.4513280,0.45159468
98,4.1107995,2.8581499,-1.3879723,0.43117774,3.3486595,2.2524063,-1.4483434,0.46867014
99,4.1189841,2.8730097,-1.3854827,0.44555509,3.3832307,2.2941837,-1.4445175,0.48635161
100,4.1262879,2.8872873,-1.3827159,0.46048606,3.4169840,2.3355290,-1.4398525,0.50465796
101,4.1327803,2.9009862,-1.3796876,0.47597958,3.4499028,2.3763555,-1.4343528,0.52360726
102,4.1385349,2.9141109,-1.3764139,0.49204396,3.4819756,2.4165778,-1.4280252,0.54321665
103,4.1436285,2.9266668,-1.3729115,0.50868682,3.5131956,2.4561125,-1.4208784,0.56350225
104,4.1481419,2.9386604,-1.3691975,0.52591503,3.5435613,2.4948781,-1.4129234,0.58447908
105,4.1521587,2.9500990,-1.3652893,0.54373468,3.5730757,2.5327957,-1.4041732,0.60616091
106,4.1557656,2.9609910,-1.3612048,0.56215106,3.6017472,2.5697892,-1.3946432,0.62856022
107,4.1590521,2.9713458,-1.3569620,0.58116854,3.6295891,2.6057852,-1.3843508,0.65168807
108,4.1621100,2.9811736,-1.3525793,0.60079063,3.6566198,2.6407139,-1.3733154,0.67555399
109,4.1650334,2.9904855,-1.3480751,0.62101986,3.6828623,2.6745086,-1.3615587,0.70016595
110,4.1679181,2.9992936,-1.3434679,0.64185776,3.7083450,2.7071066,-1.3491043,0.72553021
111,4.1708614,3.0076109,-1.3387763,0.66330484,3.7331008,2.7384493,-1.3359776,0.75165124
112,4.1739621,3.0154510,-1.3340186,0.68536052,3.7571674,2.7684819,-1.3222063,0.77853171
113,4.1773194,3.0228285,-1.3292134,0.70802312,3.7805870,2.7971545,-1.3078197,0.80617230
114,4.1810336,3.0297587,-1.3243788,0.73128982,3.8034064,2.8244215,-1.2928489,0.83457172
115,4.1852047,3.0362576,-1.3195327,0.75515661,3.8256767,2.8502420,-1.2773269,0.86372661
116,4.1899330,3.0423418,-1.3146928,0.77961827,3.8474530,2.8745805,-1.2612881,0.89363144
117,4.1953178,3.0480287,-1.3098762,0.80466837,3.8687944,2.8974061,-1.2447687,0.92427851
118,4.2014581,3.0533361,-1.3050998,0.83029917,3.8897637,2.9186934,-1.2278063,0.95565787
119,4.2084511,3.0582826,-1.3003796,0.85650169,3.9104272,2.9384224,-1.2104397,0.98775724
120,4.2163930,3.0628870,-1.2957315,0.88326559,3.9308544,2.9565785,-1.1927091,1.0205620
121,4.2253775,3.0671688,-1.2911702,0.91057924,3.9511179,2.9731526,-1.1746560,1.0540552
122,4.2354965,3.0711477,-1.2867100,0.93842965,3.9712929,2.9881412,-1.1563228,1.0882175
123,4.2468389,3.0748437,-1.2823644,0.96680246,3.9914571,3.0015466,-1.1377527,1.1230269
124,4.2594906,3.0782773,-1.2781459,0.99568195,4.0116902,3.0133767,-1.1189901,1.1584592
125,4.2735343,3.0814690,-1.2740660,1.0250510,4.0320738,3.0236450,-1.1000798,1.1944876
126,4.2890489,3.0844396,-1.2701355,1.0548912,4.0526911,3.0323711,-1.0810673,1.2310829
127,4.3061090,3.0872099,-1.2663639,1.0851825,4.0736262,3.0395797,-1.0619984,1.2682133
128,4.3247853,3.0898006,-1.2627597,1.1159038,4.0949642,3.0453017,-1.0429195,1.3058447
129,4.3451432,3.0922328,-1.2593302,1.1470324,4.1167907,3.0495732,-1.0238769,1.3439405
130,4.3672435,3.0945269,-1.2560815,1.1785443,4.1391911,3.0524360,-1.0049171,1.3824615
131,4.3911413,3.0967038,-1.2530185,1.2104141,4.1622508,3.0539373,-0.98608650,1.4213664
132,4.4168865,3.0987836,-1.2501447,1.2426151,4.1860546,3.0541294,-0.96743122,1.4606112
133,4.4445226,3.1007864,-1.2474623,1.2751192,4.2106862,3.0530701,-0.94899707,1.5001499
134,4.4740872,3.1027320,-1.2449722,1.3078971,4.2362280,3.0508220,-0.93082934,1.5399341
135,4.5056113,3.1046396,-1.2426737,1.3409181,4.2627605,3.0474525,-0.91297270,1.5799130
136,4.5391192,3.1065280,-1.2405649,1.3741502,4.2903622,3.0430338,-0.89547104,1.6200340
137,4.5746285,3.1084156,-1.2386421,1.4075605,4.3191091,3.0376426,-0.87836733,1.6602421
138,4.6121495,3.1103199,-1.2369003,1.4411144,4.3490743,3.0313598,-0.86170351,1.7004805
139,4.6516850,3.1122581,-1.2353330,1.4747766,4.3803278,3.0242705,-0.84552034,1.7406904
140,4.6932308,3.1142463,-1.2339320,1.5085105,4.4129359,3.0164632,-0.82985727,1.7808113
141,4.7367745,3.1163002,-1.2326878,1.5422783,4.4469608,3.0080304,-0.81475232,1.8207807
142,4.7822965,3.1184343,-1.2315892,1.5760414,4.4824607,2.9990677,-0.80024193,1.8605348
143,4.8297688,3.1206624,-1.2306233,1.6097601,4.5194891,2.9896735,-0.78636089,1.9000081
144,4.8791558,3.1229974,-1.2297758,1.6433939,4.5580942,2.9799494,-0.77314217,1.9391336
145,4.9304137,3.1254511,-1.2290310,1.6769013,4.5983195,2.9699989,-0.76061682,1.9778432
146,4.9834906,3.1280344,-1.2283713,1.7102400,4.6402023,2.9599278,-0.74881387,2.0160676
147,5.0383266,3.1307568,-1.2277779,1.7433671,4.6837746,2.9498438,-0.73776023,2.0537365
148,5.0948535,3.1336270,-1.2272303,1.7762389,4.7290616,2.9398558,-0.72748056,2.0907785
149,5.1529951,3.1366523,-1.2267066,1.8088111,4.7760827,2.9300741,-0.71799722,2.1271218
150,5.2126672,3.1398389,-1.2261835,1.8410389,4.8248502,2.9206096,-0.70933014,2.1626936
151,5.2737775,3.1431918,-1.2256361,1.8728771,4.8753696,2.9115736,-0.70149676,2.1974210
152,5.3362258,3.1467146,-1.2250384,1.9042800,4.9276393,2.9030775,-0.69451194,2.2312305
153,5.3999041,3.1504095,-1.2243629,1.9352015,4.9816504,2.8952326,-0.68838790,2.2640487
154,5.4646969,3.1542776,-1.2235808,1.9655955,5.0373863,2.8881493,-0.68313416,2.2958019
155,5.5304808,3.1583185,-1.2226621,1.9954155,5.0948231,2.8819371,-0.67875747,2.3264168
156,5.5971255,3.1625303,-1.2215757,2.0246151,5.1539288,2.8767044,-0.67526177,2.3558204
157,5.6644933,3.1669100,-1.2202892,2.0531478,5.2146636,2.8725575,-0.67264814,2.3839400
158,5.7324397,3.1714529,-1.2187694,2.0809672,5.2769797,2.8696009,-0.67091477,2.4107036
159,5.8008134,3.1761530,-1.2169819,2.1080271,5.3408212,2.8679366,-0.67005695,2.4360403
160,5.8694568,3.1810029,-1.2148915,2.1342816,5.4061241,2.8676640,-0.67006703,2.4598797
161,5.9382061,3.1859937,-1.2124623,2.1596851,5.4728163,2.8688792,-0.67093439,2.4821529
162,6.0068918,3.1911151,-1.2096572,2.1841923,5.5408175,2.8716749,-0.67264549,2.5027922
163,6.0753388,3.1963554,-1.2064390,2.2077586,5.6100393,2.8761401,-0.67518384,2.5217312
164,6.1433668,3.2017015,-1.2027695,2.2303399,5.6803853,2.8823598,-0.67853000,2.5389054
165,6.2107909,3.2071388,-1.1986102,2.2518929,5.7517510,2.8904145,-0.68266165,2.5542519
166,6.2774216,3.2126514,-1.1939221,2.2723750,5.8240241,2.9003800,-0.68755355,2.5677098
167,6.3430654,3.2182221,-1.1886659,2.2917444,5.8970844,2.9123271,-0.69317767,2.5792203
168,6.4075253,3.2238321,-1.1828022,2.3099603,5.9708041,2.9263214,-0.69950312,2.5887268
169,6.4706010,3.2294617,-1.1762914,2.3269830,6.0450482,2.9424229,-0.70649631,2.5961753
170,6.5320895,3.2350897,-1.1690938,2.3427739,6.1196740,2.9606859,-0.71412095,2.6015141
171,6.5917855,3.2406935,-1.1611700,2.3572956,6.1945321,2.9811585,-0.72233814,2.6046943
172,6.6494817,3.2462496,-1.1524805,2.3705118,6.2694662,3.0038829,-0.73110642,2.6056700
173,6.7049698,3.2517331,-1.1429864,2.3823877,6.3443133,3.0288944,-0.74038190,2.6043979
174,6.7580402,3.2571183,-1.1326489,2.3928901,6.4189043,3.0562219,-0.75011832,2.6008381
175,6.8084831,3.2623781,-1.1214300,2.4019870,6.4930642,3.0858874,-0.76026715,2.5949538
176,6.8560887,3.2674846,-1.1092921,2.4096482,6.5666123,3.1179060,-0.77077769,2.5867115
177,6.9006480,3.2724088,-1.0961984,2.4158452,6.6393626,3.1522856,-0.78159720,2.5760812
178,6.9419529,3.2771210,-1.0821129,2.4205509,6.7111242,3.1890269,-0.79267102,2.5630365
179,6.9797970,3.2815906,-1.0670006,2.4237403,6.7817018,3.2281231,-0.80394266,2.5475544
180,7.0139759,3.2857861,-1.0508273,2.4253902,6.8508959,3.2695602,-0.81535397,2.5296160
181,7.0442879,3.2896754,-1.0335601,2.4254792,6.9185033,3.3133164,-0.82684525,2.5092059
182,7.0705345,3.2932259,-1.0151675,2.4239880,6.9843176,3.3593628,-0.83835540,2.4863127
183,7.0925208,3.2964043,-0.99561908,2.4208991,7.0481295,3.4076625,-0.84982206,2.4609291
184,7.1100560,3.2991769,-0.97488590,2.4161975,7.1097277,3.4581713,-0.86118178,2.4330514
185,7.1229541,3.3015094,-0.95294062,2.4098698,7.1688987,3.5108374,-0.87237013,2.4026805
186,7.1310340,3.3033674,-0.92975750,2.4019050,7.2254278,3.5656014,-0.88332190,2.3698211
187,7.1341204,3.3047162,-0.90531251,2.3922945,7.2790996,3.6223966,-0.89397127,2.3344820
188,7.1320443,3.3055209,-0.87958344,2.3810315,7.3296981,3.6811488,-0.90425190,2.2966764
189,7.1246428,3.3057465,-0.85254994,2.3681119,7.3770076,3.7417766,-0.91409719,2.2564214
190,7.1117605,3.3053582,-0.82419367,2.3535334,7.4208134,3.8041916,-0.92344039,2.2137385
191,7.0932492,3.3043209,-0.79449832,2.3372965,7.4609015,3.8682981,-0.93221478,2.1686534
192,7.0689688,3.3026000,-0.76344969,2.3194038,7.4970603,3.9339938,-0.94035386,2.1211959
193,7.0387874,3.3001611,-0.73103582,2.2998602,7.5290801,4.0011698,-0.94779149,2.0714000
194,7.0025819,3.2969700,-0.69724697,2.2786729,7.5567543,4.0697104,-0.95446209,2.0193037
195,6.9602384,3.2929931,-0.66207576,2.2558517,7.5798797,4.1394941,-0.96030083,1.9649492
196,6.9116524,3.2881973,-0.62551715,2.2314086,7.5982570,4.2103931,-0.96524373,1.9083829
197,6.8567293,3.2825498,-0.58756858,2.2053578,7.6116914,4.2822740,-0.96922791,1.8496550
198,6.7953847,3.2760190,-0.54822993,2.1777162,7.6199932,4.3549979,-0.97219173,1.7888196
199,6.7275445,3.2685736,-0.50750363,2.1485027,7.6229782,4.4284206,-0.97407493,1.7259349
200,6.6531456,3.2601834,-0.46539467,2.1177387,7.6204685,4.5023934,-0.97481883,1.6610625
201,6.5721358,3.2508192,-0.42191062,2.0854477,7.6122924,4.5767626,-0.97436651,1.5942680
202,6.4844743,3.2404524,-0.37706168,2.0516557,7.5982857,4.6513706,-0.97266290,1.5256204
203,6.3901317,3.2290561,-0.33086068,2.0163908,7.5782916,4.7260558,-0.96965500,1.4551924
204,6.2890904,3.2166040,-0.28332311,1.9796831,7.5521614,4.8006532,-0.96529202,1.3830598
205,6.1813444,3.2030714,-0.23446712,1.9415653,7.5197550,4.8749945,-0.95952551,1.3093018
206,6.0669001,3.1884347,-0.18431353,1.9020719,7.4809411,4.9489089,-0.95230949,1.2340006
207,5.9457758,3.1726720,-0.13288583,1.8612394,7.4355981,5.0222231,-0.94360065,1.1572416
208,5.8180019,3.1557624,-0.080210152,1.8191064,7.3836141,5.0947618,-0.93335841,1.0791127
209,5.6836214,3.1376868,-0.026315277,1.7757137,7.3248873,5.1663483,-0.92154509,0.99970484
210,5.5426893,3.1184278,0.028767395,1.7311035,7.2593269,5.2368048,-0.90812600,0.91911116
211,5.3952730,3.0979693,0.085003870,1.6853202,7.1868527,5.3059526,-0.89306960,0.83742735
212,5.2414523,3.0762971,0.14235759,1.6384098,7.1073960,5.3736131,-0.87634756,0.75475124
213,5.0813193,3.0533987,0.20078948,1.5904201,7.0208997,5.4396077,-0.85793487,0.67118268
214,4.9149781,3.0292634,0.26025798,1.5414004,6.9273185,5.5037582,-0.83780994,0.58682336
215,4.7425450,3.0038825,0.32071909,1.4914015,6.8266194,5.5658878,-0.81595470,0.50177665
216,4.5641482,2.9772488,0.38212646,1.4404758,6.7187818,5.6258209,-0.79235463,0.41614736
217,4.3799277,2.9493573,0.44443141,1.3886769,6.6037976,5.6833842,-0.76699887,0.33004160
218,4.1900352,2.9202050,0.50758301,1.3360599,6.4816716,5.7384064,-0.73988027,0.24356655
219,3.9946337,2.8897906,0.57152816,1.2826808,6.3524216,5.7907191,-0.71099542,0.15683030
220,3.7938974,2.8581152,0.63621167,1.2285971,6.2160783,5.8401573,-0.68034473,0.069941626
221,3.5880113,2.8251815,0.70157631,1.1738668,6.0726859,5.8865593,-0.64793241,-0.016990211
222,3.3771713,2.7909946,0.76756295,1.1185493,5.9223014,5.9297679,-0.61376657,-0.10385566
223,3.1615832,2.7555615,0.83411060,1.0627044,5.7649955,5.9696301,-0.57785914,-0.19054507
224,2.9414632,2.7188912,0.90115654,1.0063930,5.6008521,6.0059978,-0.54022596,-0.27694894
225,2.7170368,2.6809950,0.96863640,0.94967636,5.4299681,6.0387282,-0.50088673,-0.36295806
226,2.4885387,2.6418859,1.0364843,0.89261629,5.2524540,6.0676842,-0.45986501,-0.44846375
227,2.2562127,2.6015794,1.1046328,0.83527508,5.0684333,6.0927347,-0.41718821,-0.53335806
228,2.0203107,2.5600927,1.1730135,0.77771527,4.8780425,6.1137549,-0.37288755,-0.61753400
229,1.7810927,2.5174453,1.2415563,0.71999964,4.6814309,6.1306268,-0.32699799,-0.70088565
230,1.5388262,2.4736585,1.3101903,0.66219106,4.4787607,6.1432394,-0.27955824,-0.78330847
231,1.2937855,2.4287558,1.3788437,0.60435239,4.2702067,6.1514893,-0.23061065,-0.86469940
232,1.0462517,2.3827625,1.4474438,0.54654639,4.0559555,6.1552803,-0.18020119,-0.94495712
233,0.79651175,2.3357060,1.5159171,0.48883560,3.8362064,6.1545246,-0.12837932,-1.0239822
234,0.54485793,2.2876154,1.5841896,0.43128225,3.6111698,6.1491423,-0.075197961,-1.1016773
235,0.29158761,2.2385219,1.6521868,0.37394817,3.3810679,6.1390621,-0.020713351,-1.1779473
236,0.037002453,2.1884585,1.7198339,0.31689464,3.1461340,6.1242213,0.035015015,-1.2526997
237,-0.21859208,2.1374597,1.7870560,0.26018236,2.9066118,6.1045662,0.091924512,-1.3258443
238,-0.47488730,2.0855621,1.8537780,0.20387128,2.6627555,6.0800521,0.14994950,-1.3972939
239,-0.73157189,2.0328037,1.9199250,0.14802055,2.4148292,6.0506433,0.20902144,-1.4669642
240,-0.98833249,1.9792243,1.9854222,0.092688421,2.1631063,6.0163139,0.26906905,-1.5347739
241,-1.2448543,1.9248650,2.0501954,0.037932128,1.9078694,5.9770472,0.33001839,-1.6006451
242,-1.5008216,1.8697687,2.1141706,-0.016192182,1.6494093,5.9328361,0.39179308,-1.6645031
243,-1.7559186,1.8139794,2.1772745,-0.069629544,1.3880250,5.8836832,0.45431437,-1.7262768
244,-2.0098296,1.7575427,2.2394348,-0.12232626,1.1240226,5.8296010,0.51750137,-1.7858985
245,-2.2622401,1.7005053,2.3005796,-0.17422998,0.85771537,5.7706115,0.58127116,-1.8433047
246,-2.5128370,1.6429152,2.3606385,-0.22528980,0.58942277,5.7067465,0.64553898,-1.8984353
247,-2.7613095,1.5848214,2.4195420,-0.27545631,0.31946996,5.6380477,0.71021838,-1.9512343
248,-3.0073495,1.5262740,2.4772220,-0.32468169,0.048187220,5.5645663,0.77522144,-2.0016499
249,-3.2506522,1.4673241,2.5336116,-0.37291977,-0.22409068,5.4863633,0.84045890,-2.0496342
250,-3.4909168,1.4080236,2.5886456,-0.42012612,-0.49702510,5.4035090,0.90584037,-2.0951436
251,-3.7278470,1.3484250,2.6422604,-0.46625807,-0.77027418,5.3160836,0.97127450,-2.1381387
252,-3.9611515,1.2885818,2.6943941,-0.51127481,-1.0434935,5.2241761,1.0366692,-2.1785846
253,-4.1905447,1.2285479,2.7449867,-0.55513743,-1.3163366,5.1278850,1.1019318,-2.2164504
254,-4.4157471,1.1683776,2.7939803,-0.59780898,-1.5884561,5.0273176,1.1669692,-2.2517101
255,-4.6364860,1.1081258,2.8413188,-0.63925452,-1.8595035,4.9225902,1.2316881,-2.2843416
256,-4.8524958,1.0478476,2.8869486,-0.67944113,-2.1291309,4.8138275,1.2959954,-2.3143277
257,-5.0635186,0.98759842,2.9308182,-0.71833800,-2.3969909,4.7011626,1.3597980,-2.3416553
258,-5.2693048,0.92743360,2.9728784,-0.75591644,-2.6627374,4.5847365,1.4230032,-2.3663161
259,-5.4696134,0.86740866,3.0130826,-0.79214992,-2.9260268,4.4646983,1.4855190,-2.3883059
260,-5.6642124,0.80757900,3.0513866,-0.82701407,-3.1865178,4.3412043,1.5472541,-2.4076252
261,-5.8528794,0.74799984,3.0877491,-0.86048675,-3.4438729,4.2144183,1.6081182,-2.4242788
262,-6.0354019,0.68872616,3.1221311,-0.89254802,-3.6977586,4.0845106,1.6680220,-2.4382758
263,-6.2115777,0.62981257,3.1544966,-0.92318020,-3.9478460,3.9516583,1.7268779,-2.4496297
264,-6.3812153,0.57131324,3.1848123,-0.95236784,-4.1938117,3.8160444,1.7845994,-2.4583583
265,-6.5441341,0.51328178,3.2130478,-0.98009776,-4.4353383,3.6778578,1.8411020,-2.4644834
266,-6.7001648,0.45577120,3.2391757,-1.0063590,-4.6721151,3.5372927,1.8963030,-2.4680311
267,-6.8491497,0.39883377,3.2631715,-1.0311429,-4.9038385,3.3945483,1.9501216,-2.4690316
268,-6.9909429,0.34252095,3.2850135,-1.0544429,-5.1302130,3.2498283,2.0024795,-2.4675188
269,-7.1254107,0.28688334,3.3046833,-1.0762549,-5.3509511,3.1033405,2.0533004,-2.4635307
270,-7.2524316,0.23197054,3.3221654,-1.0965769,-5.5657745,2.9552964,2.1025110,-2.4571090
271,-7.3718964,0.17783110,3.3374473,-1.1154090,-5.7744146,2.8059107,2.1500402,-2.4482990
272,-7.4837088,0.12451245,3.3505199,-1.1327536,-5.9766124,2.6554009,2.1958200,-2.4371494
273,-7.5877849,0.072060803,3.3613767,-1.1486151,-6.1721198,2.5039866,2.2397853,-2.4237125
274,-7.6840539,0.020521110,3.3700147,-1.1630001,-6.3606994,2.3518896,2.2818741,-2.4080438
275,-7.7724577,-0.030063041,3.3764337,-1.1759174,-6.5421255,2.1993327,2.3220275,-2.3902019
276,-7.8529512,-0.079649470,3.3806367,-1.1873775,-6.7161840,2.0465397,2.3601901,-2.3702484
277,-7.9255023,-0.12819747,3.3826296,-1.1973931,-6.8826733,1.8937349,2.3963098,-2.3482477
278,-7.9900917,-0.17566789,3.3824215,-1.2059789,-7.0414043,1.7411425,2.4303381,-2.3242668
279,-8.0467130,-0.22202313,3.3800243,-1.2131514,-7.1922010,1.5889860,2.4622301,-2.2983755
280,-8.0953726,-0.26722729,3.3754531,-1.2189288,-7.3349005,1.4374881,2.4919445,-2.2706456
281,-8.1360897,-0.31124611,3.3687255,-1.2233313,-7.4693539,1.2868697,2.5194440,-2.2411513
282,-8.1688959,-0.35404711,3.3598622,-1.2263806,-7.5954256,1.1373499,2.5446949,-2.2099688
283,-8.1938354,-0.39559956,3.3488868,-1.2281003,-7.7129945,0.98914553,2.5676677,-2.1771761
284,-8.2109645,-0.43587458,3.3358255,-1.2285154,-7.8219538,0.84247018,2.5883364,-2.1428528
285,-8.2203516,-0.47484510,3.3207070,-1.2276525,-7.9222107,0.69753431,2.6066795,-2.1070802
286,-8.2220769,-0.51248597,3.3035629,-1.2255396,-8.0136876,0.55454452,2.6226792,-2.0699406
287,-8.2162321,-0.54877391,3.2844272,-1.2222061,-8.0963211,0.41370320,2.6363217,-2.0315177
288,-8.2029202,-0.58368758,3.2633363,-1.2176828,-8.1700629,0.27520808,2.6475974,-1.9918961
289,-8.1822551,-0.61720760,3.2403290,-1.2120015,-8.2348791,0.13925182,2.6565007,-1.9511610
290,-8.1543614,-0.64931651,3.2154464,-1.2051955,-8.2907511,0.0060216373,2.6630300,-1.9093982
291,-8.1193741,-0.67999883,3.1887317,-1.1972989,-8.3376748,-0.12430111,2.6671878,-1.8666942
292,-8.0774378,-0.70924104,3.1602302,-1.1883468,-8.3756608,-0.25154127,2.6689805,-1.8231353
293,-8.0287070,-0.73703161,3.1299892,-1.1783753,-8.4047345,-0.37553028,2.6684186,-1.7788081
294,-7.9733452,-0.76336095,3.0980580,-1.1674215,-8.4249356,-0.49610647,2.6655162,-1.7337990
295,-7.9115245,-0.78822141,3.0644874,-1.1555229,-8.4363186,-0.61311544,2.6602917,-1.6881940
296,-7.8434254,-0.81160733,3.0293301,-1.1427180,-8.4389517,-0.72641029,2.6527671,-1.6420787
297,-7.7692362,-0.83351492,2.9926402,-1.1290457,-8.4329175,-0.83585197,2.6429679,-1.5955381
298,-7.6891527,-0.85394235,2.9544733,-1.1145454,-8.4183119,-0.94130953,2.6309237,-1.5486561
299,-7.6033772,-0.87288962,2.9148864,-1.0992571,-8.3952448,-1.0426603,2.6166673,-1.5015160
300,-7.5121189,-0.89035862,2.8739374,-1.0832210,-8.3638389,-1.1397903,2.6002351,-1.4541996
301,-7.4155924,-0.90635306,2.8316856,-1.0664775,-8.3242299,-1.2325942,2.5816670,-1.4067875
302,-7.3140180,-0.92087842,2.7881911,-1.0490674,-8.2765659,-1.3209758,2.5610060,-1.3593589
303,-7.2076208,-0.93394194,2.7435149,-1.0310315,-8.2210074,-1.4048477,2.5382983,-1.3119915
304,-7.0966302,-0.94555258,2.6977187,-1.0124105,-8.1577262,-1.4841320,2.5135931,-1.2647609
305,-6.9812795,-0.95572094,2.6508647,-0.99324527,-8.0869058,-1.5587603,2.4869426,-1.2177412
306,-6.8618051,-0.96445925,2.6030158,-0.97357642,-8.0087404,-1.6286734,2.4584017,-1.1710043
307,-6.7384463,-0.97178131,2.5542349,-0.95344440,-7.9234345,-1.6938217,2.4280278,-1.1246200
308,-6.6114447,-0.97770242,2.5045854,-0.93288938,-7.8312027,-1.7541654,2.3958811,-1.0786559
309,-6.4810433,-0.98223935,2.4541307,-0.91195119,-7.7322687,-1.8096742,2.3620237,-1.0331771
310,-6.3474865,-0.98541025,2.4029343,-0.89066924,-7.6268654,-1.8603273,2.3265203,-0.98824652
311,-6.2110192,-0.98723463,2.3510593,-0.86908249,-7.5152337,-1.9061137,2.2894374,-0.94392428
312,-6.0718864,-0.98773325,2.2985689,-0.84722932,-7.3976226,-1.9470319,2.2508434,-0.90026796
313,-5.9303327,-0.98692811,2.2455256,-0.82514755,-7.2742879,-1.9830899,2.2108083,-0.85733244
314,-5.7866017,-0.98484232,2.1919916,-0.80287431,-7.1454924,-2.0143051,2.1694037,-0.81516977
315,-5.6409356,-0.98150008,2.1380286,-0.78044600,-7.0115047,-2.0407042,2.1267028,-0.77382917
316,-5.4935747,-0.97692662,2.0836974,-0.75789830,-6.8725988,-2.0623232,2.0827795,-0.73335692
317,-5.3447567,-0.97114807,2.0290582,-0.73526600,-6.7290536,-2.0792069,2.0377091,-0.69379637
318,-5.1947166,-0.96419145,1.9741700,-0.71258306,-6.5811522,-2.0914092,1.9915675,-0.65518783
319,-5.0436859,-0.95608456,1.9190911,-0.68988252,-6.4291810,-2.0989925,1.9444316,-0.61756860
320,-4.8918922,-0.94685592,1.8638787,-0.66719644,-6.2734297,-2.1020278,1.8963783,-0.58097289
321,-4.7395590,-0.93653472,1.8085885,-0.64455590,-6.1141901,-2.1005940,1.8474852,-0.54543184
322,-4.5869051,-0.92515069,1.7532754,-0.62199093,-5.9517558,-2.0947782,1.7978300,-0.51097348
323,-4.4341442,-0.91273409,1.6979924,-0.59953049,-5.7864213,-2.0846753,1.7474901,-0.47762276
324,-4.2814844,-0.89931558,1.6427916,-0.57720245,-5.6184816,-2.0703874,1.6965430,-0.44540153
325,-4.1291282,-0.88492620,1.5877233,-0.55503355,-5.4482316,-2.0520237,1.6450658,-0.41432853
326,-3.9772717,-0.86959726,1.5328362,-0.53304937,-5.2759652,-2.0297003,1.5931348,-0.38441948
327,-3.8261047,-0.85336029,1.4781776,-0.51127433,-5.1019752,-2.0035398,1.5408260,-0.35568703
328,-3.6758100,-0.83624694,1.4237927,-0.48973166,-4.9265520,-1.9736707,1.4882142,-0.32814084
329,-3.5265634,-0.81828894,1.3697254,-0.46844338,-4.7499838,-1.9402274,1.4353733,-0.30178760
330,-3.3785334,-0.79951804,1.3160174,-0.44743030,-4.5725553,-1.9033497,1.3823762,-0.27663111
331,-3.2318806,-0.77996590,1.2627089,-0.42671201,-4.3945476,-1.8631824,1.3292942,-0.25267227
332,-3.0867581,-0.75966405,1.2098380,-0.40630686,-4.2162375,-1.8198747,1.2761974,-0.22990921
333,-2.9433108,-0.73864385,1.1574408,-0.38623197,-4.0378971,-1.7735804,1.2231541,-0.20833731
334,-2.8016753,-0.71693637,1.1055516,-0.36650326,-3.8597930,-1.7244566,1.1702311,-0.18794931
335,-2.6619801,-0.69457239,1.0542027,-0.34713540,-3.6821858,-1.6726643,1.1174931,-0.16873534
336,-2.5243449,-0.67158231,1.0034244,-0.32814184,-3.5053303,-1.6183671,1.0650031,-0.15068305
337,-2.3888810,-0.64799609,0.95324497,-0.30953482,-3.3294739,-1.5617313,1.0128217,-0.13377767
338,-2.2556910,-0.62384322,0.90369060,-0.29132540,-3.1548571,-1.5029253,0.96100769,-0.11800211
339,-2.1248686,-0.59915263,0.85478552,-0.27352345,-2.9817128,-1.4421191,0.90961722,-0.10333706
340,-1.9964991,-0.57395271,0.80655192,-0.25613766,-2.8102656,-1.3794841,0.85870423,-0.089761103
341,-1.8706586,-0.54827120,0.75900997,-0.23917560,-2.6407319,-1.3151925,0.80832018,-0.077250785
342,-1.7474146,-0.52213515,0.71217783,-0.22264369,-2.4733192,-1.2494169,0.75851394,-0.065780764
343,-1.6268259,-0.49557095,0.66607166,-0.20654727,-2.3082259,-1.1823296,0.70933181,-0.055323900
344,-1.5089426,-0.46860420,0.62070566,-0.19089060,-2.1456411,-1.1141030,0.66081735,-0.045851371
345,-1.3938062,-0.44125974,0.57609208,-0.17567689,-1.9857440,-1.0449080,0.61301142,-0.037332798
346,-1.2814497,-0.41356159,0.53224123,-0.16090835,-1.8287042,-0.97491483,0.56595209,-0.029736354
347,-1.1718976,-0.38553295,0.48916157,-0.14658618,-1.6746807,-0.90429157,0.51967457,-0.023028894
348,-1.0651663,-0.35719615,0.44685970,-0.13271065,-1.5238227,-0.83320442,0.47421126,-0.017176070
349,-0.96126418,-0.32857261,0.40534041,-0.11928111,-1.3762684,-0.76181708,0.42959163,-0.012142456
350,-0.86019162,-0.29968290,0.36460673,-0.10629601,-1.2321456,-0.69029039,0.38584228,-0.0078916741
351,-0.76194136,-0.27054663,0.32466000,-0.093753000,-1.0915713,-0.61878196,0.34298691,-0.0043865141
352,-0.66649866,-0.24118249,0.28549989,-0.081648880,-0.95465162,-0.54744582,0.30104628,-0.0015890597
353,-0.57384158,-0.21160826,0.24712449,-0.069979706,-0.82148185,-0.47643207,0.26003827,0.00053918931
354,-0.48394117,-0.18184074,0.20953032,-0.058740804,-0.69214628,-0.40588656,0.21997790,0.0020371949
355,-0.39676179,-0.15189582,0.17271246,-0.047926813,-0.56671827,-0.33595056,0.18087730,0.0029442596
356,-0.31226137,-0.12178843,0.13666455,-0.037531726,-0.44526030,-0.26676045,0.14274577,0.0032999068
357,-0.23039173,-0.091532556,0.10137891,-0.027548933,-0.32782399,-0.19844745,0.10558985,0.0031437637
358,-0.15109886,-0.061141267,0.066846586,-0.017971262,-0.21445019,-0.13113734,0.069413309,0.0025154449
359,-0.074323240,-0.030626699,0.033057407,-0.0087910169,-0.10516907,-0.064950195,0.034217238,0.0014544404
360,-2.0390783e-07,-8.5554618e-08,9.1177526e-08,-2.3980419e-08,-2.8753832e-07,-1.7929876e-07,9.4059345e-08,4.5682924e-09
