deg,XRT_AX,XRT_BX,XRT_AY,XRT_BY,SOT_AX,SOT_BX,SOT_AY,SOT_BY
valid,1,1,1,1,1,1,1,1,revB
offset,121.01021,118.47567,1985.6940,1987.1098,64.265240,61.564171,91.848829,93.240215
0,0.0000000,0.0000000,0.0000000,0.0000000,0.0000000,0.0000000,0.0000000,0.0000000
1,0.012068175,0.018727781,-0.0064479767,-0.0061185404,0.013514143,0.014676944,-0.0031402745,-0.0037674645
2,0.024018671,0.037545511,-0.012578227,-0.012011543,0.026370463,0.029043252,-0.0062270103,-0.0075749070
3,0.035836405,0.056437542,-0.018382788,-0.017673749,0.038546892,0.043091173,-0.0092598554,-0.011422992
4,0.047506270,0.075388053,-0.023854158,-0.023100291,0.050022523,0.056813713,-0.012238227,-0.015311971
5,0.059013163,0.094381084,-0.028985319,-0.028286700,0.060777655,0.070204648,-0.015161309,-0.019241674
6,0.070342007,0.11340057,-0.033769753,-0.033228919,0.070793827,0.083258532,-0.018028051,-0.023211511
7,0.081477773,0.13243038,-0.038201453,-0.037923309,0.080053855,0.095970702,-0.020837166,-0.027220463
8,0.092405509,0.15145433,-0.042274944,-0.042366662,0.088541862,0.10833728,-0.023587131,-0.031267084
9,0.10311036,0.17045625,-0.045985287,-0.046556202,0.096243306,0.12035519,-0.026276183,-0.035349497
10,0.11357759,0.18941999,-0.049328095,-0.050489588,0.10314501,0.13202212,-0.028902324,-0.039465394
11,0.12379260,0.20832948,-0.052299541,-0.054164926,0.10923517,0.14333657,-0.031463319,-0.043612038
12,0.13374098,0.22716873,-0.054896362,-0.057580758,0.11450340,0.15429781,-0.033956695,-0.047786262
13,0.14340850,0.24592190,-0.057115866,-0.060736073,0.11894072,0.16490589,-0.036379746,-0.051984472
14,0.15278113,0.26457330,-0.058955938,-0.063630298,0.12253957,0.17516164,-0.038729533,-0.056202652
15,0.16184510,0.28310745,-0.060415037,-0.066263298,0.12529385,0.18506663,-0.041002886,-0.060436367
16,0.17058687,0.30150909,-0.061492200,-0.068635371,0.12719889,0.19462319,-0.043196408,-0.064680765
17,0.17899319,0.31976324,-0.062187040,-0.070747239,0.12825146,0.20383438,-0.045306477,-0.068930589
18,0.18705111,0.33785519,-0.062499740,-0.072600044,0.12844977,0.21270398,-0.047329251,-0.073180180
19,0.19474799,0.35577058,-0.062431052,-0.074195338,0.12779349,0.22123647,-0.049260672,-0.077423484
20,0.20207154,0.37349537,-0.061982287,-0.075535070,0.12628370,0.22943700,-0.051096470,-0.081654064
21,0.20900981,0.39101592,-0.061155307,-0.076621577,0.12392289,0.23731140,-0.052832167,-0.085865109
22,0.21555123,0.40831900,-0.059952519,-0.077457567,0.12071496,0.24486612,-0.054463087,-0.090049441
23,0.22168463,0.42539180,-0.058376856,-0.078046110,0.11666522,0.25210822,-0.055984356,-0.094199529
24,0.22739923,0.44222196,-0.056431773,-0.078390615,0.11178030,0.25904537,-0.057390915,-0.098307504
25,0.23268469,0.45879763,-0.054121226,-0.078494819,0.10606819,0.26568578,-0.058677522,-0.10236516
26,0.23753110,0.47510744,-0.051449656,-0.078362764,0.099538204,0.27203818,-0.059838760,-0.10636400
27,0.24192900,0.49114054,-0.048421975,-0.077998784,0.092200910,0.27811183,-0.060869047,-0.11029519
28,0.24586940,0.50688664,-0.045043547,-0.077407476,0.084068141,0.28391645,-0.061762644,-0.11414965
29,0.24934379,0.52233599,-0.041320164,-0.076593685,0.075152940,0.28946217,-0.062513660,-0.11791800
30,0.25234415,0.53747944,-0.037258028,-0.075562481,0.065469522,0.29475957,-0.063116067,-0.12159062
31,0.25486297,0.55230841,-0.032863729,-0.074319135,0.055033235,0.29981955,-0.063563703,-0.12515767
32,0.25689324,0.56681493,-0.028144219,-0.072869094,0.043860519,0.30465338,-0.063850287,-0.12860906
33,0.25842846,0.58099166,-0.023106788,-0.071217959,0.031968858,0.30927262,-0.063969425,-0.13193454
34,0.25946270,0.59483188,-0.017759041,-0.069371459,0.019376731,0.31368907,-0.063914625,-0.13512365
35,0.25999052,0.60832948,-0.012108869,-0.067335425,0.0061035658,0.31791478,-0.063679302,-0.13816578
36,0.26000705,0.62147903,-0.0061644231,-0.065115765,-0.0078303131,0.32196197,-0.063256794,-0.14105018
37,0.25950796,0.63427571,6.5913519e-05,-0.062718440,-0.022403740,0.32584301,-0.062640372,-0.14376598
38,0.25848948,0.64671538,0.0065735541,-0.060149432,-0.037594759,0.32957039,-0.061823248,-0.14630221
39,0.25694838,0.65879451,0.013349737,-0.057414721,-0.053380684,0.33315664,-0.060798595,-0.14864783
40,0.25488202,0.67051026,0.020385555,-0.054520260,-0.069738153,0.33661436,-0.059559548,-0.15079172
41,0.25228828,0.68186042,0.027671985,-0.051471946,-0.086643189,0.33995611,-0.058099228,-0.15272275
42,0.24916564,0.69284341,0.035199918,-0.048275594,-0.10407126,0.34319442,-0.056410744,-0.15442976
43,0.24551311,0.70345831,0.042960188,-0.044936909,-0.12199732,0.34634173,-0.054487214,-0.15590161
44,0.24133030,0.71370481,0.050943604,-0.041461465,-0.14039592,0.34941037,-0.052321772,-0.15712717
45,0.23661734,0.72358325,0.059140979,-0.037854674,-0.15924120,0.35241250,-0.049907584,-0.15809539
46,0.23137493,0.73309454,0.067543158,-0.034121765,-0.17850702,0.35536007,-0.047237861,-0.15879527
47,0.22560434,0.74224023,0.076141051,-0.030267757,-0.19816695,0.35826482,-0.044305869,-0.15921592
48,0.21930737,0.75102243,0.084925661,-0.026297436,-0.21819441,0.36113820,-0.041104947,-0.15934657
49,0.21248637,0.75944382,0.093888111,-0.022215332,-0.23856266,0.36399137,-0.037628516,-0.15917657
50,0.20514422,0.76750765,0.10301967,-0.018025696,-0.25924491,0.36683516,-0.033870094,-0.15869546
51,0.19728436,0.77521768,0.11231180,-0.013732479,-0.28021436,0.36968001,-0.029823310,-0.15789294
52,0.18891070,0.78257822,0.12175615,-0.0093393129,-0.30144424,0.37253596,-0.025481916,-0.15675894
53,0.18002773,0.78959404,0.13134461,-0.0048494873,-0.32290792,0.37541264,-0.020839800,-0.15528358
54,0.17064039,0.79627041,0.14106931,-0.00026593510,-0.34457893,0.37831919,-0.015890999,-0.15345728
55,0.16075415,0.80261303,0.15092269,0.0044087867,-0.36643102,0.38126427,-0.010629715,-0.15127066
56,0.15037496,0.80862804,0.16089746,0.0091725124,-0.38843823,0.38425603,-0.0050503211,-0.14871469
57,0.13950924,0.81432196,0.17098670,0.014023483,-0.41057492,0.38730209,0.00085261835,-0.14578061
58,0.12816388,0.81970172,0.18118379,0.018960357,-0.43281586,0.39040947,0.0070843402,-0.14245999
59,0.11634622,0.82477455,0.19148250,0.023982227,-0.45513624,0.39358463,0.013649868,-0.13874475
60,0.10406404,0.82954805,0.20187700,0.029088624,-0.47751174,0.39683343,0.020554002,-0.13462718
61,0.091325535,0.83403006,0.21236184,0.034279533,-0.49991860,0.40016109,0.027801303,-0.13009992
62,0.078139336,0.83822872,0.22293201,0.039555394,-0.52233360,0.40357219,0.035396086,-0.12515605
63,0.064514456,0.84215237,0.23358290,0.044917112,-0.54473417,0.40707066,0.043342406,-0.11978901
64,0.050460299,0.84580958,0.24431040,0.050366060,-0.56709840,0.41065977,0.051644049,-0.11399271
65,0.035986636,0.84920907,0.25511081,0.055904080,-0.58940507,0.41434208,0.060304516,-0.10776147
66,0.021103595,0.85235969,0.26598091,0.061533487,-0.61163373,0.41811951,0.069327020,-0.10109010
67,0.0058216427,0.85527042,0.27691798,0.067257065,-0.63376467,0.42199324,0.078714472,-0.093973841
68,-0.0098484317,0.85795031,0.28791976,0.073078067,-0.65577899,0.42596377,0.088469471,-0.086408435
69,-0.025895530,0.86040843,0.29898448,0.079000208,-0.67765862,0.43003090,0.098594298,-0.078390110
70,-0.042308263,0.86265390,0.31011085,0.085027663,-0.69938636,0.43419372,0.10909090,-0.069915596
71,-0.059074965,0.86469579,0.32129810,0.091165056,-0.72094588,0.43845062,0.11996090,-0.060982136
72,-0.076183713,0.86654314,0.33254592,0.097417450,-0.74232174,0.44279929,0.13120556,-0.051587490
73,-0.093622340,0.86820489,0.34385451,0.10379034,-0.76349944,0.44723671,0.14282579,-0.041729947
74,-0.11137845,0.86968990,0.35522455,0.11028964,-0.78446539,0.45175919,0.15482216,-0.031408332
75,-0.12943945,0.87100685,0.36665719,0.11692166,-0.80520694,0.45636235,0.16719486,-0.020622008
76,-0.14779254,0.87216428,0.37815405,0.12369310,-0.82571241,0.46104116,0.17994370,-0.0093708844
77,-0.16642474,0.87317051,0.38971722,0.13061104,-0.84597106,0.46578991,0.19306813,0.0023445813
78,-0.18532294,0.87403366,0.40134925,0.13768289,-0.86597312,0.47060224,0.20656721,0.014523378
79,-0.20447384,0.87476158,0.41305311,0.14491640,-0.88570978,0.47547121,0.22043962,0.027163943
80,-0.22386406,0.87536183,0.42483219,0.15231964,-0.90517318,0.48038923,0.23468364,0.040264155
81,-0.24348008,0.87584168,0.43669032,0.15990095,-0.92435640,0.48534813,0.24929717,0.053821340
82,-0.26330829,0.87620808,0.44863170,0.16766892,-0.94325348,0.49033919,0.26427770,0.067832268
83,-0.28333500,0.87646760,0.46066088,0.17563239,-0.96185940,0.49535313,0.27962233,0.082293159
84,-0.30354647,0.87662647,0.47278281,0.18380041,-0.98017003,0.50038017,0.29532777,0.097199680
85,-0.32392889,0.87669050,0.48500273,0.19218219,-0.99818217,0.50541001,0.31139031,0.11254696
86,-0.34446844,0.87666509,0.49732620,0.20078711,-1.0158935,0.51043190,0.32780586,0.12832957
87,-0.36515125,0.87655523,0.50975906,0.20962464,-1.0333025,0.51543467,0.34456992,0.14454156
88,-0.38596348,0.87636545,0.52230741,0.21870437,-1.0504085,0.52040672,0.36167759,0.16117644
89,-0.40689127,0.87609980,0.53497759,0.22803591,-1.0672119,0.52533607,0.37912357,0.17822722
90,-0.42792081,0.87576188,0.54777611,0.23762891,-1.0837134,0.53021043,0.39690218,0.19568637
91,-0.44903830,0.87535480,0.56070967,0.24749301,-1.0999148,0.53501717,0.41500734,0.21354587
92,-0.47023000,0.87488116,0.57378512,0.25763780,-1.1158186,0.53974339,0.43343256,0.23179720
93,-0.49148224,0.87434306,0.58700942,0.26807278,-1.1314279,0.54437596,0.45217100,0.25043136
94,-0.51278142,0.87374208,0.60038959,0.27880734,-1.1467464,0.54890154,0.47121541,0.26943888
95,-0.53411402,0.87307930,0.61393271,0.28985071,-1.1617786,0.55330662,0.49055818,0.28880982
96,-0.55546661,0.87235525,0.62764589,0.30121195,-1.1765294,0.55757755,0.51019132,0.30853379
97,-0.57682589,0.87156996,0.64153620,0.31289987,-1.1910044,0.56170060,0.53010649,0.32859999
98,-0.59817866,0.87072292,0.65561065,0.32492304,-1.2052094,0.56566198,0.55029497,0.34899718
99,-0.61951186,0.86981311,0.66987620,0.33728974,-1.2191509,0.56944787,0.57074772,0.36971373
100,-0.64081254,0.86883897,0.68433966,0.35000789,-1.2328359,0.57304449,0.59145531,0.39073759
101,-0.66206794,0.86779843,0.69900770,0.36308507,-1.2462715,0.57643808,0.61240803,0.41205639
102,-0.68326541,0.86668893,0.71388678,0.37652845,-1.2594652,0.57961502,0.63359580,0.43365736
103,-0.70439250,0.86550739,0.72898316,0.39034476,-1.2724248,0.58256178,0.65500824,0.45552741
104,-0.72543690,0.86425023,0.74430284,0.40454028,-1.2851585,0.58526502,0.67663468,0.47765313
105,-0.74638650,0.86291342,0.75985152,0.41912075,-1.2976743,0.58771161,0.69846412,0.50002079
106,-0.76722936,0.86149243,0.77563458,0.43409143,-1.3099807,0.58988865,0.72048529,0.52261641
107,-0.78795375,0.85998230,0.79165705,0.44945696,-1.3220861,0.59178352,0.74268664,0.54542570
108,-0.80854810,0.85837761,0.80792356,0.46522143,-1.3339989,0.59338392,0.76505637,0.56843415
109,-0.82900107,0.85667254,0.82443834,0.48138827,-1.3457276,0.59467789,0.78758241,0.59162703
110,-0.84930153,0.85486087,0.84120513,0.49796027,-1.3572807,0.59565385,0.81025246,0.61498939
111,-0.86943855,0.85293598,0.85822725,0.51493955,-1.3686665,0.59630064,0.83305397,0.63850608
112,-0.88940140,0.85089091,0.87550745,0.53232752,-1.3798931,0.59660754,0.85597420,0.66216180
113,-0.90917960,0.84871835,0.89304799,0.55012485,-1.3909687,0.59656430,0.87900020,0.68594110
114,-0.92876286,0.84641069,0.91085055,0.56833148,-1.4019010,0.59616117,0.90211884,0.70982839
115,-0.94814115,0.84396001,0.92891621,0.58694655,-1.4126975,0.59538896,0.92531678,0.73380798
116,-0.96730464,0.84135815,0.94724546,0.60596842,-1.4233655,0.59423900,0.94858056,0.75786410
117,-0.98624374,0.83859670,0.96583814,0.62539467,-1.4339120,0.59270322,0.97189655,0.78198089
118,-1.0049491,0.83566705,0.98469345,0.64522200,-1.4443433,0.59077416,0.99525100,0.80614246
119,-1.0234116,0.83256042,1.0038099,0.66544632,-1.4546656,0.58844498,1.0186300,0.83033288
120,-1.0416223,0.82926787,1.0231853,0.68606266,-1.4648847,0.58570949,1.0420196,0.85453622
121,-1.0595725,0.82578033,1.0428169,0.70706521,-1.4750057,0.58256216,1.0654057,0.87873657
122,-1.0772540,0.82208867,1.0627009,0.72844728,-1.4850334,0.57899816,1.0887742,0.90291801
123,-1.0946584,0.81818367,1.0828330,0.75020130,-1.4949718,0.57501334,1.1121109,0.92706472
124,-1.1117779,0.81405612,1.1032083,0.77231884,-1.5048247,0.57060426,1.1354015,0.95116091
125,-1.1286046,0.80969679,1.1238207,0.79479056,-1.5145950,0.56576822,1.1586317,0.97519088
126,-1.1451313,0.80509649,1.1446638,0.81760628,-1.5242853,0.56050324,1.1817873,0.99913906
127,-1.1613506,0.80024611,1.1657302,0.84075491,-1.5338974,0.55480809,1.2048539,1.0229900
128,-1.1772555,0.79513664,1.1870117,0.86422450,-1.5434324,0.54868226,1.2278173,1.0467283
129,-1.1928393,0.78975921,1.2084995,0.88800224,-1.5528910,0.54212601,1.2506631,1.0703388
130,-1.2080954,0.78410510,1.2301839,0.91207444,-1.5622731,0.53514035,1.2733773,1.0938066
131,-1.2230176,0.77816580,1.2520544,0.93642658,-1.5715780,0.52772703,1.2959457,1.1171167
132,-1.2375999,0.77193305,1.2740998,0.96104332,-1.5808041,0.51988856,1.3183541,1.1402546
133,-1.2518363,0.76539880,1.2963083,0.98590849,-1.5899495,0.51162818,1.3405886,1.1632060
134,-1.2657214,0.75855535,1.3186672,1.0110051,-1.5990115,0.50294989,1.3626353,1.1859565
135,-1.2792497,0.75139527,1.3411630,1.0363154,-1.6079865,0.49385840,1.3844805,1.2084923
136,-1.2924162,0.74391153,1.3637815,1.0618209,-1.6168705,0.48435915,1.4061106,1.2307997
137,-1.3052159,0.73609743,1.3865081,1.0875023,-1.6256588,0.47445828,1.4275119,1.2528653
138,-1.3176442,0.72794672,1.4093271,1.1133398,-1.6343460,0.46416263,1.4486713,1.2746760
139,-1.3296967,0.71945356,1.4322224,1.1393125,-1.6429261,0.45347974,1.4695755,1.2962190
140,-1.3413691,0.71061257,1.4551772,1.1653994,-1.6513925,0.44241779,1.4902115,1.3174817
141,-1.3526574,0.70141886,1.4781741,1.1915783,-1.6597379,0.43098560,1.5105667,1.3384519
142,-1.3635580,0.69186806,1.5011949,1.2178269,-1.6679545,0.41919264,1.5306283,1.3591177
143,-1.3740672,0.68195630,1.5242212,1.2441221,-1.6760339,0.40704898,1.5503842,1.3794676
144,-1.3841818,0.67168028,1.5472337,1.2704404,-1.6839673,0.39456523,1.5698220,1.3994903
145,-1.3938986,0.66103727,1.5702129,1.2967575,-1.6917452,0.38175262,1.5889301,1.4191749
146,-1.4032149,0.65002513,1.5931387,1.3230492,-1.6993578,0.36862285,1.6076967,1.4385109
147,-1.4121279,0.63864232,1.6159904,1.3492904,-1.7067945,0.35518816,1.6261106,1.4574881
148,-1.4206352,0.62688792,1.6387471,1.3754560,-1.7140448,0.34146124,1.6441605,1.4760967
149,-1.4287347,0.61476165,1.6613875,1.4015204,-1.7210974,0.32745525,1.6618359,1.4943272
150,-1.4364244,0.60226387,1.6838900,1.4274577,-1.7279409,0.31318374,1.6791261,1.5121706
151,-1.4437025,0.58939561,1.7062326,1.4532418,-1.7345634,0.29866064,1.6960209,1.5296180
152,-1.4505674,0.57615854,1.7283930,1.4788467,-1.7409528,0.28390024,1.7125105,1.5466613
153,-1.4570179,0.56255504,1.7503489,1.5042457,-1.7470968,0.26891715,1.7285854,1.5632924
154,-1.4630529,0.54858814,1.7720777,1.5294126,-1.7529830,0.25372624,1.7442363,1.5795037
155,-1.4686715,0.53426155,1.7935566,1.5543209,-1.7585986,0.23834264,1.7594542,1.5952881
156,-1.4738731,0.51957968,1.8147629,1.5789440,-1.7639309,0.22278169,1.7742307,1.6106386
157,-1.4786572,0.50454762,1.8356738,1.6032555,-1.7689671,0.20705890,1.7885576,1.6255489
158,-1.4830237,0.48917114,1.8562663,1.6272291,-1.7736943,0.19118993,1.8024269,1.6400129
159,-1.4869726,0.47345668,1.8765178,1.6508388,-1.7780997,0.17519053,1.8158313,1.6540248
160,-1.4905041,0.45741136,1.8964055,1.6740584,-1.7821707,0.15907651,1.8287635,1.6675793
161,-1.4936187,0.44104298,1.9159069,1.6968625,-1.7858945,0.14286374,1.8412169,1.6806716
162,-1.4963172,0.42435997,1.9349996,1.7192255,-1.7892588,0.12656805,1.8531850,1.6932969
163,-1.4986004,0.40737143,1.9536616,1.7411226,-1.7922513,0.11020524,1.8646618,1.7054510
164,-1.5004696,0.39008709,1.9718710,1.7625290,-1.7948601,0.093791041,1.8756418,1.7171302
165,-1.5019261,0.37251728,1.9896063,1.7834206,-1.7970735,0.077341058,1.8861196,1.7283309
166,-1.5029717,0.35467297,2.0068463,1.8037738,-1.7988803,0.060870752,1.8960903,1.7390498
167,-1.5036080,0.33656568,2.0235703,1.8235654,-1.8002696,0.044395399,1.9055496,1.7492843
168,-1.5038374,0.31820754,2.0397580,1.8427730,-1.8012308,0.027930057,1.9144933,1.7590318
169,-1.5036620,0.29961120,2.0553897,1.8613746,-1.8017541,0.011489536,1.9229178,1.7682902
170,-1.5030846,0.28078985,2.0704460,1.8793491,-1.8018300,-0.0049116390,1.9308196,1.7770577
171,-1.5021078,0.26175717,2.0849085,1.8966759,-1.8014497,-0.021259254,1.9381959,1.7853327
172,-1.5007347,0.24252733,2.0987589,1.9133353,-1.8006048,-0.037539442,1.9450441,1.7931142
173,-1.4989688,0.22311496,2.1119800,1.9293084,-1.7992879,-0.053738707,1.9513621,1.8004013
174,-1.4968133,0.20353510,2.1245551,1.9445771,-1.7974920,-0.069843956,1.9571482,1.8071933
175,-1.4942723,0.18380320,2.1364683,1.9591242,-1.7952109,-0.085842522,1.9624008,1.8134901
176,-1.4913496,0.16393507,2.1477044,1.9729334,-1.7924392,-0.10172219,1.9671191,1.8192916
177,-1.4880496,0.14394688,2.1582490,1.9859892,-1.7891723,-0.11747124,1.9713023,1.8245982
178,-1.4843767,0.12385508,2.1680887,1.9982774,-1.7854062,-0.13307841,1.9749503,1.8294104
179,-1.4803356,0.10367640,2.1772108,2.0097844,-1.7811382,-0.14853301,1.9780631,1.8337291
180,-1.4759315,0.083427828,2.1856036,2.0204980,-1.7763660,-0.16382486,1.9806412,1.8375554
181,-1.4711694,0.063126546,2.1932562,2.0304068,-1.7710884,-0.17894435,1.9826856,1.8408906
182,-1.4660549,0.042789912,2.2001587,2.0395005,-1.7653052,-0.19388244,1.9841973,1.8437363
183,-1.4605936,0.022435427,2.2063023,2.0477700,-1.7590170,-0.20863067,1.9851780,1.8460944
184,-1.4547916,0.0020806923,2.2116791,2.0552073,-1.7522254,-0.22318121,1.9856296,1.8479670
185,-1.4486549,-0.018256622,2.2162820,2.0618053,-1.7449329,-0.23752682,1.9855543,1.8493563
186,-1.4421901,-0.038558812,2.2201054,2.0675585,-1.7371431,-0.25166089,1.9849548,1.8502648
187,-1.4354038,-0.058808180,2.2231442,2.0724620,-1.7288605,-0.26557744,1.9838340,1.8506952
188,-1.4283028,-0.078987066,2.2253948,2.0765125,-1.7200905,-0.27927113,1.9821951,1.8506505
189,-1.4208942,-0.099077886,2.2268544,2.0797077,-1.7108397,-0.29273725,1.9800418,1.8501338
190,-1.4131855,-0.11906317,2.2275214,2.0820464,-1.7011155,-0.30597175,1.9773779,1.8491484
191,-1.4051840,-0.13892559,2.2273953,2.0835287,-1.6909264,-0.31897120,1.9742076,1.8476976
192,-1.3968978,-0.15864801,2.2264764,2.0841558,-1.6802818,-0.33173283,1.9705355,1.8457853
193,-1.3883346,-0.17821349,2.2247665,2.0839301,-1.6691922,-0.34425450,1.9663664,1.8434152
194,-1.3795027,-0.19760538,2.2222681,2.0828551,-1.6576689,-0.35653469,1.9617053,1.8405912
195,-1.3704105,-0.21680729,2.2189851,2.0809355,-1.6457242,-0.36857251,1.9565577,1.8373176
196,-1.3610665,-0.23580314,2.2149223,2.0781772,-1.6333713,-0.38036770,1.9509291,1.8335987
197,-1.3514797,-0.25457722,2.2100854,2.0745872,-1.6206245,-0.39192059,1.9448255,1.8294388
198,-1.3416589,-0.27311420,2.2044815,2.0701735,-1.6074987,-0.40323210,1.9382530,1.8248426
199,-1.3316132,-0.29139917,2.1981185,2.0649453,-1.5940098,-0.41430373,1.9312181,1.8198148
200,-1.3213521,-0.30941764,2.1910055,2.0589129,-1.5801745,-0.42513756,1.9237274,1.8143602
201,-1.3108849,-0.32715562,2.1831522,2.0520876,-1.5660104,-0.43573619,1.9157878,1.8084839
202,-1.3002214,-0.34459960,2.1745698,2.0444817,-1.5515357,-0.44610276,1.9074064,1.8021910
203,-1.2893712,-0.36173661,2.1652702,2.0361087,-1.5367695,-0.45624091,1.8985906,1.7954866
204,-1.2783444,-0.37855421,2.1552662,2.0269828,-1.5217315,-0.46615476,1.8893478,1.7883761
205,-1.2671510,-0.39504057,2.1445716,2.0171193,-1.5064419,-0.47584891,1.8796858,1.7808651
206,-1.2558011,-0.41118441,2.1332010,2.0065344,-1.4909218,-0.48532837,1.8696125,1.7729590
207,-1.2443050,-0.42697511,2.1211701,1.9952451,-1.4751928,-0.49459859,1.8591361,1.7646637
208,-1.2326731,-0.44240265,2.1084950,1.9832695,-1.4592768,-0.50366538,1.8482648,1.7559848
209,-1.2209158,-0.45745768,2.0951929,1.9706261,-1.4431965,-0.51253493,1.8370070,1.7469283
210,-1.2090438,-0.47213153,2.0812817,1.9573345,-1.4269746,-0.52121373,1.8253714,1.7375002
211,-1.1970675,-0.48641620,2.0667800,1.9434148,-1.4106347,-0.52970859,1.8133666,1.7277065
212,-1.1849977,-0.50030437,2.0517071,1.9288881,-1.3942002,-0.53802658,1.8010017,1.7175536
213,-1.1728450,-0.51378946,2.0360828,1.9137757,-1.3776951,-0.54617501,1.7882856,1.7070477
214,-1.1606202,-0.52686558,2.0199276,1.8980999,-1.3611435,-0.55416140,1.7752274,1.6961952
215,-1.1483340,-0.53952758,2.0032627,1.8818833,-1.3445696,-0.56199343,1.7618365,1.6850026
216,-1.1359971,-0.55177101,1.9861095,1.8651491,-1.3279978,-0.56967895,1.7481221,1.6734765
217,-1.1236202,-0.56359218,1.9684902,1.8479209,-1.3114524,-0.57722587,1.7340938,1.6616236
218,-1.1112142,-0.57498813,1.9504271,1.8302228,-1.2949579,-0.58464223,1.7197611,1.6494506
219,-1.0987895,-0.58595661,1.9319432,1.8120792,-1.2785385,-0.59193607,1.7051337,1.6369645
220,-1.0863568,-0.59649613,1.9130616,1.7935149,-1.2622183,-0.59911545,1.6902211,1.6241722
221,-1.0739266,-0.60660590,1.8938057,1.7745547,-1.2460212,-0.60618842,1.6750333,1.6110807
222,-1.0615095,-0.61628586,1.8741993,1.7552240,-1.2299710,-0.61316296,1.6595801,1.5976973
223,-1.0491156,-0.62553668,1.8542662,1.7355481,-1.2140910,-0.62004696,1.6438713,1.5840291
224,-1.0367554,-0.63435972,1.8340304,1.7155524,-1.1984042,-0.62684818,1.6279169,1.5700834
225,-1.0244388,-0.64275704,1.8135161,1.6952625,-1.1829330,-0.63357423,1.6117268,1.5558678
226,-1.0121759,-0.65073136,1.7927474,1.6747040,-1.1676996,-0.64023255,1.5953111,1.5413897
227,-0.99997638,-0.65828610,1.7717485,1.6539024,-1.1527254,-0.64683034,1.5786797,1.5266566
228,-0.98785001,-0.66542531,1.7505435,1.6328831,-1.1380314,-0.65337457,1.5618427,1.5116764
229,-0.97580618,-0.67215367,1.7291563,1.6116713,-1.1236377,-0.65987190,1.5448102,1.4964567
230,-0.96385415,-0.67847650,1.7076110,1.5902923,-1.1095639,-0.66632874,1.5275920,1.4810055
231,-0.95200295,-0.68439967,1.6859310,1.5687710,-1.0958287,-0.67275111,1.5101984,1.4653306
232,-0.94026139,-0.68992968,1.6641400,1.5471319,-1.0824502,-0.67914472,1.4926392,1.4494401
233,-0.92863803,-0.69507352,1.6422609,1.5253993,-1.0694452,-0.68551486,1.4749245,1.4333422
234,-0.91714118,-0.69983874,1.6203167,1.5035972,-1.0568301,-0.69186642,1.4570643,1.4170450
235,-0.90577886,-0.70423337,1.5983299,1.4817491,-1.0446200,-0.69820388,1.4390685,1.4005568
236,-0.89455882,-0.70826593,1.5763224,1.4598782,-1.0328291,-0.70453125,1.4209469,1.3838860
237,-0.88348850,-0.71194535,1.5543159,1.4380069,-1.0214707,-0.71085207,1.4027094,1.3670410
238,-0.87257505,-0.71528101,1.5323314,1.4161575,-1.0105568,-0.71716940,1.3843658,1.3500304
239,-0.86182527,-0.71828265,1.5103897,1.3943513,-1.0000985,-0.72348576,1.3659259,1.3328628
240,-0.85124566,-0.72096036,1.4885107,1.3726094,-0.99010555,-0.72980320,1.3473993,1.3155467
241,-0.84084233,-0.72332457,1.4667139,1.3509520,-0.98058670,-0.73612319,1.3287956,1.2980911
242,-0.83062106,-0.72538597,1.4450180,1.3293987,-0.97154945,-0.74244667,1.3101243,1.2805046
243,-0.82058725,-0.72715553,1.4234411,1.3079684,-0.96300008,-0.74877402,1.2913948,1.2627961
244,-0.81074594,-0.72864442,1.4020009,1.2866794,-0.95494361,-0.75510506,1.2726166,1.2449746
245,-0.80110177,-0.72986401,1.3807139,1.2655492,-0.94738383,-0.76143903,1.2537989,1.2270491
246,-0.79165897,-0.73082582,1.3595962,1.2445943,-0.94032324,-0.76777460,1.2349508,1.2090285
247,-0.78242138,-0.73154148,1.3386630,1.2238307,-0.93376306,-0.77410983,1.2160814,1.1909220
248,-0.77339244,-0.73202271,1.3179287,1.2032735,-0.92770322,-0.78044224,1.1971996,1.1727387
249,-0.76457514,-0.73228128,1.2974069,1.1829368,-0.92214234,-0.78676873,1.1783144,1.1544878
250,-0.75597208,-0.73232898,1.2771106,1.1628341,-0.91707775,-0.79308566,1.1594343,1.1361785
251,-0.74758539,-0.73217755,1.2570515,1.1429780,-0.91250549,-0.79938877,1.1405681,1.1178199
252,-0.73941679,-0.73183871,1.2372408,1.1233800,-0.90842027,-0.80567327,1.1217242,1.0994214
253,-0.73146756,-0.73132406,1.2176888,1.1040509,-0.90481556,-0.81193379,1.1029109,1.0809921
254,-0.72373853,-0.73064511,1.1984049,1.0850006,-0.90168353,-0.81816441,1.0841364,1.0625414
255,-0.71623008,-0.72981319,1.1793974,1.0662380,-0.89901509,-0.82435868,1.0654088,1.0440785
256,-0.70894216,-0.72883944,1.1606741,1.0477714,-0.89679990,-0.83050961,1.0467361,1.0256128
257,-0.70187424,-0.72773479,1.1422416,1.0296077,-0.89502643,-0.83660970,1.0281260,1.0071533
258,-0.69502538,-0.72650992,1.1241057,1.0117534,-0.89368192,-0.84265097,1.0095860,0.98870941
259,-0.68839417,-0.72517523,1.1062715,0.99421371,-0.89275246,-0.84862495,0.99112381,0.97029028
260,-0.68197876,-0.72374080,1.0887429,0.97699325,-0.89222299,-0.85452272,0.97274658,0.95190507
261,-0.67577684,-0.72221637,1.0715232,0.96009560,-0.89207734,-0.86033492,0.95446148,0.93356288
262,-0.66978569,-0.72061132,1.0546147,0.94352351,-0.89229830,-0.86605178,0.93627549,0.91527279
263,-0.66400213,-0.71893466,1.0380189,0.92727887,-0.89286761,-0.87166314,0.91819543,0.89704379
264,-0.65842257,-0.71719493,1.0217364,0.91136273,-0.89376600,-0.87715849,0.90022791,0.87888479
265,-0.65304297,-0.71540029,1.0057671,0.89577530,-0.89497330,-0.88252697,0.88237940,0.86080464
266,-0.64785888,-0.71355840,0.99010989,0.88051601,-0.89646843,-0.88775741,0.86465616,0.84281208
267,-0.64286546,-0.71167644,0.97476305,0.86558346,-0.89822945,-0.89283838,0.84706430,0.82491577
268,-0.63805744,-0.70976112,0.95972402,0.85097552,-0.90023363,-0.89775819,0.82960971,0.80712424
269,-0.63342918,-0.70781859,0.94498953,0.83668928,-0.90245753,-0.90250493,0.81229812,0.78944590
270,-0.62897463,-0.70585449,0.93055554,0.82272116,-0.90487699,-0.90706651,0.79513504,0.77188903
271,-0.62468739,-0.70387391,0.91641736,0.80906683,-0.90746724,-0.91143071,0.77812582,0.75446179
272,-0.62056070,-0.70188136,0.90256961,0.79572132,-0.91020296,-0.91558516,0.76127559,0.73717216
273,-0.61658744,-0.69988081,0.88900628,0.78267905,-0.91305831,-0.91951741,0.74458929,0.72002796
274,-0.61276016,-0.69787561,0.87572075,0.76993378,-0.91600702,-0.92321499,0.72807166,0.70303687
275,-0.60907110,-0.69586854,0.86270581,0.75747873,-0.91902244,-0.92666540,0.71172723,0.68620636
276,-0.60551217,-0.69386179,0.84995374,0.74530659,-0.92207763,-0.92985614,0.69556034,0.66954370
277,-0.60207501,-0.69185694,0.83745629,0.73340950,-0.92514539,-0.93277482,0.67957511,0.65305600
278,-0.59875098,-0.68985497,0.82520473,0.72177916,-0.92819835,-0.93540909,0.66377547,0.63675012
279,-0.59553118,-0.68785625,0.81318990,0.71040683,-0.93120904,-0.93774676,0.64816512,0.62063271
280,-0.59240648,-0.68586057,0.80140224,0.69928336,-0.93414997,-0.93977581,0.63274756,0.60471021
281,-0.58936751,-0.68386710,0.78983183,0.68839922,-0.93699365,-0.94148440,0.61752610,0.58898878
282,-0.58640471,-0.68187444,0.77846843,0.67774459,-0.93971273,-0.94286094,0.60250380,0.57347438
283,-0.58350833,-0.67988057,0.76730148,0.66730932,-0.94228001,-0.94389413,0.58768355,0.55817267
284,-0.58066846,-0.67788293,0.75632022,0.65708303,-0.94466854,-0.94457293,0.57306798,0.54308906
285,-0.57787503,-0.67587836,0.74551365,0.64705512,-0.94685169,-0.94488669,0.55865955,0.52822870
286,-0.57511785,-0.67386317,0.73487062,0.63721481,-0.94880320,-0.94482510,0.54446049,0.51359644
287,-0.57238665,-0.67183310,0.72437983,0.62755119,-0.95049727,-0.94437828,0.53047281,0.49919684
288,-0.56967104,-0.66978338,0.71402991,0.61805325,-0.95190860,-0.94353677,0.51669832,0.48503418
289,-0.56696058,-0.66770874,0.70380943,0.60870989,-0.95301248,-0.94229159,0.50313861,0.47111241
290,-0.56424481,-0.66560338,0.69370696,0.59951002,-0.95378486,-0.94063426,0.48979506,0.45743520
291,-0.56151323,-0.66346107,0.68371110,0.59044254,-0.95420238,-0.93855682,0.47666884,0.44400587
292,-0.55875534,-0.66127510,0.67381050,0.58149641,-0.95424246,-0.93605186,0.46376091,0.43082745
293,-0.55596068,-0.65903833,0.66399393,0.57266067,-0.95388336,-0.93311258,0.45107204,0.41790263
294,-0.55311884,-0.65674322,0.65425029,0.56392445,-0.95310422,-0.92973275,0.43860275,0.40523375
295,-0.55021945,-0.65438186,0.64456869,0.55527709,-0.95188513,-0.92590680,0.42635340,0.39282286
296,-0.54725228,-0.65194596,0.63493843,0.54670806,-0.95020719,-0.92162978,0.41432412,0.38067162
297,-0.54420717,-0.64942692,0.62534905,0.53820708,-0.94805253,-0.91689743,0.40251486,0.36878139
298,-0.54107413,-0.64681583,0.61579039,0.52976410,-0.94540440,-0.91170620,0.39092534,0.35715317
299,-0.53784329,-0.64410352,0.60625262,0.52136937,-0.94224721,-0.90605320,0.37955512,0.34578760
300,-0.53450501,-0.64128056,0.59672624,0.51301343,-0.93856655,-0.89993630,0.36840354,0.33468500
301,-0.53104981,-0.63833733,0.58720212,0.50468717,-0.93434923,-0.89335410,0.35746977,0.32384533
302,-0.52746845,-0.63526402,0.57767155,0.49638182,-0.92958337,-0.88630594,0.34675277,0.31326820
303,-0.52375194,-0.63205067,0.56812626,0.48808903,-0.92425838,-0.87879192,0.33625136,0.30295289
304,-0.51989154,-0.62868721,0.55855844,0.47980082,-0.91836500,-0.87081291,0.32596413,0.29289832
305,-0.51587880,-0.62516349,0.54896074,0.47150968,-0.91189537,-0.86237055,0.31588952,0.28310308
306,-0.51170558,-0.62146930,0.53932635,0.46320852,-0.90484301,-0.85346725,0.30602581,0.27356541
307,-0.50736406,-0.61759443,0.52964897,0.45489075,-0.89720286,-0.84410621,0.29637110,0.26428322
308,-0.50284676,-0.61352868,0.51992286,0.44655024,-0.88897131,-0.83429139,0.28692332,0.25525410
309,-0.49814656,-0.60926190,0.51014283,0.43818138,-0.88014620,-0.82402756,0.27768026,0.24647530
310,-0.49325673,-0.60478403,0.50030428,0.42977907,-0.87072683,-0.81332023,0.26863956,0.23794376
311,-0.48817093,-0.60008512,0.49040323,0.42133874,-0.86071400,-0.80217569,0.25979870,0.22965609
312,-0.48288321,-0.59515539,0.48043626,0.41285636,-0.85010998,-0.79060100,0.25115503,0.22160862
313,-0.47738807,-0.58998522,0.47040060,0.40432844,-0.83891852,-0.77860394,0.24270576,0.21379735
314,-0.47168045,-0.58456523,0.46029411,0.39575205,-0.82714486,-0.76619307,0.23444798,0.20621802
315,-0.46575574,-0.57888628,0.45011526,0.38712482,-0.81479573,-0.75337765,0.22637866,0.19886606
316,-0.45960980,-0.57293951,0.43986318,0.37844493,-0.80187930,-0.74016765,0.21849465,0.19173666
317,-0.45323896,-0.56671636,0.42953764,0.36971112,-0.78840523,-0.72657373,0.21079268,0.18482471
318,-0.44664006,-0.56020864,0.41913902,0.36092271,-0.77438460,-0.71260725,0.20326940,0.17812488
319,-0.43981043,-0.55340851,0.40866838,0.35207956,-0.75982992,-0.69828020,0.19592135,0.17163159
320,-0.43274791,-0.54630853,0.39812739,0.34318210,-0.74475510,-0.68360520,0.18874500,0.16533904
321,-0.42545089,-0.53890168,0.38751837,0.33423128,-0.72917542,-0.66859549,0.18173672,0.15924119
322,-0.41791824,-0.53118141,0.37684425,0.32522862,-0.71310752,-0.65326488,0.17489282,0.15333183
323,-0.41014940,-0.52314163,0.36610858,0.31617617,-0.69656932,-0.63762775,0.16820955,0.14760455
324,-0.40214434,-0.51477676,0.35531552,0.30707649,-0.67958005,-0.62169899,0.16168310,0.14205277
325,-0.39390359,-0.50608174,0.34446981,0.29793265,-0.66216015,-0.60549399,0.15530960,0.13666973
326,-0.38542819,-0.49705205,0.33357679,0.28874822,-0.64433128,-0.58902862,0.14908516,0.13144856
327,-0.37671978,-0.48768374,0.32264236,0.27952724,-0.62611623,-0.57231916,0.14300585,0.12638224
328,-0.36778052,-0.47797343,0.31167294,0.27027424,-0.60753890,-0.55538231,0.13706771,0.12146364
329,-0.35861314,-0.46791836,0.30067551,0.26099417,-0.58862424,-0.53823512,0.13126679,0.11668554
330,-0.34922091,-0.45751637,0.28965754,0.25169241,-0.56939822,-0.52089497,0.12559910,0.11204064
331,-0.33960766,-0.44676591,0.27862700,0.24237475,-0.54988773,-0.50337954,0.12006067,0.10752157
332,-0.32977778,-0.43566610,0.26759230,0.23304737,-0.53012055,-0.48570676,0.11464756,0.10312092
333,-0.31973619,-0.42421670,0.25656231,0.22371681,-0.51012531,-0.46789478,0.10935582,0.098831256
334,-0.30948834,-0.41241811,0.24554631,0.21438995,-0.48993139,-0.44996193,0.10418154,0.094645127
335,-0.29904025,-0.40027142,0.23455394,0.20507397,-0.46956889,-0.43192668,0.099120854,0.090555089
336,-0.28839843,-0.38777837,0.22359525,0.19577636,-0.44906852,-0.41380759,0.094169942,0.086553727
337,-0.27756994,-0.37494138,0.21268056,0.18650486,-0.42846159,-0.39562330,0.089325034,0.082633667
338,-0.26656233,-0.36176355,0.20182054,0.17726745,-0.40777991,-0.37739246,0.084582429,0.078787593
339,-0.25538367,-0.34824864,0.19102610,0.16807233,-0.38705572,-0.35913369,0.079938497,0.075008273
340,-0.24404250,-0.33440110,0.18030841,0.15892787,-0.36632163,-0.34086557,0.075389691,0.071288567
341,-0.23254787,-0.32022604,0.16967882,0.14984259,-0.34561055,-0.32260658,0.070932554,0.067621450
342,-0.22090925,-0.30572922,0.15914889,0.14082516,-0.32495561,-0.30437505,0.066563730,0.064000031
343,-0.20913662,-0.29091708,0.14873030,0.13188433,-0.30439010,-0.28618915,0.062279967,0.060417567
344,-0.19724035,-0.27579669,0.13843484,0.12302892,-0.28394738,-0.26806681,0.058078132,0.056867481
345,-0.18523126,-0.26037576,0.12827439,0.11426779,-0.26366083,-0.25002573,0.053955213,0.053343380
346,-0.17312057,-0.24466263,0.11826087,0.10560983,-0.24356376,-0.23208330,0.049908331,0.049839073
347,-0.16091990,-0.22866623,0.10840621,0.097063901,-0.22368934,-0.21425660,0.045934748,0.046348584
348,-0.14864122,-0.21239611,0.098722313,0.088638817,-0.20407054,-0.19656232,0.042031870,0.042866172
349,-0.13629688,-0.19586238,0.089221033,0.080343332,-0.18474006,-0.17901679,0.038197260,0.039386343
350,-0.12389955,-0.17907571,0.079914139,0.072186096,-0.16573024,-0.16163586,0.034428643,0.035903868
351,-0.11146223,-0.16204731,0.070813276,0.064175639,-0.14707300,-0.14443495,0.030723910,0.032413797
352,-0.098998202,-0.14478891,0.061929941,0.056320337,-0.12879979,-0.12742896,0.027081129,0.028911473
353,-0.086521031,-0.12731273,0.053275448,0.048628394,-0.11094149,-0.11063227,0.023498551,0.025392545
354,-0.074044537,-0.10963146,0.044860900,0.041107811,-0.093528372,-0.094058709,0.019974612,0.021852983
355,-0.061582768,-0.091758235,0.036697154,0.033766367,-0.076590026,-0.077721506,0.016507945,0.018289091
356,-0.049149988,-0.073706601,0.028794800,0.026611593,-0.060155295,-0.061633289,0.013097380,0.014697516
357,-0.036760642,-0.055490500,0.021164125,0.019650753,-0.044252219,-0.045806046,0.0097419515,0.011075262
358,-0.024429345,-0.037124236,0.013815093,0.012890822,-0.028907974,-0.030251107,0.0064409050,0.0074196971
359,-0.012170852,-0.018622442,0.0067573131,0.0063384636,-0.014148819,-0.014979123,0.0031936986,0.0037285694
360,-3.3804525e-08,-5.2086193e-08,1.8416813e-08,1.7372031e-08,-3.8582712e-08,-4.1354880e-08,8.8317478e-09,1.0451458e-08
