deg,XRT_AX,XRT_BX,XRT_AY,XRT_BY,SOT_AX,SOT_BX,SOT_AY,SOT_BY
valid,1,1,1,1,1,1,1,1,revB
offset,122.33006,109.10598,1979.6620,1983.4089,60.127055,46.450336,88.008021,91.770206
0,0.0000000,0.0000000,0.0000000,0.0000000,0.0000000,0.0000000,0.0000000,0.0000000
1,0.012144478,0.0033857962,-0.016653305,-0.015472469,0.017062857,0.0066524995,-0.0068868627,-0.0075952553
2,0.025204532,0.0079252954,-0.033312113,-0.031015693,0.033273184,0.012920515,-0.013577984,-0.015008774
3,0.039158381,0.013615465,-0.049959534,-0.046615841,0.048611352,0.018799395,-0.020072338,-0.022240395
4,0.053981738,0.020450986,-0.066578339,-0.062258765,0.063059473,0.024285843,-0.026369191,-0.029290242
5,0.069647861,0.028424270,-0.083151010,-0.077930037,0.076601420,0.029377915,-0.032468108,-0.036158730
6,0.086127623,0.037525489,-0.099659780,-0.093614990,0.089222855,0.034075025,-0.038368955,-0.042846573
7,0.10338958,0.047742603,-0.11608668,-0.10929875,0.10091125,0.038377938,-0.044071902,-0.049354779
8,0.12140006,0.059061402,-0.13241357,-0.12496629,0.11165588,0.042288761,-0.049577428,-0.055684659
9,0.14012324,0.071465544,-0.14862222,-0.14060244,0.12144786,0.045810934,-0.054886317,-0.061837827
10,0.15952121,0.084936605,-0.16469430,-0.15619197,0.13028014,0.048949214,-0.059999664,-0.067816195
11,0.17955414,0.099454134,-0.18061148,-0.17171959,0.13814750,0.051709655,-0.064918869,-0.073621980
12,0.20018030,0.11499571,-0.19635545,-0.18717002,0.14504654,0.054099587,-0.069645637,-0.079257697
13,0.22135622,0.13153699,-0.21190797,-0.20252801,0.15097568,0.056127589,-0.074181975,-0.084726156
14,0.24303676,0.14905182,-0.22725091,-0.21777841,0.15593514,0.057803462,-0.078530188,-0.090030460
15,0.26517528,0.16751225,-0.24236633,-0.23290615,0.15992694,0.059138193,-0.082692873,-0.095174001
16,0.28772370,0.18688866,-0.25723646,-0.24789634,0.16295485,0.060143920,-0.086672916,-0.10016045
17,0.31063267,0.20714980,-0.27184382,-0.26273431,0.16502439,0.060833895,-0.090473477,-0.10499376
18,0.33385166,0.22826290,-0.28617121,-0.27740560,0.16614275,0.061222439,-0.094097994,-0.10967814
19,0.35732911,0.25019377,-0.30020179,-0.29189602,0.16631885,0.061324900,-0.097550161,-0.11421806
20,0.38101257,0.27290684,-0.31391910,-0.30619171,0.16556318,0.061157602,-0.10083393,-0.11861824
21,0.40484881,0.29636531,-0.32730711,-0.32027916,0.16388787,0.060737796,-0.10395348,-0.12288364
22,0.42878399,0.32053122,-0.34035027,-0.33414521,0.16130656,0.060083608,-0.10691325,-0.12701944
23,0.45276377,0.34536556,-0.35303353,-0.34777717,0.15783440,0.059213982,-0.10971785,-0.13103104
24,0.47673344,0.37082835,-0.36534241,-0.36116275,0.15348797,0.058148620,-0.11237213,-0.13492402
25,0.50063812,0.39687877,-0.37726300,-0.37429017,0.14828524,0.056907931,-0.11488112,-0.13870418
26,0.52442283,0.42347526,-0.38878205,-0.38714815,0.14224550,0.055512958,-0.11725001,-0.14237744
27,0.54803268,0.45057561,-0.39988692,-0.39972596,0.13538931,0.053985322,-0.11948415,-0.14594991
28,0.57141301,0.47813710,-0.41056571,-0.41201342,0.12773840,0.052347156,-0.12158905,-0.14942783
29,0.59450950,0.50611658,-0.42080721,-0.42400095,0.11931566,0.050621039,-0.12357031,-0.15281755
30,0.61726832,0.53447059,-0.43060099,-0.43567959,0.11014503,0.048829924,-0.12543365,-0.15612552
31,0.63963631,0.56315547,-0.43993739,-0.44704100,0.10025143,0.046997078,-0.12718489,-0.15935828
32,0.66156106,0.59212748,-0.44880755,-0.45807752,0.089660685,0.045146003,-0.12882990,-0.16252242
33,0.68299107,0.62134289,-0.45720344,-0.46878213,0.078399479,0.043300376,-0.13037459,-0.16562458
34,0.70387590,0.65075810,-0.46511788,-0.47914854,0.066495241,0.041483970,-0.13182492,-0.16867141
35,0.72416627,0.68032974,-0.47254457,-0.48917112,0.053976086,0.039720589,-0.13318684,-0.17166958
36,0.74381421,0.71001480,-0.47947808,-0.49884499,0.040870730,0.038033997,-0.13446629,-0.17462573
37,0.76277316,0.73977071,-0.48591387,-0.50816597,0.027208414,0.036447845,-0.13566918,-0.17754643
38,0.78099813,0.76955544,-0.49184833,-0.51713062,0.013018817,0.034985602,-0.13680136,-0.18043824
39,0.79844576,0.79932763,-0.49727876,-0.52573623,-0.0016680201,0.033670487,-0.13786860,-0.18330757
40,0.81507449,0.82904667,-0.50220337,-0.53398083,-0.016821777,0.032525400,-0.13887658,-0.18616078
41,0.83084461,0.85867278,-0.50662132,-0.54186320,-0.032411935,0.031572851,-0.13983087,-0.18900406
42,0.84571841,0.88816714,-0.51053268,-0.54938285,-0.048407859,0.030834899,-0.14073687,-0.19184346
43,0.85966026,0.91749194,-0.51393845,-0.55654002,-0.064778879,0.030333079,-0.14159985,-0.19468485
44,0.87263668,0.94661052,-0.51684058,-0.56333568,-0.081494365,0.030088346,-0.14242489,-0.19753390
45,0.88461645,0.97548740,-0.51924190,-0.56977152,-0.098523809,0.030121007,-0.14321686,-0.20039608
46,0.89557069,1.0040884,-0.52114618,-0.57584995,-0.11583690,0.030450665,-0.14398041,-0.20327658
47,0.90547292,1.0323806,-0.52255807,-0.58157405,-0.13340361,0.031096154,-0.14471995,-0.20618036
48,0.91429913,1.0603326,-0.52348313,-0.58694762,-0.15119425,0.032075491,-0.14543965,-0.20911210
49,0.92202784,1.0879146,-0.52392775,-0.59197511,-0.16917956,0.033405815,-0.14614336,-0.21207613
50,0.92864017,1.1150981,-0.52389921,-0.59666160,-0.18733077,0.035103339,-0.14683467,-0.21507652
51,0.93411984,1.1418564,-0.52340560,-0.60101282,-0.20561967,0.037183300,-0.14751683,-0.21811694
52,0.93845328,1.1681644,-0.52245582,-0.60503510,-0.22401867,0.039659912,-0.14819277,-0.22120073
53,0.94162960,1.1939988,-0.52105956,-0.60873535,-0.24250090,0.042546326,-0.14886507,-0.22433083
54,0.94364065,1.2193378,-0.51922724,-0.61212105,-0.26104020,0.045854585,-0.14953596,-0.22750981
55,0.94448103,1.2441617,-0.51697004,-0.61520017,-0.27961125,0.049595588,-0.15020726,-0.23073978
56,0.94414808,1.2684525,-0.51429982,-0.61798122,-0.29818958,0.053779057,-0.15088043,-0.23402247
57,0.94264194,1.2921941,-0.51122909,-0.62047315,-0.31675165,0.058413507,-0.15155651,-0.23735914
58,0.93996547,1.3153720,-0.50777100,-0.62268537,-0.33527488,0.063506215,-0.15223614,-0.24075057
59,0.93612429,1.3379740,-0.50393930,-0.62462766,-0.35373769,0.069063197,-0.15291952,-0.24419711
60,0.93112677,1.3599895,-0.49974825,-0.62631021,-0.37211956,0.075089192,-0.15360642,-0.24769860
61,0.92498397,1.3814100,-0.49521268,-0.62774351,-0.39040108,0.081587636,-0.15429617,-0.25125439
62,0.91770961,1.4022288,-0.49034783,-0.62893836,-0.40856393,0.088560658,-0.15498765,-0.25486334
63,0.90932006,1.4224410,-0.48516941,-0.62990581,-0.42659098,0.096009062,-0.15567928,-0.25852378
64,0.89983428,1.4420437,-0.47969350,-0.63065713,-0.44446626,0.10393233,-0.15636902,-0.26223352
65,0.88927375,1.4610360,-0.47393652,-0.63120378,-0.46217502,0.11232860,-0.15705437,-0.26598987
66,0.87766243,1.4794185,-0.46791518,-0.63155736,-0.47970373,0.12119470,-0.15773237,-0.26978958
67,0.86502669,1.4971939,-0.46164643,-0.63172955,-0.49704010,0.13052613,-0.15839958,-0.27362890
68,0.85139523,1.5143666,-0.45514745,-0.63173212,-0.51417309,0.14031706,-0.15905210,-0.27750351
69,0.83679902,1.5309427,-0.44843553,-0.63157684,-0.53109294,0.15056037,-0.15968556,-0.28140859
70,0.82127119,1.5469301,-0.44152809,-0.63127545,-0.54779112,0.16124765,-0.16029515,-0.28533877
71,0.80484694,1.5623382,-0.43444260,-0.63083965,-0.56426038,0.17236921,-0.16087556,-0.28928814
72,0.78756350,1.5771781,-0.42719654,-0.63028103,-0.58049474,0.18391414,-0.16142108,-0.29325028
73,0.76945993,1.5914624,-0.41980734,-0.62961102,-0.59648945,0.19587029,-0.16192553,-0.29721824
74,0.75057713,1.6052053,-0.41229234,-0.62884088,-0.61224100,0.20822432,-0.16238228,-0.30118456
75,0.73095762,1.6184224,-0.40466875,-0.62798164,-0.62774711,0.22096175,-0.16278430,-0.30514126
76,0.71064551,1.6311303,-0.39695360,-0.62704408,-0.64300668,0.23406696,-0.16312414,-0.30907988
77,0.68968633,1.6433475,-0.38916365,-0.62603866,-0.65801982,0.24752325,-0.16339394,-0.31299146
78,0.66812695,1.6550931,-0.38131542,-0.62497552,-0.67278777,0.26131290,-0.16358545,-0.31686657
79,0.64601541,1.6663876,-0.37342509,-0.62386440,-0.68731287,0.27541717,-0.16369007,-0.32069532
80,0.62340084,1.6772527,-0.36550847,-0.62271466,-0.70159859,0.28981640,-0.16369881,-0.32446736
81,0.60033326,1.6877107,-0.35758094,-0.62153519,-0.71564941,0.30449001,-0.16360236,-0.32817193
82,0.57686355,1.6977849,-0.34965744,-0.62033442,-0.72947083,0.31941659,-0.16339108,-0.33179786
83,0.55304321,1.7074995,-0.34175241,-0.61912027,-0.74306933,0.33457393,-0.16305503,-0.33533356
84,0.52892430,1.7168792,-0.33387974,-0.61790009,-0.75645229,0.34993910,-0.16258401,-0.33876709
85,0.50455925,1.7259494,-0.32605275,-0.61668071,-0.76962796,0.36548850,-0.16196752,-0.34208616
86,0.48000077,1.7347360,-0.31828415,-0.61546833,-0.78260541,0.38119791,-0.16119485,-0.34527813
87,0.45530168,1.7432652,-0.31058598,-0.61426855,-0.79539448,0.39704256,-0.16025509,-0.34833008
88,0.43051476,1.7515636,-0.30296963,-0.61308631,-0.80800572,0.41299721,-0.15913710,-0.35122879
89,0.40569266,1.7596579,-0.29544574,-0.61192591,-0.82045033,0.42903620,-0.15782962,-0.35396079
90,0.38088771,1.7675751,-0.28802423,-0.61079093,-0.83274008,0.44513350,-0.15632123,-0.35651239
91,0.35615183,1.7753419,-0.28071424,-0.60968429,-0.84488731,0.46126282,-0.15460041,-0.35886969
92,0.33153636,1.7829851,-0.27352411,-0.60860817,-0.85690479,0.47739764,-0.15265555,-0.36101863
93,0.30709193,1.7905313,-0.26646137,-0.60756402,-0.86880571,0.49351131,-0.15047500,-0.36294499
94,0.28286836,1.7980069,-0.25953271,-0.60655256,-0.88060360,0.50957709,-0.14804708,-0.36463445
95,0.25891450,1.8054377,-0.25274394,-0.60557375,-0.89231227,0.52556823,-0.14536009,-0.36607261
96,0.23527813,1.8128492,-0.24610004,-0.60462681,-0.90394570,0.54145807,-0.14240242,-0.36724501
97,0.21200580,1.8202663,-0.23960505,-0.60371018,-0.91551806,0.55722004,-0.13916246,-0.36813718
98,0.18914275,1.8277131,-0.23326216,-0.60282156,-0.92704356,0.57282782,-0.13562875,-0.36873466
99,0.16673278,1.8352132,-0.22707363,-0.60195788,-0.93853642,0.58825533,-0.13178992,-0.36902304
100,0.14481814,1.8427892,-0.22104080,-0.60111531,-0.95001081,0.60347683,-0.12763477,-0.36898798
101,0.12343943,1.8504628,-0.21516412,-0.60028927,-0.96148075,0.61846700,-0.12315227,-0.36861527
102,0.10263549,1.8582548,-0.20944310,-0.59947444,-0.97296010,0.63320097,-0.11833164,-0.36789083
103,0.082443298,1.8661847,-0.20387637,-0.59866475,-0.98446244,0.64765443,-0.11316231,-0.36680077
104,0.062897907,1.8742713,-0.19846161,-0.59785343,-0.99600103,0.66180366,-0.10763401,-0.36533140
105,0.044032327,1.8825317,-0.19319564,-0.59703298,-1.0075887,0.67562559,-0.10173678,-0.36346931
106,0.025877467,1.8909821,-0.18807436,-0.59619523,-1.0192380,0.68909787,-0.095460964,-0.36120133
107,0.0084620498,1.8996371,-0.18309281,-0.59533132,-1.0309608,0.70219895,-0.088797314,-0.35851462
108,-0.0081874472,1.9085100,-0.17824516,-0.59443176,-1.0427684,0.71490808,-0.081736951,-0.35539670
109,-0.024046859,1.9176127,-0.17352474,-0.59348640,-1.0546717,0.72720543,-0.074271428,-0.35183545
110,-0.039094385,1.9269555,-0.16892406,-0.59248452,-1.0666806,0.73907207,-0.066392742,-0.34781916
111,-0.053310638,1.9365473,-0.16443480,-0.59141482,-1.0788046,0.75049009,-0.058093373,-0.34333658
112,-0.066678686,1.9463953,-0.16004791,-0.59026543,-1.0910522,0.76144257,-0.049366299,-0.33837691
113,-0.079184083,1.9565052,-0.15575355,-0.58902400,-1.1034313,0.77191370,-0.040205028,-0.33292986
114,-0.090814902,1.9668809,-0.15154118,-0.58767767,-1.1159486,0.78188876,-0.030603619,-0.32698569
115,-0.10156175,1.9775248,-0.14739957,-0.58621316,-1.1286103,0.79135419,-0.020556708,-0.32053519
116,-0.11141779,1.9884374,-0.14331682,-0.58461676,-1.1414213,0.80029760,-0.010059526,-0.31356975
117,-0.12037874,1.9996179,-0.13928043,-0.58287441,-1.1543858,0.80870781,0.00089207638,-0.30608140
118,-0.12844286,2.0110632,-0.13527730,-0.58097169,-1.1675070,0.81657489,0.012301611,-0.29806276
119,-0.13561099,2.0227692,-0.13129381,-0.57889392,-1.1807867,0.82389016,0.024171932,-0.28950714
120,-0.14188647,2.0347294,-0.12731583,-0.57662613,-1.1942262,0.83064625,0.036505221,-0.28040856
121,-0.14727516,2.0469361,-0.12332874,-0.57415319,-1.2078253,0.83683704,0.049302968,-0.27076170
122,-0.15178542,2.0593798,-0.11931756,-0.57145978,-1.2215828,0.84245775,0.062565957,-0.26056200
123,-0.15542805,2.0720491,-0.11526690,-0.56853047,-1.2354965,0.84750493,0.076294257,-0.24980566
124,-0.15821624,2.0849313,-0.11116106,-0.56534975,-1.2495631,0.85197642,0.090487204,-0.23848960
125,-0.16016555,2.0980119,-0.10698405,-0.56190210,-1.2637780,0.85587143,0.10514340,-0.22661158
126,-0.16129385,2.1112749,-0.10271969,-0.55817200,-1.2781357,0.85919047,0.12026068,-0.21417011
127,-0.16162123,2.1247026,-0.098351577,-0.55414403,-1.2926294,0.86193536,0.13583615,-0.20116453
128,-0.16116997,2.1382759,-0.093863212,-0.54980285,-1.3072513,0.86410925,0.15186612,-0.18759502
129,-0.15996443,2.1519745,-0.089238006,-0.54513332,-1.3219924,0.86571660,0.16834618,-0.17346256
130,-0.15803101,2.1657762,-0.084459347,-0.54012048,-1.3368428,0.86676312,0.18527110,-0.15876899
131,-0.15539803,2.1796580,-0.079510650,-0.53474965,-1.3517913,0.86725581,0.20263492,-0.14351700
132,-0.15209565,2.1935953,-0.074375405,-0.52900645,-1.3668258,0.86720289,0.22043089,-0.12771011
133,-0.14815581,2.2075623,-0.069037233,-0.52287686,-1.3819331,0.86661382,0.23865150,-0.11135274
134,-0.14361207,2.2215323,-0.063479934,-0.51634724,-1.3970990,0.86549921,0.25728848,-0.094450126
135,-0.13849955,2.2354772,-0.057687540,-0.50940442,-1.4123084,0.86387084,0.27633280,-0.077008380
136,-0.13285479,2.2493683,-0.051644365,-0.50203570,-1.4275452,0.86174162,0.29577468,-0.059034470
137,-0.12671569,2.2631756,-0.045335057,-0.49422894,-1.4427924,0.85912550,0.31560361,-0.040536215
138,-0.12012134,2.2768686,-0.038744644,-0.48597255,-1.4580322,0.85603749,0.33580833,-0.021522281
139,-0.11311191,2.2904160,-0.031858586,-0.47725557,-1.4732461,0.85249358,0.35637690,-0.0020021748
140,-0.10572857,2.3037857,-0.024662823,-0.46806771,-1.4884145,0.84851071,0.37729663,0.018013765
141,-0.098013314,2.3169452,-0.017143819,-0.45839937,-1.5035174,0.84410669,0.39855418,0.038514380
142,-0.090008869,2.3298616,-0.0092886075,-0.44824169,-1.5185340,0.83930018,0.42013551,0.059487702
143,-0.081758548,2.3425014,-0.0010848402,-0.43758659,-1.5334431,0.83411064,0.44202596,0.080920968
144,-0.073306133,2.3548311,0.0074791753,-0.42642678,-1.5482226,0.82855823,0.46421022,0.10280064
145,-0.064695735,2.3668170,0.016414432,-0.41475583,-1.5628502,0.82266379,0.48667235,0.12511240
146,-0.055971670,2.3784251,0.025731185,-0.40256818,-1.5773031,0.81644877,0.50939586,0.14784122
147,-0.047178322,2.3896216,0.035438911,-0.38985916,-1.5915582,0.80993517,0.53236366,0.17097132
148,-0.038360018,2.4003731,0.045546279,-0.37662503,-1.6055920,0.80314545,0.55555814,0.19448622
149,-0.029560889,2.4106459,0.056061109,-0.36286302,-1.6193808,0.79610252,0.57896119,0.21836878
150,-0.020824747,2.4204071,0.066990345,-0.34857131,-1.6329008,0.78882960,0.60255418,0.24260120
151,-0.012194951,2.4296241,0.078340023,-0.33374909,-1.6461281,0.78135023,0.62631804,0.26716505
152,-0.0037142837,2.4382647,0.090115248,-0.31839656,-1.6590388,0.77368815,0.65023330,0.29204129
153,0.0045751795,2.4462975,0.10232016,-0.30251495,-1.6716091,0.76586724,0.67428004,0.31721033
154,0.012632190,2.4536919,0.11495793,-0.28610652,-1.6838151,0.75791149,0.69843803,0.34265201
155,0.020416448,2.4604179,0.12803072,-0.26917459,-1.6956334,0.74984486,0.72268668,0.36834571
156,0.027888723,2.4664467,0.14153966,-0.25172355,-1.7070408,0.74169128,0.74700510,0.39427027
157,0.035010965,2.4717502,0.15548488,-0.23375883,-1.7180142,0.73347455,0.77137215,0.42040413
158,0.041746419,2.4763018,0.16986542,-0.21528695,-1.7285313,0.72521828,0.79576645,0.44672530
159,0.048059732,2.4800759,0.18467931,-0.19631549,-1.7385700,0.71694580,0.82016643,0.47321142
160,0.053917053,2.4830480,0.19992349,-0.17685308,-1.7481090,0.70868013,0.84455037,0.49983978
161,0.059286140,2.4851953,0.21559384,-0.15690943,-1.7571273,0.70044390,0.86889641,0.52658738
162,0.064136445,2.4864962,0.23168518,-0.13649529,-1.7656049,0.69225927,0.89318262,0.55343094
163,0.068439212,2.4869308,0.24819125,-0.11562246,-1.7735225,0.68414790,0.91738701,0.58034695
164,0.072167554,2.4864807,0.26510475,-0.094303762,-1.7808615,0.67613084,0.94148758,0.60731173
165,0.075296536,2.4851290,0.28241729,-0.072553022,-1.7876044,0.66822852,0.96546237,0.63430142
166,0.077803248,2.4828607,0.30011947,-0.050385072,-1.7937343,0.66046066,0.98928946,0.66129206
167,0.079666870,2.4796627,0.31820085,-0.027815713,-1.7992358,0.65284625,1.0129470,0.68825959
168,0.080868737,2.4755233,0.33664996,-0.0048616959,-1.8040942,0.64540344,1.0364134,0.71517995
169,0.081392388,2.4704331,0.35545433,0.018459305,-1.8082961,0.63814954,1.0596671,0.74202906
170,0.081223623,2.4643844,0.37460052,0.042128718,-1.8118291,0.63110096,1.0826868,0.76878288
171,0.080350535,2.4573714,0.39407414,0.066127108,-1.8146823,0.62427312,1.1054515,0.79541746
172,0.078763557,2.4493905,0.41385985,0.090434206,-1.8168457,0.61768049,1.1279403,0.82190895
173,0.076455479,2.4404400,0.43394141,0.11502894,-1.8183111,0.61133646,1.1501328,0.84823367
174,0.073421481,2.4305200,0.45430173,0.13988950,-1.8190711,0.60525338,1.1720089,0.87436814
175,0.069659140,2.4196332,0.47492285,0.16499331,-1.8191202,0.59944247,1.1935488,0.90028910
176,0.065168443,2.4077838,0.49578601,0.19031715,-1.8184539,0.59391381,1.2147332,0.92597357
177,0.059951785,2.3949783,0.51687170,0.21583715,-1.8170694,0.58867632,1.2355433,0.95139885
178,0.054013967,2.3812254,0.53815966,0.24152884,-1.8149653,0.58373773,1.2559605,0.97654262
179,0.047362181,2.3665358,0.55962894,0.26736722,-1.8121416,0.57910454,1.2759671,1.0013829
180,0.040005993,2.3509220,0.58125797,0.29332675,-1.8086000,0.57478202,1.2955455,1.0258982
181,0.031957312,2.3343988,0.60302454,0.31938148,-1.8043435,0.57077421,1.3146791,1.0500673
182,0.023230365,2.3169829,0.62490592,0.34550504,-1.7993769,0.56708388,1.3333515,1.0738696
183,0.013841650,2.2986931,0.64687884,0.37167070,-1.7937063,0.56371255,1.3515472,1.0972850
184,0.0038098953,2.2795500,0.66891959,0.39785145,-1.7873393,0.56066044,1.3692511,1.1202939
185,-0.0068439964,2.2595763,0.69100405,0.42402001,-1.7802853,0.55792655,1.3864490,1.1428772
186,-0.018097004,2.2387963,0.71310773,0.45014893,-1.7725549,0.55550858,1.4031271,1.1650166
187,-0.029924055,2.2172363,0.73520585,0.47621062,-1.7641605,0.55340300,1.4192725,1.1866942
188,-0.042298094,2.1949245,0.75727337,0.50217739,-1.7551158,0.55160501,1.4348730,1.2078929
189,-0.055190161,2.1718904,0.77928503,0.52802154,-1.7454360,0.55010861,1.4499170,1.2285961
190,-0.068569470,2.1481654,0.80121547,0.55371539,-1.7351378,0.54890657,1.4643938,1.2487880
191,-0.082403500,2.1237826,0.82303921,0.57923136,-1.7242393,0.54799047,1.4782934,1.2684536
192,-0.096658086,2.0987764,0.84473074,0.60454198,-1.7127599,0.54735074,1.4916065,1.2875784
193,-0.11129751,2.0731826,0.86626457,0.62961999,-1.7007204,0.54697667,1.5043246,1.3061488
194,-0.12628462,2.0470384,0.88761530,0.65443840,-1.6881430,0.54685644,1.5164402,1.3241521
195,-0.14158091,2.0203822,0.90875764,0.67897049,-1.6750511,0.54697717,1.5279464,1.3415760
196,-0.15714664,1.9932538,0.92966651,0.70318991,-1.6614692,0.54732495,1.5388370,1.3584093
197,-0.17294096,1.9656937,0.95031705,0.72707074,-1.6474230,0.54788487,1.5491069,1.3746415
198,-0.18892202,1.9377437,0.97068471,0.75058749,-1.6329395,0.54864110,1.5587515,1.3902630
199,-0.20504709,1.9094462,0.99074528,0.77371522,-1.6180465,0.54957689,1.5677673,1.4052649
200,-0.22127265,1.8808446,1.0104750,0.79642954,-1.6027730,0.55067465,1.5761514,1.4196391
201,-0.23755458,1.8519829,1.0298504,0.81870666,-1.5871486,0.55191599,1.5839019,1.4333785
202,-0.25384822,1.8229056,1.0488487,0.84052348,-1.5712041,0.55328180,1.5910173,1.4464767
203,-0.27010855,1.7936577,1.0674477,0.86185759,-1.5549708,0.55475226,1.5974974,1.4589282
204,-0.28629028,1.7642845,1.0856256,0.88268733,-1.5384809,0.55630693,1.6033426,1.4707283
205,-0.30234800,1.7348317,1.1033613,0.90299185,-1.5217672,0.55792481,1.6085538,1.4818731
206,-0.31823629,1.7053449,1.1206345,0.92275113,-1.5048630,0.55958440,1.6131331,1.4923597
207,-0.33390991,1.6758699,1.1374256,0.94194603,-1.4878021,0.56126375,1.6170831,1.5021857
208,-0.34932383,1.6464522,1.1537158,0.96055830,-1.4706186,0.56294054,1.6204072,1.5113499
209,-0.36443345,1.6171374,1.1694870,0.97857066,-1.4533471,0.56459216,1.6231095,1.5198516
210,-0.37919468,1.5879705,1.1847219,0.99596680,-1.4360222,0.56619574,1.6251949,1.5276911
211,-0.39356409,1.5589961,1.1994045,1.0127314,-1.4186788,0.56772823,1.6266690,1.5348694
212,-0.40749902,1.5302583,1.2135192,1.0288503,-1.4013519,0.56916651,1.6275378,1.5413883
213,-0.42095771,1.5018006,1.2270516,1.0443102,-1.3840762,0.57048740,1.6278084,1.5472503
214,-0.43389943,1.4736657,1.2399883,1.0590991,-1.3668867,0.57166776,1.6274881,1.5524587
215,-0.44628457,1.4458953,1.2523170,1.0732058,-1.3498177,0.57268457,1.6265852,1.5570176
216,-0.45807480,1.4185303,1.2640261,1.0866207,-1.3329037,0.57351497,1.6251082,1.5609316
217,-0.46923314,1.3916104,1.2751054,1.0993348,-1.3161784,0.57413635,1.6230666,1.5642063
218,-0.47972408,1.3651742,1.2855455,1.1113408,-1.2996752,0.57452643,1.6204700,1.5668476
219,-0.48951370,1.3392590,1.2953383,1.1226321,-1.2834272,0.57466328,1.6173288,1.5688624
220,-0.49856976,1.3139007,1.3044766,1.1332034,-1.2674663,0.57452544,1.6136537,1.5702581
221,-0.50686179,1.2891337,1.3129546,1.1430509,-1.2518243,0.57409198,1.6094562,1.5710425
222,-0.51436119,1.2649910,1.3207672,1.1521715,-1.2365316,0.57334250,1.6047478,1.5712243
223,-0.52104130,1.2415038,1.3279109,1.1605635,-1.2216183,0.57225731,1.5995407,1.5708126
224,-0.52687750,1.2187018,1.3343829,1.1682265,-1.2071131,0.57081736,1.5938473,1.5698170
225,-0.53184727,1.1966126,1.3401817,1.1751610,-1.1930438,0.56900441,1.5876804,1.5682477
226,-0.53593026,1.1752622,1.3453070,1.1813688,-1.1794371,0.56680102,1.5810532,1.5661151
227,-0.53910836,1.1546746,1.3497595,1.1868530,-1.1663187,0.56419065,1.5739792,1.5634306
228,-0.54136577,1.1348719,1.3535411,1.1916175,-1.1537126,0.56115766,1.5664718,1.5602054
229,-0.54268899,1.1158740,1.3566546,1.1956675,-1.1416419,0.55768743,1.5585452,1.5564514
230,-0.54306696,1.0976989,1.3591041,1.1990094,-1.1301282,0.55376634,1.5502133,1.5521809
231,-0.54249100,1.0803623,1.3608947,1.2016505,-1.1191915,0.54938187,1.5414904,1.5474065
232,-0.54095491,1.0638778,1.3620324,1.2035992,-1.1088504,0.54452261,1.5323908,1.5421409
233,-0.53845494,1.0482569,1.3625245,1.2048650,-1.0991222,0.53917832,1.5229292,1.5363974
234,-0.53498988,1.0335087,1.3623790,1.2054582,-1.0900221,0.53333994,1.5131200,1.5301892
235,-0.53056098,1.0196402,1.3616051,1.2053904,-1.0815642,0.52699966,1.5029779,1.5235299
236,-0.52517202,1.0066560,1.3602128,1.2046737,-1.0737604,0.52015092,1.4925174,1.5164333
237,-0.51882927,0.99455845,1.3582131,1.2033214,-1.0666212,0.51278846,1.4817532,1.5089133
238,-0.51154151,0.98334769,1.3556178,1.2013477,-1.0601553,0.50490833,1.4706999,1.5009839
239,-0.50331997,0.97302154,1.3524396,1.1987674,-1.0543696,0.49650789,1.4593719,1.4926593
240,-0.49417836,0.96357551,1.3486920,1.1955961,-1.0492692,0.48758589,1.4477837,1.4839536
241,-0.48413277,0.95500291,1.3443893,1.1918504,-1.0448572,0.47814240,1.4359496,1.4748811
242,-0.47320170,0.94729476,1.3395464,1.1875473,-1.0411351,0.46817889,1.4238836,1.4654560
243,-0.46140597,0.94043990,1.3341791,1.1827045,-1.0381024,0.45769821,1.4115997,1.4556925
244,-0.44876868,0.93442496,1.3283035,1.1773404,-1.0357569,0.44670455,1.3991118,1.4456048
245,-0.43531515,0.92923445,1.3219367,1.1714740,-1.0340943,0.43520352,1.3864334,1.4352069
246,-0.42107288,0.92485075,1.3150960,1.1651246,-1.0331087,0.42320209,1.3735777,1.4245130
247,-0.40607143,0.92125420,1.3077995,1.1583120,-1.0327921,0.41070857,1.3605579,1.4135368
248,-0.39034239,0.91842314,1.3000656,1.1510566,-1.0331350,0.39773263,1.3473867,1.4022922
249,-0.37391927,0.91633397,1.2919130,1.1433790,-1.0341256,0.38428529,1.3340766,1.3907928
250,-0.35683744,0.91496120,1.2833610,1.1353001,-1.0357509,0.37037885,1.3206397,1.3790518
251,-0.33913400,0.91427753,1.2744289,1.1268410,-1.0379956,0.35602693,1.3070880,1.3670826
252,-0.32084772,0.91425394,1.2651366,1.1180231,-1.0408430,0.34124437,1.2934328,1.3548980
253,-0.30201891,0.91485975,1.2555039,1.1088680,-1.0442746,0.32604727,1.2796852,1.3425109
254,-0.28268932,0.91606271,1.2455510,1.0993971,-1.0482701,0.31045291,1.2658562,1.3299337
255,-0.26290203,0.91782906,1.2352980,1.0896322,-1.0528079,0.29447974,1.2519559,1.3171784
256,-0.24270136,0.92012368,1.2247652,1.0795949,-1.0578646,0.27814730,1.2379944,1.3042572
257,-0.22213270,0.92291013,1.2139726,1.0693066,-1.0634154,0.26147622,1.2239813,1.2911815
258,-0.20124244,0.92615079,1.2029406,1.0587889,-1.0694339,0.24448815,1.2099257,1.2779625
259,-0.18007781,0.92980691,1.1916892,1.0480631,-1.0758925,0.22720571,1.1958363,1.2646114
260,-0.15868677,0.93383878,1.1802383,1.0371501,-1.0827621,0.20965246,1.1817214,1.2511385
261,-0.13711788,0.93820577,1.1686075,1.0260709,-1.0900126,0.19185280,1.1675891,1.2375542
262,-0.11542017,0.94286651,1.1568163,1.0148458,-1.0976124,0.17383196,1.1534466,1.2238684
263,-0.093642990,0.94777894,1.1448840,1.0034950,-1.1055289,0.15561591,1.1393011,1.2100905
264,-0.071835904,0.95290047,1.1328291,0.99203817,-1.1137286,0.13723131,1.1251592,1.1962297
265,-0.050048539,0.95818804,1.1206703,0.98049468,-1.1221770,0.11870544,1.1110270,1.1822949
266,-0.028330451,0.96359832,1.1084254,0.96888328,-1.1308386,0.10006615,1.0969103,1.1682943
267,-0.0067309980,0.96908775,1.0961120,0.95722224,-1.1396772,0.081341771,1.0828144,1.1542360
268,0.014700802,0.97461268,1.0837471,0.94552924,-1.1486559,0.062561058,1.0687443,1.1401277
269,0.035916399,0.98012953,1.0713471,0.93382138,-1.1577372,0.043753120,1.0547044,1.1259765
270,0.056867847,0.98559485,1.0589279,0.92211510,-1.1668831,0.024947345,1.0406988,1.1117894
271,0.077507931,0.99096546,1.0465046,0.91042620,-1.1760551,0.0061733343,1.0267313,1.0975729
272,0.097790302,0.99619858,1.0340919,0.89876975,-1.1852146,-0.012539178,1.0128051,1.0833330
273,0.11766960,1.0012520,1.0217037,0.88716008,-1.1943225,-0.031160391,0.99892325,1.0690756
274,0.13710156,1.0060839,1.0093530,0.87561080,-1.2033397,-0.049660514,0.98508825,1.0548060
275,0.15604319,1.0106536,0.99705249,0.86413470,-1.2122270,-0.068009840,0.97130233,1.0405293
276,0.17445281,1.0149208,0.98481368,0.85274379,-1.2209453,-0.086178817,0.95756739,1.0262501
277,0.19229024,1.0188466,0.97264747,0.84144924,-1.2294558,-0.10413812,0.94388497,1.0119729
278,0.20951685,1.0223929,0.96056396,0.83026138,-1.2377196,-0.12185874,0.93025632,0.99770159
279,0.22609571,1.0255228,0.94857240,0.81918970,-1.2456986,-0.13931202,0.91668236,0.98343994
280,0.24199168,1.0282006,0.93668121,0.80824281,-1.2533547,-0.15646975,0.90316376,0.96919132
281,0.25717150,1.0303923,0.92489797,0.79742842,-1.2606506,-0.17330426,0.88970090,0.95495884
282,0.27160387,1.0320650,0.91322940,0.78675340,-1.2675497,-0.18978844,0.87629394,0.94074530
283,0.28525957,1.0331876,0.90168135,0.77622369,-1.2740160,-0.20589584,0.86294277,0.92655325
284,0.29811153,1.0337304,0.89025882,0.76584435,-1.2800143,-0.22160071,0.84964709,0.91238497
285,0.31013488,1.0336657,0.87896591,0.75561956,-1.2855103,-0.23687810,0.83640639,0.89824251
286,0.32130705,1.0329673,0.86780590,0.74555259,-1.2904708,-0.25170389,0.82321999,0.88412766
287,0.33160782,1.0316113,0.85678117,0.73564582,-1.2948637,-0.26605486,0.81008703,0.87004202
288,0.34101940,1.0295753,0.84589326,0.72590079,-1.2986580,-0.27990877,0.79700654,0.85598700
289,0.34952642,1.0268392,0.83514284,0.71631812,-1.3018238,-0.29324437,0.78397738,0.84196380
290,0.35711605,1.0233849,0.82452979,0.70689762,-1.3043328,-0.30604148,0.77099835,0.82797346
291,0.36377799,1.0191964,0.81405311,0.69763824,-1.3061578,-0.31828103,0.75806813,0.81401687
292,0.36950450,1.0142597,0.80371103,0.68853809,-1.3072734,-0.32994514,0.74518535,0.80009479
293,0.37429045,1.0085635,0.79350098,0.67959450,-1.3076555,-0.34101710,0.73234857,0.78620784
294,0.37813333,1.0020981,0.78341962,0.67080401,-1.3072816,-0.35148147,0.71955633,0.77235657
295,0.38103322,0.99485668,0.77346288,0.66216240,-1.3061309,-0.36132409,0.70680715,0.75854139
296,0.38299285,0.98683431,0.76362593,0.65366471,-1.3041843,-0.37053211,0.69409957,0.74476268
297,0.38401756,0.97802857,0.75390330,0.64530527,-1.3014246,-0.37909404,0.68143212,0.73102075
298,0.38411527,0.96843931,0.74428880,0.63707774,-1.2978360,-0.38699975,0.66880338,0.71731586
299,0.38329653,0.95806874,0.73477566,0.62897513,-1.2934050,-0.39424053,0.65621198,0.70364824
300,0.38157441,0.94692142,0.72535647,0.62098984,-1.2881198,-0.40080907,0.64365662,0.69001812
301,0.37896453,0.93500421,0.71602327,0.61311368,-1.2819706,-0.40669951,0.63113608,0.67642573
302,0.37548498,0.92232632,0.70676755,0.60533792,-1.2749492,-0.41190743,0.61864924,0.66287131
303,0.37115629,0.90889925,0.69758034,0.59765331,-1.2670499,-0.41642987,0.60619508,0.64935513
304,0.36600137,0.89473678,0.68845219,0.59005016,-1.2582687,-0.42026532,0.59377272,0.63587750
305,0.36004545,0.87985492,0.67937324,0.58251831,-1.2486035,-0.42341376,0.58138140,0.62243878
306,0.35331604,0.86427194,0.67033327,0.57504725,-1.2380546,-0.42587660,0.56902051,0.60903941
307,0.34584280,0.84800822,0.66132169,0.56762608,-1.2266238,-0.42765672,0.55668961,0.59567989
308,0.33765752,0.83108630,0.65232767,0.56024362,-1.2143155,-0.42875845,0.54438841,0.58236081
309,0.32879397,0.81353079,0.64334011,0.55288841,-1.2011356,-0.42918754,0.53211680,0.56908288
310,0.31928788,0.79536829,0.63434770,0.54554880,-1.1870923,-0.42895114,0.51987487,0.55584687
311,0.30917681,0.77662736,0.62533901,0.53821291,-1.1721957,-0.42805781,0.50766288,0.54265371
312,0.29850003,0.75733845,0.61630246,0.53086878,-1.1564579,-0.42651747,0.49548131,0.52950442
313,0.28729845,0.73753378,0.60722642,0.52350431,-1.1398929,-0.42434137,0.48333081,0.51640015
314,0.27561449,0.71724733,0.59809926,0.51610740,-1.1225168,-0.42154208,0.47121227,0.50334220
315,0.26349196,0.69651472,0.58890936,0.50866591,-1.1043472,-0.41813343,0.45912678,0.49033199
316,0.25097595,0.67537309,0.57964516,0.50116776,-1.0854040,-0.41413048,0.44707563,0.47737109
317,0.23811273,0.65386110,0.57029524,0.49360096,-1.0657085,-0.40954948,0.43506033,0.46446120
318,0.22494956,0.63201874,0.56084833,0.48595363,-1.0452841,-0.40440782,0.42308262,0.45160420
319,0.21153465,0.60988729,0.55129338,0.47821408,-1.0241557,-0.39872400,0.41114443,0.43880208
320,0.19791695,0.58750919,0.54161957,0.47037082,-1.0023498,-0.39251756,0.39924791,0.42605699
321,0.18414606,0.56492795,0.53181638,0.46241260,-0.97989470,-0.38580903,0.38739543,0.41337124
322,0.17027208,0.54218804,0.52187364,0.45432850,-0.95682007,-0.37861988,0.37558955,0.40074728
323,0.15634548,0.51933478,0.51178154,0.44610789,-0.93315708,-0.37097246,0.36383304,0.38818769
324,0.14241695,0.49641420,0.50153069,0.43774053,-0.90893830,-0.36288993,0.35212887,0.37569521
325,0.12853727,0.47347299,0.49111214,0.42921658,-0.88419761,-0.35439621,0.34048018,0.36327269
326,0.11475718,0.45055833,0.48051746,0.42052665,-0.85897013,-0.34551593,0.32889031,0.35092315
327,0.10112723,0.42771777,0.46973872,0.41166181,-0.83329215,-0.33627432,0.31736277,0.33864971
328,0.087697636,0.40499915,0.45876855,0.40261364,-0.80720103,-0.32669717,0.30590123,0.32645560
329,0.074518145,0.38245046,0.44760019,0.39337425,-0.78073513,-0.31681078,0.29450954,0.31434419
330,0.061637906,0.36011973,0.43622750,0.38393633,-0.75393370,-0.30664185,0.28319166,0.30231895
331,0.049105329,0.33805489,0.42464496,0.37429315,-0.72683685,-0.29621744,0.27195170,0.29038342
332,0.036967949,0.31630367,0.41284778,0.36443860,-0.69948539,-0.28556487,0.26079391,0.27854125
333,0.025272299,0.29491349,0.40083182,0.35436721,-0.67192076,-0.27471169,0.24972262,0.26679616
334,0.014063777,0.27393132,0.38859369,0.34407417,-0.64418497,-0.26368554,0.23874229,0.25515194
335,0.0033865203,0.25340356,0.37613074,0.33355534,-0.61632047,-0.25251416,0.22785745,0.24361243
336,-0.0067167132,0.23337598,0.36344110,0.32280730,-0.58837004,-0.24122524,0.21707268,0.23218152
337,-0.016204669,0.21389353,0.35052364,0.31182731,-0.56037676,-0.22984642,0.20639266,0.22086312
338,-0.025037711,0.19500029,0.33737806,0.30061338,-0.53238385,-0.21840514,0.19582209,0.20966116
339,-0.033177928,0.17673933,0.32400484,0.28916425,-0.50443459,-0.20692863,0.18536568,0.19857960
340,-0.040589246,0.15915262,0.31040527,0.27747939,-0.47657223,-0.19544380,0.17502818,0.18762236
341,-0.047237528,0.14228091,0.29658148,0.26555903,-0.44883991,-0.18397721,0.16481433,0.17679336
342,-0.053090668,0.12616365,0.28253639,0.25340414,-0.42128053,-0.17255496,0.15472885,0.16609649
343,-0.058118688,0.11083889,0.26827377,0.24101646,-0.39393668,-0.16120263,0.14477641,0.15553556
344,-0.062293817,0.096343183,0.25379820,0.22839848,-0.36685055,-0.14994524,0.13496166,0.14511436
345,-0.065590578,0.082711490,0.23911507,0.21555342,-0.34006382,-0.13880717,0.12528916,0.13483658
346,-0.067985853,0.069977111,0.22423060,0.20248526,-0.31361756,-0.12781208,0.11576339,0.12470582
347,-0.069458961,0.058171597,0.20915179,0.18919872,-0.28755219,-0.11698288,0.10638874,0.11472559
348,-0.069991710,0.047324678,0.19388646,0.17569924,-0.26190733,-0.10634165,0.097169504,0.10489926
349,-0.069568457,0.037464189,0.17844318,0.16199297,-0.23672178,-0.095909595,0.088109813,0.095230083
350,-0.068176153,0.028616007,0.16283131,0.14808677,-0.21203338,-0.085706980,0.079213680,0.085721170
351,-0.065804384,0.020803994,0.14706094,0.13398819,-0.18787896,-0.075753094,0.070484956,0.076375465
352,-0.062445407,0.014049934,0.13114289,0.11970543,-0.16429427,-0.066066193,0.061927317,0.067195743
353,-0.058094173,0.0083734915,0.11508868,0.10524733,-0.14131387,-0.056663457,0.053544260,0.058184594
354,-0.052748349,0.0037921642,0.098910512,0.090623396,-0.11897112,-0.047560946,0.045339079,0.049344412
355,-0.046408329,0.00032124381,0.082621239,0.075843688,-0.097298044,-0.038773566,0.037314861,0.040677382
356,-0.039077242,-0.0020262151,0.066234338,0.060918864,-0.076325311,-0.030315026,0.029474470,0.032185469
357,-0.030760942,-0.0032394227,0.049763878,0.045860127,-0.056082162,-0.022197813,0.021820534,0.023870408
358,-0.021468008,-0.0033098748,0.033224490,0.030679196,-0.036596354,-0.014433156,0.014355438,0.015733694
359,-0.011209718,-0.0022313677,0.016631330,0.015388280,-0.017894105,-0.0070310083,0.0070813110,0.0077765701
360,-3.2572117e-08,-7.8320710e-09,4.6417881e-08,4.3036607e-08,-4.8752334e-08,-1.9082613e-08,1.9477113e-08,2.1433877e-08
