XRT N-S vs UFSS-A
      177.022
      2.44647
     -4.23744
      2.44109
      1.37876
    -0.426836
      1.03038
XRT N-S vs UFSS-B
      162.401
     0.272847
     -1.73938
     0.527941
   -0.0757001
    0.0775352
     0.196380
XRT E-W vs UFSS-A
      3981.68
     -1.50539
     0.748810
    -0.341420
    -0.466034
     0.323946
    -0.159324
XRT E-W vs UFSS-B
      3962.47
     -2.25082
     -1.17256
     0.188417
    -0.957957
     0.600102
    -0.280792
SOT N-S vs UFSS-A
      30.5203
     0.974940
     -4.36391
      2.25580
     0.360992
     0.218833
     0.643501
SOT N-S vs UFSS-B
      14.0746
   -0.0435273
     -1.95396
     0.559917
    -0.186567
     0.136623
     0.113221
SOT E-W vs UFSS-A
      224.866
     -1.69039
      1.28625
     -1.22237
    -0.371262
     0.113202
    -0.484259
SOT E-W vs UFSS-B
      202.671
    -0.452526
     -1.39584
     0.480266
    0.0203104
     0.194789
   0.00610434
