XRT N-S vs UFSS-A
      231.068
     0.611324
     0.344748
     0.232101
    0.0282379
    0.0965729
    0.0398950
XRT N-S vs UFSS-B
      235.106
     0.510818
    -0.774605
   -0.0687742
  -0.00438124
    0.0285751
   -0.0533284
XRT E-W vs UFSS-A
      3978.21
    -0.964476
    -0.495541
     0.174241
   -0.0255190
    -0.152595
   -0.0518346
XRT E-W vs UFSS-B
      3975.91
     -1.00100
    -0.379159
     0.299117
    0.0906183
    -0.106591
    0.0116255
SOT N-S vs UFSS-A
      121.399
     0.480008
     0.635930
     0.312297
    0.0994243
    0.0360322
     0.102660
SOT N-S vs UFSS-B
      125.505
     0.442122
    -0.526169
     0.107673
    0.0706565
   -0.0564328
  -0.00237016
SOT E-W vs UFSS-A
      188.437
    -0.744771
    -0.616010
     0.128981
    0.0700265
   -0.0454302
    -0.100258
SOT E-W vs UFSS-B
      186.154
    -0.792854
    -0.498032
     0.262777
    0.0881543
   -0.0633224
    0.0104995
