A:0.036957827354358624 C:0.02173817510656686 D:0.551584220780172 E:0.0392429724464236 F:0.0031493986845767354 G:0.01211419866113935 H:0.00770504050273192 I:0.003339827442248817 K:0.03937480774019658 L:0.013080990815474534 M:0.006577116322674206 N:0.10832466638346493 P:0.0038671686173407356 Q:0.009374954223856329 R:0.013300716305096166 S:0.06865689132377284 T:0.05169408352498279 V:0.004790015673751593 W:0.0009374954223856329 Y:0.004189432668785797
A:0.058197958017783116 C:0.014296805191380902 D:0.003925762081239838 E:0.005009741163373225 F:0.1070209618117099 G:0.002563464045585715 H:0.07940879194925805 I:0.01211419866113935 K:0.004394509792432654 L:0.12215272386365301 M:0.005185521555070532 N:0.002446277117787511 P:0.12755797090834517 Q:0.0032958823443244908 R:0.004306619596584001 S:0.010312449646241962 T:0.0027831895352073478 V:0.006372039199027349 W:0.02699693849151127 Y:0.4016581950283446
A:0.005537082338465144 C:0.0027831895352073478 D:0.005214818287020083 E:0.010107372522595104 F:0.04110331492522009 G:0.0035302561999208987 H:0.007353479719337308 I:0.004160135936836246 K:0.005053686261297552 L:0.02507800254881568 M:0.0018456941128217148 N:0.0020068261385442453 P:0.00156737515930098 Q:0.0032665856123749396 R:0.006225555539279593 S:0.004394509792432654 T:0.0028857280970307764 V:0.006108368611481389 W:0.006181610441355267 Y:0.855596408220663
A:0.11793399446291766 C:0.0018310457468469392 D:0.14953051987050844 E:0.27557970908345175 F:0.0027978379011821233 G:0.043080844331814784 H:0.010649362063661799 I:0.010898384285232982 K:0.1536174139774708 L:0.022748912358826374 M:0.0026660026074091436 N:0.017607335901680166 P:0.0014501882315027758 Q:0.05547336194647487 R:0.032343592072304334 S:0.06112763121273822 T:0.025004760718941803 V:0.01270013330013037 W:0.00046874771119281643 Y:0.0024902222157118376
A:0.0341599894531765 C:0.0013330013037045718 D:0.014223563361507024 E:0.0099901855947969 F:0.015424729371438616 G:0.005610324168339021 H:0.0024902222157118376 I:0.3000571286273016 K:0.004833960771675919 L:0.14747974863403987 M:0.010766548991460003 N:0.004306619596584001 P:0.0033544758082235926 Q:0.0045409934521804095 R:0.009257767296058124 S:0.006533171224749879 T:0.06695768087069888 V:0.3520588278377547 W:0.0025048705816866127 Y:0.00411619083891192
A:0.007792930698580574 C:0.00048339607716759196 D:0.007983359456252654 E:0.00741207318323641 F:0.01687491760294139 G:0.011425725460324901 H:0.0018456941128217148 I:0.006577116322674206 K:0.003896465349290287 L:0.8932280604098612 M:0.009506789517629309 N:0.0036034980297947766 P:0.005068334627272328 Q:0.0017871006489226127 R:0.0024169803858379597 S:0.007866172528454451 T:0.002446277117787511 V:0.006899380374119267 W:0.00026367058754595923 Y:0.002622057509484817
A:0.01707999472658825 C:0.0037499816895425315 D:0.03937480774019658 E:0.06590299852051504 F:0.0015527267933262044 G:0.6649625734249345 H:0.00884761304876441 I:0.00300291502482898 K:0.022016494060087596 L:0.01642081825772335 M:0.0009228470564108574 N:0.05153295149926026 P:0.00953608624957886 Q:0.04048808355427952 R:0.013828057480188085 S:0.028608258748736577 T:0.004160135936836246 V:0.00600583004965796 W:0.0003955058813189389 Y:0.0016113202572253064
A:0.014589772510876411 C:0.010209911084418533 D:0.009360305857881553 E:0.008715777754991431 F:0.004321267962558777 G:0.004833960771675919 H:0.003911113715265062 I:0.1450188231502776 K:0.006796841812295839 L:0.20684957592980502 M:0.0024609254837622864 N:0.004907202601549797 P:0.00600583004965796 Q:0.0029443215609298782 R:0.003515607833946123 S:0.0073388313533625325 T:0.009550734615553636 V:0.5465158861528997 W:0.00038085751534416336 Y:0.0017724522829478371
A:0.07882285731026704 C:0.0016845620870991841 D:0.12099550295164574 E:0.11170843892363806 F:0.0009667921543351839 G:0.03506818814361258 H:0.012817320227928575 I:0.0033984209061479194 K:0.06937466125653684 L:0.009550734615553636 M:0.002592760777535266 N:0.03706036591618205 P:0.1456633512531677 Q:0.04218729400735348 R:0.03514142997348646 S:0.23311409612257752 T:0.049863037778135846 V:0.007133754229715675 W:0.0008349568605622043 Y:0.002021474504519021
A:0.03807110316844156 C:0.002021474504519021 D:0.02236805484348221 E:0.05229466652994858 F:0.007866172528454451 G:0.008071249652101308 H:0.020287986875064088 I:0.010048779058696002 K:0.2500183104574685 L:0.012480407810508737 M:0.005112279725196654 N:0.015073168588044004 P:0.17569250150145752 Q:0.031625822139540335 R:0.24240116015058522 S:0.05245579855567112 T:0.02308582477624621 V:0.019643458772173963 W:0.0019482326746451434 Y:0.009433547687755431
A:0.03098129403665021 C:0.0018017490148973883 D:0.2083583576252069 E:0.05494602077138295 F:0.008452107167445471 G:0.12476013300716306 H:0.015234300613766535 I:0.004409158158407429 K:0.030263524103886212 L:0.026733267903965314 M:0.00313475031860196 N:0.13451594474636355 P:0.009799756837124819 Q:0.017490148973881965 R:0.011923769903467269 S:0.14882739830371922 T:0.14008232381677824 V:0.010751900625485228 W:0.004511696720230858 Y:0.013022397351575432
A:0.6965151537346009 C:0.03476057245814229 D:0.023569220853413803 E:0.01642081825772335 F:0.00842281043549592 G:0.007045864033867022 H:0.0023290901899893066 I:0.005346653580793063 K:0.017636632633629717 L:0.007573205208958941 M:0.004306619596584001 N:0.006621061420598532 P:0.009038041806436492 Q:0.008745074486940983 R:0.02890122606823209 S:0.06486296453630598 T:0.023730352879136333 V:0.028403181625089723 W:0.0013183529377297962 Y:0.004453103256331756
-:1.4648365974775514e-05 A:0.02529772803843731 C:0.0018163973808721636 D:0.11614689381399505 E:0.02520983784258866 F:0.00770504050273192 G:0.027128773785284253 H:0.005610324168339021 I:0.004086894106962368 K:0.030644381619230374 L:0.010165965986494207 M:0.001201166009931592 N:0.03908184042070107 P:0.02824204959936719 Q:0.013740167284339432 R:0.009609328079452736 S:0.3733429035991035 T:0.2576501091303265 V:0.005082982993247103 W:0.005156224823120981 Y:0.013066342449499758
-:1.4648365974775514e-05 A:0.11220648336678044 C:0.0019482326746451434 D:0.17021401262689148 E:0.17901768057773154 F:0.01227533068686188 G:0.016904214334890942 H:0.007851524162479676 I:0.033486164618336825 K:0.06373504035624826 L:0.05225072143202426 M:0.00626950063720392 N:0.01652335681954678 P:0.07114711353948468 Q:0.10010693307161586 R:0.02050771236468572 S:0.046640397263685233 T:0.042201942373328256 V:0.03464338553034409 W:0.0008496052265369798 Y:0.011205999970703267
-:1.4648365974775514e-05 A:0.159476760367381 C:0.002622057509484817 D:0.2114638112118593 E:0.18960844917749425 F:0.0022851450920649804 G:0.020551657462610045 H:0.009448196053730207 I:0.01322747447522229 K:0.0870991840860152 L:0.020097558117392004 M:0.0031201019526271843 N:0.02811021430559421 P:0.015161058783892657 Q:0.05453586652408924 R:0.05191380901460442 S:0.07795860371775529 T:0.03161117377356556 V:0.016479411721622452 W:0.0003222640514450613 Y:0.004892554235575022
-:1.4648365974775514e-05 A:0.04606911099066899 C:0.00048339607716759196 D:0.1995839864063164 E:0.4781812588805719 F:0.0016845620870991841 G:0.005522433972490369 H:0.0030175633908037557 I:0.0142382117274818 K:0.026747916269940088 L:0.014033134603834943 M:0.002314441824014531 N:0.007866172528454451 P:0.004907202601549797 Q:0.07829551613517512 R:0.012597594738306942 S:0.014589772510876411 T:0.06184540114550222 V:0.021591691446819106 W:0.0002490222215711837 Y:0.006166962075380492
-:1.4648365974775514e-05 A:0.024506716275799433 C:0.0006445281028901226 D:0.012392517614660085 E:0.024770386863345394 F:0.0019921777725694697 G:0.002109364700367674 H:0.0033691241741983682 I:0.6293523957402551 K:0.02260242869907862 L:0.1278362898618659 M:0.003471662736021797 N:0.0036620914936938784 P:0.0052880601168939605 Q:0.010063427424670777 R:0.017680577731554046 S:0.01012202088856988 T:0.008290975141722941 V:0.08838824029179546 W:0.00026367058754595923 Y:0.0031786954165262866
-:1.4648365974775514e-05 A:0.027714708424275272 C:0.0010986274481081634 D:0.01564445486106025 E:0.021606339812793883 F:0.003046860122753307 G:0.0034863111019965724 H:0.008598590827193227 I:0.017592687535705392 K:0.6486003486311102 L:0.014926684928296248 M:0.0014062431335784492 N:0.016113202572253064 P:0.0020947163343928983 Q:0.017753819561427922 R:0.14052177479602151 S:0.020375877070912738 T:0.01740225877803331 V:0.010590768599762697 W:0.0006298797369153471 Y:0.010781197357434779
-:1.4648365974775514e-05 A:0.08331990566452312 C:0.0019189359426955922 D:0.014736256170624167 E:0.019247952890855024 F:0.005244115018969634 G:0.0034423660040722457 H:0.007148402595690451 I:0.013300716305096166 K:0.49010502878403917 L:0.02784654371804825 M:0.002871079731056001 N:0.011777286243719513 P:0.0027245960713082455 Q:0.0506686979067485 R:0.13470637350403564 S:0.0757320520895894 T:0.03265120775777462 V:0.01168939604787086 W:0.0007031215667892246 Y:0.010151317620519431
-:1.4648365974775514e-05 A:0.6524235721505266 C:0.003339827442248817 D:0.004174784302811021 E:0.017431555509982863 F:0.0044384548903569805 G:0.009433547687755431 H:0.01410637643370882 I:0.03150863521174213 K:0.04165995283226156 L:0.007968711090277879 M:0.0014208914995532248 N:0.010078075790645553 P:0.0025488156796109394 Q:0.042289832569176906 R:0.04965796065448899 S:0.058827837754698464 T:0.014340750289305228 V:0.011132758140829391 W:0.002680650973383919 Y:0.020522360730660494
-:1.4648365974775514e-05 A:0.020844624782105556 C:0.0010400339842090616 D:0.0045409934521804095 E:0.007441369915185961 F:0.10895454612038027 G:0.0014208914995532248 H:0.01371087055238988 I:0.00956538298152841 K:0.041542765904463354 L:0.01185052807359339 M:0.0012744078398054697 N:0.0024169803858379597 P:0.0026660026074091436 Q:0.010898384285232982 R:0.03191878945903585 S:0.006752896714371512 T:0.0037206849575929803 V:0.004526345086205634 W:0.009843701935049146 Y:0.7050551510978951
-:1.4648365974775514e-05 A:0.026308465290696824 C:0.0017431555509982862 D:0.00411619083891192 E:0.013037045717550207 F:0.010737252259510452 G:0.0014062431335784492 H:0.029208841753702374 I:0.011777286243719513 K:0.1340032519372464 L:0.02624987182679772 M:0.005478488874566042 N:0.005170873189095757 P:0.0030615084887280824 Q:0.01312493591339886 R:0.6182342859654005 S:0.008100546384050859 T:0.004394509792432654 V:0.010078075790645553 W:0.0031201019526271843 Y:0.07063442073036753
-:1.4648365974775514e-05 A:0.058505573703253405 C:0.002402332019863184 D:0.014282156825406126 E:0.025327024770386862 F:0.007426721549211186 G:0.011059516310955513 H:0.009506789517629309 I:0.011132758140829391 K:0.4757935752266835 L:0.03839336721988662 M:0.005009741163373225 N:0.016054609108353962 P:0.0034130692721226945 Q:0.0556930874360965 R:0.16940835249827882 S:0.03060043652130605 T:0.024111210394480494 V:0.01697745616476482 W:0.0006298797369153471 Y:0.02425769405422825
-:1.4648365974775514e-05 A:0.06612272401013666 C:0.0053905986787173895 D:0.004497048354256083 E:0.009492141151654533 F:0.006840786910220165 G:0.005859346389910205 H:0.01936513981865323 I:0.016332928061874696 K:0.09393997099623537 L:0.5808516559977734 M:0.047079848242928504 N:0.0030175633908037557 P:0.004848609137650695 Q:0.030746920181053804 R:0.0505515109789503 S:0.008173788213924737 T:0.006108368611481389 V:0.017900303221175678 W:0.0024169803858379597 Y:0.020449118900786618
-:2.9296731949551027e-05 A:0.5975361448430427 C:0.00911128363631037 D:0.0064892261268255525 E:0.007148402595690451 F:0.010327098012216738 G:0.0018017490148973883 H:0.00669430325047241 I:0.014926684928296248 K:0.03367659337600891 L:0.027612169862451845 M:0.02295398948247323 N:0.006108368611481389 P:0.004160135936836246 Q:0.008715777754991431 R:0.03101059076859976 S:0.1375335081371673 T:0.012890562057802452 V:0.052953842998813484 W:0.001713858819048735 Y:0.006606413054623757
-:5.8593463899102054e-05 A:0.0334422195204125 C:0.0009081986904360818 D:0.006372039199027349 E:0.008510700631344573 F:0.011337835264476247 G:0.002138661432317225 H:0.01724112675231078 I:0.0498337410461863 K:0.19760645699972168 L:0.33533039389456104 M:0.07470666647135513 N:0.006606413054623757 P:0.005024389529348001 Q:0.018662018251864004 R:0.16656656949917237 S:0.01713858819048735 T:0.004599586916079511 V:0.029238138485651925 W:0.0033251790762740415 Y:0.011352483630451023
-:0.00017578039169730616 A:0.037895322776744254 C:0.0018456941128217148 D:0.013154232645348412 E:0.09514113700616696 F:0.006840786910220165 G:0.0016699137211244085 H:0.019995019555568577 I:0.02874009404250956 K:0.3790997114271903 L:0.08456501677237904 M:0.01835440256639372 N:0.007851524162479676 P:0.016142499304202616 Q:0.1261663761407415 R:0.07104457497766124 S:0.020800679684181228 T:0.0293113803155258 V:0.029457863975273557 W:0.004086894106962368 Y:0.007661095404807593
-:0.00023437385559640822 A:0.020624899292483925 C:0.02879868750640866 D:0.017900303221175678 E:0.005873994755884981 F:0.072626598502937 G:0.0020361228704937964 H:0.10889595265648117 I:0.01482414636647282 K:0.020375877070912738 L:0.13551203363264827 M:0.012055605197240247 N:0.03153793194369168 P:0.014252860093456575 Q:0.005932588219784083 R:0.01201166009931592 S:0.015483322835337718 T:0.02654283914629323 V:0.05639620900288573 W:0.09244583766680826 Y:0.3056381560636911
-:0.0004248026132684899 A:0.013051694083524983 C:0.0007617150306883267 D:0.015629806495085472 E:0.00698727056996792 F:0.0019775294065946946 G:0.0030908052206776336 H:0.8213631769376126 I:0.0034423660040722457 K:0.018134677076772087 L:0.03861309270950825 M:0.001054682350183837 N:0.005449192142616491 P:0.026791861367864416 Q:0.010693307161586126 R:0.010576120233787921 S:0.0069140287400940425 T:0.0022119032621911025 V:0.003281233978349715 W:0.001655265355149633 Y:0.007895469260404003
-:0.0006445281028901226 A:0.011235296702652818 C:0.0015234300613766534 D:0.02563464045585715 E:0.004570290184129961 F:0.005097631359221879 G:0.0064892261268255525 H:0.016245037866026046 I:0.0020654196024433476 K:0.027670763326350947 L:0.015688399958984574 M:0.0023437385559640822 N:0.007734337234681471 P:0.8245711690860884 Q:0.003896465349290287 R:0.014311453557355677 S:0.006372039199027349 T:0.0038378718853911845 V:0.011220648336678043 W:0.0008203084945874288 Y:0.008027304554176981
-:0.0008349568605622043 A:0.00940425095580588 C:0.0011425725460324902 D:0.8187557677941025 E:0.010341746378191513 F:0.0020654196024433476 G:0.009462844419704982 H:0.047167738438777154 I:0.002622057509484817 K:0.011059516310955513 L:0.011777286243719513 M:0.004174784302811021 N:0.006884732008144491 P:0.020331931972988413 Q:0.005185521555070532 R:0.010942329383157309 S:0.005068334627272328 T:0.00911128363631037 V:0.005170873189095757 W:0.000541989541066694 Y:0.007954062724303103
-:0.0012158143759063676 A:0.032870933247396254 C:0.0015234300613766534 D:0.01861807315393968 E:0.008920854878638288 F:0.004980444431423675 G:0.012949155521701554 H:0.042524206424773316 I:0.019277249622804575 K:0.4490163622247938 L:0.04041484172440564 M:0.008950151610587839 N:0.024037968564606618 P:0.029296731949551028 Q:0.013784112382263758 R:0.14528249373782354 S:0.024902222157118372 T:0.03382307703575666 V:0.08216268475251585 W:0.0004101542472937144 Y:0.0050390378953227765
-:0.0014501882315027758 A:0.047460705758272666 C:0.02090321824600466 D:0.03607892539587209 E:0.010927681017182533 F:0.01904287576720817 G:0.054667701817862215 H:0.04891089398977544 I:0.01368157382044033 K:0.017592687535705392 L:0.036738101864736986 M:0.004775367307776818 N:0.4832935386057685 P:0.04293436067206703 Q:0.018984282303309067 R:0.014487233949052982 S:0.03670880513278744 T:0.022411999941406534 V:0.04675758419148344 W:0.004350564694508328 Y:0.017841709757276576
-:0.0018749908447712657 A:0.05731905605929659 C:0.004892554235575022 D:0.05091772012831969 E:0.01684562087099184 F:0.006533171224749879 G:0.09666456706754362 H:0.025444211698185067 I:0.014003837871885392 K:0.18087802305652803 L:0.021035053539777637 M:0.005170873189095757 N:0.022514538503229965 P:0.27700060058300496 Q:0.05206029267435218 R:0.04813453059311234 S:0.05622042861118842 T:0.02515124437868956 V:0.027172718883208578 W:0.0004101542472937144 Y:0.009755811739200492
-:0.002446277117787511 A:0.07854453835674631 C:0.00541989541066694 D:0.22633190267625647 E:0.0799214847583752 F:0.01606925747432874 G:0.17195716817788975 H:0.03685528879253519 I:0.0070165673019174715 K:0.048163827325061886 L:0.017329016948159432 M:0.0023290901899893066 N:0.10113231868985015 P:0.03808575153441634 Q:0.027289905811006782 R:0.015937422180555758 S:0.08012656188202207 T:0.02507800254881568 V:0.009257767296058124 W:0.00038085751534416336 Y:0.010327098012216738
-:0.0029003764630055515 A:0.08081503508283651 C:0.004599586916079511 D:0.2215125902705553 E:0.07354944555934785 F:0.008334920239647268 G:0.030732271815079027 H:0.011542912388123105 I:0.007631798672858042 K:0.05619113187923887 L:0.01792959995312523 M:0.007778282332605798 N:0.14684986889712454 P:0.159740430954927 Q:0.028007675743770784 R:0.038437312317810945 S:0.05964814624928589 T:0.022470593405305637 V:0.016215741134076495 W:0.0004540993452180409 Y:0.004658180379978613
-:0.0032372888804253885 A:0.09771924941772746 C:0.0019189359426955922 D:0.077650988032285 E:0.11169379055766329 F:0.01299310061962588 G:0.15206468718414462 H:0.012773375130004249 I:0.007675743770782369 K:0.11512150819576077 L:0.023950078368757965 M:0.003193343782501062 N:0.03877422473523078 P:0.14787525451535882 Q:0.03644513454524148 R:0.033178548932866536 S:0.06080536716129316 T:0.03322249403079087 V:0.022441296673356086 W:0.0013622980356541227 Y:0.005903291487834532
-:0.003764630055517307 A:0.26857779014750904 C:0.0045409934521804095 D:0.07453088607965781 E:0.16551188714898854 F:0.009331009125932002 G:0.02252918686920474 H:0.016083905840303513 I:0.013535090160692575 K:0.09467238929497415 L:0.0469040678512312 M:0.008832964682789634 N:0.03191878945903585 P:0.02348133065756515 Q:0.0397849619874903 R:0.03244613063412776 S:0.062079775001098625 T:0.04505837373840948 V:0.028461775088988825 W:0.0005566379070414695 Y:0.007397424817261635
-:0.004628883648029062 A:0.29969091947793225 C:0.00313475031860196 D:0.051796622086806215 E:0.18856841519328518 F:0.034951001215814376 G:0.021987197328138045 H:0.013608331990566453 I:0.013271419573146615 K:0.08547321546281512 L:0.024506716275799433 M:0.008364216971596818 N:0.014677662706725065 P:0.04117655675509397 Q:0.03514142997348646 R:0.03675275023071176 S:0.058988969780420994 T:0.03814434499831544 V:0.01946767838047666 W:0.0009228470564108574 Y:0.004746070575827267
-:0.0055663790704146955 A:0.17638097470227196 C:0.0019042875767208169 D:0.07331507170375144 E:0.2805601535148754 F:0.034658033896318864 G:0.033193197298841313 H:0.029208841753702374 I:0.017519445705831513 K:0.0793209017534094 L:0.02337879209574172 M:0.009580031347503185 N:0.03079086527897813 P:0.013784112382263758 Q:0.036884585524484745 R:0.029897314954516824 S:0.04833960771675919 T:0.03938945610617136 V:0.02824204959936719 W:0.00033691241741983684 Y:0.007748985600656247
-:0.006503874492800328 A:0.17614660084667555 C:0.0014941333294271025 D:0.052968491364788255 E:0.22874888306209443 F:0.018925688839409965 G:0.015556564665211596 H:0.011425725460324901 I:0.01939443655060278 K:0.1518303133285482 L:0.02863755548068613 M:0.013139584279373636 N:0.02154774634889478 P:0.006972622203993145 Q:0.06492155800020508 R:0.08283650958735553 S:0.03581525480832613 T:0.033720538473933234 V:0.016625895381370208 W:0.0009521437883604084 Y:0.011835879707618615
-:0.008613239193168002 A:0.10012158143759063 C:0.0026660026074091436 D:0.027377796006855436 E:0.08771441545695578 F:0.20856343474885378 G:0.009580031347503185 H:0.011586857486047432 I:0.030307469201810537 K:0.19132230799654298 L:0.04589333059897169 M:0.028593610382761803 N:0.02151844961694523 P:0.009946240496872575 Q:0.03539045219505764 R:0.08652789781299897 S:0.025590695357932822 T:0.03168441560343944 V:0.02603014633717609 W:0.0018163973808721636 Y:0.009155228734234697
-:0.010473581671964492 A:0.08438923638068173 C:0.003896465349290287 D:0.02608873980107519 E:0.07731407561486517 F:0.2625573117318763 G:0.014326101923330453 H:0.010898384285232982 I:0.05189916064862964 K:0.19171781387786194 L:0.031874844361111515 M:0.017387610412058534 N:0.020595602560534373 P:0.0034130692721226945 Q:0.052118886138251275 R:0.05436008613239193 S:0.0199803711895938 T:0.021928603864238946 V:0.034789869190091846 W:0.0010107372522595104 Y:0.00897944834253739
-:0.012978452253651105 A:0.09681105072729138 C:0.001713858819048735 D:0.04025370969868311 E:0.15717696690934127 F:0.08490192918979887 G:0.007470666647135512 H:0.01397454113993584 I:0.024697145033471517 K:0.20822652233143393 L:0.052397205091772016 M:0.015366135907539514 N:0.015878828716656655 P:0.0032665856123749396 Q:0.09594679713477962 R:0.05755342991489299 S:0.04293436067206703 T:0.02651354241434368 V:0.031171722794322294 W:0.0010986274481081634 Y:0.009667921543351839
-:0.014706959438674616 A:0.1017621984267655 C:0.0025488156796109394 D:0.04103007309534622 E:0.1960976753043198 F:0.0591061567082192 G:0.004936499333499348 H:0.011352483630451023 I:0.11929629249857178 K:0.09972607555627169 L:0.07792930698580573 M:0.01437004702125478 N:0.021166888833550616 P:0.003471662736021797 Q:0.056967495275901975 R:0.04079569923974981 S:0.020419822168837067 T:0.019540920210350535 V:0.08353963115414476 W:0.0008642535925117553 Y:0.010371043110141065
-:0.016962807798790044 A:0.14980883882402918 C:0.007602501940908492 D:0.017856358123251353 E:0.06187469787745177 F:0.04010722603893536 G:0.033559406448210705 H:0.009125932002285146 I:0.12369080229100445 K:0.08257283899980958 L:0.09177201283196859 M:0.011938418269442044 N:0.044223416877847276 P:0.003222640514450613 Q:0.058300496579606544 R:0.030146337176088008 S:0.0643063266292645 T:0.022939341116498455 V:0.09609328079452736 W:0.0038085751534416338 Y:0.030087743712188905
-:0.019057524133182943 A:0.10078075790645553 C:0.003999003911113715 D:0.025942256141327436 E:0.1326848989995166 F:0.029428567243324006 G:0.03889141166302899 H:0.015014575124144901 I:0.06014619069242826 K:0.09988720758199422 L:0.039726368523591196 M:0.014150321531633146 N:0.11353948467048501 P:0.0019775294065946946 Q:0.05308567829258646 R:0.03729473977177846 S:0.09650343504182109 T:0.0358299031743009 V:0.04457497766124189 W:0.005507785606515593 Y:0.03197738292293495
-:0.0213573175912227 A:0.2679332620446189 C:0.001962881040619919 D:0.034628737164369316 E:0.2035829903174301 F:0.04740211229437356 G:0.009374954223856329 H:0.010473581671964492 I:0.035024243045688255 K:0.04990698287606018 L:0.03569806788052793 M:0.005434543776641715 N:0.030146337176088008 P:0.002226551628165878 Q:0.07347620372947397 R:0.03905254368875152 S:0.041542765904463354 T:0.015937422180555758 V:0.04482399988281307 W:0.0058886431218597565 Y:0.02412585876045527
-:0.02436023261605168 A:0.30225438352351797 C:0.0019042875767208169 D:0.015981367278480086 E:0.06229950049072026 F:0.0418796783218832 G:0.005610324168339021 H:0.013447199964843922 I:0.03807110316844156 K:0.0591061567082192 L:0.05375950312742613 M:0.003076156854702858 N:0.015366135907539514 P:0.0025048705816866127 Q:0.051796622086806215 R:0.034731275726192744 S:0.03684064042656042 T:0.014912036562321472 V:0.04678688092343299 W:0.018588776421990128 Y:0.1567228675641232
-:0.02752427966660319 A:0.13480891206585904 C:0.00884761304876441 D:0.045922627330921235 E:0.1320257225306517 F:0.022309461379583107 G:0.0077636339666310224 H:0.021196185565500167 I:0.037338684869702786 K:0.03833477375598752 L:0.06004365213060483 M:0.00741207318323641 N:0.03404280252537829 P:0.0029003764630055515 Q:0.05266087567931797 R:0.029296731949551028 S:0.04417947177992295 T:0.03395491232952964 V:0.02255848360115429 W:0.00996088886284735 Y:0.22691783731524748
-:0.03161117377356556 A:0.1041498820806539 C:0.011088813042905064 D:0.06498015146410419 E:0.15902266102216298 F:0.012304627418811432 G:0.00868648102304188 H:0.011747989511769962 I:0.06569792139686818 K:0.02579577248157968 L:0.054799537111635196 M:0.0048632575036254705 N:0.03191878945903585 P:0.002138661432317225 Q:0.06938930962251161 R:0.01958486530827486 S:0.05702608873980108 T:0.04359353714093193 V:0.14406667936191717 W:0.0033691241741983682 Y:0.07416467693028843
-:0.03669415676681266 A:0.077650988032285 C:0.007104457497766124 D:0.04869116850015381 E:0.08573688605036109 F:0.01381340911421331 G:0.01171869277982041 H:0.005859346389910205 I:0.08638141415325121 K:0.027553576398552743 L:0.2271961562687682 M:0.0085546457292689 N:0.022411999941406534 P:0.019335843086703677 Q:0.02534167313636164 R:0.016625895381370208 S:0.02444812281190033 T:0.03663556330291356 V:0.17244056425505735 W:0.0009667921543351839 Y:0.044838648248787846
-:0.04542458288777887 A:0.0570114403738263 C:0.008539997363294125 D:0.030380711031684417 E:0.06216766519694728 F:0.008935503244613063 G:0.017153236556462125 H:0.007426721549211186 I:0.04520485739815724 K:0.049716554118388094 L:0.2990024462771178 M:0.009462844419704982 N:0.015454026103388167 P:0.016830972505017066 Q:0.02526843130648776 R:0.021166888833550616 S:0.1489006401335931 T:0.02906235809395462 V:0.06541960244334745 W:0.001113275814082939 Y:0.036357244349392824
-:0.05097631359221879 A:0.062153016830972505 C:0.008920854878638288 D:0.17597082045497825 E:0.0599411135687814 F:0.003764630055517307 G:0.02954575417112221 H:0.006123016977456165 I:0.02906235809395462 K:0.06602018544831324 L:0.09659132523766974 M:0.005595675802364247 N:0.05591281292571813 P:0.012187440491013227 Q:0.0242869907861778 R:0.022016494060087596 S:0.18071689103080552 T:0.04699195804707985 V:0.030322117567785314 W:0.0008935503244613064 Y:0.0320066796548845
-:0.05709933056967495 A:0.06256317107826621 C:0.004760718941802042 D:0.2526550163329281 E:0.06723599982421961 F:0.008950151610587839 G:0.008935503244613063 H:0.010429636574040165 I:0.014912036562321472 K:0.05986787173890752 L:0.06660612008730427 M:0.00355955293187045 N:0.0426560417185463 P:0.08230916841226361 Q:0.01841299603029282 R:0.04611305608859332 S:0.09165482590417039 T:0.032343592072304334 V:0.028432478357039274 W:0.0025195189476613883 Y:0.037983212972592904
-:0.06445281028901226 A:0.0999604494118681 C:0.0021240130663424494 D:0.10713814873950811 E:0.13680108983842854 F:0.0071191058637409 G:0.01625968623200082 H:0.0085546457292689 I:0.018691314983813555 K:0.0784273514289481 L:0.05332005214818287 M:0.0036181463957695517 N:0.02475573849737062 P:0.11787540099901855 Q:0.04765113451594474 R:0.04567360510935005 S:0.07186488347224868 T:0.03764630055517307 V:0.030102392078163683 W:0.003735333323567756 Y:0.0242283973222787
-:0.07488244686305243 A:0.06024872925425169 C:0.0018163973808721636 D:0.09471633439289848 E:0.12235780098729987 F:0.00555173070443992 G:0.013447199964843922 H:0.00982905356907437 I:0.026528190780318456 K:0.17132728844097442 L:0.04772437634581862 M:0.007221644425564329 N:0.02608873980107519 P:0.04076640250780025 Q:0.06149384036210761 R:0.057670616842691196 S:0.06549284427322133 T:0.03837871885391184 V:0.03391096723160531 W:0.007133754229715675 Y:0.033412922788462945
-:0.09030717623449104 A:0.033251790762740416 C:0.0011279241800577146 D:0.05545871358050009 E:0.04527809922803111 F:0.008466755533420247 G:0.00597653331770841 H:0.00685543527619494 I:0.02526843130648776 K:0.22602428699078617 L:0.07583459065141283 M:0.0037792784214920826 N:0.018852447009536085 P:0.022294813013608333 Q:0.05456516325603879 R:0.20194237332825524 S:0.05258763384944409 T:0.019013579035258618 V:0.019277249622804575 W:0.004028300643063266 Y:0.02980942475866817
-:0.10127880234959791 A:0.07760704293436067 C:0.0013476496696793474 D:0.06502409656202851 E:0.07656700895015162 F:0.004467751622306532 G:0.010590768599762697 H:0.006108368611481389 I:0.012172792125038452 K:0.11409612257752648 L:0.045541769815577074 M:0.0070165673019174715 N:0.011674747681896084 P:0.019863184261795598 Q:0.04417947177992295 R:0.2776451286858951 S:0.051869863916680095 T:0.02515124437868956 V:0.015703048324959352 W:0.0019921777725694697 Y:0.030102392078163683
-:0.13996513688898005 A:0.12423279183207113 C:0.0009960888862847348 D:0.06594694361843936 E:0.05345188744195585 F:0.008027304554176981 G:0.009462844419704982 H:0.011777286243719513 I:0.050727291370647604 K:0.12662047548595953 L:0.04828101425286009 M:0.010634713697687023 N:0.026689322806040985 P:0.019057524133182943 Q:0.060834663893242706 R:0.1350139891895059 S:0.04215799727540393 T:0.0213573175912227 V:0.021635636544743434 W:0.0008349568605622043 Y:0.022294813013608333
-:0.17975009887647034 A:0.09376419060453807 C:0.0018456941128217148 D:0.044062284852124746 E:0.05884248612067324 F:0.017123939824512574 G:0.006415984296951675 H:0.008027304554176981 I:0.035727364612477476 K:0.07894004423806525 L:0.04006328094101103 M:0.011542912388123105 N:0.01896963393733429 P:0.01684562087099184 Q:0.05143041293743683 R:0.09325149779542093 S:0.028007675743770784 T:0.023788946343035435 V:0.023788946343035435 W:0.003222640514450613 Y:0.16458904009257766
-:0.2108046347429944 A:0.03345686788638727 C:0.0006738248348396737 D:0.2004042949009038 E:0.024960815621017474 F:0.01737296204608376 G:0.0040136522770884905 H:0.007983359456252654 I:0.01880850191161176 K:0.04706519987695373 L:0.021445207787071353 M:0.0026074091435100413 N:0.016142499304202616 P:0.01067865879561135 Q:0.011191351604728493 R:0.07079555275609006 S:0.01750479733985674 T:0.011704044413845635 V:0.016435466623698127 W:0.013622980356541229 Y:0.24232791832071132
-:0.41583781329192726 A:0.031171722794322294 C:0.002109364700367674 D:0.25565793135775705 E:0.02869614894458523 F:0.006708951616447185 G:0.006503874492800328 H:0.004497048354256083 I:0.011191351604728493 K:0.03799786133856768 L:0.015571213031186372 M:0.0030175633908037557 N:0.014018486237860167 P:0.01195306663541682 Q:0.012758726764029473 R:0.0434909985791085 S:0.012070253563215023 T:0.00969721827530139 V:0.008481403899395022 W:0.0002929673194955103 Y:0.06827603380842867
-:0.6823794805689425 A:0.014428640485153882 C:0.0005566379070414695 D:0.07365198412117129 E:0.013901299310061963 F:0.007441369915185961 G:0.0015527267933262044 H:0.0023730352879136334 I:0.012890562057802452 K:0.037367981601652334 L:0.010473581671964492 M:0.0013476496696793474 N:0.007851524162479676 P:0.006533171224749879 Q:0.008715777754991431 R:0.04990698287606018 S:0.009038041806436492 T:0.009155228734234697 V:0.0066650065185228586 W:0.00048339607716759196 Y:0.043285921455461646
-:0.7631798672858042 A:0.012949155521701554 C:0.00026367058754595923 D:0.05308567829258646 E:0.011967715001391595 F:0.0078368757965049 G:0.0057128627301624504 H:0.0019042875767208169 I:0.00754390847700939 K:0.018559479690040577 L:0.006196258807330043 M:0.005112279725196654 N:0.004409158158407429 P:0.0017578039169730616 Q:0.006518522858775104 R:0.040209764600758785 S:0.008862261414739185 T:0.005654269266263348 V:0.009609328079452736 W:0.0015087816954018778 Y:0.027158070517233804
-:0.825054565163256 A:0.012685484934155595 C:0.00036620914936938783 D:0.03496564958178915 E:0.007587853574933716 F:0.0070165673019174715 G:0.0007324182987387757 H:0.001479484963452327 I:0.005141576457146206 K:0.013066342449499758 L:0.00613766534343094 M:0.0018310457468469392 N:0.0057128627301624504 P:0.0014062431335784492 Q:0.010151317620519431 R:0.037045717550207274 S:0.003823223519416409 T:0.002651354241434368 V:0.00156737515930098 W:0.0004540993452180409 Y:0.02112294373562629
-:0.8641364055839571 A:0.014340750289305228 C:0.00011718692779820411 D:0.02576647574963013 E:0.008701129389016656 F:0.0066650065185228586 G:0.004218729400735348 H:0.0007763633966631022 I:0.002475573849737062 K:0.0046142352820542866 L:0.006240203905254369 M:0.0016699137211244085 N:0.007426721549211186 P:0.0012304627418811432 Q:0.006225555539279593 R:0.011601505852022206 S:0.0028417829991064496 T:0.002475573849737062 V:0.001713858819048735 W:0.0010986274481081634 Y:0.0256639371878067
-:0.8953960185741281 A:0.00600583004965796 C:0.00019042875767208168 D:0.026689322806040985 E:0.010400339842090614 F:0.003925762081239838 G:0.0013915947676036739 H:0.0010693307161586125 I:0.0020654196024433476 K:0.0039404104472146135 L:0.0032372888804253885 M:0.00027831895352073476 N:0.007924765992353554 P:0.00046874771119281643 Q:0.002622057509484817 R:0.009623976445427512 S:0.0028124862671568985 T:0.0023437385559640822 V:0.0016406169891748576 W:0.00038085751534416336 Y:0.017592687535705392
-:0.9288968315584396 A:0.009433547687755431 C:5.8593463899102054e-05 D:0.018281160736519843 E:0.0031786954165262866 F:0.0019775294065946946 G:0.00014648365974775514 H:0.000600583004965796 I:0.0009081986904360818 K:0.0023290901899893066 L:0.0022119032621911025 M:0.00027831895352073476 N:0.0007324182987387757 P:0.000541989541066694 Q:0.0011279241800577146 R:0.00411619083891192 S:0.001655265355149633 T:0.0009521437883604084 V:0.002446277117787511 W:0.00023437385559640822 Y:0.01989248099374515
-:0.9607716759195511 A:0.0029443215609298782 C:7.324182987387757e-05 D:0.008745074486940983 E:0.0017724522829478371 F:0.0034130692721226945 G:0.00011718692779820411 H:0.0002929673194955103 I:0.0007177699327640002 K:0.0019775294065946946 L:0.0034863111019965724 M:0.00014648365974775514 N:0.000541989541066694 P:0.0005273411750919185 Q:0.0011572209120072655 R:0.0024902222157118376 S:0.0011425725460324902 T:0.0008203084945874288 V:0.0010400339842090616 W:7.324182987387757e-05 Y:0.007748985600656247
-:0.9701026850454831 A:0.0036034980297947766 D:0.006474577760850777 E:0.001083979082133388 F:0.00036620914936938783 G:4.394509792432654e-05 H:0.0002197254896216327 I:0.0019335843086703678 K:0.0014062431335784492 L:0.001596671891250531 M:0.00046874771119281643 N:0.003339827442248817 P:0.0003222640514450613 Q:0.000541989541066694 R:0.0014501882315027758 S:0.0010986274481081634 T:0.0009081986904360818 V:0.0008496052265369798 W:2.9296731949551027e-05 Y:0.004160135936836246
-:0.9775001098627448 A:0.0021826065302415518 C:4.394509792432654e-05 D:0.0052880601168939605 E:0.0009228470564108574 F:0.00023437385559640822 G:0.0002197254896216327 H:0.00016113202572253066 I:0.0018017490148973883 K:0.0008789019584865308 L:0.001201166009931592 M:0.00048339607716759196 N:0.0002490222215711837 P:0.0004980444431423674 Q:0.0005273411750919185 R:0.0011865176439568167 S:0.0007910117626378778 T:0.0007470666647135512 V:0.0021240130663424494 W:5.8593463899102054e-05 Y:0.0029003764630055515
-:0.9805762667174477 A:0.0010400339842090616 C:2.9296731949551027e-05 D:0.0030175633908037557 E:0.0006298797369153471 F:0.0002197254896216327 G:0.00016113202572253066 H:0.00013183529377297962 I:0.0006591764688648981 K:0.001054682350183837 L:0.003984355545138939 M:8.789019584865308e-05 N:0.00026367058754595923 P:0.0023290901899893066 Q:0.0004101542472937144 R:0.0009228470564108574 S:0.0010400339842090616 T:0.0006591764688648981 V:0.0014355398655280004 W:1.4648365974775514e-05 Y:0.0013330013037045718
-:0.9832129725929073 A:0.0007763633966631022 C:1.4648365974775514e-05 D:0.0018456941128217148 E:0.0004540993452180409 F:8.789019584865308e-05 G:0.0001025385618234286 H:2.9296731949551027e-05 I:0.0005566379070414695 K:0.0008789019584865308 L:0.0018749908447712657 M:4.394509792432654e-05 N:0.0003955058813189389 P:0.000512692809117143 Q:0.0004101542472937144 R:0.001113275814082939 S:0.004101542472937144 T:0.0009521437883604084 V:0.0014062431335784492 W:4.394509792432654e-05 Y:0.0011865176439568167
-:0.9844727320667379 A:0.0007031215667892246 C:2.9296731949551027e-05 D:0.004321267962558777 E:0.0005859346389910206 F:7.324182987387757e-05 G:0.0002050771236468572 H:5.8593463899102054e-05 I:7.324182987387757e-05 K:0.002534167313636164 L:0.0008203084945874288 M:4.394509792432654e-05 N:0.00027831895352073476 P:0.0006298797369153471 Q:0.00026367058754595923 R:0.0014355398655280004 S:0.00156737515930098 T:0.0006738248348396737 V:0.0003076156854702858 W:2.9296731949551027e-05 Y:0.0008935503244613064
-:0.9855127660509471 A:0.00048339607716759196 D:0.0021240130663424494 E:0.00048339607716759196 F:8.789019584865308e-05 G:8.789019584865308e-05 H:7.324182987387757e-05 I:0.00026367058754595923 K:0.0006884732008144492 L:0.0006591764688648981 M:2.9296731949551027e-05 N:0.00014648365974775514 P:0.0031493986845767354 Q:0.0002929673194955103 R:0.0031786954165262866 S:0.0009960888862847348 T:0.0006152313709405716 V:0.00026367058754595923 W:4.394509792432654e-05 Y:0.0008203084945874288
-:0.9865088549372317 A:0.0013330013037045718 D:0.0015820235252757555 E:0.0004248026132684899 F:4.394509792432654e-05 G:0.00014648365974775514 H:8.789019584865308e-05 I:0.00027831895352073476 K:0.0009081986904360818 L:0.0007617150306883267 M:5.8593463899102054e-05 N:0.0002050771236468572 P:0.0007617150306883267 Q:0.0003955058813189389 R:0.003193343782501062 S:0.0009228470564108574 T:0.0015087816954018778 V:0.00027831895352073476 W:1.4648365974775514e-05 Y:0.0005859346389910206
-:0.9871533830401219 A:0.0008056601286126532 D:0.0008935503244613064 E:0.0006591764688648981 F:7.324182987387757e-05 G:4.394509792432654e-05 H:5.8593463899102054e-05 I:0.0020068261385442453 K:0.002827134633131674 L:0.0005712862730162451 M:0.00046874771119281643 N:0.0002197254896216327 P:0.0003222640514450613 Q:0.0002197254896216327 R:0.0011425725460324902 S:0.0007470666647135512 T:0.0007470666647135512 V:0.00013183529377297962 Y:0.0009081986904360818
-:0.987797911143012 A:0.0004394509792432654 D:0.0009521437883604084 E:0.00033691241741983684 F:0.0006152313709405716 G:1.4648365974775514e-05 H:7.324182987387757e-05 I:0.0003955058813189389 K:0.0019042875767208169 L:0.0003515607833946123 M:8.789019584865308e-05 N:0.0003955058813189389 P:0.00014648365974775514 Q:0.0001025385618234286 R:0.003383772540173144 S:0.0004101542472937144 T:0.00027831895352073476 V:0.00017578039169730616 W:2.9296731949551027e-05 Y:0.002109364700367674
-:0.9888672418591706 A:0.0007763633966631022 C:1.4648365974775514e-05 D:0.002871079731056001 E:0.0007177699327640002 F:0.0002197254896216327 G:4.394509792432654e-05 H:5.8593463899102054e-05 I:2.9296731949551027e-05 K:0.0004540993452180409 L:0.000512692809117143 M:2.9296731949551027e-05 N:0.0002197254896216327 P:0.00036620914936938783 Q:0.000600583004965796 R:0.0016845620870991841 S:0.0014501882315027758 T:0.00014648365974775514 V:0.00013183529377297962 W:7.324182987387757e-05 Y:0.0007324182987387757
-:0.9917383215902266 A:0.00038085751534416336 C:2.9296731949551027e-05 D:0.0009960888862847348 E:0.0012744078398054697 F:0.00019042875767208168 G:4.394509792432654e-05 H:8.789019584865308e-05 I:0.0001025385618234286 K:0.0005273411750919185 L:0.00023437385559640822 N:2.9296731949551027e-05 P:2.9296731949551027e-05 Q:0.0007617150306883267 R:0.0016406169891748576 S:0.0010107372522595104 T:0.00014648365974775514 V:4.394509792432654e-05 W:1.4648365974775514e-05 Y:0.0007177699327640002
-:0.9929687843321078 A:0.0004394509792432654 D:0.0007324182987387757 E:0.0008642535925117553 F:0.00011718692779820411 G:7.324182987387757e-05 I:8.789019584865308e-05 K:0.0004394509792432654 L:7.324182987387757e-05 N:0.00014648365974775514 P:0.00011718692779820411 Q:0.00027831895352073476 R:0.0004248026132684899 S:0.00019042875767208168 T:0.00014648365974775514 V:2.9296731949551027e-05 Y:0.002871079731056001
-:0.9938769830225438 A:0.00016113202572253066 D:0.0028857280970307764 E:0.00027831895352073476 F:2.9296731949551027e-05 G:4.394509792432654e-05 H:0.00014648365974775514 I:5.8593463899102054e-05 K:0.00017578039169730616 L:0.00014648365974775514 N:0.0001025385618234286 P:5.8593463899102054e-05 Q:4.394509792432654e-05 R:0.00038085751534416336 S:0.00016113202572253066 T:0.00016113202572253066 V:5.8593463899102054e-05 W:1.4648365974775514e-05 Y:0.0012158143759063676
-:0.9968213045834737 A:0.00026367058754595923 D:0.0012744078398054697 E:0.00014648365974775514 F:1.4648365974775514e-05 G:4.394509792432654e-05 H:4.394509792432654e-05 I:1.4648365974775514e-05 K:0.00014648365974775514 L:8.789019584865308e-05 N:0.00011718692779820411 P:0.00013183529377297962 Q:4.394509792432654e-05 R:0.00016113202572253066 S:0.00016113202572253066 T:7.324182987387757e-05 V:1.4648365974775514e-05 Y:0.0004394509792432654
