{
 { "model" : "lara_metainfo.ItemClass",
    "fields": {
      "item_class" : "SingleLetterAlphabet", 
      "description" : "Generic alphabet with letters of size one."
    }
  },
  { "model" : "lara_metainfo.ItemClass",
    "fields": {
      "item_class" : "ProteinAlphabet", 
      "description" : "Generic single letter protein alphabet."
    }
  },
  { "model" : "lara_metainfo.ItemClass",
    "fields": {
      "item_class" : "NucleotideAlphabet", 
      "description" : "Generic single letter nucleotide alphabet."
    }
  },
  { "model" : "lara_metainfo.ItemClass",
    "fields": {
      "item_class" : "DNAAlphabet", 
      "description" : "Generic single letter DNA alphabet."
    }
  },
  { "model" : "lara_metainfo.ItemClass",
    "fields": {
      "item_class" : "RNAAlphabet", 
      "description" : "Generic single letter RNA alphabet."
    }
  },
  { "model" : "lara_metainfo.ItemClass",
    "fields": {
      "item_class" : "SecondaryStructure", 
      "description" : "Alphabet used to describe secondary structure."
    }
  },
  { "model" : "lara_metainfo.ItemClass",
    "fields": {
      "item_class" : "ThreeLetterProtein", 
      "description" : "Three letter protein alphabet."
    }
  },
  { "model" : "lara_metainfo.ItemClass",
    "fields": {
      "item_class" : "ExtendedIUPACProtein", 
      "description" : "Extended uppercase IUPAC protein single letter alphabet including X etc."
    }
  },
  { "model" : "lara_metainfo.ItemClass",
    "fields": {
      "item_class" : "IUPACProtein", 
      "description" : "Uppercase IUPAC protein single letter alphabet of the 20 standard amino acids."
    }
  },
  { "model" : "lara_metainfo.ItemClass",
    "fields": {
      "item_class" : "IUPACAmbiguousDNA", 
      "description" : "Uppercase IUPAC ambiguous DNA."
    }
  },
  { "model" : "lara_metainfo.ItemClass",
    "fields": {
      "item_class" : "IUPACUnambiguousDNA", 
      "description" : "Uppercase IUPAC unambiguous DNA (letters GATC only)."
    }
  },
  { "model" : "lara_metainfo.ItemClass",
    "fields": {
      "item_class" : "ExtendedIUPACDNA", 
      "description" : "Extended IUPAC DNA alphabet."
    }
  },
  { "model" : "lara_metainfo.ItemClass",
    "fields": {
      "item_class" : "IUPACAmbiguousRNA", 
      "description" : "Uppercase IUPAC ambiguous RNA."
    }
  },
  { "model" : "lara_metainfo.ItemClass",
    "fields": {
      "item_class" : "IUPACUnambiguousRNA", 
      "description" : "Uppercase IUPAC unambiguous RNA (letters GAUC only)."
    }
  },
  { "model" : "lara_metainfo.ItemClass",
    "fields": {
      "item_class" : "Murphy10", 
      "description" : "Murphy L.R., Wallqvist A, Levy RM. (2000) Simplified amino acid alphabets for protein fold recognition and implications for folding. Protein Eng. 13(3):149-152."
    }
  },
  { "model" : "lara_metainfo.ItemClass",
    "fields": {
      "item_class" : "Murphy8", 
      "description" : "Murphy L.R., Wallqvist A, Levy RM. (2000) Simplified amino acid alphabets for protein fold recognition and implications for folding. Protein Eng. 13(3):149-152."
    }
  },
  { "model" : "lara_metainfo.ItemClass",
    "fields": {
      "item_class" : "Murphy4", 
      "description" : "Murphy L.R., Wallqvist A, Levy RM. (2000) Simplified amino acid alphabets for protein fold recognition and implications for folding. Protein Eng. 13(3):149-152."
    }
  },
  { "model" : "lara_metainfo.ItemClass",
    "fields": {
      "item_class" : "HPModel", 
      "description" : "Murphy L.R., Wallqvist A, Levy RM. (2000) Simplified amino acid alphabets for protein fold recognition and implications for folding. Protein Eng. 13(3):149-152."
    }
  },
  { "model" : "lara_metainfo.ItemClass",
    "fields": {
      "item_class" : "PC5", 
      "description" : "Murphy L.R., Wallqvist A, Levy RM. (2000) Simplified amino acid alphabets for protein fold recognition and implications for folding. Protein Eng. 13(3):149-152."
    }
  },
   { "model" : "lara_metainfo.ItemClass",
   "fields": {
     "item_class" : "PNA1L", 
     "description" : "Peptide nucleic acid one letter code sequence"
    }
   }, 
   { "model" : "lara_metainfo.ItemClass",
   "fields": {
     "item_class" : "PNA3L", 
     "description" : "Peptide nucleic acid three letter code sequence"
    }
   }, 
   { "model" : "lara_metainfo.ItemClass",
   "fields": {
     "item_class" : "PNA5L", 
     "description" : "Peptide nucleic acid five letter code sequence"
    }
   },
 { "model" : "lara_metainfo.ItemClass",
   "fields": {
     "item_class" : "SeqDNA",
     "description" : "Sequencing DNA"
   }
 },
 { "model" : "lara_metainfo.ItemClass",
   "fields": {
     "item_class" : "SeqProtein",
     "description" : "Sequencing Protein"
   }
 },
 { "model" : "lara_metainfo.ItemClass",
   "fields": {
     "item_class" : "SeqProteinDiff",
     "description" : "Determine differences of a protein sequence"
   }
 }, 
   { "model" : "lara_metainfo.ItemClass",
   "fields": {
     "item_class" : "ML_best_prediction",
     "description" : "Machine learning results of best prediction"
   }
 }
}
