[
 { "model" : "lara_metainfo.ItemClass",
   "fields": {
     "item_class" : "project",
     "description":"A LARA project"
   }
 },
 { "model" : "lara_metainfo.ItemClass",
   "fields": {
     "item_class" : "experiment",
     "description":"A LARA experiment"
   }
 },
 { "model" : "lara_metainfo.ItemClass",
   "fields": {
     "item_class" : "ReportIntroduction",
     "description":"Report class - Introduction"
   }
 },
 { "model" : "lara_metainfo.ItemClass",
   "fields": {
     "item_class" : "ReportMaterialsMethods",
     "description":"Report class - Materials Methods"
   }
 },
 { "model" : "lara_metainfo.ItemClass",
   "fields": {
     "item_class" : "ReportResults",
     "description":"Report class - Report Results"
   }
 },
 { "model" : "lara_metainfo.ItemClass",
   "fields": {
     "item_class" : "ReportSummary",
     "description":"Report class - Report Summary"
   }
 },
 { "model" : "lara_metainfo.ItemClass",
   "fields": {
     "item_class" : "ReportAbstract",
     "description":"Report class - Report Abstract"
   }
 },
 { "model" : "lara_metainfo.ItemClass",
   "fields": {
     "item_class" : "ReportCriticalAnalysis",
     "description":"Report class - Report Critical Analysis (in some literature misleadingly called 'Discssion')"
   }
 },
 { "model" : "lara_metainfo.ItemClass",
   "fields": {
     "item_class" : "ReportReferences",
     "description":"Report class - Report References, Literature, Sources, ..."
   }
 },
 { "model" : "lara_metainfo.ItemClass",
   "fields": {
     "item_class" : "SelectedReport",
     "description":"Report class - report of selected items"
   }
 },
 { "model" : "lara_metainfo.ItemClass",
   "fields": {
     "item_class" : "MetaInfoTXT",
     "description":"MetaInfo text file"
   }
 },
 { "model" : "lara_metainfo.ItemClass",
   "fields": {
     "item_class" : "MetaInfoJSON",
     "description":"MetaInfo JSON file"
   }
 },
 { "model" : "lara_metainfo.ItemClass",
   "fields": {
     "item_class" : "MetaInfoXML",
     "description":"MetaInfo XML file"
   }
 },
 { "model" : "lara_metainfo.ItemClass",
   "fields": {
     "item_class" : "FullReport",
     "description":"Report class - full report"
   }
 },
  { "model" : "lara_metainfo.ItemClass",
   "fields": {
     "item_class" : "testing",
     "description":"status of experiment"
   }
 },
  { "model" : "lara_metainfo.ItemClass",
   "fields": {
     "item_class" : "replication",
     "description":"status of experiment"
   }
 },
  { "model" : "lara_metainfo.ItemClass",
   "fields": {
     "item_class" : "final",
     "description":"status of experiment"
   }
 },
  { "model" : "lara_metainfo.ItemClass",
   "fields": {
     "item_class" : "planned",
     "description":"status of experiment"
   }
 },
  { "model" : "lara_metainfo.ItemClass",
   "fields": {
     "item_class" : "failed",
     "description":"outcome of experiment"
   }
 },
  { "model" : "lara_metainfo.ItemClass",
   "fields": {
     "item_class" : "probablyFailed",
     "description":"outcome of experiment"
   }
 },
  { "model" : "lara_metainfo.ItemClass",
   "fields": {
     "item_class" : "ambiguous",
     "description":"outcome of experiment"
   }
 },
  { "model" : "lara_metainfo.ItemClass",
   "fields": {
     "item_class" : "probablySuccessful",
     "description":"outcome of experiment"
   }
 },
  { "model" : "lara_metainfo.ItemClass",
   "fields": {
     "item_class" : "successful",
     "description":"outcome of experiment"
   }
 },
 { "model" : "lara_metainfo.ItemClass",
   "fields": {
     "item_class" : "forPublication",
     "description":"outcome of experiment"
   }
 },
  { "model" : "lara_metainfo.ItemClass",
   "fields": {
     "item_class" : "resultsHTML",
     "description" : "HTML summary of results"
   }
 },
  { "model" : "lara_metainfo.ItemClass",
   "fields": {
     "item_class" : "resultsTeX",
     "description" : "TeX/LaTeX summary of results"
   }
 },
  { "model" : "lara_metainfo.ItemClass",
   "fields": {
     "item_class" : "resultsXML",
     "description" : "XML summary of results"
   }
 }
]
