<svg width="271" height="242" viewBox="0 0 271 242" fill="none" xmlns="http://www.w3.org/2000/svg">
<g clip-path="url(#clip0_1644_62958)">
<rect x="1" width="270.053" height="242.167" rx="5.87072" fill="#262626"/>
<rect x="24.4824" y="49.9014" width="223.087" height="0.73384" rx="0.36692" fill="#404040"/>
<path d="M184.233 219.492V218.415L187.404 213.406H188.301V214.938H187.754L185.619 218.32V218.379H190.045V219.492H184.233ZM187.798 220.878V219.163L187.812 218.682V213.406H189.089V220.878H187.798ZM191.01 219.492V218.415L194.18 213.406H195.077V214.938H194.53L192.396 218.32V218.379H196.821V219.492H191.01ZM194.574 220.878V219.163L194.589 218.682V213.406H195.866V220.878H194.574ZM199.275 219.856L199.228 220.258C199.194 220.564 199.133 220.875 199.046 221.192C198.96 221.51 198.87 221.803 198.776 222.071C198.681 222.338 198.604 222.549 198.546 222.702H197.656C197.69 222.554 197.736 222.352 197.794 222.096C197.855 221.841 197.913 221.554 197.969 221.235C198.025 220.917 198.063 220.593 198.082 220.265L198.108 219.856H199.275ZM203.158 213.304C203.515 213.306 203.863 213.37 204.201 213.494C204.542 213.615 204.848 213.815 205.121 214.092C205.393 214.367 205.61 214.735 205.77 215.197C205.931 215.66 206.011 216.231 206.011 216.912C206.013 217.554 205.945 218.128 205.807 218.634C205.67 219.138 205.475 219.563 205.219 219.911C204.964 220.259 204.656 220.524 204.296 220.706C203.936 220.889 203.531 220.98 203.081 220.98C202.609 220.98 202.191 220.888 201.826 220.703C201.464 220.518 201.171 220.265 200.947 219.944C200.723 219.623 200.586 219.256 200.535 218.842H201.866C201.934 219.139 202.073 219.375 202.282 219.55C202.494 219.723 202.76 219.809 203.081 219.809C203.599 219.809 203.998 219.584 204.278 219.134C204.558 218.684 204.697 218.059 204.697 217.259H204.646C204.527 217.473 204.373 217.658 204.183 217.813C203.993 217.967 203.778 218.085 203.537 218.167C203.299 218.25 203.046 218.291 202.778 218.291C202.341 218.291 201.947 218.187 201.596 217.977C201.249 217.768 200.972 217.481 200.768 217.116C200.566 216.752 200.464 216.335 200.462 215.865C200.462 215.379 200.574 214.942 200.797 214.555C201.024 214.166 201.339 213.86 201.742 213.636C202.146 213.41 202.618 213.299 203.158 213.304ZM203.161 214.398C202.899 214.398 202.662 214.463 202.45 214.592C202.241 214.718 202.075 214.891 201.954 215.11C201.835 215.326 201.775 215.568 201.775 215.836C201.778 216.101 201.837 216.342 201.954 216.558C202.073 216.775 202.235 216.946 202.439 217.073C202.646 217.199 202.882 217.262 203.147 217.262C203.344 217.262 203.528 217.225 203.698 217.149C203.868 217.074 204.016 216.969 204.143 216.836C204.272 216.699 204.372 216.545 204.442 216.372C204.515 216.2 204.55 216.017 204.548 215.825C204.548 215.57 204.487 215.334 204.365 215.117C204.246 214.901 204.082 214.727 203.873 214.595C203.666 214.464 203.429 214.398 203.161 214.398ZM210.199 213.406V220.878H208.845V214.723H208.801L207.054 215.84V214.599L208.911 213.406H210.199ZM214.628 220.98C214.141 220.98 213.706 220.889 213.321 220.706C212.937 220.522 212.632 220.269 212.406 219.948C212.182 219.627 212.063 219.259 212.048 218.846H213.362C213.386 219.152 213.518 219.403 213.759 219.597C214 219.79 214.289 219.886 214.628 219.886C214.893 219.886 215.129 219.825 215.335 219.703C215.542 219.582 215.705 219.413 215.824 219.196C215.943 218.98 216.002 218.733 215.999 218.455C216.002 218.173 215.942 217.923 215.821 217.704C215.699 217.485 215.532 217.313 215.321 217.189C215.109 217.063 214.866 217 214.591 217C214.367 216.997 214.147 217.039 213.931 217.124C213.714 217.209 213.543 217.321 213.416 217.459L212.194 217.259L212.584 213.406H216.919V214.537H213.704L213.489 216.518H213.533C213.672 216.355 213.867 216.22 214.12 216.113C214.373 216.004 214.651 215.949 214.952 215.949C215.405 215.949 215.808 216.056 216.163 216.27C216.519 216.482 216.798 216.774 217.003 217.146C217.207 217.518 217.309 217.943 217.309 218.423C217.309 218.916 217.195 219.357 216.966 219.743C216.74 220.128 216.425 220.43 216.021 220.652C215.62 220.871 215.155 220.98 214.628 220.98ZM225.968 215.274L223.972 220.878H222.513L220.517 215.274H221.925L223.213 219.437H223.272L224.563 215.274H225.968ZM229.069 220.987C228.522 220.987 228.048 220.867 227.646 220.626C227.245 220.385 226.934 220.049 226.712 219.616C226.494 219.183 226.384 218.677 226.384 218.098C226.384 217.519 226.494 217.012 226.712 216.577C226.934 216.141 227.245 215.803 227.646 215.562C228.048 215.321 228.522 215.201 229.069 215.201C229.617 215.201 230.091 215.321 230.492 215.562C230.893 215.803 231.204 216.141 231.422 216.577C231.644 217.012 231.754 217.519 231.754 218.098C231.754 218.677 231.644 219.183 231.422 219.616C231.204 220.049 230.893 220.385 230.492 220.626C230.091 220.867 229.617 220.987 229.069 220.987ZM229.077 219.929C229.373 219.929 229.621 219.848 229.821 219.685C230.02 219.52 230.169 219.298 230.266 219.021C230.366 218.744 230.416 218.435 230.416 218.094C230.416 217.751 230.366 217.441 230.266 217.164C230.169 216.884 230.02 216.662 229.821 216.496C229.621 216.331 229.373 216.248 229.077 216.248C228.773 216.248 228.52 216.331 228.318 216.496C228.118 216.662 227.969 216.884 227.869 217.164C227.772 217.441 227.723 217.751 227.723 218.094C227.723 218.435 227.772 218.744 227.869 219.021C227.969 219.298 228.118 219.52 228.318 219.685C228.52 219.848 228.773 219.929 229.077 219.929ZM235.608 215.274V216.296H232.386V215.274H235.608ZM233.182 213.931H234.502V219.192C234.502 219.37 234.529 219.506 234.582 219.601C234.638 219.693 234.711 219.757 234.801 219.791C234.891 219.825 234.991 219.842 235.101 219.842C235.183 219.842 235.259 219.836 235.327 219.824C235.397 219.811 235.451 219.8 235.487 219.791L235.71 220.823C235.639 220.848 235.538 220.874 235.407 220.903C235.278 220.933 235.12 220.95 234.933 220.955C234.602 220.964 234.304 220.914 234.039 220.805C233.774 220.693 233.563 220.52 233.408 220.287C233.254 220.053 233.179 219.762 233.182 219.411V213.931ZM239.067 220.987C238.505 220.987 238.02 220.871 237.611 220.637C237.205 220.401 236.892 220.068 236.674 219.637C236.455 219.205 236.345 218.695 236.345 218.109C236.345 217.532 236.455 217.026 236.674 216.591C236.895 216.153 237.204 215.813 237.6 215.57C237.997 215.324 238.462 215.201 238.998 215.201C239.343 215.201 239.669 215.257 239.975 215.369C240.284 215.478 240.557 215.649 240.793 215.88C241.031 216.111 241.218 216.405 241.354 216.763C241.491 217.118 241.559 217.541 241.559 218.032V218.437H236.965V217.547H240.293C240.29 217.294 240.236 217.069 240.129 216.872C240.022 216.673 239.872 216.516 239.68 216.401C239.49 216.287 239.269 216.23 239.016 216.23C238.746 216.23 238.509 216.296 238.304 216.427C238.1 216.556 237.941 216.726 237.826 216.938C237.715 217.147 237.657 217.377 237.655 217.627V218.404C237.655 218.73 237.715 219.01 237.834 219.243C237.953 219.475 238.119 219.652 238.334 219.776C238.548 219.898 238.798 219.959 239.085 219.959C239.277 219.959 239.451 219.932 239.607 219.878C239.762 219.822 239.897 219.741 240.012 219.634C240.126 219.527 240.212 219.394 240.271 219.236L241.504 219.375C241.426 219.701 241.278 219.985 241.059 220.229C240.842 220.469 240.565 220.657 240.227 220.79C239.889 220.922 239.502 220.987 239.067 220.987ZM247.039 216.755L245.835 216.887C245.801 216.765 245.741 216.651 245.656 216.544C245.574 216.437 245.462 216.35 245.321 216.285C245.18 216.219 245.007 216.186 244.803 216.186C244.528 216.186 244.297 216.246 244.109 216.365C243.925 216.484 243.833 216.639 243.836 216.828C243.833 216.991 243.893 217.124 244.015 217.226C244.139 217.328 244.343 217.412 244.627 217.478L245.583 217.682C246.114 217.796 246.508 217.977 246.765 218.226C247.026 218.474 247.157 218.798 247.159 219.2C247.157 219.552 247.054 219.864 246.849 220.134C246.647 220.401 246.367 220.61 246.007 220.761C245.647 220.912 245.233 220.987 244.766 220.987C244.08 220.987 243.528 220.844 243.11 220.557C242.691 220.267 242.442 219.865 242.362 219.349L243.65 219.225C243.708 219.478 243.832 219.669 244.022 219.798C244.212 219.927 244.458 219.991 244.762 219.991C245.076 219.991 245.328 219.927 245.518 219.798C245.71 219.669 245.806 219.51 245.806 219.32C245.806 219.16 245.744 219.027 245.62 218.922C245.498 218.818 245.309 218.738 245.051 218.682L244.095 218.481C243.557 218.369 243.16 218.181 242.902 217.915C242.644 217.648 242.516 217.31 242.519 216.901C242.516 216.556 242.61 216.257 242.8 216.004C242.992 215.748 243.258 215.551 243.599 215.413C243.942 215.272 244.337 215.201 244.784 215.201C245.441 215.201 245.958 215.341 246.335 215.621C246.714 215.9 246.949 216.279 247.039 216.755Z" fill="#737373"/>
<path d="M45.4276 148.16C45.4276 149.08 45.2553 149.868 44.9106 150.524C44.5687 151.177 44.1017 151.678 43.5096 152.025C42.9203 152.373 42.2518 152.546 41.5041 152.546C40.7563 152.546 40.0864 152.373 39.4943 152.025C38.905 151.675 38.438 151.173 38.0934 150.52C37.7515 149.864 37.5805 149.077 37.5805 148.16C37.5805 147.24 37.7515 146.453 38.0934 145.8C38.438 145.144 38.905 144.642 39.4943 144.295C40.0864 143.947 40.7563 143.774 41.5041 143.774C42.2518 143.774 42.9203 143.947 43.5096 144.295C44.1017 144.642 44.5687 145.144 44.9106 145.8C45.2553 146.453 45.4276 147.24 45.4276 148.16ZM43.8724 148.16C43.8724 147.512 43.7709 146.966 43.568 146.521C43.3678 146.074 43.0899 145.736 42.7341 145.508C42.3783 145.278 41.9683 145.162 41.5041 145.162C41.0398 145.162 40.6298 145.278 40.274 145.508C39.9182 145.736 39.6389 146.074 39.436 146.521C39.2358 146.966 39.1358 147.512 39.1358 148.16C39.1358 148.808 39.2358 149.355 39.436 149.803C39.6389 150.248 39.9182 150.585 40.274 150.816C40.6298 151.044 41.0398 151.158 41.5041 151.158C41.9683 151.158 42.3783 151.044 42.7341 150.816C43.0899 150.585 43.3678 150.248 43.568 149.803C43.7709 149.355 43.8724 148.808 43.8724 148.16ZM46.6913 154.831V146.025H48.1756V147.084H48.2632C48.341 146.929 48.4508 146.763 48.5926 146.588C48.7343 146.41 48.9261 146.259 49.168 146.134C49.4098 146.006 49.7184 145.942 50.0936 145.942C50.5884 145.942 51.0345 146.068 51.432 146.321C51.8323 146.571 52.1492 146.943 52.3827 147.435C52.619 147.924 52.7371 148.524 52.7371 149.236C52.7371 149.939 52.6217 150.537 52.391 151.029C52.1603 151.521 51.8462 151.896 51.4487 152.154C51.0512 152.413 50.6009 152.542 50.0978 152.542C49.7309 152.542 49.4265 152.481 49.1847 152.359C48.9428 152.236 48.7482 152.089 48.6009 151.917C48.4564 151.742 48.3438 151.576 48.2632 151.421H48.2006V154.831H46.6913ZM48.1715 149.227C48.1715 149.642 48.2298 150.004 48.3466 150.316C48.4661 150.627 48.6371 150.87 48.8594 151.045C49.0846 151.218 49.357 151.304 49.6767 151.304C50.0102 151.304 50.2896 151.215 50.5147 151.037C50.7399 150.856 50.9095 150.61 51.0234 150.299C51.1402 149.985 51.1985 149.628 51.1985 149.227C51.1985 148.83 51.1416 148.477 51.0276 148.168C50.9136 147.86 50.7441 147.618 50.5189 147.443C50.2938 147.268 50.013 147.18 49.6767 147.18C49.3542 147.18 49.0804 147.265 48.8553 147.435C48.6301 147.604 48.4592 147.842 48.3424 148.148C48.2284 148.453 48.1715 148.813 48.1715 149.227ZM57.0956 146.025V147.193H53.4139V146.025H57.0956ZM54.3229 144.491H55.8322V150.503C55.8322 150.706 55.8628 150.862 55.924 150.97C55.9879 151.076 56.0713 151.148 56.1741 151.187C56.277 151.226 56.391 151.246 56.516 151.246C56.6106 151.246 56.6967 151.239 56.7746 151.225C56.8552 151.211 56.9163 151.198 56.958 151.187L57.2124 152.367C57.1318 152.395 57.0164 152.426 56.8663 152.459C56.719 152.492 56.5383 152.512 56.3243 152.517C55.9462 152.528 55.6057 152.471 55.3027 152.346C54.9997 152.218 54.7593 152.021 54.5814 151.754C54.4063 151.487 54.3201 151.154 54.3229 150.754V144.491ZM58.2259 152.43V146.025H59.7352V152.43H58.2259ZM58.9847 145.116C58.7457 145.116 58.54 145.037 58.3676 144.879C58.1953 144.717 58.1091 144.524 58.1091 144.299C58.1091 144.071 58.1953 143.878 58.3676 143.72C58.54 143.558 58.7457 143.478 58.9847 143.478C59.2265 143.478 59.4322 143.558 59.6018 143.72C59.7741 143.878 59.8603 144.071 59.8603 144.299C59.8603 144.524 59.7741 144.717 59.6018 144.879C59.4322 145.037 59.2265 145.116 58.9847 145.116ZM63.9489 152.555C63.3234 152.555 62.7814 152.417 62.3227 152.142C61.8641 151.867 61.5083 151.482 61.2553 150.987C61.0052 150.492 60.8801 149.914 60.8801 149.252C60.8801 148.591 61.0052 148.011 61.2553 147.514C61.5083 147.016 61.8641 146.63 62.3227 146.355C62.7814 146.079 63.3234 145.942 63.9489 145.942C64.5743 145.942 65.1163 146.079 65.575 146.355C66.0336 146.63 66.388 147.016 66.6382 147.514C66.8912 148.011 67.0176 148.591 67.0176 149.252C67.0176 149.914 66.8912 150.492 66.6382 150.987C66.388 151.482 66.0336 151.867 65.575 152.142C65.1163 152.417 64.5743 152.555 63.9489 152.555ZM63.9572 151.346C64.2963 151.346 64.5798 151.252 64.8078 151.066C65.0357 150.877 65.2053 150.624 65.3165 150.307C65.4304 149.991 65.4874 149.637 65.4874 149.248C65.4874 148.856 65.4304 148.502 65.3165 148.185C65.2053 147.865 65.0357 147.611 64.8078 147.422C64.5798 147.233 64.2963 147.139 63.9572 147.139C63.6097 147.139 63.3206 147.233 63.0899 147.422C62.862 147.611 62.691 147.865 62.5771 148.185C62.4659 148.502 62.4103 148.856 62.4103 149.248C62.4103 149.637 62.4659 149.991 62.5771 150.307C62.691 150.624 62.862 150.877 63.0899 151.066C63.3206 151.252 63.6097 151.346 63.9572 151.346ZM69.676 148.677V152.43H68.1666V146.025H69.6093V147.114H69.6844C69.8317 146.755 70.0666 146.47 70.389 146.259C70.7142 146.048 71.1159 145.942 71.594 145.942C72.036 145.942 72.421 146.036 72.749 146.225C73.0798 146.414 73.3355 146.688 73.5162 147.047C73.6996 147.405 73.79 147.84 73.7872 148.352V152.43H72.2778V148.585C72.2778 148.157 72.1666 147.822 71.9442 147.581C71.7247 147.339 71.4203 147.218 71.0311 147.218C70.767 147.218 70.5322 147.276 70.3265 147.393C70.1235 147.507 69.9637 147.672 69.847 147.889C69.733 148.106 69.676 148.369 69.676 148.677ZM79.1331 152.43H77.482L80.4882 143.89H82.3979L85.4083 152.43H83.7572L81.4764 145.642H81.4097L79.1331 152.43ZM79.1873 149.082H83.6904V150.324H79.1873V149.082Z" fill="white"/>
<rect x="25.5808" y="133.926" width="221.622" height="29.0076" rx="5.5038" stroke="#737373" stroke-width="0.73384"/>
<g filter="url(#filter0_d_1644_62958)">
<rect x="25.2139" y="168.783" width="222.356" height="29.7414" rx="5.87072" fill="#262626"/>
<path d="M45.4276 183.385C45.4276 184.305 45.2553 185.093 44.9106 185.749C44.5687 186.402 44.1017 186.902 43.5096 187.25C42.9203 187.597 42.2518 187.771 41.5041 187.771C40.7563 187.771 40.0864 187.597 39.4943 187.25C38.905 186.9 38.438 186.398 38.0934 185.745C37.7515 185.089 37.5805 184.302 37.5805 183.385C37.5805 182.465 37.7515 181.678 38.0934 181.025C38.438 180.369 38.905 179.867 39.4943 179.52C40.0864 179.172 40.7563 178.998 41.5041 178.998C42.2518 178.998 42.9203 179.172 43.5096 179.52C44.1017 179.867 44.5687 180.369 44.9106 181.025C45.2553 181.678 45.4276 182.465 45.4276 183.385ZM43.8724 183.385C43.8724 182.737 43.7709 182.191 43.568 181.746C43.3678 181.299 43.0899 180.961 42.7341 180.733C42.3783 180.502 41.9683 180.387 41.5041 180.387C41.0398 180.387 40.6298 180.502 40.274 180.733C39.9182 180.961 39.6389 181.299 39.436 181.746C39.2358 182.191 39.1358 182.737 39.1358 183.385C39.1358 184.032 39.2358 184.58 39.436 185.027C39.6389 185.472 39.9182 185.81 40.274 186.041C40.6298 186.269 41.0398 186.383 41.5041 186.383C41.9683 186.383 42.3783 186.269 42.7341 186.041C43.0899 185.81 43.3678 185.472 43.568 185.027C43.7709 184.58 43.8724 184.032 43.8724 183.385ZM46.6913 190.056V181.25H48.1756V182.309H48.2632C48.341 182.153 48.4508 181.988 48.5926 181.813C48.7343 181.635 48.9261 181.483 49.168 181.358C49.4098 181.23 49.7184 181.166 50.0936 181.166C50.5884 181.166 51.0345 181.293 51.432 181.546C51.8323 181.796 52.1492 182.167 52.3827 182.659C52.619 183.148 52.7371 183.749 52.7371 184.46C52.7371 185.164 52.6217 185.761 52.391 186.253C52.1603 186.745 51.8462 187.121 51.4487 187.379C51.0512 187.638 50.6009 187.767 50.0978 187.767C49.7309 187.767 49.4265 187.706 49.1847 187.583C48.9428 187.461 48.7482 187.314 48.6009 187.141C48.4564 186.966 48.3438 186.801 48.2632 186.645H48.2006V190.056H46.6913ZM48.1715 184.452C48.1715 184.866 48.2298 185.229 48.3466 185.54C48.4661 185.852 48.6371 186.095 48.8594 186.27C49.0846 186.442 49.357 186.529 49.6767 186.529C50.0102 186.529 50.2896 186.44 50.5147 186.262C50.7399 186.081 50.9095 185.835 51.0234 185.524C51.1402 185.21 51.1985 184.852 51.1985 184.452C51.1985 184.055 51.1416 183.702 51.0276 183.393C50.9136 183.084 50.7441 182.843 50.5189 182.668C50.2938 182.492 50.013 182.405 49.6767 182.405C49.3542 182.405 49.0804 182.49 48.8553 182.659C48.6301 182.829 48.4592 183.066 48.3424 183.372C48.2284 183.678 48.1715 184.038 48.1715 184.452ZM57.0956 181.25V182.417H53.4139V181.25H57.0956ZM54.3229 179.715H55.8322V185.728C55.8322 185.931 55.8628 186.087 55.924 186.195C55.9879 186.301 56.0713 186.373 56.1741 186.412C56.277 186.451 56.391 186.47 56.516 186.47C56.6106 186.47 56.6967 186.463 56.7746 186.449C56.8552 186.435 56.9163 186.423 56.958 186.412L57.2124 187.592C57.1318 187.62 57.0164 187.65 56.8663 187.683C56.719 187.717 56.5383 187.736 56.3243 187.742C55.9462 187.753 55.6057 187.696 55.3027 187.571C54.9997 187.443 54.7593 187.246 54.5814 186.979C54.4063 186.712 54.3201 186.378 54.3229 185.978V179.715ZM58.2259 187.654V181.25H59.7352V187.654H58.2259ZM58.9847 180.341C58.7457 180.341 58.54 180.262 58.3676 180.103C58.1953 179.942 58.1091 179.749 58.1091 179.524C58.1091 179.296 58.1953 179.103 58.3676 178.944C58.54 178.783 58.7457 178.702 58.9847 178.702C59.2265 178.702 59.4322 178.783 59.6018 178.944C59.7741 179.103 59.8603 179.296 59.8603 179.524C59.8603 179.749 59.7741 179.942 59.6018 180.103C59.4322 180.262 59.2265 180.341 58.9847 180.341ZM63.9489 187.779C63.3234 187.779 62.7814 187.642 62.3227 187.367C61.8641 187.091 61.5083 186.706 61.2553 186.212C61.0052 185.717 60.8801 185.139 60.8801 184.477C60.8801 183.816 61.0052 183.236 61.2553 182.738C61.5083 182.241 61.8641 181.854 62.3227 181.579C62.7814 181.304 63.3234 181.166 63.9489 181.166C64.5743 181.166 65.1163 181.304 65.575 181.579C66.0336 181.854 66.388 182.241 66.6382 182.738C66.8912 183.236 67.0176 183.816 67.0176 184.477C67.0176 185.139 66.8912 185.717 66.6382 186.212C66.388 186.706 66.0336 187.091 65.575 187.367C65.1163 187.642 64.5743 187.779 63.9489 187.779ZM63.9572 186.57C64.2963 186.57 64.5798 186.477 64.8078 186.291C65.0357 186.102 65.2053 185.849 65.3165 185.532C65.4304 185.215 65.4874 184.862 65.4874 184.473C65.4874 184.081 65.4304 183.727 65.3165 183.41C65.2053 183.09 65.0357 182.836 64.8078 182.647C64.5798 182.458 64.2963 182.363 63.9572 182.363C63.6097 182.363 63.3206 182.458 63.0899 182.647C62.862 182.836 62.691 183.09 62.5771 183.41C62.4659 183.727 62.4103 184.081 62.4103 184.473C62.4103 184.862 62.4659 185.215 62.5771 185.532C62.691 185.849 62.862 186.102 63.0899 186.291C63.3206 186.477 63.6097 186.57 63.9572 186.57ZM69.676 183.902V187.654H68.1666V181.25H69.6093V182.338H69.6844C69.8317 181.98 70.0666 181.695 70.389 181.483C70.7142 181.272 71.1159 181.166 71.594 181.166C72.036 181.166 72.421 181.261 72.749 181.45C73.0798 181.639 73.3355 181.913 73.5162 182.271C73.6996 182.63 73.79 183.065 73.7872 183.576V187.654H72.2778V183.81C72.2778 183.382 72.1666 183.047 71.9442 182.805C71.7247 182.563 71.4203 182.442 71.0311 182.442C70.767 182.442 70.5322 182.501 70.3265 182.617C70.1235 182.731 69.9637 182.897 69.847 183.114C69.733 183.33 69.676 183.593 69.676 183.902ZM78.0365 187.654V179.115H81.3055C81.9226 179.115 82.4354 179.212 82.844 179.407C83.2554 179.599 83.5626 179.861 83.7655 180.195C83.9712 180.529 84.074 180.907 84.074 181.329C84.074 181.677 84.0073 181.974 83.8739 182.221C83.7405 182.466 83.5612 182.665 83.336 182.818C83.1109 182.971 82.8593 183.08 82.5813 183.147V183.23C82.8843 183.247 83.1748 183.34 83.4528 183.51C83.7335 183.677 83.9629 183.913 84.1408 184.219C84.3187 184.524 84.4076 184.894 84.4076 185.328C84.4076 185.77 84.3006 186.167 84.0866 186.52C83.8725 186.87 83.5501 187.147 83.1192 187.35C82.6884 187.553 82.1463 187.654 81.4931 187.654H78.0365ZM79.5834 186.362H81.2471C81.8086 186.362 82.213 186.255 82.4604 186.041C82.7106 185.824 82.8357 185.546 82.8357 185.207C82.8357 184.954 82.7731 184.726 82.6481 184.523C82.523 184.317 82.3451 184.156 82.1144 184.039C81.8836 183.92 81.6085 183.86 81.2888 183.86H79.5834V186.362ZM79.5834 182.747H81.1137C81.3805 182.747 81.621 182.698 81.835 182.601C82.049 182.501 82.2172 182.36 82.3395 182.18C82.4646 181.996 82.5271 181.779 82.5271 181.529C82.5271 181.198 82.4104 180.926 82.1769 180.712C81.9462 180.498 81.6029 180.391 81.147 180.391H79.5834V182.747Z" fill="white"/>
<rect x="25.5808" y="169.15" width="221.622" height="29.0076" rx="5.5038" stroke="#737373" stroke-width="0.73384"/>
</g>
<path d="M25.3174 32.6123V23.0057H29.1075C29.8361 23.0057 30.4569 23.1448 30.9697 23.4231C31.4826 23.6983 31.8735 24.0814 32.1424 24.5724C32.4145 25.0602 32.5505 25.6231 32.5505 26.261C32.5505 26.899 32.4129 27.4619 32.1377 27.9497C31.8625 28.4375 31.4638 28.8175 30.9416 29.0896C30.4225 29.3616 29.7939 29.4977 29.0559 29.4977H26.6402V27.87H28.7275C29.1184 27.87 29.4405 27.8027 29.6938 27.6683C29.9503 27.5307 30.141 27.3415 30.2661 27.1007C30.3943 26.8568 30.4584 26.5769 30.4584 26.261C30.4584 25.9421 30.3943 25.6638 30.2661 25.4261C30.141 25.1853 29.9503 24.9992 29.6938 24.8679C29.4374 24.7334 29.1122 24.6662 28.7182 24.6662H27.3485V32.6123H25.3174ZM36.7807 32.753C36.0521 32.753 35.422 32.5982 34.8904 32.2886C34.3619 31.9759 33.9538 31.5413 33.6661 30.9846C33.3784 30.4249 33.2345 29.776 33.2345 29.038C33.2345 28.2937 33.3784 27.6432 33.6661 27.0866C33.9538 26.5269 34.3619 26.0922 34.8904 25.7826C35.422 25.4699 36.0521 25.3135 36.7807 25.3135C37.5093 25.3135 38.1379 25.4699 38.6664 25.7826C39.198 26.0922 39.6077 26.5269 39.8954 27.0866C40.1831 27.6432 40.3269 28.2937 40.3269 29.038C40.3269 29.776 40.1831 30.4249 39.8954 30.9846C39.6077 31.5413 39.198 31.9759 38.6664 32.2886C38.1379 32.5982 37.5093 32.753 36.7807 32.753ZM36.7901 31.2051C37.1216 31.2051 37.3983 31.1113 37.6204 30.9236C37.8424 30.7329 38.0097 30.4733 38.1223 30.145C38.238 29.8166 38.2958 29.4429 38.2958 29.0239C38.2958 28.6048 38.238 28.2312 38.1223 27.9028C38.0097 27.5744 37.8424 27.3149 37.6204 27.1241C37.3983 26.9334 37.1216 26.838 36.7901 26.838C36.4555 26.838 36.1741 26.9334 35.9458 27.1241C35.7206 27.3149 35.5502 27.5744 35.4345 27.9028C35.3219 28.2312 35.2656 28.6048 35.2656 29.0239C35.2656 29.4429 35.3219 29.8166 35.4345 30.145C35.5502 30.4733 35.7206 30.7329 35.9458 30.9236C36.1741 31.1113 36.4555 31.2051 36.7901 31.2051ZM43.4337 23.0057V32.6123H41.4355V23.0057H43.4337ZM46.8419 23.0057V32.6123H44.8436V23.0057H46.8419Z" fill="white"/>
<path d="M33.5641 220.98C33.0144 220.98 32.5462 220.831 32.1595 220.531C31.7727 220.23 31.4772 219.793 31.2729 219.222C31.0686 218.648 30.9664 217.954 30.9664 217.142C30.9664 216.335 31.0686 215.645 31.2729 215.073C31.4796 214.499 31.7764 214.062 32.1631 213.76C32.5523 213.456 33.0192 213.304 33.5641 213.304C34.1089 213.304 34.5747 213.456 34.9614 213.76C35.3505 214.062 35.6473 214.499 35.8516 215.073C36.0583 215.645 36.1617 216.335 36.1617 217.142C36.1617 217.954 36.0595 218.648 35.8552 219.222C35.6509 219.793 35.3554 220.23 34.9687 220.531C34.582 220.831 34.1138 220.98 33.5641 220.98ZM33.5641 220.177C34.1089 220.177 34.5321 219.915 34.8337 219.389C35.1353 218.864 35.2861 218.115 35.2861 217.142C35.2861 216.495 35.2168 215.944 35.0781 215.489C34.9419 215.034 34.7449 214.688 34.4871 214.45C34.2317 214.211 33.924 214.092 33.5641 214.092C33.0241 214.092 32.6021 214.358 32.2981 214.891C31.9941 215.421 31.842 216.172 31.842 217.142C31.842 217.789 31.9101 218.339 32.0464 218.791C32.1826 219.243 32.3784 219.588 32.6337 219.824C32.8916 220.059 33.2017 220.177 33.5641 220.177ZM37.482 220.878V220.221L39.9483 217.521C40.2377 217.205 40.4761 216.93 40.6634 216.697C40.8507 216.461 40.9893 216.24 41.0793 216.033C41.1717 215.824 41.2179 215.605 41.2179 215.376C41.2179 215.114 41.1547 214.886 41.0282 214.694C40.9042 214.502 40.7339 214.353 40.5175 214.249C40.301 214.144 40.0578 214.092 39.7878 214.092C39.5008 214.092 39.2503 214.152 39.0362 214.271C38.8246 214.388 38.6604 214.552 38.5437 214.763C38.4294 214.975 38.3722 215.223 38.3722 215.508H37.5112C37.5112 215.07 37.6121 214.685 37.814 214.355C38.0159 214.024 38.2907 213.766 38.6386 213.581C38.9888 213.396 39.3816 213.304 39.817 213.304C40.2548 213.304 40.6427 213.396 40.9808 213.581C41.3189 213.766 41.584 214.015 41.7761 214.329C41.9683 214.643 42.0644 214.992 42.0644 215.376C42.0644 215.651 42.0145 215.92 41.9148 216.182C41.8175 216.443 41.6472 216.733 41.404 217.054C41.1632 217.373 40.8288 217.762 40.4007 218.222L38.7225 220.017V220.075H42.1957V220.878H37.482ZM44.2785 219.922C44.0985 219.922 43.9441 219.858 43.8152 219.729C43.6863 219.6 43.6218 219.445 43.6218 219.265C43.6218 219.085 43.6863 218.931 43.8152 218.802C43.9441 218.673 44.0985 218.609 44.2785 218.609C44.4585 218.609 44.613 218.673 44.7419 218.802C44.8708 218.931 44.9352 219.085 44.9352 219.265C44.9352 219.385 44.9048 219.494 44.844 219.594C44.7857 219.693 44.7066 219.774 44.6069 219.835C44.5096 219.893 44.4001 219.922 44.2785 219.922ZM44.2785 216.142C44.0985 216.142 43.9441 216.078 43.8152 215.949C43.6863 215.82 43.6218 215.666 43.6218 215.486C43.6218 215.306 43.6863 215.151 43.8152 215.022C43.9441 214.893 44.0985 214.829 44.2785 214.829C44.4585 214.829 44.613 214.893 44.7419 215.022C44.8708 215.151 44.9352 215.306 44.9352 215.486C44.9352 215.605 44.9048 215.714 44.844 215.814C44.7857 215.914 44.7066 215.994 44.6069 216.055C44.5096 216.113 44.4001 216.142 44.2785 216.142ZM46.3997 220.878V220.221L48.866 217.521C49.1554 217.205 49.3938 216.93 49.581 216.697C49.7683 216.461 49.907 216.24 49.997 216.033C50.0894 215.824 50.1356 215.605 50.1356 215.376C50.1356 215.114 50.0724 214.886 49.9459 214.694C49.8218 214.502 49.6516 214.353 49.4351 214.249C49.2186 214.144 48.9754 214.092 48.7054 214.092C48.4184 214.092 48.1679 214.152 47.9539 214.271C47.7423 214.388 47.5781 214.552 47.4613 214.763C47.347 214.975 47.2899 215.223 47.2899 215.508H46.4289C46.4289 215.07 46.5298 214.685 46.7317 214.355C46.9336 214.024 47.2084 213.766 47.5562 213.581C47.9064 213.396 48.2993 213.304 48.7346 213.304C49.1724 213.304 49.5604 213.396 49.8984 213.581C50.2365 213.766 50.5016 214.015 50.6938 214.329C50.8859 214.643 50.982 214.992 50.982 215.376C50.982 215.651 50.9321 215.92 50.8324 216.182C50.7351 216.443 50.5649 216.733 50.3217 217.054C50.0809 217.373 49.7464 217.762 49.3184 218.222L47.6401 220.017V220.075H51.1133V220.878H46.3997ZM54.9912 220.98C54.4415 220.98 53.9733 220.831 53.5866 220.531C53.1998 220.23 52.9043 219.793 52.7 219.222C52.4957 218.648 52.3935 217.954 52.3935 217.142C52.3935 216.335 52.4957 215.645 52.7 215.073C52.9067 214.499 53.2035 214.062 53.5902 213.76C53.9794 213.456 54.4464 213.304 54.9912 213.304C55.536 213.304 56.0018 213.456 56.3885 213.76C56.7776 214.062 57.0744 214.499 57.2787 215.073C57.4854 215.645 57.5888 216.335 57.5888 217.142C57.5888 217.954 57.4866 218.648 57.2823 219.222C57.078 219.793 56.7825 220.23 56.3958 220.531C56.0091 220.831 55.5409 220.98 54.9912 220.98ZM54.9912 220.177C55.536 220.177 55.9592 219.915 56.2608 219.389C56.5624 218.864 56.7132 218.115 56.7132 217.142C56.7132 216.495 56.6439 215.944 56.5052 215.489C56.369 215.034 56.172 214.688 55.9142 214.45C55.6588 214.211 55.3511 214.092 54.9912 214.092C54.4512 214.092 54.0292 214.358 53.7252 214.891C53.4212 215.421 53.2691 216.172 53.2691 217.142C53.2691 217.789 53.3373 218.339 53.4735 218.791C53.6097 219.243 53.8055 219.588 54.0608 219.824C54.3187 220.059 54.6288 220.177 54.9912 220.177ZM61.7472 222.979V215.274H62.579V216.164H62.6812C62.7444 216.067 62.832 215.943 62.9438 215.792C63.0581 215.639 63.2211 215.503 63.4327 215.384C63.6468 215.262 63.9362 215.201 64.301 215.201C64.7729 215.201 65.1888 215.319 65.5488 215.555C65.9087 215.791 66.1897 216.125 66.3915 216.558C66.5934 216.991 66.6943 217.502 66.6943 218.091C66.6943 218.684 66.5934 219.198 66.3915 219.634C66.1897 220.067 65.9099 220.402 65.5524 220.641C65.1949 220.877 64.7826 220.995 64.3156 220.995C63.9556 220.995 63.6674 220.935 63.451 220.816C63.2345 220.694 63.0679 220.557 62.9511 220.404C62.8344 220.248 62.7444 220.119 62.6812 220.017H62.6082V222.979H61.7472ZM62.5936 218.076C62.5936 218.499 62.6556 218.873 62.7797 219.196C62.9037 219.517 63.0849 219.769 63.3233 219.951C63.5616 220.131 63.8535 220.221 64.1989 220.221C64.5588 220.221 64.8592 220.126 65.1 219.937C65.3432 219.745 65.5257 219.487 65.6473 219.163C65.7713 218.837 65.8333 218.475 65.8333 218.076C65.8333 217.682 65.7725 217.327 65.6509 217.011C65.5317 216.692 65.3505 216.44 65.1073 216.255C64.8665 216.068 64.5637 215.975 64.1989 215.975C63.8486 215.975 63.5543 216.063 63.316 216.241C63.0776 216.416 62.8976 216.662 62.776 216.978C62.6544 217.292 62.5936 217.658 62.5936 218.076ZM67.9417 220.878V215.274H68.7735V216.15H68.8465C68.9632 215.85 69.1517 215.618 69.412 215.453C69.6722 215.285 69.9848 215.201 70.3496 215.201C70.7193 215.201 71.027 215.285 71.2727 215.453C71.5207 215.618 71.7141 215.85 71.8527 216.15H71.9111C72.0546 215.86 72.2699 215.63 72.5569 215.46C72.8439 215.287 73.188 215.201 73.5894 215.201C74.0904 215.201 74.5002 215.358 74.8189 215.672C75.1375 215.983 75.2968 216.468 75.2968 217.127V220.878H74.4358V217.127C74.4358 216.714 74.3227 216.418 74.0965 216.241C73.8703 216.063 73.6039 215.975 73.2975 215.975C72.9035 215.975 72.5982 216.094 72.3818 216.332C72.1653 216.568 72.057 216.867 72.057 217.23V220.878H71.1814V217.04C71.1814 216.721 71.0781 216.465 70.8713 216.27C70.6646 216.073 70.3983 215.975 70.0723 215.975C69.8486 215.975 69.6394 216.034 69.4448 216.153C69.2527 216.272 69.097 216.438 68.9778 216.649C68.8611 216.859 68.8027 217.101 68.8027 217.376V220.878H67.9417ZM78.0892 219.856L78.0309 220.25C77.9895 220.528 77.9263 220.824 77.8411 221.141C77.7584 221.457 77.6721 221.755 77.5821 222.034C77.4921 222.314 77.4179 222.537 77.3596 222.702H76.7029C76.7345 222.546 76.7758 222.341 76.8269 222.086C76.878 221.83 76.929 221.544 76.9801 221.228C77.0336 220.914 77.0774 220.593 77.1115 220.265L77.1552 219.856H78.0892ZM85.0541 213.406V220.878H84.1493V214.355H84.1055L82.2813 215.566V214.647L84.1493 213.406H85.0541ZM89.574 220.98C89.0243 220.98 88.5561 220.831 88.1694 220.531C87.7827 220.23 87.4872 219.793 87.2829 219.222C87.0786 218.648 86.9764 217.954 86.9764 217.142C86.9764 216.335 87.0786 215.645 87.2829 215.073C87.4896 214.499 87.7863 214.062 88.1731 213.76C88.5622 213.456 89.0292 213.304 89.574 213.304C90.1188 213.304 90.5846 213.456 90.9713 213.76C91.3605 214.062 91.6572 214.499 91.8615 215.073C92.0683 215.645 92.1717 216.335 92.1717 217.142C92.1717 217.954 92.0695 218.648 91.8652 219.222C91.6609 219.793 91.3654 220.23 90.9786 220.531C90.5919 220.831 90.1237 220.98 89.574 220.98ZM89.574 220.177C90.1188 220.177 90.5421 219.915 90.8437 219.389C91.1453 218.864 91.2961 218.115 91.2961 217.142C91.2961 216.495 91.2267 215.944 91.0881 215.489C90.9519 215.034 90.7549 214.688 90.4971 214.45C90.2417 214.211 89.934 214.092 89.574 214.092C89.0341 214.092 88.6121 214.358 88.308 214.891C88.004 215.421 87.852 216.172 87.852 217.142C87.852 217.789 87.9201 218.339 88.0563 218.791C88.1925 219.243 88.3883 219.588 88.6437 219.824C88.9015 220.059 89.2116 220.177 89.574 220.177ZM96.4468 220.878V213.406H100.927V214.209H97.3516V216.733H100.591V217.536H97.3516V220.878H96.4468ZM104.232 220.995C103.692 220.995 103.226 220.875 102.835 220.637C102.446 220.396 102.145 220.061 101.934 219.63C101.724 219.197 101.62 218.694 101.62 218.12C101.62 217.546 101.724 217.04 101.934 216.602C102.145 216.162 102.439 215.819 102.816 215.573C103.196 215.325 103.639 215.201 104.144 215.201C104.436 215.201 104.725 215.25 105.009 215.347C105.294 215.444 105.553 215.602 105.786 215.821C106.02 216.038 106.206 216.325 106.344 216.682C106.483 217.04 106.552 217.48 106.552 218.003V218.368H102.233V217.624H105.677C105.677 217.307 105.614 217.025 105.487 216.777C105.363 216.529 105.185 216.333 104.954 216.19C104.726 216.046 104.456 215.975 104.144 215.975C103.801 215.975 103.505 216.06 103.254 216.23C103.006 216.398 102.815 216.617 102.681 216.887C102.548 217.157 102.481 217.446 102.481 217.755V218.251C102.481 218.674 102.554 219.033 102.7 219.327C102.848 219.619 103.054 219.842 103.316 219.995C103.579 220.146 103.884 220.221 104.232 220.221C104.458 220.221 104.662 220.19 104.845 220.126C105.03 220.061 105.189 219.963 105.323 219.835C105.457 219.703 105.56 219.54 105.633 219.346L106.465 219.579C106.377 219.861 106.23 220.109 106.023 220.323C105.817 220.535 105.561 220.7 105.257 220.82C104.953 220.936 104.611 220.995 104.232 220.995ZM107.913 220.878V213.406H108.774V216.164H108.847C108.91 216.067 108.998 215.943 109.109 215.792C109.224 215.639 109.387 215.503 109.598 215.384C109.812 215.262 110.102 215.201 110.467 215.201C110.939 215.201 111.354 215.319 111.714 215.555C112.074 215.791 112.355 216.125 112.557 216.558C112.759 216.991 112.86 217.502 112.86 218.091C112.86 218.684 112.759 219.198 112.557 219.634C112.355 220.067 112.076 220.402 111.718 220.641C111.36 220.877 110.948 220.995 110.481 220.995C110.121 220.995 109.833 220.935 109.617 220.816C109.4 220.694 109.234 220.557 109.117 220.404C109 220.248 108.91 220.119 108.847 220.017H108.745V220.878H107.913ZM108.759 218.076C108.759 218.499 108.821 218.873 108.945 219.196C109.069 219.517 109.251 219.769 109.489 219.951C109.727 220.131 110.019 220.221 110.364 220.221C110.724 220.221 111.025 220.126 111.266 219.937C111.509 219.745 111.691 219.487 111.813 219.163C111.937 218.837 111.999 218.475 111.999 218.076C111.999 217.682 111.938 217.327 111.817 217.011C111.697 216.692 111.516 216.44 111.273 216.255C111.032 216.068 110.729 215.975 110.364 215.975C110.014 215.975 109.72 216.063 109.482 216.241C109.243 216.416 109.063 216.662 108.942 216.978C108.82 217.292 108.759 217.658 108.759 218.076ZM115.395 219.856L115.337 220.25C115.295 220.528 115.232 220.824 115.147 221.141C115.064 221.457 114.978 221.755 114.888 222.034C114.798 222.314 114.724 222.537 114.666 222.702H114.009C114.04 222.546 114.082 222.341 114.133 222.086C114.184 221.83 114.235 221.544 114.286 221.228C114.34 220.914 114.383 220.593 114.417 220.265L114.461 219.856H115.395ZM119.733 220.878V220.221L122.2 217.521C122.489 217.205 122.727 216.93 122.915 216.697C123.102 216.461 123.241 216.24 123.331 216.033C123.423 215.824 123.469 215.605 123.469 215.376C123.469 215.114 123.406 214.886 123.279 214.694C123.155 214.502 122.985 214.353 122.769 214.249C122.552 214.144 122.309 214.092 122.039 214.092C121.752 214.092 121.501 214.152 121.287 214.271C121.076 214.388 120.912 214.552 120.795 214.763C120.681 214.975 120.623 215.223 120.623 215.508H119.762C119.762 215.07 119.863 214.685 120.065 214.355C120.267 214.024 120.542 213.766 120.89 213.581C121.24 213.396 121.633 213.304 122.068 213.304C122.506 213.304 122.894 213.396 123.232 213.581C123.57 213.766 123.835 214.015 124.027 214.329C124.22 214.643 124.316 214.992 124.316 215.376C124.316 215.651 124.266 215.92 124.166 216.182C124.069 216.443 123.898 216.733 123.655 217.054C123.414 217.373 123.08 217.762 122.652 218.222L120.974 220.017V220.075H124.447V220.878H119.733ZM128.325 220.98C127.775 220.98 127.307 220.831 126.92 220.531C126.533 220.23 126.238 219.793 126.034 219.222C125.829 218.648 125.727 217.954 125.727 217.142C125.727 216.335 125.829 215.645 126.034 215.073C126.24 214.499 126.537 214.062 126.924 213.76C127.313 213.456 127.78 213.304 128.325 213.304C128.87 213.304 129.335 213.456 129.722 213.76C130.111 214.062 130.408 214.499 130.612 215.073C130.819 215.645 130.922 216.335 130.922 217.142C130.922 217.954 130.82 218.648 130.616 219.222C130.412 219.793 130.116 220.23 129.729 220.531C129.343 220.831 128.874 220.98 128.325 220.98ZM128.325 220.177C128.87 220.177 129.293 219.915 129.594 219.389C129.896 218.864 130.047 218.115 130.047 217.142C130.047 216.495 129.977 215.944 129.839 215.489C129.703 215.034 129.506 214.688 129.248 214.45C128.992 214.211 128.685 214.092 128.325 214.092C127.785 214.092 127.363 214.358 127.059 214.891C126.755 215.421 126.603 216.172 126.603 217.142C126.603 217.789 126.671 218.339 126.807 218.791C126.943 219.243 127.139 219.588 127.394 219.824C127.652 220.059 127.962 220.177 128.325 220.177ZM132.243 220.878V220.221L134.709 217.521C134.998 217.205 135.237 216.93 135.424 216.697C135.611 216.461 135.75 216.24 135.84 216.033C135.932 215.824 135.979 215.605 135.979 215.376C135.979 215.114 135.915 214.886 135.789 214.694C135.665 214.502 135.495 214.353 135.278 214.249C135.062 214.144 134.818 214.092 134.548 214.092C134.261 214.092 134.011 214.152 133.797 214.271C133.585 214.388 133.421 214.552 133.304 214.763C133.19 214.975 133.133 215.223 133.133 215.508H132.272C132.272 215.07 132.373 214.685 132.575 214.355C132.777 214.024 133.051 213.766 133.399 213.581C133.749 213.396 134.142 213.304 134.578 213.304C135.015 213.304 135.403 213.396 135.741 213.581C136.08 213.766 136.345 214.015 136.537 214.329C136.729 214.643 136.825 214.992 136.825 215.376C136.825 215.651 136.775 215.92 136.675 216.182C136.578 216.443 136.408 216.733 136.165 217.054C135.924 217.373 135.589 217.762 135.161 218.222L133.483 220.017V220.075H136.956V220.878H132.243ZM138.397 220.878V220.221L140.863 217.521C141.153 217.205 141.391 216.93 141.578 216.697C141.766 216.461 141.904 216.24 141.994 216.033C142.087 215.824 142.133 215.605 142.133 215.376C142.133 215.114 142.07 214.886 141.943 214.694C141.819 214.502 141.649 214.353 141.433 214.249C141.216 214.144 140.973 214.092 140.703 214.092C140.416 214.092 140.165 214.152 139.951 214.271C139.74 214.388 139.576 214.552 139.459 214.763C139.344 214.975 139.287 215.223 139.287 215.508H138.426C138.426 215.07 138.527 214.685 138.729 214.355C138.931 214.024 139.206 213.766 139.554 213.581C139.904 213.396 140.297 213.304 140.732 213.304C141.17 213.304 141.558 213.396 141.896 213.581C142.234 213.766 142.499 214.015 142.691 214.329C142.883 214.643 142.979 214.992 142.979 215.376C142.979 215.651 142.93 215.92 142.83 216.182C142.733 216.443 142.562 216.733 142.319 217.054C142.078 217.373 141.744 217.762 141.316 218.222L139.638 220.017V220.075H143.111V220.878H138.397Z" fill="#737373"/>
<rect x="165.747" y="15.0437" width="81.4563" height="25.6844" rx="5.5038" fill="#404040"/>
<path d="M184.388 27.6498C184.388 28.4549 184.237 29.1444 183.936 29.7184C183.637 30.29 183.228 30.7278 182.71 31.0319C182.194 31.3359 181.609 31.4879 180.955 31.4879C180.301 31.4879 179.715 31.3359 179.196 31.0319C178.681 30.7254 178.272 30.2864 177.971 29.7148C177.671 29.1408 177.522 28.4525 177.522 27.6498C177.522 26.8448 177.671 26.1564 177.971 25.5849C178.272 25.0109 178.681 24.5718 179.196 24.2678C179.715 23.9638 180.301 23.8118 180.955 23.8118C181.609 23.8118 182.194 23.9638 182.71 24.2678C183.228 24.5718 183.637 25.0109 183.936 25.5849C184.237 26.1564 184.388 26.8448 184.388 27.6498ZM183.027 27.6498C183.027 27.0831 182.938 26.6052 182.761 26.216C182.586 25.8244 182.343 25.5289 182.031 25.3295C181.72 25.1276 181.361 25.0267 180.955 25.0267C180.549 25.0267 180.19 25.1276 179.879 25.3295C179.567 25.5289 179.323 25.8244 179.145 26.216C178.97 26.6052 178.883 27.0831 178.883 27.6498C178.883 28.2165 178.97 28.6957 179.145 29.0873C179.323 29.4764 179.567 29.772 179.879 29.9738C180.19 30.1733 180.549 30.273 180.955 30.273C181.361 30.273 181.72 30.1733 182.031 29.9738C182.343 29.772 182.586 29.4764 182.761 29.0873C182.938 28.6957 183.027 28.2165 183.027 27.6498ZM185.543 33.4872V25.7819H186.842V26.7086H186.919C186.987 26.5723 187.083 26.4276 187.207 26.2744C187.331 26.1187 187.499 25.9862 187.71 25.8767C187.922 25.7648 188.192 25.7089 188.52 25.7089C188.953 25.7089 189.344 25.8196 189.691 26.0409C190.042 26.2598 190.319 26.5845 190.523 27.015C190.73 27.4431 190.833 27.9685 190.833 28.5911C190.833 29.2065 190.732 29.7294 190.531 30.1599C190.329 30.5904 190.054 30.9188 189.706 31.145C189.358 31.3711 188.964 31.4842 188.524 31.4842C188.203 31.4842 187.937 31.4307 187.725 31.3237C187.513 31.2167 187.343 31.0878 187.214 30.937C187.088 30.7838 186.989 30.639 186.919 30.5028H186.864V33.4872H185.543ZM186.838 28.5838C186.838 28.9462 186.89 29.2636 186.992 29.536C187.096 29.8084 187.246 30.0213 187.44 30.1745C187.637 30.3253 187.876 30.4007 188.156 30.4007C188.447 30.4007 188.692 30.3229 188.889 30.1672C189.086 30.0091 189.234 29.7938 189.334 29.5214C189.436 29.2466 189.487 28.934 189.487 28.5838C189.487 28.236 189.437 27.9271 189.338 27.6571C189.238 27.3871 189.09 27.1755 188.892 27.0223C188.695 26.8691 188.45 26.7925 188.156 26.7925C187.873 26.7925 187.634 26.8666 187.437 27.015C187.24 27.1634 187.09 27.3713 186.988 27.6389C186.888 27.9064 186.838 28.2214 186.838 28.5838ZM191.898 31.3857V25.7819H193.219V31.3857H191.898ZM192.562 24.9865C192.353 24.9865 192.173 24.9172 192.022 24.7786C191.872 24.6375 191.796 24.4685 191.796 24.2715C191.796 24.072 191.872 23.903 192.022 23.7643C192.173 23.6233 192.353 23.5527 192.562 23.5527C192.774 23.5527 192.954 23.6233 193.102 23.7643C193.253 23.903 193.329 24.072 193.329 24.2715C193.329 24.4685 193.253 24.6375 193.102 24.7786C192.954 24.9172 192.774 24.9865 192.562 24.9865ZM195.832 28.1022V31.3857H194.511V25.7819H195.773V26.7341H195.839C195.968 26.4203 196.174 26.171 196.456 25.9862C196.74 25.8013 197.092 25.7089 197.51 25.7089C197.897 25.7089 198.234 25.7916 198.521 25.957C198.81 26.1224 199.034 26.362 199.192 26.6757C199.352 26.9895 199.432 27.3701 199.429 27.8177V31.3857H198.108V28.022C198.108 27.6474 198.011 27.3543 197.817 27.1427C197.624 26.9311 197.358 26.8253 197.018 26.8253C196.786 26.8253 196.581 26.8764 196.401 26.9785C196.223 27.0783 196.084 27.223 195.981 27.4127C195.882 27.6024 195.832 27.8322 195.832 28.1022ZM200.706 31.3857V25.7819H202.026V31.3857H200.706ZM201.37 24.9865C201.16 24.9865 200.98 24.9172 200.83 24.7786C200.679 24.6375 200.603 24.4685 200.603 24.2715C200.603 24.072 200.679 23.903 200.83 23.7643C200.98 23.6233 201.16 23.5527 201.37 23.5527C201.581 23.5527 201.761 23.6233 201.91 23.7643C202.06 23.903 202.136 24.072 202.136 24.2715C202.136 24.4685 202.06 24.6375 201.91 24.7786C201.761 24.9172 201.581 24.9865 201.37 24.9865ZM205.763 31.4952C205.216 31.4952 204.741 31.3748 204.34 31.134C203.939 30.8932 203.627 30.5563 203.406 30.1234C203.187 29.6905 203.078 29.1846 203.078 28.6057C203.078 28.0268 203.187 27.5197 203.406 27.0843C203.627 26.649 203.939 26.3109 204.34 26.0701C204.741 25.8293 205.216 25.7089 205.763 25.7089C206.31 25.7089 206.784 25.8293 207.186 26.0701C207.587 26.3109 207.897 26.649 208.116 27.0843C208.337 27.5197 208.448 28.0268 208.448 28.6057C208.448 29.1846 208.337 29.6905 208.116 30.1234C207.897 30.5563 207.587 30.8932 207.186 31.134C206.784 31.3748 206.31 31.4952 205.763 31.4952ZM205.77 30.4372C206.067 30.4372 206.315 30.3557 206.514 30.1927C206.714 30.0273 206.862 29.806 206.959 29.5287C207.059 29.2515 207.109 28.9426 207.109 28.602C207.109 28.2591 207.059 27.949 206.959 27.6717C206.862 27.392 206.714 27.1695 206.514 27.0041C206.315 26.8387 206.067 26.756 205.77 26.756C205.466 26.756 205.213 26.8387 205.011 27.0041C204.812 27.1695 204.662 27.392 204.562 27.6717C204.465 27.949 204.417 28.2591 204.417 28.602C204.417 28.9426 204.465 29.2515 204.562 29.5287C204.662 29.806 204.812 30.0273 205.011 30.1927C205.213 30.3557 205.466 30.4372 205.77 30.4372ZM210.824 28.1022V31.3857H209.503V25.7819H210.765V26.7341H210.831C210.96 26.4203 211.165 26.171 211.447 25.9862C211.732 25.8013 212.084 25.7089 212.502 25.7089C212.889 25.7089 213.225 25.7916 213.512 25.957C213.802 26.1224 214.026 26.362 214.184 26.6757C214.344 26.9895 214.423 27.3701 214.421 27.8177V31.3857H213.1V28.022C213.1 27.6474 213.003 27.3543 212.808 27.1427C212.616 26.9311 212.35 26.8253 212.009 26.8253C211.778 26.8253 211.573 26.8764 211.393 26.9785C211.215 27.0783 211.075 27.223 210.973 27.4127C210.873 27.6024 210.824 27.8322 210.824 28.1022ZM218.238 31.3857V23.9139H221.04C221.614 23.9139 222.096 24.0209 222.485 24.235C222.876 24.449 223.172 24.7433 223.371 25.1179C223.573 25.49 223.674 25.9132 223.674 26.3875C223.674 26.8666 223.573 27.2923 223.371 27.6644C223.169 28.0366 222.872 28.3296 222.478 28.5437C222.084 28.7553 221.598 28.8611 221.022 28.8611H219.165V27.7483H220.839C221.175 27.7483 221.45 27.69 221.664 27.5732C221.878 27.4565 222.036 27.2959 222.138 27.0916C222.243 26.8873 222.295 26.6526 222.295 26.3875C222.295 26.1224 222.243 25.8889 222.138 25.687C222.036 25.4851 221.877 25.3283 221.66 25.2164C221.446 25.1021 221.17 25.0449 220.832 25.0449H219.592V31.3857H218.238ZM227.09 31.4952C226.542 31.4952 226.068 31.3748 225.667 31.134C225.265 30.8932 224.954 30.5563 224.733 30.1234C224.514 29.6905 224.404 29.1846 224.404 28.6057C224.404 28.0268 224.514 27.5197 224.733 27.0843C224.954 26.649 225.265 26.3109 225.667 26.0701C226.068 25.8293 226.542 25.7089 227.09 25.7089C227.637 25.7089 228.111 25.8293 228.512 26.0701C228.914 26.3109 229.224 26.649 229.443 27.0843C229.664 27.5197 229.775 28.0268 229.775 28.6057C229.775 29.1846 229.664 29.6905 229.443 30.1234C229.224 30.5563 228.914 30.8932 228.512 31.134C228.111 31.3748 227.637 31.4952 227.09 31.4952ZM227.097 30.4372C227.394 30.4372 227.642 30.3557 227.841 30.1927C228.041 30.0273 228.189 29.806 228.286 29.5287C228.386 29.2515 228.436 28.9426 228.436 28.602C228.436 28.2591 228.386 27.949 228.286 27.6717C228.189 27.392 228.041 27.1695 227.841 27.0041C227.642 26.8387 227.394 26.756 227.097 26.756C226.793 26.756 226.54 26.8387 226.338 27.0041C226.139 27.1695 225.989 27.392 225.889 27.6717C225.792 27.949 225.743 28.2591 225.743 28.602C225.743 28.9426 225.792 29.2515 225.889 29.5287C225.989 29.806 226.139 30.0273 226.338 30.1927C226.54 30.3557 226.793 30.4372 227.097 30.4372ZM232.15 23.9139V31.3857H230.83V23.9139H232.15ZM234.763 23.9139V31.3857H233.442V23.9139H234.763Z" fill="#FFD147"/>
<rect x="165.747" y="15.0437" width="81.4563" height="25.6844" rx="5.5038" stroke="#FFD147" stroke-width="0.73384"/>
<rect x="24.4824" y="73.3838" width="223.087" height="8.80608" fill="#828282"/>
<rect x="24.4824" y="90.9961" width="223.087" height="8.80608" fill="#828282"/>
<rect x="24.4824" y="108.608" width="223.087" height="8.80608" fill="#828282"/>
</g>
<defs>
<filter id="filter0_d_1644_62958" x="25.2139" y="168.783" width="222.356" height="35.6119" filterUnits="userSpaceOnUse" color-interpolation-filters="sRGB">
<feFlood flood-opacity="0" result="BackgroundImageFix"/>
<feColorMatrix in="SourceAlpha" type="matrix" values="0 0 0 0 0 0 0 0 0 0 0 0 0 0 0 0 0 0 127 0" result="hardAlpha"/>
<feOffset dy="5.87072"/>
<feComposite in2="hardAlpha" operator="out"/>
<feColorMatrix type="matrix" values="0 0 0 0 0 0 0 0 0 0 0 0 0 0 0 0 0 0 0.5 0"/>
<feBlend mode="normal" in2="BackgroundImageFix" result="effect1_dropShadow_1644_62958"/>
<feBlend mode="normal" in="SourceGraphic" in2="effect1_dropShadow_1644_62958" result="shape"/>
</filter>
<clipPath id="clip0_1644_62958">
<rect width="271" height="242" fill="white"/>
</clipPath>
</defs>
</svg>
