<svg width="23" height="18" viewBox="0 0 23 18" fill="none" xmlns="http://www.w3.org/2000/svg">
<path d="M11 4.5C12.8387 4.49389 14.6419 5.00678 16.2021 5.97973C17.7624 6.95267 19.0164 8.34616 19.82 10C18.17 13.37 14.8 15.5 11 15.5C7.2 15.5 3.83 13.37 2.18 10C2.98362 8.34616 4.23763 6.95267 5.79788 5.97973C7.35813 5.00678 9.16126 4.49389 11 4.5ZM11 2.5C6 2.5 1.73 5.61 0 10C1.73 14.39 6 17.5 11 17.5C16 17.5 20.27 14.39 22 10C20.27 5.61 16 2.5 11 2.5ZM11 7.5C11.663 7.5 12.2989 7.76339 12.7678 8.23223C13.2366 8.70107 13.5 9.33696 13.5 10C13.5 10.663 13.2366 11.2989 12.7678 11.7678C12.2989 12.2366 11.663 12.5 11 12.5C10.337 12.5 9.70107 12.2366 9.23223 11.7678C8.76339 11.2989 8.5 10.663 8.5 10C8.5 9.33696 8.76339 8.70107 9.23223 8.23223C9.70107 7.76339 10.337 7.5 11 7.5ZM11 5.5C8.52 5.5 6.5 7.52 6.5 10C6.5 12.48 8.52 14.5 11 14.5C13.48 14.5 15.5 12.48 15.5 10C15.5 7.52 13.48 5.5 11 5.5Z" fill="#0075FF"/>
<circle cx="18.5" cy="4.5" r="4.5" fill="white"/>
<path d="M18.5003 1.5V7.5M21.5 4.49972H15.5" stroke="#0075FF" stroke-width="1.2" stroke-linecap="round" stroke-linejoin="round"/>
</svg>
