<svg width="20" height="20" viewBox="0 0 20 20" fill="none" xmlns="http://www.w3.org/2000/svg">
<path d="M17.9035 0C17.3514 0 16.8219 0.219493 16.4315 0.610194C16.0411 1.0009 15.8217 1.5308 15.8217 2.08333C15.8217 2.63587 16.0411 3.16577 16.4315 3.55647C16.8219 3.94717 17.3514 4.16667 17.9035 4.16667C18.4557 4.16667 18.9852 3.94717 19.3756 3.55647C19.766 3.16577 19.9853 2.63587 19.9853 2.08333C19.9853 1.5308 19.766 1.0009 19.3756 0.610194C18.9852 0.219493 18.4557 0 17.9035 0ZM10.7815 0.834961C10.7416 0.836989 10.7019 0.841885 10.6628 0.849609L6.49914 1.68294C6.28713 1.72501 6.09976 1.84791 5.97663 2.02569C5.85351 2.20346 5.80427 2.42217 5.83932 2.63561C5.87438 2.84905 5.99098 3.04048 6.16448 3.16947C6.33799 3.29845 6.55481 3.35488 6.76912 3.32682L10.775 2.84505L12.0078 4.16667L8.43132 7.01172C8.14366 7.20129 7.9075 7.45933 7.744 7.76271C7.5805 8.06608 7.49478 8.40532 7.4945 8.75C7.49508 9.24979 7.67518 9.73271 8.00194 10.1107L10.3017 12.9883L5.82906 13.3333C5.82797 13.3333 5.82689 13.3333 5.82581 13.3333L5.80629 13.335C5.69387 13.3315 5.58191 13.3509 5.47718 13.3919C5.37245 13.4329 5.2771 13.4948 5.1969 13.5737C5.1167 13.6526 5.0533 13.747 5.01052 13.8511C4.96775 13.9552 4.9465 14.0668 4.94803 14.1794C4.94957 14.2919 4.97388 14.403 5.01948 14.5059C5.06508 14.6088 5.13104 14.7014 5.21337 14.778C5.2957 14.8547 5.3927 14.9139 5.49852 14.9521C5.60433 14.9902 5.71677 15.0065 5.82906 15H12.0241C12.9426 15 13.5624 13.9806 13.1935 13.1624L13.2032 13.1527L11.6581 9.71842L14.2587 7.6595L15.0199 9.39128C15.0411 9.46698 15.0728 9.53932 15.1142 9.60612L15.1191 9.61588H15.1207C15.196 9.73359 15.2997 9.83047 15.4222 9.89759C15.5447 9.96471 15.6821 9.99993 15.8217 10H19.1526C19.2629 10.0019 19.3725 9.98191 19.475 9.94111C19.5775 9.9003 19.6709 9.83952 19.7497 9.7623C19.8286 9.68507 19.8913 9.59295 19.9343 9.49126C19.9772 9.38958 19.9996 9.28036 20 9.16997C20.0004 9.05957 19.9789 8.95018 19.9368 8.84817C19.8946 8.74615 19.8326 8.65353 19.7544 8.5757C19.6761 8.49786 19.5832 8.43635 19.4811 8.39474C19.3789 8.35314 19.2694 8.33226 19.1591 8.33333L16.4625 8.11361L15.7941 5.08789C15.7808 5.00328 15.7623 4.91957 15.7388 4.83724L15.7372 4.83561C15.5905 4.33308 15.2601 3.90424 14.8117 3.63444L11.328 1.00098C11.171 0.88291 10.9775 0.824112 10.7815 0.834961ZM2.49817 5L1.66545 5.83333H6.39993L7.44896 5H2.49817ZM0 7.5V8.33333H5.037C5.07031 8.04833 5.13069 7.76917 5.22729 7.5H0ZM0.832723 10L1.66545 10.8333H5.65178C5.47441 10.5708 5.32491 10.2942 5.21915 10H0.832723ZM9.15995 16.6667L7.66528 18.6605C7.55438 18.8059 7.49437 18.9838 7.4945 19.1667C7.4945 19.3877 7.58224 19.5996 7.7384 19.7559C7.89457 19.9122 8.10638 20 8.32723 20C8.44825 20.0001 8.56784 19.9738 8.67766 19.9229C8.78749 19.872 8.88492 19.7978 8.96315 19.7054L8.96478 19.7038C8.96532 19.7032 8.96586 19.7027 8.96641 19.7021L11.5752 16.6667H9.15995Z" fill="#A3A3A3"/>
</svg>
