<svg width="24" height="24" viewBox="0 0 24 24" fill="none" xmlns="http://www.w3.org/2000/svg">
<path fill-rule="evenodd" clip-rule="evenodd" d="M9 4H8C7.44 4 7 4.44 7 5V19C7 19.55 7.44 20 8 20H16C16.55 20 17 19.55 17 19V5C17 4.44 16.55 4 16 4H15C15 4.82 14.32 5.5 13.5 5.5H10.5C9.67 5.5 9 4.82 9 4ZM16 2C17.65 2 19 3.34 19 5V19C19 20.65 17.65 22 16 22H8C6.34 22 5 20.65 5 19V5C5 3.34 6.34 2 8 2H16Z" fill="#A3A3A3"/>
</svg>
