<svg width="310" height="303" viewBox="0 0 310 303" fill="none" xmlns="http://www.w3.org/2000/svg">
<rect width="310" height="303" rx="4" fill="#262626"/>
<rect x="95" y="266" width="127" height="26" rx="4" fill="black"/>
<path d="M143.493 276.783C143.459 276.439 143.313 276.172 143.054 275.982C142.795 275.791 142.445 275.696 142.001 275.696C141.7 275.696 141.446 275.739 141.239 275.824C141.031 275.906 140.872 276.021 140.761 276.169C140.653 276.317 140.599 276.484 140.599 276.672C140.594 276.828 140.626 276.964 140.697 277.081C140.771 277.197 140.872 277.298 141 277.384C141.128 277.466 141.276 277.538 141.443 277.601C141.611 277.661 141.79 277.712 141.98 277.754L142.764 277.942C143.145 278.027 143.494 278.141 143.812 278.283C144.131 278.425 144.406 278.599 144.639 278.807C144.872 279.014 145.053 279.259 145.18 279.54C145.311 279.821 145.378 280.143 145.381 280.507C145.378 281.041 145.241 281.504 144.972 281.896C144.705 282.286 144.318 282.588 143.812 282.804C143.31 283.017 142.703 283.124 141.993 283.124C141.288 283.124 140.675 283.016 140.152 282.8C139.632 282.584 139.226 282.264 138.933 281.841C138.643 281.415 138.491 280.888 138.477 280.26H140.263C140.283 280.553 140.366 280.797 140.514 280.993C140.665 281.186 140.865 281.332 141.115 281.432C141.368 281.528 141.653 281.577 141.972 281.577C142.284 281.577 142.555 281.531 142.786 281.44C143.018 281.349 143.199 281.223 143.327 281.061C143.455 280.899 143.518 280.713 143.518 280.503C143.518 280.307 143.46 280.142 143.344 280.009C143.23 279.875 143.063 279.761 142.841 279.668C142.622 279.574 142.354 279.489 142.036 279.412L141.085 279.173C140.349 278.994 139.768 278.714 139.342 278.334C138.916 277.953 138.705 277.44 138.707 276.795C138.705 276.267 138.845 275.805 139.129 275.411C139.416 275.016 139.81 274.707 140.31 274.486C140.81 274.264 141.378 274.153 142.014 274.153C142.662 274.153 143.227 274.264 143.71 274.486C144.196 274.707 144.574 275.016 144.844 275.411C145.114 275.805 145.253 276.263 145.261 276.783H143.493ZM150.525 280.213V276.455H152.34V283H150.598V281.811H150.529C150.382 282.195 150.136 282.503 149.792 282.736C149.451 282.969 149.035 283.085 148.544 283.085C148.106 283.085 147.721 282.986 147.389 282.787C147.056 282.588 146.796 282.305 146.609 281.939C146.424 281.572 146.331 281.134 146.328 280.622V276.455H148.143V280.298C148.146 280.685 148.25 280.99 148.454 281.214C148.659 281.439 148.933 281.551 149.277 281.551C149.495 281.551 149.7 281.501 149.89 281.402C150.081 281.3 150.234 281.149 150.35 280.95C150.47 280.751 150.528 280.506 150.525 280.213ZM153.567 283V274.273H155.382V277.554H155.437C155.517 277.378 155.632 277.199 155.783 277.017C155.936 276.832 156.135 276.679 156.379 276.557C156.626 276.432 156.933 276.369 157.3 276.369C157.777 276.369 158.217 276.494 158.621 276.744C159.024 276.991 159.346 277.365 159.588 277.865C159.829 278.362 159.95 278.986 159.95 279.736C159.95 280.466 159.832 281.082 159.596 281.585C159.364 282.085 159.045 282.464 158.642 282.723C158.241 282.979 157.792 283.107 157.295 283.107C156.943 283.107 156.643 283.048 156.396 282.932C156.152 282.815 155.952 282.669 155.795 282.493C155.639 282.314 155.52 282.134 155.437 281.952H155.356V283H153.567ZM155.344 279.727C155.344 280.116 155.398 280.456 155.506 280.746C155.614 281.036 155.77 281.261 155.974 281.423C156.179 281.582 156.427 281.662 156.72 281.662C157.016 281.662 157.266 281.581 157.47 281.419C157.675 281.254 157.829 281.027 157.935 280.737C158.042 280.445 158.096 280.108 158.096 279.727C158.096 279.349 158.044 279.017 157.939 278.73C157.834 278.443 157.679 278.219 157.474 278.057C157.27 277.895 157.018 277.814 156.72 277.814C156.425 277.814 156.175 277.892 155.97 278.048C155.768 278.205 155.614 278.426 155.506 278.713C155.398 279 155.344 279.338 155.344 279.727ZM160.901 283V276.455H162.632V277.609H162.708C162.845 277.226 163.072 276.923 163.39 276.702C163.708 276.48 164.089 276.369 164.532 276.369C164.981 276.369 165.363 276.482 165.678 276.706C165.994 276.928 166.204 277.229 166.309 277.609H166.377C166.511 277.234 166.752 276.935 167.102 276.71C167.454 276.483 167.87 276.369 168.35 276.369C168.961 276.369 169.457 276.564 169.838 276.953C170.221 277.339 170.413 277.888 170.413 278.598V283H168.602V278.956C168.602 278.592 168.505 278.32 168.312 278.138C168.119 277.956 167.877 277.865 167.588 277.865C167.258 277.865 167.001 277.97 166.816 278.18C166.632 278.388 166.539 278.662 166.539 279.003V283H164.779V278.918C164.779 278.597 164.687 278.341 164.502 278.151C164.32 277.96 164.08 277.865 163.782 277.865C163.58 277.865 163.399 277.916 163.237 278.018C163.078 278.118 162.951 278.259 162.857 278.44C162.764 278.619 162.717 278.83 162.717 279.071V283H160.901ZM171.587 283V276.455H173.402V283H171.587ZM172.499 275.611C172.229 275.611 171.997 275.521 171.804 275.342C171.614 275.161 171.519 274.943 171.519 274.69C171.519 274.44 171.614 274.226 171.804 274.047C171.997 273.865 172.229 273.774 172.499 273.774C172.769 273.774 172.999 273.865 173.189 274.047C173.382 274.226 173.479 274.44 173.479 274.69C173.479 274.943 173.382 275.161 173.189 275.342C172.999 275.521 172.769 275.611 172.499 275.611ZM178.078 276.455V277.818H174.136V276.455H178.078ZM175.031 274.886H176.846V280.989C176.846 281.156 176.872 281.287 176.923 281.381C176.974 281.472 177.045 281.536 177.136 281.572C177.23 281.609 177.338 281.628 177.46 281.628C177.545 281.628 177.63 281.621 177.716 281.607C177.801 281.589 177.866 281.577 177.912 281.568L178.197 282.919C178.106 282.947 177.978 282.98 177.814 283.017C177.649 283.057 177.449 283.081 177.213 283.089C176.775 283.107 176.392 283.048 176.062 282.915C175.736 282.781 175.481 282.574 175.299 282.293C175.118 282.011 175.028 281.656 175.031 281.227V274.886Z" fill="#454545"/>
<rect x="179.5" y="156.5" width="89" height="21" rx="3.5" fill="black" stroke="#A6A6A6"/>
<path d="M250 164L256 170L262 164" stroke="#454545" stroke-width="2" stroke-linecap="round" stroke-linejoin="round"/>
<path d="M193.551 164.783C193.517 164.439 193.371 164.172 193.112 163.982C192.854 163.791 192.503 163.696 192.06 163.696C191.758 163.696 191.504 163.739 191.297 163.824C191.089 163.906 190.93 164.021 190.82 164.169C190.712 164.317 190.658 164.484 190.658 164.672C190.652 164.828 190.685 164.964 190.756 165.081C190.83 165.197 190.93 165.298 191.058 165.384C191.186 165.466 191.334 165.538 191.501 165.601C191.669 165.661 191.848 165.712 192.038 165.754L192.822 165.942C193.203 166.027 193.553 166.141 193.871 166.283C194.189 166.425 194.464 166.599 194.697 166.807C194.93 167.014 195.111 167.259 195.239 167.54C195.369 167.821 195.436 168.143 195.439 168.507C195.436 169.041 195.3 169.504 195.03 169.896C194.763 170.286 194.376 170.588 193.871 170.804C193.368 171.017 192.761 171.124 192.051 171.124C191.347 171.124 190.733 171.016 190.21 170.8C189.69 170.584 189.284 170.264 188.991 169.841C188.702 169.415 188.55 168.888 188.535 168.26H190.321C190.341 168.553 190.425 168.797 190.572 168.993C190.723 169.186 190.923 169.332 191.173 169.432C191.426 169.528 191.712 169.577 192.03 169.577C192.342 169.577 192.614 169.531 192.844 169.44C193.077 169.349 193.257 169.223 193.385 169.061C193.513 168.899 193.577 168.713 193.577 168.503C193.577 168.307 193.518 168.142 193.402 168.009C193.288 167.875 193.121 167.761 192.899 167.668C192.68 167.574 192.412 167.489 192.094 167.412L191.143 167.173C190.408 166.994 189.827 166.714 189.401 166.334C188.974 165.953 188.763 165.44 188.766 164.795C188.763 164.267 188.903 163.805 189.187 163.411C189.474 163.016 189.868 162.707 190.368 162.486C190.868 162.264 191.436 162.153 192.072 162.153C192.72 162.153 193.285 162.264 193.768 162.486C194.254 162.707 194.632 163.016 194.902 163.411C195.172 163.805 195.311 164.263 195.32 164.783H193.551ZM199.369 171.128C198.696 171.128 198.116 170.991 197.63 170.719C197.147 170.443 196.775 170.054 196.514 169.551C196.252 169.045 196.122 168.447 196.122 167.757C196.122 167.084 196.252 166.493 196.514 165.984C196.775 165.476 197.143 165.08 197.617 164.795C198.095 164.511 198.654 164.369 199.296 164.369C199.728 164.369 200.13 164.439 200.502 164.578C200.877 164.714 201.204 164.92 201.483 165.196C201.764 165.472 201.983 165.818 202.139 166.236C202.295 166.651 202.373 167.136 202.373 167.693V168.192H196.846V167.067H200.664C200.664 166.805 200.608 166.574 200.494 166.372C200.38 166.17 200.223 166.013 200.021 165.899C199.822 165.783 199.59 165.724 199.326 165.724C199.051 165.724 198.806 165.788 198.593 165.916C198.383 166.041 198.218 166.21 198.099 166.423C197.98 166.634 197.919 166.868 197.916 167.126V168.196C197.916 168.52 197.975 168.8 198.095 169.036C198.217 169.271 198.389 169.453 198.61 169.581C198.832 169.709 199.095 169.773 199.399 169.773C199.6 169.773 199.785 169.744 199.953 169.688C200.12 169.631 200.264 169.545 200.383 169.432C200.502 169.318 200.593 169.179 200.656 169.014L202.335 169.125C202.25 169.528 202.075 169.881 201.811 170.182C201.549 170.48 201.211 170.713 200.796 170.881C200.384 171.045 199.909 171.128 199.369 171.128ZM205.113 162.273V171H203.298V162.273H205.113ZM209.29 171.128C208.617 171.128 208.037 170.991 207.552 170.719C207.069 170.443 206.697 170.054 206.435 169.551C206.174 169.045 206.043 168.447 206.043 167.757C206.043 167.084 206.174 166.493 206.435 165.984C206.697 165.476 207.064 165.08 207.539 164.795C208.016 164.511 208.576 164.369 209.218 164.369C209.65 164.369 210.052 164.439 210.424 164.578C210.799 164.714 211.126 164.92 211.404 165.196C211.685 165.472 211.904 165.818 212.06 166.236C212.216 166.651 212.295 167.136 212.295 167.693V168.192H206.768V167.067H210.586C210.586 166.805 210.529 166.574 210.415 166.372C210.302 166.17 210.144 166.013 209.942 165.899C209.743 165.783 209.512 165.724 209.248 165.724C208.972 165.724 208.728 165.788 208.515 165.916C208.304 166.041 208.14 166.21 208.02 166.423C207.901 166.634 207.84 166.868 207.837 167.126V168.196C207.837 168.52 207.897 168.8 208.016 169.036C208.138 169.271 208.31 169.453 208.532 169.581C208.753 169.709 209.016 169.773 209.32 169.773C209.522 169.773 209.706 169.744 209.874 169.688C210.042 169.631 210.185 169.545 210.304 169.432C210.424 169.318 210.515 169.179 210.577 169.014L212.256 169.125C212.171 169.528 211.996 169.881 211.732 170.182C211.471 170.48 211.133 170.713 210.718 170.881C210.306 171.045 209.83 171.128 209.29 171.128ZM216.177 171.128C215.506 171.128 214.929 170.986 214.446 170.702C213.966 170.415 213.597 170.017 213.339 169.509C213.083 169 212.955 168.415 212.955 167.753C212.955 167.082 213.084 166.494 213.343 165.989C213.604 165.48 213.975 165.084 214.455 164.8C214.935 164.513 215.506 164.369 216.168 164.369C216.739 164.369 217.239 164.473 217.668 164.68C218.097 164.888 218.437 165.179 218.687 165.554C218.937 165.929 219.074 166.369 219.1 166.875H217.387C217.339 166.548 217.211 166.286 217.003 166.087C216.799 165.885 216.53 165.784 216.198 165.784C215.917 165.784 215.671 165.861 215.461 166.014C215.253 166.165 215.091 166.385 214.975 166.675C214.858 166.964 214.8 167.315 214.8 167.727C214.8 168.145 214.857 168.5 214.971 168.793C215.087 169.085 215.25 169.308 215.461 169.462C215.671 169.615 215.917 169.692 216.198 169.692C216.405 169.692 216.591 169.649 216.756 169.564C216.924 169.479 217.062 169.355 217.169 169.193C217.28 169.028 217.353 168.831 217.387 168.601H219.1C219.071 169.101 218.935 169.541 218.691 169.922C218.449 170.3 218.116 170.595 217.689 170.808C217.263 171.021 216.759 171.128 216.177 171.128ZM223.484 164.455V165.818H219.542V164.455H223.484ZM220.437 162.886H222.252V168.989C222.252 169.156 222.278 169.287 222.329 169.381C222.38 169.472 222.451 169.536 222.542 169.572C222.636 169.609 222.744 169.628 222.866 169.628C222.951 169.628 223.036 169.621 223.121 169.607C223.207 169.589 223.272 169.577 223.318 169.568L223.603 170.919C223.512 170.947 223.384 170.98 223.219 171.017C223.055 171.057 222.854 171.081 222.619 171.089C222.181 171.107 221.798 171.048 221.468 170.915C221.141 170.781 220.887 170.574 220.705 170.293C220.523 170.011 220.434 169.656 220.437 169.227V162.886Z" fill="#454545"/>
<rect x="20" y="102" width="144" height="116" rx="8" fill="#3D3D3D"/>
<rect x="20" y="82" width="271" height="6" rx="2" fill="#565656"/>
<rect x="179" y="137" width="69" height="6" rx="2" fill="#565656"/>
<rect x="179" y="126" width="90" height="6" rx="2" fill="#565656"/>
<rect x="20" y="14" width="41" height="41" rx="20.5" fill="#B3B3B3"/>
<path d="M71.4616 25.1935V23.5455H79.2266V25.1935H76.332V33H74.3562V25.1935H71.4616ZM82.4116 33.1385C81.6822 33.1385 81.0544 32.9908 80.5281 32.6953C80.0049 32.3968 79.6017 31.9751 79.3186 31.4304C79.0354 30.8826 78.8939 30.2347 78.8939 29.4869C78.8939 28.7575 79.0354 28.1173 79.3186 27.5664C79.6017 27.0155 80.0003 26.5862 80.5142 26.2784C81.0313 25.9706 81.6376 25.8168 82.3331 25.8168C82.8009 25.8168 83.2364 25.8922 83.6396 26.043C84.0458 26.1907 84.3998 26.4138 84.7014 26.7124C85.0061 27.0109 85.243 27.3864 85.4123 27.8388C85.5816 28.2881 85.6662 28.8144 85.6662 29.4176V29.9577H79.6787V28.739H83.815C83.815 28.4558 83.7535 28.205 83.6304 27.9865C83.5073 27.768 83.3364 27.5972 83.1179 27.4741C82.9025 27.3479 82.6517 27.2848 82.3654 27.2848C82.0669 27.2848 81.8022 27.354 81.5714 27.4925C81.3437 27.628 81.1652 27.8111 81.0359 28.0419C80.9066 28.2696 80.8405 28.5236 80.8374 28.8036V29.9624C80.8374 30.3132 80.902 30.6164 81.0313 30.8718C81.1636 31.1272 81.3498 31.3242 81.5899 31.4627C81.8299 31.6012 82.1146 31.6705 82.4439 31.6705C82.6624 31.6705 82.8625 31.6397 83.0441 31.5781C83.2256 31.5166 83.3811 31.4242 83.5103 31.3011C83.6396 31.178 83.7381 31.0272 83.8058 30.8487L85.6247 30.9688C85.5323 31.4058 85.3431 31.7874 85.0569 32.1136C84.7737 32.4368 84.4075 32.6892 83.9581 32.8707C83.5119 33.0492 82.9964 33.1385 82.4116 33.1385ZM88.7116 33.1339C88.2592 33.1339 87.856 33.0554 87.5021 32.8984C87.1482 32.7384 86.8681 32.503 86.6619 32.1921C86.4588 31.8782 86.3572 31.4873 86.3572 31.0195C86.3572 30.6256 86.4295 30.2947 86.5742 30.027C86.7188 29.7592 86.9158 29.5438 87.1651 29.3807C87.4144 29.2176 87.6975 29.0945 88.0145 29.0114C88.3346 28.9283 88.6701 28.8698 89.0209 28.8359C89.4333 28.7929 89.7657 28.7528 90.0181 28.7159C90.2705 28.6759 90.4536 28.6174 90.5674 28.5405C90.6813 28.4635 90.7383 28.3497 90.7383 28.1989V28.1712C90.7383 27.8788 90.6459 27.6526 90.4613 27.4925C90.2797 27.3325 90.0212 27.2525 89.6857 27.2525C89.3318 27.2525 89.0502 27.331 88.8409 27.4879C88.6316 27.6418 88.4931 27.8357 88.4254 28.0696L86.6065 27.9219C86.6988 27.491 86.8804 27.1186 87.1513 26.8047C87.4221 26.4877 87.7714 26.2446 88.1992 26.0753C88.6301 25.9029 89.1286 25.8168 89.6949 25.8168C90.0889 25.8168 90.4659 25.8629 90.826 25.9553C91.1891 26.0476 91.5107 26.1907 91.7908 26.3846C92.074 26.5785 92.2971 26.8278 92.4602 27.1325C92.6233 27.4341 92.7049 27.7957 92.7049 28.2173V33H90.8398V32.0167H90.7844C90.6705 32.2383 90.5182 32.4337 90.3274 32.603C90.1366 32.7692 89.9073 32.9 89.6395 32.9954C89.3718 33.0877 89.0625 33.1339 88.7116 33.1339ZM89.2748 31.7766C89.5641 31.7766 89.8196 31.7197 90.0412 31.6058C90.2628 31.4889 90.4366 31.3319 90.5628 31.1349C90.689 30.938 90.7521 30.7148 90.7521 30.4656V29.7131C90.6906 29.7531 90.6059 29.79 90.4982 29.8239C90.3936 29.8546 90.2751 29.8839 90.1427 29.9116C90.0104 29.9362 89.8781 29.9593 89.7457 29.9808C89.6134 29.9993 89.4933 30.0162 89.3856 30.0316C89.1548 30.0655 88.9532 30.1193 88.7809 30.1932C88.6085 30.267 88.4746 30.3671 88.3792 30.4933C88.2838 30.6164 88.2361 30.7702 88.2361 30.9549C88.2361 31.2227 88.3331 31.4273 88.527 31.5689C88.7239 31.7074 88.9732 31.7766 89.2748 31.7766ZM93.9706 33V25.9091H95.8449V27.1602H95.928C96.0757 26.7447 96.3219 26.4169 96.6666 26.1768C97.0113 25.9368 97.4237 25.8168 97.9039 25.8168C98.3901 25.8168 98.8041 25.9383 99.1457 26.1815C99.4873 26.4215 99.7151 26.7478 99.8289 27.1602H99.9028C100.047 26.7539 100.309 26.4292 100.688 26.1861C101.069 25.9399 101.52 25.8168 102.04 25.8168C102.702 25.8168 103.239 26.0276 103.651 26.4492C104.067 26.8678 104.275 27.4618 104.275 28.2312V33H102.313V28.619C102.313 28.225 102.208 27.9296 101.999 27.7326C101.789 27.5356 101.528 27.4371 101.214 27.4371C100.857 27.4371 100.578 27.551 100.378 27.7788C100.178 28.0034 100.078 28.3004 100.078 28.6697V33H98.1716V28.5774C98.1716 28.2296 98.0716 27.9527 97.8715 27.7464C97.6746 27.5402 97.4145 27.4371 97.0914 27.4371C96.8728 27.4371 96.6759 27.4925 96.5005 27.6033C96.3281 27.7111 96.1911 27.8634 96.0896 28.0604C95.988 28.2543 95.9372 28.482 95.9372 28.7436V33H93.9706ZM116.262 23.5455V33H114.535L110.422 27.0494H110.353V33H108.354V23.5455H110.108L114.189 29.4915H114.272V23.5455H116.262ZM119.638 33.1339C119.186 33.1339 118.783 33.0554 118.429 32.8984C118.075 32.7384 117.795 32.503 117.589 32.1921C117.386 31.8782 117.284 31.4873 117.284 31.0195C117.284 30.6256 117.356 30.2947 117.501 30.027C117.646 29.7592 117.843 29.5438 118.092 29.3807C118.341 29.2176 118.624 29.0945 118.941 29.0114C119.261 28.9283 119.597 28.8698 119.948 28.8359C120.36 28.7929 120.693 28.7528 120.945 28.7159C121.197 28.6759 121.38 28.6174 121.494 28.5405C121.608 28.4635 121.665 28.3497 121.665 28.1989V28.1712C121.665 27.8788 121.573 27.6526 121.388 27.4925C121.206 27.3325 120.948 27.2525 120.612 27.2525C120.259 27.2525 119.977 27.331 119.768 27.4879C119.558 27.6418 119.42 27.8357 119.352 28.0696L117.533 27.9219C117.626 27.491 117.807 27.1186 118.078 26.8047C118.349 26.4877 118.698 26.2446 119.126 26.0753C119.557 25.9029 120.055 25.8168 120.622 25.8168C121.016 25.8168 121.393 25.8629 121.753 25.9553C122.116 26.0476 122.438 26.1907 122.718 26.3846C123.001 26.5785 123.224 26.8278 123.387 27.1325C123.55 27.4341 123.632 27.7957 123.632 28.2173V33H121.767V32.0167H121.711C121.597 32.2383 121.445 32.4337 121.254 32.603C121.063 32.7692 120.834 32.9 120.566 32.9954C120.299 33.0877 119.989 33.1339 119.638 33.1339ZM120.202 31.7766C120.491 31.7766 120.746 31.7197 120.968 31.6058C121.19 31.4889 121.363 31.3319 121.49 31.1349C121.616 30.938 121.679 30.7148 121.679 30.4656V29.7131C121.617 29.7531 121.533 29.79 121.425 29.8239C121.32 29.8546 121.202 29.8839 121.07 29.9116C120.937 29.9362 120.805 29.9593 120.673 29.9808C120.54 29.9993 120.42 30.0162 120.312 30.0316C120.082 30.0655 119.88 30.1193 119.708 30.1932C119.535 30.267 119.401 30.3671 119.306 30.4933C119.211 30.6164 119.163 30.7702 119.163 30.9549C119.163 31.2227 119.26 31.4273 119.454 31.5689C119.651 31.7074 119.9 31.7766 120.202 31.7766ZM124.897 33V25.9091H126.772V27.1602H126.855C127.003 26.7447 127.249 26.4169 127.593 26.1768C127.938 25.9368 128.351 25.8168 128.831 25.8168C129.317 25.8168 129.731 25.9383 130.072 26.1815C130.414 26.4215 130.642 26.7478 130.756 27.1602H130.83C130.974 26.7539 131.236 26.4292 131.614 26.1861C131.996 25.9399 132.447 25.8168 132.967 25.8168C133.629 25.8168 134.166 26.0276 134.578 26.4492C134.994 26.8678 135.201 27.4618 135.201 28.2312V33H133.239V28.619C133.239 28.225 133.135 27.9296 132.925 27.7326C132.716 27.5356 132.455 27.4371 132.141 27.4371C131.784 27.4371 131.505 27.551 131.305 27.7788C131.105 28.0034 131.005 28.3004 131.005 28.6697V33H129.098V28.5774C129.098 28.2296 128.998 27.9527 128.798 27.7464C128.601 27.5402 128.341 27.4371 128.018 27.4371C127.8 27.4371 127.603 27.4925 127.427 27.6033C127.255 27.7111 127.118 27.8634 127.016 28.0604C126.915 28.2543 126.864 28.482 126.864 28.7436V33H124.897ZM139.726 33.1385C138.997 33.1385 138.369 32.9908 137.843 32.6953C137.32 32.3968 136.916 31.9751 136.633 31.4304C136.35 30.8826 136.209 30.2347 136.209 29.4869C136.209 28.7575 136.35 28.1173 136.633 27.5664C136.916 27.0155 137.315 26.5862 137.829 26.2784C138.346 25.9706 138.952 25.8168 139.648 25.8168C140.116 25.8168 140.551 25.8922 140.954 26.043C141.361 26.1907 141.715 26.4138 142.016 26.7124C142.321 27.0109 142.558 27.3864 142.727 27.8388C142.896 28.2881 142.981 28.8144 142.981 29.4176V29.9577H136.993V28.739H141.13C141.13 28.4558 141.068 28.205 140.945 27.9865C140.822 27.768 140.651 27.5972 140.433 27.4741C140.217 27.3479 139.966 27.2848 139.68 27.2848C139.382 27.2848 139.117 27.354 138.886 27.4925C138.658 27.628 138.48 27.8111 138.351 28.0419C138.221 28.2696 138.155 28.5236 138.152 28.8036V29.9624C138.152 30.3132 138.217 30.6164 138.346 30.8718C138.478 31.1272 138.665 31.3242 138.905 31.4627C139.145 31.6012 139.429 31.6705 139.759 31.6705C139.977 31.6705 140.177 31.6397 140.359 31.5781C140.54 31.5166 140.696 31.4242 140.825 31.3011C140.954 31.178 141.053 31.0272 141.121 30.8487L142.939 30.9688C142.847 31.4058 142.658 31.7874 142.372 32.1136C142.088 32.4368 141.722 32.6892 141.273 32.8707C140.827 33.0492 140.311 33.1385 139.726 33.1385Z" fill="white"/>
<rect x="71" y="45" width="89" height="6" rx="2" fill="#565656"/>
<path fill-rule="evenodd" clip-rule="evenodd" d="M127.746 156.231C131.15 154.431 133.47 150.854 133.47 146.735C133.47 140.806 128.664 136 122.735 136C116.806 136 112 140.806 112 146.735C112 150.854 114.32 154.431 117.724 156.231C114.32 159.937 112 167.302 112 175.782C112 187.988 116.806 197.883 122.735 197.883C128.664 197.883 133.47 187.988 133.47 175.782C133.47 167.302 131.15 159.937 127.746 156.231Z" fill="#4E4E4E"/>
<rect x="105" y="125" width="36" height="36" fill="#242424" fill-opacity="0.5"/>
<path d="M121.646 146.235V146.114C121.655 145.321 121.734 144.69 121.883 144.222C122.036 143.753 122.254 143.374 122.535 143.084C122.816 142.794 123.155 142.53 123.551 142.291C123.807 142.129 124.037 141.948 124.242 141.748C124.446 141.548 124.608 141.317 124.727 141.058C124.847 140.798 124.906 140.51 124.906 140.195C124.906 139.815 124.817 139.487 124.638 139.21C124.459 138.933 124.22 138.72 123.922 138.571C123.628 138.418 123.3 138.341 122.938 138.341C122.61 138.341 122.296 138.409 121.998 138.545C121.7 138.682 121.453 138.895 121.257 139.185C121.061 139.47 120.948 139.839 120.918 140.29H118.975C119.004 139.523 119.198 138.876 119.556 138.347C119.914 137.815 120.387 137.412 120.975 137.139C121.568 136.866 122.222 136.73 122.938 136.73C123.722 136.73 124.408 136.877 124.996 137.171C125.584 137.461 126.04 137.868 126.364 138.392C126.692 138.912 126.856 139.519 126.856 140.214C126.856 140.691 126.781 141.121 126.632 141.505C126.483 141.884 126.27 142.223 125.993 142.521C125.72 142.82 125.392 143.084 125.009 143.314C124.646 143.54 124.352 143.774 124.127 144.017C123.905 144.26 123.743 144.548 123.641 144.88C123.539 145.212 123.483 145.624 123.475 146.114V146.235H121.646ZM122.612 150.121C122.262 150.121 121.962 149.998 121.71 149.751C121.459 149.499 121.333 149.197 121.333 148.843C121.333 148.494 121.459 148.195 121.71 147.948C121.962 147.697 122.262 147.571 122.612 147.571C122.957 147.571 123.255 147.697 123.507 147.948C123.762 148.195 123.89 148.494 123.89 148.843C123.89 149.077 123.83 149.293 123.711 149.489C123.596 149.68 123.443 149.834 123.251 149.949C123.059 150.064 122.846 150.121 122.612 150.121Z" fill="white"/>
<path fill-rule="evenodd" clip-rule="evenodd" d="M57.4674 165.019C60.1631 163.594 62 160.761 62 157.5C62 152.806 58.1944 149 53.5 149C48.8056 149 45 152.806 45 157.5C45 160.761 46.8369 163.594 49.5326 165.019C46.8369 167.954 45 173.785 45 180.5C45 190.165 48.8056 198 53.5 198C58.1944 198 62 190.165 62 180.5C62 173.785 60.1631 167.954 57.4674 165.019Z" fill="#4E4E4E"/>
<path fill-rule="evenodd" clip-rule="evenodd" d="M79.6675 159.2C82.8389 157.523 85 154.191 85 150.354C85 144.831 80.5228 140.354 75 140.354C69.4772 140.354 65 144.831 65 150.354C65 154.191 67.1611 157.523 70.3325 159.2C67.1611 162.652 65 169.513 65 177.412C65 188.783 69.4772 198.001 75 198.001C80.5228 198.001 85 188.783 85 177.412C85 169.513 82.8389 162.652 79.6675 159.2Z" fill="#4E4E4E"/>
<path fill-rule="evenodd" clip-rule="evenodd" d="M100.812 164.462C103.582 162.997 105.47 160.087 105.47 156.735C105.47 151.911 101.559 148 96.7349 148C91.9107 148 88 151.911 88 156.735C88 160.087 89.8877 162.997 92.6579 164.462C89.8877 167.477 88 173.47 88 180.371C88 190.303 91.9107 198.354 96.7349 198.354C101.559 198.354 105.47 190.303 105.47 180.371C105.47 173.47 103.582 167.477 100.812 164.462Z" fill="#4E4E4E"/>
</svg>
