<svg width="24" height="25" viewBox="0 0 24 25" fill="none" xmlns="http://www.w3.org/2000/svg">
<path d="M4 8.19531C4.55228 8.19531 5 7.7476 5 7.19531C5 6.64303 4.55228 6.19531 4 6.19531C3.44772 6.19531 3 6.64303 3 7.19531C3 7.7476 3.44772 8.19531 4 8.19531Z" fill="#051F24" fill-opacity="0.6"/>
<path d="M4 13.1953C4.55228 13.1953 5 12.7476 5 12.1953C5 11.643 4.55228 11.1953 4 11.1953C3.44772 11.1953 3 11.643 3 12.1953C3 12.7476 3.44772 13.1953 4 13.1953Z" fill="#051F24" fill-opacity="0.6"/>
<path d="M4 18.1953C4.55228 18.1953 5 17.7476 5 17.1953C5 16.643 4.55228 16.1953 4 16.1953C3.44772 16.1953 3 16.643 3 17.1953C3 17.7476 3.44772 18.1953 4 18.1953Z" fill="#051F24" fill-opacity="0.6"/>
<path d="M20.06 11.1953H7.94C7.42085 11.1953 7 11.6162 7 12.1353V12.2553C7 12.7745 7.42085 13.1953 7.94 13.1953H20.06C20.5791 13.1953 21 12.7745 21 12.2553V12.1353C21 11.6162 20.5791 11.1953 20.06 11.1953Z" fill="#051F24" fill-opacity="0.6"/>
<path d="M20.06 16.1953H7.94C7.42085 16.1953 7 16.6162 7 17.1353V17.2553C7 17.7745 7.42085 18.1953 7.94 18.1953H20.06C20.5791 18.1953 21 17.7745 21 17.2553V17.1353C21 16.6162 20.5791 16.1953 20.06 16.1953Z" fill="#051F24" fill-opacity="0.6"/>
<path d="M20.06 6.19531H7.94C7.42085 6.19531 7 6.61616 7 7.13531V7.25531C7 7.77446 7.42085 8.19531 7.94 8.19531H20.06C20.5791 8.19531 21 7.77446 21 7.25531V7.13531C21 6.61616 20.5791 6.19531 20.06 6.19531Z" fill="#051F24" fill-opacity="0.6"/>
</svg>
