<svg width="296" height="47" viewBox="0 0 296 47" fill="none" xmlns="http://www.w3.org/2000/svg">
<path fill-rule="evenodd" clip-rule="evenodd" d="M104.103 0.925056C104.565 1.39489 104.864 1.99978 104.959 2.65175C105.053 3.30373 104.937 3.9688 104.627 4.55023L97.3517 18.2117L108.281 24.0321C108.781 24.298 109.198 24.696 109.488 25.1827C109.777 25.6693 109.927 26.2261 109.922 26.7923C109.917 27.3585 109.757 27.9125 109.459 28.394C109.161 28.8755 108.737 29.2661 108.232 29.5232L74.5553 46.6603C73.9685 46.9599 73.3014 47.0644 72.651 46.9587C72.0006 46.853 71.401 46.5425 70.9392 46.0724C70.4775 45.6024 70.1779 44.9972 70.0838 44.3451C69.9898 43.6929 70.1063 43.0278 70.4163 42.4464L77.6919 28.7849L66.7627 22.9645C66.2628 22.6986 65.8455 22.3006 65.556 21.8139C65.2666 21.3273 65.1162 20.7705 65.1212 20.2043C65.1261 19.6381 65.2863 19.0841 65.5843 18.6026C65.8823 18.1211 66.3066 17.7305 66.8111 17.4735L100.488 0.336338C101.075 0.0378755 101.742 -0.0656985 102.392 0.0406634C103.041 0.147025 103.64 0.457783 104.101 0.927789L104.103 0.925056Z" fill="#F57105"/>
<path d="M9.48454 33.6866C6.75082 33.6866 4.48664 33.1023 2.69198 31.9337C0.897327 30.7651 0 29.4504 0 27.9897C0 26.508 0.75125 25.7672 2.25375 25.7672C2.85893 25.7672 3.39106 25.9759 3.85016 26.3933C4.30926 26.7897 4.69532 27.2801 5.00834 27.8645C5.32136 28.4279 5.65525 29.0018 6.01 29.5861C6.36476 30.1495 6.85516 30.6295 7.4812 31.026C8.10725 31.4225 8.84806 31.6207 9.70365 31.6207C10.6218 31.6207 11.3418 31.3912 11.8635 30.9321C12.4061 30.473 12.6774 29.8365 12.6774 29.0226C12.6774 28.2088 12.4478 27.5306 11.9887 26.988C11.5505 26.4246 10.9662 25.9968 10.2358 25.7046C9.52627 25.3916 8.73329 25.1203 7.85683 24.8908C6.98037 24.6403 6.10391 24.3586 5.22745 24.0456C4.35099 23.7117 3.54757 23.3152 2.81719 22.8561C2.10768 22.3762 1.52337 21.6979 1.06427 20.8215C0.605174 19.9242 0.375625 18.8599 0.375625 17.6287C0.375625 15.6253 1.14774 13.9976 2.69198 12.7455C4.23622 11.4934 6.29172 10.8674 8.8585 10.8674C11.3835 10.8674 13.5121 11.4413 15.2441 12.589C16.997 13.7159 17.8631 15.0097 17.8422 16.4705C17.8422 17.18 17.6335 17.7434 17.2162 18.1608C16.8197 18.5573 16.2354 18.7555 15.4632 18.7555C14.7746 18.7555 14.1903 18.5573 13.7103 18.1608C13.2304 17.7434 12.8443 17.253 12.5521 16.6896C12.2809 16.1262 11.9991 15.5627 11.707 14.9993C11.4357 14.415 11.0496 13.9246 10.5488 13.5281C10.0688 13.1107 9.4741 12.902 8.76459 12.902C7.82553 12.902 7.10558 13.1629 6.60474 13.6846C6.10391 14.1854 5.85349 14.8428 5.85349 15.6566C5.85349 16.554 6.07261 17.3156 6.51084 17.9417C6.96994 18.5469 7.55424 19.0164 8.26376 19.3503C8.99414 19.6842 9.79756 19.9868 10.674 20.258C11.5505 20.5085 12.4165 20.7902 13.2721 21.1032C14.1486 21.4162 14.9415 21.8023 15.6511 22.2614C16.3814 22.6996 16.9657 23.3361 17.404 24.1708C17.8631 25.0055 18.0926 26.0176 18.0926 27.2071C18.0926 29.1896 17.2579 30.7651 15.5885 31.9337C13.9399 33.1023 11.9052 33.6866 9.48454 33.6866Z" fill="white"/>
<path d="M28.6087 18.0356C30.5494 18.0356 32.2606 18.7034 33.7422 20.0389C35.2447 21.3536 35.996 23.2109 35.996 25.6107C35.996 28.0105 35.2656 29.9617 33.8048 31.4642C32.3649 32.9458 30.6329 33.6866 28.6087 33.6866C27.3357 33.6866 26.2714 33.3841 25.4158 32.7789V36.5664C25.4158 37.0881 25.6454 37.5994 26.1045 38.1002C26.5845 38.6219 26.8244 39.008 26.8244 39.2584V39.3836C26.8244 39.7801 26.574 39.9784 26.0732 39.9784H19.4371C18.9363 39.9784 18.6859 39.7801 18.6859 39.3836V39.2584C18.6859 39.008 18.8946 38.6219 19.3119 38.1002C19.7293 37.5994 19.938 37.0881 19.938 36.5664V23.7326C19.938 23.2526 19.6876 22.8039 19.1867 22.3866C18.6859 21.9484 18.4355 21.5936 18.4355 21.3223V21.1658C18.4355 20.8319 18.6755 20.5293 19.1554 20.258L23.2873 18.2234C23.7464 18.0356 24.0803 18.0043 24.289 18.1295C24.4976 18.2547 24.602 18.4947 24.602 18.8494V19.7572C25.4158 18.6095 26.7514 18.0356 28.6087 18.0356ZM28.1078 32.1528C29.6938 32.1528 30.4868 30.8382 30.4868 28.2088C30.4868 26.9567 30.3824 25.7046 30.1738 24.4525C29.986 23.2004 29.6312 22.0736 29.1095 21.0719C28.6087 20.0702 28.0035 19.5694 27.294 19.5694C26.7305 19.5694 26.2714 19.7989 25.9167 20.258C25.5828 20.7171 25.4158 21.3119 25.4158 22.0423V27.7079C25.4158 29.0018 25.6871 30.066 26.2297 30.9008C26.7723 31.7355 27.3983 32.1528 28.1078 32.1528Z" fill="white"/>
<path d="M45.3467 33.6866C42.926 33.6866 40.8705 32.9458 39.1802 31.4642C37.5108 29.9617 36.676 28.0836 36.676 25.8298C36.676 23.5761 37.5108 21.7188 39.1802 20.258C40.8497 18.7764 42.8321 18.0356 45.1276 18.0356C47.5066 18.0356 49.5308 18.7764 51.2002 20.258C52.8697 21.7397 53.7044 23.6178 53.7044 25.8924C53.7044 28.1462 52.8905 30.0139 51.2628 31.4955C49.6351 32.9563 47.6631 33.6866 45.3467 33.6866ZM46.0041 32.1528C47.3396 32.1528 48.0074 30.8695 48.0074 28.3027C48.0074 27.3636 47.8718 26.2472 47.6005 24.9534C47.3501 23.6595 46.9118 22.4388 46.2858 21.291C45.6806 20.1433 45.0024 19.5694 44.2512 19.5694C43.5208 19.5694 42.9991 19.8928 42.686 20.5398C42.373 21.1867 42.2165 22.1675 42.2165 23.4822C42.2165 24.1708 42.3 24.9847 42.4669 25.9237C42.6339 26.8628 42.8634 27.8123 43.1556 28.7722C43.4477 29.7113 43.8442 30.5147 44.3451 31.1825C44.8668 31.8294 45.4198 32.1528 46.0041 32.1528Z" fill="white"/>
<path d="M64.9705 18.0356C65.8678 18.0356 66.5773 18.3277 67.099 18.9121C67.6416 19.4964 67.9128 20.2372 67.9128 21.1345C67.9128 23.0961 67.1094 24.0769 65.5026 24.0769C64.8557 24.0769 64.3653 23.9308 64.0314 23.6387C63.6975 23.3256 63.4993 22.9813 63.4366 22.6057C63.3949 22.2301 63.2906 21.8962 63.1236 21.604C62.9567 21.291 62.7063 21.1345 62.3724 21.1345C61.6003 21.1345 61.2142 22.1362 61.2142 24.1395V29.9617C61.2142 30.4834 61.4855 31.0051 62.0281 31.5268C62.5915 32.0276 62.8732 32.4033 62.8732 32.6537V32.7789C62.8732 33.1754 62.6228 33.3736 62.122 33.3736H55.392C54.8912 33.3736 54.6408 33.1754 54.6408 32.7789V32.6537C54.6408 32.4033 54.8494 32.0276 55.2668 31.5268C55.6842 31.0051 55.8928 30.4834 55.8928 29.9617V23.7326C55.8928 23.3152 55.7676 22.9605 55.5172 22.6683C55.2668 22.3762 55.0164 22.1257 54.766 21.9171C54.5155 21.7084 54.3903 21.4788 54.3903 21.2284V21.1345C54.3903 20.7797 54.6303 20.4772 55.1103 20.2267L59.5239 18.1608C59.9412 18.0147 60.2334 18.0043 60.4003 18.1295C60.5673 18.2547 60.6508 18.4947 60.6508 18.8494V21.1345C61.3603 19.0686 62.8002 18.0356 64.9705 18.0356Z" fill="white"/>
<path d="M74.5208 33.6866C72.9348 33.6866 71.6827 33.1858 70.7645 32.1841C69.8672 31.1825 69.4185 29.753 69.4185 27.8958V20.4772H68.2291C68.0204 20.4772 67.843 20.4146 67.6969 20.2893C67.5717 20.1433 67.5091 19.9659 67.5091 19.7572V19.0686C67.5091 18.5886 67.7491 18.3486 68.2291 18.3486H68.8238C69.7837 18.3486 70.608 18.0669 71.2967 17.5035C71.9853 16.9191 72.434 16.147 72.6427 15.1871C72.747 14.6445 73.0287 14.3732 73.4878 14.3732H74.2078C74.7712 14.3732 75.0529 14.6445 75.0529 15.1871V18.3486H78.277C78.4857 18.3486 78.6527 18.4216 78.7779 18.5677C78.9239 18.6929 78.997 18.8599 78.997 19.0686V19.7572C78.997 19.9659 78.9239 20.1433 78.7779 20.2893C78.6527 20.4146 78.4857 20.4772 78.277 20.4772H75.0529V27.9897C75.0529 28.5114 75.1886 28.9287 75.4598 29.2417C75.7311 29.5339 76.065 29.68 76.4615 29.68C77.3588 29.68 78.0475 29.2939 78.5275 28.5218C78.6735 28.334 78.8405 28.2296 79.0283 28.2088C79.2161 28.167 79.3726 28.1983 79.4978 28.3027C79.6439 28.407 79.7169 28.5531 79.7169 28.7409C79.7169 30.0556 79.2474 31.2138 78.3083 32.2154C77.3901 33.1962 76.1276 33.6866 74.5208 33.6866Z" fill="white"/>
<path d="M97.7621 27.0193C98.3881 27.0193 98.6281 27.3114 98.4821 27.8958L97.5117 32.6224C97.3656 33.1232 97.1048 33.3736 96.7291 33.3736H80.2642C80.0555 33.3736 79.8677 33.3006 79.7008 33.1545C79.5339 33.0084 79.4504 32.8311 79.4504 32.6224V32.2154C79.4504 32.0902 79.4817 31.9546 79.5443 31.8085C79.6278 31.6624 79.7321 31.4955 79.8573 31.3077C79.9825 31.1199 80.066 30.9947 80.1077 30.9321L90.8443 13.309H84.9908C84.5944 13.309 84.1979 13.5177 83.8014 13.935C83.4257 14.3315 83.1023 14.7697 82.831 15.2497C82.5597 15.7297 82.2154 16.1783 81.798 16.5957C81.4015 16.9922 80.9946 17.1904 80.5772 17.1904H80.3894C79.6382 17.1904 79.3565 16.8044 79.5443 16.0323L80.4207 12.1195C80.5042 11.7647 80.619 11.5143 80.7651 11.3682C80.932 11.2222 81.1824 11.1491 81.5163 11.1491H97.0422C97.2508 11.1491 97.4282 11.2222 97.5743 11.3682C97.7204 11.5143 97.7934 11.6917 97.7934 11.9004V12.3073C97.7934 12.4116 97.5221 12.9438 96.9796 13.9037L86.5872 31.2138H92.5347C93.0772 31.2138 93.5989 30.9947 94.0998 30.5564C94.6006 30.1182 95.018 29.6382 95.3518 29.1165C95.6857 28.5948 96.0614 28.1149 96.4787 27.6766C96.8961 27.2384 97.2821 27.0193 97.6369 27.0193H97.7621Z" fill="white"/>
<path d="M106.741 33.6866C104.362 33.6866 102.411 32.9145 100.888 31.3703C99.3645 29.8052 98.6029 27.9584 98.6029 25.8298C98.6029 23.4717 99.375 21.5936 100.919 20.1954C102.463 18.7764 104.342 18.0565 106.554 18.0356C108.411 18.0147 109.986 18.4425 111.28 19.319C112.574 20.1746 113.221 21.291 113.221 22.6683C113.221 23.19 113.033 23.6282 112.658 23.983C112.303 24.3377 111.729 24.5047 110.936 24.4838C110.226 24.4421 109.611 24.1604 109.089 23.6387C108.588 23.117 108.223 22.5535 107.993 21.9484C107.764 21.3432 107.451 20.8006 107.054 20.3206C106.658 19.8198 106.209 19.5694 105.708 19.5694C105.062 19.5903 104.529 19.9346 104.112 20.6024C103.716 21.2701 103.517 22.0944 103.517 23.0752C103.517 25.1203 103.976 26.7584 104.895 27.9897C105.834 29.2209 107.075 29.8365 108.62 29.8365C110.018 29.8365 111.176 29.2313 112.094 28.021C112.303 27.7705 112.553 27.6871 112.845 27.7705C113.137 27.8332 113.284 28.0314 113.284 28.3653C113.242 29.8261 112.647 31.0781 111.499 32.1215C110.352 33.1649 108.766 33.6866 106.741 33.6866Z" fill="white"/>
<path d="M130.682 29.9304C130.723 30.4521 130.922 30.9738 131.276 31.4955C131.631 31.9963 131.809 32.3824 131.809 32.6537V32.7789C131.809 33.1754 131.558 33.3736 131.057 33.3736H124.828C124.327 33.3736 124.077 33.1754 124.077 32.7789V32.6537C124.077 32.4033 124.265 32.0172 124.64 31.4955C125.037 30.9738 125.225 30.4521 125.204 29.9304L124.891 24.1082C124.807 22.6683 124.599 21.6458 124.265 21.0406C123.931 20.4146 123.409 20.1015 122.7 20.1015C122.032 20.1015 121.521 20.3728 121.166 20.9154C120.832 21.458 120.665 22.1988 120.665 23.1378V29.9617C120.665 30.4834 120.895 31.0051 121.354 31.5268C121.834 32.0276 122.074 32.4033 122.074 32.6537V32.7789C122.074 33.1754 121.823 33.3736 121.322 33.3736H114.53C114.05 33.3736 113.81 33.1754 113.81 32.7789V32.6537C113.81 32.4033 114.039 32.0276 114.498 31.5268C114.958 31.0051 115.187 30.4834 115.187 29.9617V15.4375C115.187 14.8949 114.926 14.4045 114.405 13.9663C113.904 13.5281 113.653 13.1838 113.653 12.9333V12.8394C113.653 12.4638 113.893 12.1717 114.373 11.963L119.319 9.77183C119.674 9.60489 119.955 9.58402 120.164 9.70923C120.394 9.83444 120.508 10.0744 120.508 10.4292V19.5068C121.448 18.526 122.72 18.0356 124.327 18.0356C125.872 18.0356 127.207 18.5364 128.334 19.5381C129.461 20.5189 130.108 22.1049 130.275 24.296L130.682 29.9304Z" fill="white"/>
<path d="M147.191 29.9617C147.254 30.4625 147.368 30.8695 147.535 31.1825C147.723 31.4746 147.901 31.6624 148.068 31.7459C148.255 31.8294 148.422 31.9337 148.568 32.0589C148.714 32.1841 148.787 32.3407 148.787 32.5285C148.787 33.2171 147.608 33.5614 145.25 33.5614C144.29 33.5614 143.57 33.4467 143.09 33.2171C142.631 32.9876 142.339 32.6015 142.214 32.0589C141.421 33.1441 140.096 33.6866 138.239 33.6866C136.486 33.6866 135.056 33.2797 133.95 32.4659C132.865 31.652 132.323 30.473 132.323 28.9287C132.323 27.4262 132.865 26.2576 133.95 25.4229C135.035 24.5673 136.371 24.1395 137.957 24.1395C139.188 24.1395 140.242 24.4004 141.118 24.9221V24.8281C140.91 22.7622 140.67 21.364 140.399 20.6337C140.148 19.9033 139.647 19.5381 138.896 19.5381C138.416 19.5381 138.03 19.7572 137.738 20.1954C137.446 20.6337 137.227 21.1136 137.08 21.6353C136.955 22.157 136.705 22.637 136.329 23.0752C135.954 23.5135 135.453 23.7326 134.827 23.7326C134.18 23.7326 133.648 23.5448 133.23 23.1691C132.834 22.7935 132.636 22.3031 132.636 21.6979C132.636 20.4876 133.241 19.5798 134.451 18.9747C135.661 18.3486 137.143 18.0356 138.896 18.0356C140.983 18.0356 142.704 18.6095 144.061 19.7572C145.438 20.8841 146.252 22.4179 146.502 24.3586L147.191 29.9617ZM139.96 32.0902C140.44 32.0902 140.826 31.8607 141.118 31.4016C141.431 30.9425 141.588 30.4208 141.588 29.8365L141.463 28.3966C141.254 26.6645 140.607 25.7985 139.522 25.7985C139.042 25.7985 138.656 25.9968 138.364 26.3933C138.072 26.7689 137.926 27.2801 137.926 27.9271C137.926 29.0957 138.103 30.0869 138.458 30.9008C138.833 31.6937 139.334 32.0902 139.96 32.0902Z" fill="white"/>
<path d="M153.069 16.5018C152.005 16.5018 151.139 16.2096 150.471 15.6253C149.803 15.0202 149.469 14.2689 149.469 13.3716C149.469 12.4742 149.803 11.7334 150.471 11.1491C151.139 10.544 152.005 10.2414 153.069 10.2414C154.112 10.2414 154.968 10.544 155.636 11.1491C156.304 11.7334 156.637 12.4742 156.637 13.3716C156.637 14.2689 156.304 15.0202 155.636 15.6253C154.968 16.2096 154.112 16.5018 153.069 16.5018ZM149.72 33.3736C149.219 33.3736 148.968 33.1754 148.968 32.7789V32.6537C148.968 32.4033 149.177 32.0172 149.594 31.4955C150.012 30.9738 150.221 30.4521 150.221 29.9304V23.983C150.221 23.4404 150.012 22.9187 149.594 22.4179C149.177 21.8962 148.968 21.5414 148.968 21.3536V21.2284C148.968 20.978 149.208 20.738 149.688 20.5085L154.415 18.1921C154.853 18.0043 155.198 17.9834 155.448 18.1295C155.698 18.2756 155.824 18.5156 155.824 18.8494V29.9304C155.824 30.4521 156.053 30.9738 156.512 31.4955C156.992 32.0172 157.232 32.4033 157.232 32.6537V32.7789C157.232 33.1754 156.971 33.3736 156.45 33.3736H149.72Z" fill="white"/>
<path d="M174.873 29.9617C174.915 30.4834 175.113 31.0051 175.468 31.5268C175.823 32.0276 176 32.4137 176 32.685V32.8102C176 33.2067 175.75 33.4049 175.249 33.4049H168.988C168.487 33.4049 168.237 33.2067 168.237 32.8102V32.685C168.237 32.4346 168.435 32.0485 168.832 31.5268C169.228 31.0051 169.406 30.4834 169.364 29.9617L169.051 24.3586C168.967 22.8144 168.759 21.7188 168.425 21.0719C168.112 20.425 167.601 20.1015 166.891 20.1015C166.223 20.1015 165.712 20.3728 165.357 20.9154C165.023 21.458 164.856 22.1988 164.856 23.1378V29.9617C164.856 30.4834 165.086 31.0051 165.545 31.5268C166.004 32.0485 166.234 32.4346 166.234 32.685V32.8102C166.234 33.2067 165.983 33.4049 165.482 33.4049H158.721C158.22 33.4049 157.97 33.2067 157.97 32.8102V32.685C157.97 32.4346 158.2 32.0485 158.659 31.5268C159.118 31.0051 159.347 30.4834 159.347 29.9617V23.7952C159.347 23.3569 159.212 22.9918 158.94 22.6996C158.669 22.3866 158.387 22.1257 158.095 21.9171C157.824 21.6875 157.688 21.4475 157.688 21.1971V21.1032C157.688 20.8319 157.939 20.5711 158.44 20.3206L162.822 18.1608C163.218 17.9939 163.51 17.9939 163.698 18.1608C163.907 18.3069 164.011 18.5573 164.011 18.9121V20.3832C164.888 18.8181 166.38 18.0356 168.488 18.0356C170.053 18.0356 171.399 18.5469 172.525 19.5694C173.652 20.5919 174.299 22.2509 174.466 24.5464L174.873 29.9617Z" fill="white"/>
<path d="M97.7512 27.0197C98.3772 27.0197 98.6172 27.3119 98.4711 27.8962L97.5007 32.6229C97.3547 33.1238 97.0938 33.3742 96.7182 33.3742H80.2528C80.0442 33.3742 79.8563 33.3012 79.6894 33.1551C79.5224 33.009 79.439 32.8316 79.439 32.6229V32.216C79.439 32.0908 79.4703 31.9551 79.5329 31.809C79.6163 31.663 79.7207 31.496 79.8459 31.3082C79.9711 31.1204 80.0546 30.9952 80.0963 30.9326L90.8332 13.309H84.9796C84.5831 13.309 84.1866 13.5177 83.7901 13.9351C83.4144 14.3316 83.091 14.7698 82.8197 15.2498C82.5484 15.7298 82.2041 16.1785 81.7867 16.5958C81.3902 16.9923 80.9832 17.1906 80.5659 17.1906H80.378C79.6268 17.1906 79.3451 16.8045 79.5329 16.0324L80.4094 12.1195C80.4928 11.7648 80.6076 11.5143 80.7537 11.3683C80.9206 11.2222 81.1711 11.1491 81.505 11.1491H97.0312C97.2399 11.1491 97.4173 11.2222 97.5633 11.3683C97.7094 11.5143 97.7825 11.6917 97.7825 11.9004V12.3073C97.7825 12.4117 97.5112 12.9438 96.9686 13.9038L86.576 31.2143H92.5236C93.0662 31.2143 93.5879 30.9952 94.0887 30.5569C94.5896 30.1187 95.0069 29.6387 95.3408 29.117C95.6747 28.5953 96.0504 28.1153 96.4677 27.6771C96.8851 27.2388 97.2712 27.0197 97.6259 27.0197H97.7512Z" fill="black"/>
</svg>
