<svg width="24" height="24" viewBox="0 0 24 24" fill="none" xmlns="http://www.w3.org/2000/svg">
<path fill-rule="evenodd" clip-rule="evenodd" d="M5 6.00023H19C19.38 6.00023 19.72 6.21023 19.88 6.53023L12.54 11.4102C12.2 11.6302 11.76 11.6302 11.43 11.4102L4.09 6.52023C4.25 6.19023 4.59 5.98023 4.97 5.98023L5 6.00023ZM4 8.86023V16.9902C4 17.5402 4.44 17.9902 5 17.9902H19C19.55 17.9902 20 17.5402 20 16.9902V8.85023L13.66 13.0702C12.65 13.7402 11.33 13.7402 10.33 13.0702L3.99 8.84023L4 8.86023ZM2 6.99023C2 5.33023 3.34 3.99023 5 3.99023H19C20.65 3.99023 22 5.33023 22 6.99023V16.9902C22 18.6402 20.65 19.9902 19 19.9902H5C3.34 19.9902 2 18.6402 2 16.9902V6.99023Z" fill="#A3A3A3"/>
</svg>
