<svg width="24" height="25" viewBox="0 0 24 25" fill="none" xmlns="http://www.w3.org/2000/svg">
<path d="M15 16.1953H9C8.73478 16.1953 8.48043 16.3007 8.29289 16.4882C8.10536 16.6757 8 16.9301 8 17.1953C8 17.4605 8.10536 17.7149 8.29289 17.9024C8.48043 18.09 8.73478 18.1953 9 18.1953H15C15.2652 18.1953 15.5196 18.09 15.7071 17.9024C15.8946 17.7149 16 17.4605 16 17.1953C16 16.9301 15.8946 16.6757 15.7071 16.4882C15.5196 16.3007 15.2652 16.1953 15 16.1953Z" fill="#051F24" fill-opacity="0.6"/>
<path d="M9 14.1953H12C12.2652 14.1953 12.5196 14.09 12.7071 13.9024C12.8946 13.7149 13 13.4605 13 13.1953C13 12.9301 12.8946 12.6757 12.7071 12.4882C12.5196 12.3007 12.2652 12.1953 12 12.1953H9C8.73478 12.1953 8.48043 12.3007 8.29289 12.4882C8.10536 12.6757 8 12.9301 8 13.1953C8 13.4605 8.10536 13.7149 8.29289 13.9024C8.48043 14.09 8.73478 14.1953 9 14.1953Z" fill="#051F24" fill-opacity="0.6"/>
<path d="M19.74 8.52525L14.3 2.52525C14.2065 2.42166 14.0924 2.33878 13.9649 2.28194C13.8375 2.22511 13.6995 2.19558 13.56 2.19525H6.56C6.22775 2.19129 5.89797 2.25281 5.5895 2.3763C5.28103 2.4998 4.9999 2.68285 4.76218 2.915C4.52446 3.14715 4.33479 3.42386 4.20402 3.72931C4.07324 4.03477 4.00392 4.363 4 4.69525V19.6952C4.00392 20.0275 4.07324 20.3557 4.20402 20.6612C4.33479 20.9666 4.52446 21.2433 4.76218 21.4755C4.9999 21.7076 5.28103 21.8907 5.5895 22.0142C5.89797 22.1377 6.22775 22.1992 6.56 22.1952H17.44C17.7723 22.1992 18.102 22.1377 18.4105 22.0142C18.719 21.8907 19.0001 21.7076 19.2378 21.4755C19.4755 21.2433 19.6652 20.9666 19.796 20.6612C19.9268 20.3557 19.9961 20.0275 20 19.6952V9.19525C19.9994 8.94741 19.9067 8.70865 19.74 8.52525ZM14 5.19525L16.74 8.19525H14.74C14.6353 8.18893 14.5329 8.16181 14.4387 8.11548C14.3446 8.06915 14.2607 8.00454 14.1918 7.92541C14.1229 7.84629 14.0704 7.75423 14.0375 7.65462C14.0046 7.55501 13.9918 7.44984 14 7.34525V5.19525ZM17.44 20.1952H6.56C6.49037 20.1993 6.42063 20.1896 6.35477 20.1666C6.28892 20.1437 6.22824 20.1079 6.17621 20.0615C6.12419 20.015 6.08184 19.9588 6.0516 19.8959C6.02137 19.8331 6.00383 19.7649 6 19.6952V4.69525C6.00383 4.62561 6.02137 4.55741 6.0516 4.49456C6.08184 4.43172 6.12419 4.37546 6.17621 4.32901C6.22824 4.28256 6.28892 4.24683 6.35477 4.22388C6.42063 4.20092 6.49037 4.1912 6.56 4.19525H12V7.34525C11.9839 8.08187 12.2598 8.79497 12.7675 9.32892C13.2752 9.86286 13.9735 10.1743 14.71 10.1952H18V19.6952C17.9962 19.7649 17.9786 19.8331 17.9484 19.8959C17.9182 19.9588 17.8758 20.015 17.8238 20.0615C17.7718 20.1079 17.7111 20.1437 17.6452 20.1666C17.5794 20.1896 17.5096 20.1993 17.44 20.1952Z" fill="#051F24" fill-opacity="0.6"/>
</svg>
