<svg width="12" height="12" viewBox="0 0 12 12" fill="none" xmlns="http://www.w3.org/2000/svg">
<path fill-rule="evenodd" clip-rule="evenodd" d="M9.6 5.4C9.6 7.7196 7.7196 9.6 5.4 9.6C3.0804 9.6 1.2 7.7196 1.2 5.4C1.2 3.0804 3.0804 1.2 5.4 1.2C7.7196 1.2 9.6 3.0804 9.6 5.4ZM8.77061 9.61914C7.84681 10.3581 6.67501 10.8 5.4 10.8C2.41766 10.8 0 8.38234 0 5.4C0 2.41766 2.41766 0 5.4 0C8.38234 0 10.8 2.41766 10.8 5.4C10.8 6.67501 10.3581 7.84681 9.61914 8.77061L11.8243 10.9757C12.0586 11.2101 12.0586 11.5899 11.8243 11.8243C11.5899 12.0586 11.2101 12.0586 10.9757 11.8243L8.77061 9.61914Z" fill="#A3A3A3"/>
</svg>
