<svg width="16" height="20" viewBox="0 0 16 20" fill="none" xmlns="http://www.w3.org/2000/svg">
<path fill-rule="evenodd" clip-rule="evenodd" d="M3 6V5C3 2.23 5.23 0 8 0C10.76 0 13 2.23 13 5V6C14.65 6 16 7.34 16 9V17C16 18.65 14.65 20 13 20H3C1.34 20 0 18.65 0 17V9C0 7.34 1.34 6 3 6ZM5 5C5 3.34 6.34 2 8 2C9.65 2 11 3.34 11 5V6H5V5ZM2 9C2 8.44 2.44 8 3 8H13C13.55 8 14 8.44 14 9V17C14 17.55 13.55 18 13 18H3C2.44 18 2 17.55 2 17V9Z" fill="#A3A3A3"/>
</svg>
