[
    {
      "id": 1,
      "countryName": "Afghanistan",
      "isoCode": "AFG",
      "isActive": 1
    },
    {
      "id": 2,
      "countryName": "Aland Islands",
      "isoCode": "ALA",
      "isActive": 1
    },
    {
      "id": 3,
      "countryName": "Albania",
      "isoCode": "ALB",
      "isActive": 1
    },
    {
      "id": 4,
      "countryName": "Algeria",
      "isoCode": "DZA",
      "isActive": 1
    },
    {
      "id": 5,
      "countryName": "American Samoa",
      "isoCode": "ASM",
      "isActive": 1
    },
    {
      "id": 6,
      "countryName": "Andorra",
      "isoCode": "AND",
      "isActive": 1
    },
    {
      "id": 7,
      "countryName": "Angola",
      "isoCode": "AGO",
      "isActive": 1
    },
    {
      "id": 8,
      "countryName": "Anguilla",
      "isoCode": "AIA",
      "isActive": 1
    },
    {
      "id": 9,
      "countryName": "Antarctica",
      "isoCode": "ATA",
      "isActive": 1
    },
    {
      "id": 10,
      "countryName": "Antigua And Barbuda",
      "isoCode": "ATG",
      "isActive": 1
    },
    {
      "id": 11,
      "countryName": "Argentina",
      "isoCode": "ARG",
      "isActive": 1
    },
    {
      "id": 12,
      "countryName": "Armenia",
      "isoCode": "ARM",
      "isActive": 1
    },
    {
      "id": 13,
      "countryName": "Aruba",
      "isoCode": "ABW",
      "isActive": 1
    },
    {
      "id": 14,
      "countryName": "Australia",
      "isoCode": "AUS",
      "isActive": 1
    },
    {
      "id": 15,
      "countryName": "Austria",
      "isoCode": "AUT",
      "isActive": 1
    },
    {
      "id": 16,
      "countryName": "Azerbaijan",
      "isoCode": "AZE",
      "isActive": 1
    },
    {
      "id": 18,
      "countryName": "Bahrain",
      "isoCode": "BHR",
      "isActive": 1
    },
    {
      "id": 19,
      "countryName": "Bangladesh",
      "isoCode": "BGD",
      "isActive": 1
    },
    {
      "id": 20,
      "countryName": "Barbados",
      "isoCode": "BRB",
      "isActive": 1
    },
    {
      "id": 21,
      "countryName": "Belarus",
      "isoCode": "BLR",
      "isActive": 1
    },
    {
      "id": 22,
      "countryName": "Belgium",
      "isoCode": "BEL",
      "isActive": 1
    },
    {
      "id": 23,
      "countryName": "Belize",
      "isoCode": "BLZ",
      "isActive": 1
    },
    {
      "id": 24,
      "countryName": "Benin",
      "isoCode": "BEN",
      "isActive": 1
    },
    {
      "id": 25,
      "countryName": "Bermuda",
      "isoCode": "BMU",
      "isActive": 1
    },
    {
      "id": 26,
      "countryName": "Bhutan",
      "isoCode": "BTN",
      "isActive": 1
    },
    {
      "id": 27,
      "countryName": "Bolivia",
      "isoCode": "BOL",
      "isActive": 1
    },
    {
      "id": 155,
      "countryName": "Bonaire, Sint Eustatius and Saba",
      "isoCode": "BES",
      "isActive": 1
    },
    {
      "id": 28,
      "countryName": "Bosnia and Herzegovina",
      "isoCode": "BIH",
      "isActive": 1
    },
    {
      "id": 29,
      "countryName": "Botswana",
      "isoCode": "BWA",
      "isActive": 1
    },
    {
      "id": 30,
      "countryName": "Bouvet Island",
      "isoCode": "BVT",
      "isActive": 1
    },
    {
      "id": 31,
      "countryName": "Brazil",
      "isoCode": "BRA",
      "isActive": 1
    },
    {
      "id": 32,
      "countryName": "British Indian Ocean Territory",
      "isoCode": "IOT",
      "isActive": 1
    },
    {
      "id": 33,
      "countryName": "Brunei",
      "isoCode": "BRN",
      "isActive": 1
    },
    {
      "id": 34,
      "countryName": "Bulgaria",
      "isoCode": "BGR",
      "isActive": 1
    },
    {
      "id": 35,
      "countryName": "Burkina Faso",
      "isoCode": "BFA",
      "isActive": 1
    },
    {
      "id": 36,
      "countryName": "Burundi",
      "isoCode": "BDI",
      "isActive": 1
    },
    {
      "id": 37,
      "countryName": "Cambodia",
      "isoCode": "KHM",
      "isActive": 1
    },
    {
      "id": 38,
      "countryName": "Cameroon",
      "isoCode": "CMR",
      "isActive": 1
    },
    {
      "id": 39,
      "countryName": "Canada",
      "isoCode": "CAN",
      "isActive": 1
    },
    {
      "id": 40,
      "countryName": "Cape Verde",
      "isoCode": "CPV",
      "isActive": 1
    },
    {
      "id": 41,
      "countryName": "Cayman Islands",
      "isoCode": "CYM",
      "isActive": 1
    },
    {
      "id": 42,
      "countryName": "Central African Republic",
      "isoCode": "CAF",
      "isActive": 1
    },
    {
      "id": 43,
      "countryName": "Chad",
      "isoCode": "TCD",
      "isActive": 1
    },
    {
      "id": 44,
      "countryName": "Chile",
      "isoCode": "CHL",
      "isActive": 1
    },
    {
      "id": 45,
      "countryName": "China",
      "isoCode": "CHN",
      "isActive": 1
    },
    {
      "id": 46,
      "countryName": "Christmas Island",
      "isoCode": "CXR",
      "isActive": 1
    },
    {
      "id": 47,
      "countryName": "Cocos (Keeling) Islands",
      "isoCode": "CCK",
      "isActive": 1
    },
    {
      "id": 48,
      "countryName": "Colombia",
      "isoCode": "COL",
      "isActive": 1
    },
    {
      "id": 49,
      "countryName": "Comoros",
      "isoCode": "COM",
      "isActive": 1
    },
    {
      "id": 50,
      "countryName": "Congo",
      "isoCode": "COG",
      "isActive": 1
    },
    {
      "id": 52,
      "countryName": "Cook Islands",
      "isoCode": "COK",
      "isActive": 1
    },
    {
      "id": 53,
      "countryName": "Costa Rica",
      "isoCode": "CRI",
      "isActive": 1
    },
    {
      "id": 54,
      "countryName": "Cote D'Ivoire (Ivory Coast)",
      "isoCode": "CIV",
      "isActive": 1
    },
    {
      "id": 55,
      "countryName": "Croatia",
      "isoCode": "HRV",
      "isActive": 1
    },
    {
      "id": 56,
      "countryName": "Cuba",
      "isoCode": "CUB",
      "isActive": 1
    },
    {
      "id": 249,
      "countryName": "Curaçao",
      "isoCode": "CUW",
      "isActive": 1
    },
    {
      "id": 57,
      "countryName": "Cyprus",
      "isoCode": "CYP",
      "isActive": 1
    },
    {
      "id": 58,
      "countryName": "Czech Republic",
      "isoCode": "CZE",
      "isActive": 1
    },
    {
      "id": 51,
      "countryName": "Democratic Republic of the Congo",
      "isoCode": "COD",
      "isActive": 1
    },
    {
      "id": 59,
      "countryName": "Denmark",
      "isoCode": "DNK",
      "isActive": 1
    },
    {
      "id": 60,
      "countryName": "Djibouti",
      "isoCode": "DJI",
      "isActive": 1
    },
    {
      "id": 61,
      "countryName": "Dominica",
      "isoCode": "DMA",
      "isActive": 1
    },
    {
      "id": 62,
      "countryName": "Dominican Republic",
      "isoCode": "DOM",
      "isActive": 1
    },
    {
      "id": 63,
      "countryName": "East Timor",
      "isoCode": "TLS",
      "isActive": 1
    },
    {
      "id": 64,
      "countryName": "Ecuador",
      "isoCode": "ECU",
      "isActive": 1
    },
    {
      "id": 65,
      "countryName": "Egypt",
      "isoCode": "EGY",
      "isActive": 1
    },
    {
      "id": 66,
      "countryName": "El Salvador",
      "isoCode": "SLV",
      "isActive": 1
    },
    {
      "id": 67,
      "countryName": "Equatorial Guinea",
      "isoCode": "GNQ",
      "isActive": 1
    },
    {
      "id": 68,
      "countryName": "Eritrea",
      "isoCode": "ERI",
      "isActive": 1
    },
    {
      "id": 69,
      "countryName": "Estonia",
      "isoCode": "EST",
      "isActive": 1
    },
    {
      "id": 70,
      "countryName": "Ethiopia",
      "isoCode": "ETH",
      "isActive": 1
    },
    {
      "id": 71,
      "countryName": "Falkland Islands",
      "isoCode": "FLK",
      "isActive": 1
    },
    {
      "id": 72,
      "countryName": "Faroe Islands",
      "isoCode": "FRO",
      "isActive": 1
    },
    {
      "id": 73,
      "countryName": "Fiji Islands",
      "isoCode": "FJI",
      "isActive": 1
    },
    {
      "id": 74,
      "countryName": "Finland",
      "isoCode": "FIN",
      "isActive": 1
    },
    {
      "id": 75,
      "countryName": "France",
      "isoCode": "FRA",
      "isActive": 1
    },
    {
      "id": 76,
      "countryName": "French Guiana",
      "isoCode": "GUF",
      "isActive": 1
    },
    {
      "id": 77,
      "countryName": "French Polynesia",
      "isoCode": "PYF",
      "isActive": 1
    },
    {
      "id": 78,
      "countryName": "French Southern Territories",
      "isoCode": "ATF",
      "isActive": 1
    },
    {
      "id": 79,
      "countryName": "Gabon",
      "isoCode": "GAB",
      "isActive": 1
    },
    {
      "id": 80,
      "countryName": "Gambia The",
      "isoCode": "GMB",
      "isActive": 1
    },
    {
      "id": 81,
      "countryName": "Georgia",
      "isoCode": "GEO",
      "isActive": 1
    },
    {
      "id": 82,
      "countryName": "Germany",
      "isoCode": "DEU",
      "isActive": 1
    },
    {
      "id": 83,
      "countryName": "Ghana",
      "isoCode": "GHA",
      "isActive": 1
    },
    {
      "id": 84,
      "countryName": "Gibraltar",
      "isoCode": "GIB",
      "isActive": 1
    },
    {
      "id": 85,
      "countryName": "Greece",
      "isoCode": "GRC",
      "isActive": 1
    },
    {
      "id": 86,
      "countryName": "Greenland",
      "isoCode": "GRL",
      "isActive": 1
    },
    {
      "id": 87,
      "countryName": "Grenada",
      "isoCode": "GRD",
      "isActive": 1
    },
    {
      "id": 88,
      "countryName": "Guadeloupe",
      "isoCode": "GLP",
      "isActive": 1
    },
    {
      "id": 89,
      "countryName": "Guam",
      "isoCode": "GUM",
      "isActive": 1
    },
    {
      "id": 90,
      "countryName": "Guatemala",
      "isoCode": "GTM",
      "isActive": 1
    },
    {
      "id": 91,
      "countryName": "Guernsey and Alderney",
      "isoCode": "GGY",
      "isActive": 1
    },
    {
      "id": 92,
      "countryName": "Guinea",
      "isoCode": "GIN",
      "isActive": 1
    },
    {
      "id": 93,
      "countryName": "Guinea-Bissau",
      "isoCode": "GNB",
      "isActive": 1
    },
    {
      "id": 94,
      "countryName": "Guyana",
      "isoCode": "GUY",
      "isActive": 1
    },
    {
      "id": 95,
      "countryName": "Haiti",
      "isoCode": "HTI",
      "isActive": 1
    },
    {
      "id": 96,
      "countryName": "Heard Island and McDonald Islands",
      "isoCode": "HMD",
      "isActive": 1
    },
    {
      "id": 97,
      "countryName": "Honduras",
      "isoCode": "HND",
      "isActive": 1
    },
    {
      "id": 98,
      "countryName": "Hong Kong S.A.R.",
      "isoCode": "HKG",
      "isActive": 1
    },
    {
      "id": 99,
      "countryName": "Hungary",
      "isoCode": "HUN",
      "isActive": 1
    },
    {
      "id": 100,
      "countryName": "Iceland",
      "isoCode": "ISL",
      "isActive": 1
    },
    {
      "id": 101,
      "countryName": "India",
      "isoCode": "IND",
      "isActive": 1
    },
    {
      "id": 102,
      "countryName": "Indonesia",
      "isoCode": "IDN",
      "isActive": 1
    },
    {
      "id": 103,
      "countryName": "Iran",
      "isoCode": "IRN",
      "isActive": 1
    },
    {
      "id": 104,
      "countryName": "Iraq",
      "isoCode": "IRQ",
      "isActive": 1
    },
    {
      "id": 105,
      "countryName": "Ireland",
      "isoCode": "IRL",
      "isActive": 1
    },
    {
      "id": 106,
      "countryName": "Israel",
      "isoCode": "ISR",
      "isActive": 1
    },
    {
      "id": 107,
      "countryName": "Italy",
      "isoCode": "ITA",
      "isActive": 1
    },
    {
      "id": 108,
      "countryName": "Jamaica",
      "isoCode": "JAM",
      "isActive": 1
    },
    {
      "id": 109,
      "countryName": "Japan",
      "isoCode": "JPN",
      "isActive": 1
    },
    {
      "id": 110,
      "countryName": "Jersey",
      "isoCode": "JEY",
      "isActive": 1
    },
    {
      "id": 111,
      "countryName": "Jordan",
      "isoCode": "JOR",
      "isActive": 1
    },
    {
      "id": 112,
      "countryName": "Kazakhstan",
      "isoCode": "KAZ",
      "isActive": 1
    },
    {
      "id": 113,
      "countryName": "Kenya",
      "isoCode": "KEN",
      "isActive": 1
    },
    {
      "id": 114,
      "countryName": "Kiribati",
      "isoCode": "KIR",
      "isActive": 1
    },
    {
      "id": 248,
      "countryName": "Kosovo",
      "isoCode": "XKX",
      "isActive": 1
    },
    {
      "id": 117,
      "countryName": "Kuwait",
      "isoCode": "KWT",
      "isActive": 1
    },
    {
      "id": 118,
      "countryName": "Kyrgyzstan",
      "isoCode": "KGZ",
      "isActive": 1
    },
    {
      "id": 119,
      "countryName": "Laos",
      "isoCode": "LAO",
      "isActive": 1
    },
    {
      "id": 120,
      "countryName": "Latvia",
      "isoCode": "LVA",
      "isActive": 1
    },
    {
      "id": 121,
      "countryName": "Lebanon",
      "isoCode": "LBN",
      "isActive": 1
    },
    {
      "id": 122,
      "countryName": "Lesotho",
      "isoCode": "LSO",
      "isActive": 1
    },
    {
      "id": 123,
      "countryName": "Liberia",
      "isoCode": "LBR",
      "isActive": 1
    },
    {
      "id": 124,
      "countryName": "Libya",
      "isoCode": "LBY",
      "isActive": 1
    },
    {
      "id": 125,
      "countryName": "Liechtenstein",
      "isoCode": "LIE",
      "isActive": 1
    },
    {
      "id": 126,
      "countryName": "Lithuania",
      "isoCode": "LTU",
      "isActive": 1
    },
    {
      "id": 127,
      "countryName": "Luxembourg",
      "isoCode": "LUX",
      "isActive": 1
    },
    {
      "id": 128,
      "countryName": "Macau S.A.R.",
      "isoCode": "MAC",
      "isActive": 1
    },
    {
      "id": 129,
      "countryName": "Macedonia",
      "isoCode": "MKD",
      "isActive": 1
    },
    {
      "id": 130,
      "countryName": "Madagascar",
      "isoCode": "MDG",
      "isActive": 1
    },
    {
      "id": 131,
      "countryName": "Malawi",
      "isoCode": "MWI",
      "isActive": 1
    },
    {
      "id": 132,
      "countryName": "Malaysia",
      "isoCode": "MYS",
      "isActive": 1
    },
    {
      "id": 133,
      "countryName": "Maldives",
      "isoCode": "MDV",
      "isActive": 1
    },
    {
      "id": 134,
      "countryName": "Mali",
      "isoCode": "MLI",
      "isActive": 1
    },
    {
      "id": 135,
      "countryName": "Malta",
      "isoCode": "MLT",
      "isActive": 1
    },
    {
      "id": 136,
      "countryName": "Man (Isle of)",
      "isoCode": "IMN",
      "isActive": 1
    },
    {
      "id": 137,
      "countryName": "Marshall Islands",
      "isoCode": "MHL",
      "isActive": 1
    },
    {
      "id": 138,
      "countryName": "Martinique",
      "isoCode": "MTQ",
      "isActive": 1
    },
    {
      "id": 139,
      "countryName": "Mauritania",
      "isoCode": "MRT",
      "isActive": 1
    },
    {
      "id": 140,
      "countryName": "Mauritius",
      "isoCode": "MUS",
      "isActive": 1
    },
    {
      "id": 141,
      "countryName": "Mayotte",
      "isoCode": "MYT",
      "isActive": 1
    },
    {
      "id": 142,
      "countryName": "Mexico",
      "isoCode": "MEX",
      "isActive": 1
    },
    {
      "id": 143,
      "countryName": "Micronesia",
      "isoCode": "FSM",
      "isActive": 1
    },
    {
      "id": 144,
      "countryName": "Moldova",
      "isoCode": "MDA",
      "isActive": 1
    },
    {
      "id": 145,
      "countryName": "Monaco",
      "isoCode": "MCO",
      "isActive": 1
    },
    {
      "id": 146,
      "countryName": "Mongolia",
      "isoCode": "MNG",
      "isActive": 1
    },
    {
      "id": 147,
      "countryName": "Montenegro",
      "isoCode": "MNE",
      "isActive": 1
    },
    {
      "id": 148,
      "countryName": "Montserrat",
      "isoCode": "MSR",
      "isActive": 1
    },
    {
      "id": 149,
      "countryName": "Morocco",
      "isoCode": "MAR",
      "isActive": 1
    },
    {
      "id": 150,
      "countryName": "Mozambique",
      "isoCode": "MOZ",
      "isActive": 1
    },
    {
      "id": 151,
      "countryName": "Myanmar",
      "isoCode": "MMR",
      "isActive": 1
    },
    {
      "id": 152,
      "countryName": "Namibia",
      "isoCode": "NAM",
      "isActive": 1
    },
    {
      "id": 153,
      "countryName": "Nauru",
      "isoCode": "NRU",
      "isActive": 1
    },
    {
      "id": 154,
      "countryName": "Nepal",
      "isoCode": "NPL",
      "isActive": 1
    },
    {
      "id": 156,
      "countryName": "Netherlands",
      "isoCode": "NLD",
      "isActive": 1
    },
    {
      "id": 157,
      "countryName": "New Caledonia",
      "isoCode": "NCL",
      "isActive": 1
    },
    {
      "id": 158,
      "countryName": "New Zealand",
      "isoCode": "NZL",
      "isActive": 1
    },
    {
      "id": 159,
      "countryName": "Nicaragua",
      "isoCode": "NIC",
      "isActive": 1
    },
    {
      "id": 160,
      "countryName": "Niger",
      "isoCode": "NER",
      "isActive": 1
    },
    {
      "id": 161,
      "countryName": "Nigeria",
      "isoCode": "NGA",
      "isActive": 1
    },
    {
      "id": 162,
      "countryName": "Niue",
      "isoCode": "NIU",
      "isActive": 1
    },
    {
      "id": 163,
      "countryName": "Norfolk Island",
      "isoCode": "NFK",
      "isActive": 1
    },
    {
      "id": 115,
      "countryName": "North Korea",
      "isoCode": "PRK",
      "isActive": 1
    },
    {
      "id": 164,
      "countryName": "Northern Mariana Islands",
      "isoCode": "MNP",
      "isActive": 1
    },
    {
      "id": 165,
      "countryName": "Norway",
      "isoCode": "NOR",
      "isActive": 1
    },
    {
      "id": 166,
      "countryName": "Oman",
      "isoCode": "OMN",
      "isActive": 1
    },
    {
      "id": 167,
      "countryName": "Pakistan",
      "isoCode": "PAK",
      "isActive": 1
    },
    {
      "id": 168,
      "countryName": "Palau",
      "isoCode": "PLW",
      "isActive": 1
    },
    {
      "id": 169,
      "countryName": "Palestinian Territory Occupied",
      "isoCode": "PSE",
      "isActive": 1
    },
    {
      "id": 170,
      "countryName": "Panama",
      "isoCode": "PAN",
      "isActive": 1
    },
    {
      "id": 171,
      "countryName": "Papua new Guinea",
      "isoCode": "PNG",
      "isActive": 1
    },
    {
      "id": 172,
      "countryName": "Paraguay",
      "isoCode": "PRY",
      "isActive": 1
    },
    {
      "id": 173,
      "countryName": "Peru",
      "isoCode": "PER",
      "isActive": 1
    },
    {
      "id": 174,
      "countryName": "Philippines",
      "isoCode": "PHL",
      "isActive": 1
    },
    {
      "id": 175,
      "countryName": "Pitcairn Island",
      "isoCode": "PCN",
      "isActive": 1
    },
    {
      "id": 176,
      "countryName": "Poland",
      "isoCode": "POL",
      "isActive": 1
    },
    {
      "id": 177,
      "countryName": "Portugal",
      "isoCode": "PRT",
      "isActive": 1
    },
    {
      "id": 178,
      "countryName": "Puerto Rico",
      "isoCode": "PRI",
      "isActive": 1
    },
    {
      "id": 179,
      "countryName": "Qatar",
      "isoCode": "QAT",
      "isActive": 1
    },
    {
      "id": 180,
      "countryName": "Reunion",
      "isoCode": "REU",
      "isActive": 1
    },
    {
      "id": 181,
      "countryName": "Romania",
      "isoCode": "ROU",
      "isActive": 1
    },
    {
      "id": 182,
      "countryName": "Russia",
      "isoCode": "RUS",
      "isActive": 1
    },
    {
      "id": 183,
      "countryName": "Rwanda",
      "isoCode": "RWA",
      "isActive": 1
    },
    {
      "id": 184,
      "countryName": "Saint Helena",
      "isoCode": "SHN",
      "isActive": 1
    },
    {
      "id": 185,
      "countryName": "Saint Kitts And Nevis",
      "isoCode": "KNA",
      "isActive": 1
    },
    {
      "id": 186,
      "countryName": "Saint Lucia",
      "isoCode": "LCA",
      "isActive": 1
    },
    {
      "id": 187,
      "countryName": "Saint Pierre and Miquelon",
      "isoCode": "SPM",
      "isActive": 1
    },
    {
      "id": 188,
      "countryName": "Saint Vincent And The Grenadines",
      "isoCode": "VCT",
      "isActive": 1
    },
    {
      "id": 189,
      "countryName": "Saint-Barthelemy",
      "isoCode": "BLM",
      "isActive": 1
    },
    {
      "id": 190,
      "countryName": "Saint-Martin (French part)",
      "isoCode": "MAF",
      "isActive": 1
    },
    {
      "id": 191,
      "countryName": "Samoa",
      "isoCode": "WSM",
      "isActive": 1
    },
    {
      "id": 192,
      "countryName": "San Marino",
      "isoCode": "SMR",
      "isActive": 1
    },
    {
      "id": 193,
      "countryName": "Sao Tome and Principe",
      "isoCode": "STP",
      "isActive": 1
    },
    {
      "id": 194,
      "countryName": "Saudi Arabia",
      "isoCode": "SAU",
      "isActive": 1
    },
    {
      "id": 195,
      "countryName": "Senegal",
      "isoCode": "SEN",
      "isActive": 1
    },
    {
      "id": 196,
      "countryName": "Serbia",
      "isoCode": "SRB",
      "isActive": 1
    },
    {
      "id": 197,
      "countryName": "Seychelles",
      "isoCode": "SYC",
      "isActive": 1
    },
    {
      "id": 198,
      "countryName": "Sierra Leone",
      "isoCode": "SLE",
      "isActive": 1
    },
    {
      "id": 199,
      "countryName": "Singapore",
      "isoCode": "SGP",
      "isActive": 1
    },
    {
      "id": 250,
      "countryName": "Sint Maarten (Dutch part)",
      "isoCode": "SXM",
      "isActive": 1
    },
    {
      "id": 200,
      "countryName": "Slovakia",
      "isoCode": "SVK",
      "isActive": 1
    },
    {
      "id": 201,
      "countryName": "Slovenia",
      "isoCode": "SVN",
      "isActive": 1
    },
    {
      "id": 202,
      "countryName": "Solomon Islands",
      "isoCode": "SLB",
      "isActive": 1
    },
    {
      "id": 203,
      "countryName": "Somalia",
      "isoCode": "SOM",
      "isActive": 1
    },
    {
      "id": 204,
      "countryName": "South Africa",
      "isoCode": "ZAF",
      "isActive": 1
    },
    {
      "id": 205,
      "countryName": "South Georgia",
      "isoCode": "SGS",
      "isActive": 1
    },
    {
      "id": 116,
      "countryName": "South Korea",
      "isoCode": "KOR",
      "isActive": 1
    },
    {
      "id": 206,
      "countryName": "South Sudan",
      "isoCode": "SSD",
      "isActive": 1
    },
    {
      "id": 207,
      "countryName": "Spain",
      "isoCode": "ESP",
      "isActive": 1
    },
    {
      "id": 208,
      "countryName": "Sri Lanka",
      "isoCode": "LKA",
      "isActive": 1
    },
    {
      "id": 209,
      "countryName": "Sudan",
      "isoCode": "SDN",
      "isActive": 1
    },
    {
      "id": 210,
      "countryName": "Suriname",
      "isoCode": "SUR",
      "isActive": 1
    },
    {
      "id": 211,
      "countryName": "Svalbard And Jan Mayen Islands",
      "isoCode": "SJM",
      "isActive": 1
    },
    {
      "id": 212,
      "countryName": "Swaziland",
      "isoCode": "SWZ",
      "isActive": 1
    },
    {
      "id": 213,
      "countryName": "Sweden",
      "isoCode": "SWE",
      "isActive": 1
    },
    {
      "id": 214,
      "countryName": "Switzerland",
      "isoCode": "CHE",
      "isActive": 1
    },
    {
      "id": 215,
      "countryName": "Syria",
      "isoCode": "SYR",
      "isActive": 1
    },
    {
      "id": 216,
      "countryName": "Taiwan",
      "isoCode": "TWN",
      "isActive": 1
    },
    {
      "id": 217,
      "countryName": "Tajikistan",
      "isoCode": "TJK",
      "isActive": 1
    },
    {
      "id": 218,
      "countryName": "Tanzania",
      "isoCode": "TZA",
      "isActive": 1
    },
    {
      "id": 219,
      "countryName": "Thailand",
      "isoCode": "THA",
      "isActive": 1
    },
    {
      "id": 17,
      "countryName": "The Bahamas",
      "isoCode": "BHS",
      "isActive": 1
    },
    {
      "id": 220,
      "countryName": "Togo",
      "isoCode": "TGO",
      "isActive": 1
    },
    {
      "id": 221,
      "countryName": "Tokelau",
      "isoCode": "TKL",
      "isActive": 1
    },
    {
      "id": 222,
      "countryName": "Tonga",
      "isoCode": "TON",
      "isActive": 1
    },
    {
      "id": 223,
      "countryName": "Trinidad And Tobago",
      "isoCode": "TTO",
      "isActive": 1
    },
    {
      "id": 224,
      "countryName": "Tunisia",
      "isoCode": "TUN",
      "isActive": 1
    },
    {
      "id": 225,
      "countryName": "Turkey",
      "isoCode": "TUR",
      "isActive": 1
    },
    {
      "id": 226,
      "countryName": "Turkmenistan",
      "isoCode": "TKM",
      "isActive": 1
    },
    {
      "id": 227,
      "countryName": "Turks And Caicos Islands",
      "isoCode": "TCA",
      "isActive": 1
    },
    {
      "id": 228,
      "countryName": "Tuvalu",
      "isoCode": "TUV",
      "isActive": 1
    },
    {
      "id": 229,
      "countryName": "Uganda",
      "isoCode": "UGA",
      "isActive": 1
    },
    {
      "id": 230,
      "countryName": "Ukraine",
      "isoCode": "UKR",
      "isActive": 1
    },
    {
      "id": 231,
      "countryName": "United Arab Emirates",
      "isoCode": "ARE",
      "isActive": 1
    },
    {
      "id": 232,
      "countryName": "United Kingdom",
      "isoCode": "GBR",
      "isActive": 1
    },
    {
      "id": 233,
      "countryName": "United States",
      "isoCode": "USA",
      "isActive": 1
    },
    {
      "id": 234,
      "countryName": "United States Minor Outlying Islands",
      "isoCode": "UMI",
      "isActive": 1
    },
    {
      "id": 235,
      "countryName": "Uruguay",
      "isoCode": "URY",
      "isActive": 1
    },
    {
      "id": 236,
      "countryName": "Uzbekistan",
      "isoCode": "UZB",
      "isActive": 1
    },
    {
      "id": 237,
      "countryName": "Vanuatu",
      "isoCode": "VUT",
      "isActive": 1
    },
    {
      "id": 238,
      "countryName": "Vatican City State (Holy See)",
      "isoCode": "VAT",
      "isActive": 1
    },
    {
      "id": 239,
      "countryName": "Venezuela",
      "isoCode": "VEN",
      "isActive": 1
    },
    {
      "id": 240,
      "countryName": "Vietnam",
      "isoCode": "VNM",
      "isActive": 1
    },
    {
      "id": 241,
      "countryName": "Virgin Islands (British)",
      "isoCode": "VGB",
      "isActive": 1
    },
    {
      "id": 242,
      "countryName": "Virgin Islands (US)",
      "isoCode": "VIR",
      "isActive": 1
    },
    {
      "id": 243,
      "countryName": "Wallis And Futuna Islands",
      "isoCode": "WLF",
      "isActive": 1
    },
    {
      "id": 244,
      "countryName": "Western Sahara",
      "isoCode": "ESH",
      "isActive": 1
    },
    {
      "id": 245,
      "countryName": "Yemen",
      "isoCode": "YEM",
      "isActive": 1
    },
    {
      "id": 246,
      "countryName": "Zambia",
      "isoCode": "ZMB",
      "isActive": 1
    },
    {
      "id": 247,
      "countryName": "Zimbabwe",
      "isoCode": "ZWE",
      "isActive": 1
    }
  ]