{
	"info": {
		"_postman_id": "f6703a30-ee4c-4e01-8dc4-3a40e98493f9",
		"name": "session 32 - activity",
		"schema": "https://schema.getpostman.com/json/collection/v2.1.0/collection.json"
	},
	"item": [
		{
			"name": "NEW USER",
			"request": {
				"method": "POST",
				"header": [],
				"body": {
					"mode": "raw",
					"raw": "{\r\n    \"email\": \"chopper@mail.com\",\r\n    \"username\": \"doctor\",\r\n    \"password\": \"doctor\",\r\n    \"age\": \"18\"\r\n}",
					"options": {
						"raw": {
							"language": "json"
						}
					}
				},
				"url": {
					"raw": "localhost:4000/users/signup",
					"host": [
						"localhost"
					],
					"port": "4000",
					"path": [
						"users",
						"signup"
					]
				}
			},
			"response": []
		},
		{
			"name": "RETRIEVE ALL USERS",
			"request": {
				"method": "GET",
				"header": [],
				"url": {
					"raw": "localhost:4000/users",
					"host": [
						"localhost"
					],
					"port": "4000",
					"path": [
						"users"
					]
				}
			},
			"response": []
		},
		{
			"name": "UPDATE USER",
			"request": {
				"method": "PUT",
				"header": [],
				"body": {
					"mode": "raw",
					"raw": "{\r\n    \"username\": \"SANTORYU\"\r\n}",
					"options": {
						"raw": {
							"language": "json"
						}
					}
				},
				"url": {
					"raw": "localhost:4000/users/update-user/61f3f25307828514b2042d52",
					"host": [
						"localhost"
					],
					"port": "4000",
					"path": [
						"users",
						"update-user",
						"61f3f25307828514b2042d52"
					]
				}
			},
			"response": []
		},
		{
			"name": "DELETE USER",
			"request": {
				"method": "DELETE",
				"header": [],
				"url": {
					"raw": "localhost:4000/users/archive-task/61f3f4c186f9858dca7a8f1e",
					"host": [
						"localhost"
					],
					"port": "4000",
					"path": [
						"users",
						"archive-task",
						"61f3f4c186f9858dca7a8f1e"
					]
				}
			},
			"response": []
		}
	]
}