{
	"info": {
		"_postman_id": "06d7b673-d81e-48e5-aa2e-d3d1fc27ad94",
		"name": "session 30 - activity",
		"schema": "https://schema.getpostman.com/json/collection/v2.1.0/collection.json"
	},
	"item": [
		{
			"name": "RETRIEVE TODO LIST ITEMS",
			"request": {
				"method": "GET",
				"header": [],
				"url": {
					"raw": "https://jsonplaceholder.typicode.com/todos",
					"protocol": "https",
					"host": [
						"jsonplaceholder",
						"typicode",
						"com"
					],
					"path": [
						"todos"
					]
				}
			},
			"response": []
		},
		{
			"name": "CREATE A TODO LIST ITEM",
			"request": {
				"method": "POST",
				"header": [],
				"body": {
					"mode": "raw",
					"raw": "{\r\n    \"title\": \"New Task to improve programming skills\",\r\n\t\"body\": \"Study Node.js\",\r\n    \"userId\": 7\r\n}",
					"options": {
						"raw": {
							"language": "json"
						}
					}
				},
				"url": {
					"raw": "http://jsonplaceholder.typicode.com/todos",
					"protocol": "http",
					"host": [
						"jsonplaceholder",
						"typicode",
						"com"
					],
					"path": [
						"todos"
					]
				}
			},
			"response": []
		},
		{
			"name": "UPDATING TO DO LIST",
			"request": {
				"method": "PUT",
				"header": [],
				"body": {
					"mode": "raw",
					"raw": "{\r\n    \"id\": 7,\r\n    \"title\": \"Update todo list\",\r\n\t\"description\": \"Update to do list\",\r\n\t\"status\": \"still in progress\",\r\n\t\"dateCompleted\": \"Not completed yet\",\r\n\t\"body\": \"This needs to be updated\",\r\n\t\"userId\": 7\r\n}",
					"options": {
						"raw": {
							"language": "json"
						}
					}
				},
				"url": {
					"raw": "http://jsonplaceholder.typicode.com/todos/7",
					"protocol": "http",
					"host": [
						"jsonplaceholder",
						"typicode",
						"com"
					],
					"path": [
						"todos",
						"7"
					]
				}
			},
			"response": []
		},
		{
			"name": "UPDATE A TODO LIST ITEM PATCH",
			"request": {
				"method": "PATCH",
				"header": [],
				"body": {
					"mode": "raw",
					"raw": "{\r\n    \"title\": \"New Task Update\",\r\n\t\"completed\": \"completed\",\r\n\t\"statusChanged\": \"01/26/2022\"\r\n}",
					"options": {
						"raw": {
							"language": "json"
						}
					}
				},
				"url": {
					"raw": "http://jsonplaceholder.typicode.com/todos/7",
					"protocol": "http",
					"host": [
						"jsonplaceholder",
						"typicode",
						"com"
					],
					"path": [
						"todos",
						"7"
					]
				}
			},
			"response": []
		},
		{
			"name": "DELETE METHOD",
			"request": {
				"method": "DELETE",
				"header": [],
				"url": {
					"raw": "https://jsonplaceholder.typicode.com/posts/7",
					"protocol": "https",
					"host": [
						"jsonplaceholder",
						"typicode",
						"com"
					],
					"path": [
						"posts",
						"7"
					]
				}
			},
			"response": []
		}
	]
}