{
  "passengers": [
    {
      "id": 1,
      "fullName": "Hello",
      "checkedIn": true,
      "checkedInDate": 1572204062891,
      "children": [
        {
          "name": "Gaga",
          "age": 12
        }
      ]
    },
    {
      "id": 2,
      "fullName": "Zurik",
      "checkedIn": true,
      "checkedInDate": 1572204062891,
      "children": [
        {
          "name": "Gaga",
          "age": 12
        }
      ]
    },
    {
      "id": 3,
      "fullName": "Zimart",
      "checkedIn": true,
      "checkedInDate": 1572204062891,
      "children": [
        {
          "name": "Gaga",
          "age": 12
        }
      ]
    },
    {
      "id": 4,
      "fullName": "Rura",
      "checkedIn": true,
      "checkedInDate": 1572204063501,
      "children": null
    },
    {
      "id": 5,
      "fullName": "Rura",
      "checkedIn": false,
      "checkedInDate": null,
      "children": [
        {
          "name": "Zoza",
          "age": 5
        }
      ]
    }
  ]
}