{
  "rulesDirectory": [
    "tslint-plugin-prettier"
  ],
  "extends": [
    "tslint-config-standard",
    "tslint-config-prettier"
  ],
  "rules": {
    "prettier": [
      true,
      {
        "singleQuote": true,
        "trailingComma": "es5",
        "semi": false
      }
    ],
    "await-promise": [true, "Bluebird"]
  }
}
