{
  "runtimeTarget": {
    "name": ".NETCoreApp,Version=v3.1",
    "signature": ""
  },
  "compilationOptions": {},
  "targets": {
    ".NETCoreApp,Version=v3.1": {
      "Otus.Teaching.Concurrency.Import.DataGenerator.App/1.0.0": {
        "dependencies": {
          "Otus.Teaching.Concurrency.Import.Core": "1.0.0",
          "Otus.Teaching.Concurrency.Import.DataAccess": "1.0.0",
          "Otus.Teaching.Concurrency.Import.DataGenerator": "1.0.0"
        },
        "runtime": {
          "Otus.Teaching.Concurrency.Import.DataGenerator.App.dll": {}
        }
      },
      "Bogus/28.4.4": {
        "runtime": {
          "lib/netstandard2.0/Bogus.dll": {
            "assemblyVersion": "28.4.4.0",
            "fileVersion": "28.4.4.0"
          }
        }
      },
      "Microsoft.Bcl.AsyncInterfaces/1.1.1": {
        "runtime": {
          "lib/netstandard2.1/Microsoft.Bcl.AsyncInterfaces.dll": {
            "assemblyVersion": "1.0.0.0",
            "fileVersion": "4.700.20.21406"
          }
        }
      },
      "Microsoft.Bcl.HashCode/1.1.1": {
        "runtime": {
          "lib/netcoreapp2.1/Microsoft.Bcl.HashCode.dll": {
            "assemblyVersion": "1.0.0.0",
            "fileVersion": "4.700.20.56604"
          }
        }
      },
      "Microsoft.EntityFrameworkCore/3.1.28": {
        "dependencies": {
          "Microsoft.Bcl.AsyncInterfaces": "1.1.1",
          "Microsoft.Bcl.HashCode": "1.1.1",
          "Microsoft.EntityFrameworkCore.Abstractions": "3.1.28",
          "Microsoft.EntityFrameworkCore.Analyzers": "3.1.28",
          "Microsoft.Extensions.Caching.Memory": "3.1.28",
          "Microsoft.Extensions.DependencyInjection": "3.1.28",
          "Microsoft.Extensions.Logging": "3.1.28",
          "System.Collections.Immutable": "1.7.1",
          "System.ComponentModel.Annotations": "4.7.0",
          "System.Diagnostics.DiagnosticSource": "4.7.1"
        },
        "runtime": {
          "lib/netstandard2.0/Microsoft.EntityFrameworkCore.dll": {
            "assemblyVersion": "3.1.28.0",
            "fileVersion": "3.100.2822.36309"
          }
        }
      },
      "Microsoft.EntityFrameworkCore.Abstractions/3.1.28": {
        "runtime": {
          "lib/netstandard2.0/Microsoft.EntityFrameworkCore.Abstractions.dll": {
            "assemblyVersion": "3.1.28.0",
            "fileVersion": "3.100.2822.36309"
          }
        }
      },
      "Microsoft.EntityFrameworkCore.Analyzers/3.1.28": {},
      "Microsoft.EntityFrameworkCore.Relational/3.1.18": {
        "dependencies": {
          "Microsoft.EntityFrameworkCore": "3.1.28"
        },
        "runtime": {
          "lib/netstandard2.0/Microsoft.EntityFrameworkCore.Relational.dll": {
            "assemblyVersion": "3.1.18.0",
            "fileVersion": "3.100.1821.36403"
          }
        }
      },
      "Microsoft.Extensions.Caching.Abstractions/3.1.28": {
        "dependencies": {
          "Microsoft.Extensions.Primitives": "3.1.28"
        },
        "runtime": {
          "lib/netcoreapp3.1/Microsoft.Extensions.Caching.Abstractions.dll": {
            "assemblyVersion": "3.1.28.0",
            "fileVersion": "3.100.2822.36305"
          }
        }
      },
      "Microsoft.Extensions.Caching.Memory/3.1.28": {
        "dependencies": {
          "Microsoft.Extensions.Caching.Abstractions": "3.1.28",
          "Microsoft.Extensions.DependencyInjection.Abstractions": "3.1.28",
          "Microsoft.Extensions.Logging.Abstractions": "3.1.28",
          "Microsoft.Extensions.Options": "3.1.28"
        },
        "runtime": {
          "lib/netcoreapp3.1/Microsoft.Extensions.Caching.Memory.dll": {
            "assemblyVersion": "3.1.28.0",
            "fileVersion": "3.100.2822.36305"
          }
        }
      },
      "Microsoft.Extensions.Configuration/3.1.28": {
        "dependencies": {
          "Microsoft.Extensions.Configuration.Abstractions": "3.1.28"
        },
        "runtime": {
          "lib/netcoreapp3.1/Microsoft.Extensions.Configuration.dll": {
            "assemblyVersion": "3.1.28.0",
            "fileVersion": "3.100.2822.36305"
          }
        }
      },
      "Microsoft.Extensions.Configuration.Abstractions/3.1.28": {
        "dependencies": {
          "Microsoft.Extensions.Primitives": "3.1.28"
        },
        "runtime": {
          "lib/netcoreapp3.1/Microsoft.Extensions.Configuration.Abstractions.dll": {
            "assemblyVersion": "3.1.28.0",
            "fileVersion": "3.100.2822.36305"
          }
        }
      },
      "Microsoft.Extensions.Configuration.Binder/3.1.28": {
        "dependencies": {
          "Microsoft.Extensions.Configuration": "3.1.28"
        },
        "runtime": {
          "lib/netcoreapp3.1/Microsoft.Extensions.Configuration.Binder.dll": {
            "assemblyVersion": "3.1.28.0",
            "fileVersion": "3.100.2822.36305"
          }
        }
      },
      "Microsoft.Extensions.DependencyInjection/3.1.28": {
        "dependencies": {
          "Microsoft.Extensions.DependencyInjection.Abstractions": "3.1.28"
        },
        "runtime": {
          "lib/netcoreapp3.1/Microsoft.Extensions.DependencyInjection.dll": {
            "assemblyVersion": "3.1.28.0",
            "fileVersion": "3.100.2822.36305"
          }
        }
      },
      "Microsoft.Extensions.DependencyInjection.Abstractions/3.1.28": {
        "runtime": {
          "lib/netstandard2.0/Microsoft.Extensions.DependencyInjection.Abstractions.dll": {
            "assemblyVersion": "3.1.28.0",
            "fileVersion": "3.100.2822.36305"
          }
        }
      },
      "Microsoft.Extensions.Logging/3.1.28": {
        "dependencies": {
          "Microsoft.Extensions.Configuration.Binder": "3.1.28",
          "Microsoft.Extensions.DependencyInjection": "3.1.28",
          "Microsoft.Extensions.Logging.Abstractions": "3.1.28",
          "Microsoft.Extensions.Options": "3.1.28"
        },
        "runtime": {
          "lib/netcoreapp3.1/Microsoft.Extensions.Logging.dll": {
            "assemblyVersion": "3.1.28.0",
            "fileVersion": "3.100.2822.36305"
          }
        }
      },
      "Microsoft.Extensions.Logging.Abstractions/3.1.28": {
        "runtime": {
          "lib/netstandard2.0/Microsoft.Extensions.Logging.Abstractions.dll": {
            "assemblyVersion": "3.1.28.0",
            "fileVersion": "3.100.2822.36305"
          }
        }
      },
      "Microsoft.Extensions.Options/3.1.28": {
        "dependencies": {
          "Microsoft.Extensions.DependencyInjection.Abstractions": "3.1.28",
          "Microsoft.Extensions.Primitives": "3.1.28"
        },
        "runtime": {
          "lib/netcoreapp3.1/Microsoft.Extensions.Options.dll": {
            "assemblyVersion": "3.1.28.0",
            "fileVersion": "3.100.2822.36305"
          }
        }
      },
      "Microsoft.Extensions.Primitives/3.1.28": {
        "runtime": {
          "lib/netcoreapp3.1/Microsoft.Extensions.Primitives.dll": {
            "assemblyVersion": "3.1.28.0",
            "fileVersion": "3.100.2822.36305"
          }
        }
      },
      "Npgsql/4.1.9": {
        "dependencies": {
          "System.Runtime.CompilerServices.Unsafe": "4.6.0"
        },
        "runtime": {
          "lib/netcoreapp3.0/Npgsql.dll": {
            "assemblyVersion": "4.1.9.0",
            "fileVersion": "4.1.9.0"
          }
        }
      },
      "Npgsql.EntityFrameworkCore.PostgreSQL/3.1.18": {
        "dependencies": {
          "Microsoft.EntityFrameworkCore": "3.1.28",
          "Microsoft.EntityFrameworkCore.Abstractions": "3.1.28",
          "Microsoft.EntityFrameworkCore.Relational": "3.1.18",
          "Npgsql": "4.1.9"
        },
        "runtime": {
          "lib/netstandard2.0/Npgsql.EntityFrameworkCore.PostgreSQL.dll": {
            "assemblyVersion": "3.1.18.0",
            "fileVersion": "3.1.18.0"
          }
        }
      },
      "System.Collections.Immutable/1.7.1": {
        "runtime": {
          "lib/netstandard2.0/System.Collections.Immutable.dll": {
            "assemblyVersion": "1.2.5.0",
            "fileVersion": "4.700.20.21406"
          }
        }
      },
      "System.ComponentModel.Annotations/4.7.0": {},
      "System.Diagnostics.DiagnosticSource/4.7.1": {
        "runtime": {
          "lib/netstandard1.3/System.Diagnostics.DiagnosticSource.dll": {
            "assemblyVersion": "4.0.5.0",
            "fileVersion": "4.700.20.21406"
          }
        }
      },
      "System.Runtime.CompilerServices.Unsafe/4.6.0": {},
      "Otus.Teaching.Concurrency.Import.Core/1.0.0": {
        "runtime": {
          "Otus.Teaching.Concurrency.Import.Core.dll": {}
        }
      },
      "Otus.Teaching.Concurrency.Import.DataAccess/1.0.0": {
        "dependencies": {
          "Microsoft.EntityFrameworkCore": "3.1.28",
          "Npgsql.EntityFrameworkCore.PostgreSQL": "3.1.18",
          "Otus.Teaching.Concurrency.Import.Core": "1.0.0",
          "Otus.Teaching.Concurrency.Import.DataGenerator": "1.0.0"
        },
        "runtime": {
          "Otus.Teaching.Concurrency.Import.DataAccess.dll": {}
        }
      },
      "Otus.Teaching.Concurrency.Import.DataGenerator/1.0.0": {
        "dependencies": {
          "Bogus": "28.4.4",
          "Otus.Teaching.Concurrency.Import.Core": "1.0.0"
        },
        "runtime": {
          "Otus.Teaching.Concurrency.Import.DataGenerator.dll": {}
        }
      }
    }
  },
  "libraries": {
    "Otus.Teaching.Concurrency.Import.DataGenerator.App/1.0.0": {
      "type": "project",
      "serviceable": false,
      "sha512": ""
    },
    "Bogus/28.4.4": {
      "type": "package",
      "serviceable": true,
      "sha512": "sha512-L8VKtXaxl7Nh3ITxvoQ5XRZkh6qhflkiEXd6xufyHqHTEjHnA2a/HVftV19UoloeHsinqtwWnTMq9RU9Kcq+mA==",
      "path": "bogus/28.4.4",
      "hashPath": "bogus.28.4.4.nupkg.sha512"
    },
    "Microsoft.Bcl.AsyncInterfaces/1.1.1": {
      "type": "package",
      "serviceable": true,
      "sha512": "sha512-yuvf07qFWFqtK3P/MRkEKLhn5r2UbSpVueRziSqj0yJQIKFwG1pq9mOayK3zE5qZCTs0CbrwL9M6R8VwqyGy2w==",
      "path": "microsoft.bcl.asyncinterfaces/1.1.1",
      "hashPath": "microsoft.bcl.asyncinterfaces.1.1.1.nupkg.sha512"
    },
    "Microsoft.Bcl.HashCode/1.1.1": {
      "type": "package",
      "serviceable": true,
      "sha512": "sha512-MalY0Y/uM/LjXtHfX/26l2VtN4LDNZ2OE3aumNOHDLsT4fNYy2hiHXI4CXCqKpNUNm7iJ2brrc4J89UdaL56FA==",
      "path": "microsoft.bcl.hashcode/1.1.1",
      "hashPath": "microsoft.bcl.hashcode.1.1.1.nupkg.sha512"
    },
    "Microsoft.EntityFrameworkCore/3.1.28": {
      "type": "package",
      "serviceable": true,
      "sha512": "sha512-tjbuKOYY1SWLvcL5R3PamILLBQTHIM4gLRLv2zxWE2YgHkRtiGcF0t/JYJr5hXpSkQWhqC9446Bx8q86rrt4Wg==",
      "path": "microsoft.entityframeworkcore/3.1.28",
      "hashPath": "microsoft.entityframeworkcore.3.1.28.nupkg.sha512"
    },
    "Microsoft.EntityFrameworkCore.Abstractions/3.1.28": {
      "type": "package",
      "serviceable": true,
      "sha512": "sha512-7GxcI+LqoaoJUgu00qNi4dFP6zncDcfQ8aUkyEg9xsCEPjgAyc+u6X8vnuF/5HQMD1MoJkcPcnjuPi1dkR673A==",
      "path": "microsoft.entityframeworkcore.abstractions/3.1.28",
      "hashPath": "microsoft.entityframeworkcore.abstractions.3.1.28.nupkg.sha512"
    },
    "Microsoft.EntityFrameworkCore.Analyzers/3.1.28": {
      "type": "package",
      "serviceable": true,
      "sha512": "sha512-ciNwkUwOW65tossW560kGXrZc5JkjW70PmLQ5dKqEJ5bIJw5x5tnJ/t7zZCrg8si0IbBc4ZH1iRCzGu5Wnu9jQ==",
      "path": "microsoft.entityframeworkcore.analyzers/3.1.28",
      "hashPath": "microsoft.entityframeworkcore.analyzers.3.1.28.nupkg.sha512"
    },
    "Microsoft.EntityFrameworkCore.Relational/3.1.18": {
      "type": "package",
      "serviceable": true,
      "sha512": "sha512-Gn1muuph+wShFI3Ywta9FyvWHM6oEEvIUjP2y53a0qkJnMgwYp/nw0oDXMJj920E2YYqldn3Yp0eHBP6cYME4w==",
      "path": "microsoft.entityframeworkcore.relational/3.1.18",
      "hashPath": "microsoft.entityframeworkcore.relational.3.1.18.nupkg.sha512"
    },
    "Microsoft.Extensions.Caching.Abstractions/3.1.28": {
      "type": "package",
      "serviceable": true,
      "sha512": "sha512-3BtJGhWCE8mVX1vn20hiE/dqCc+LVR/dLmY62Z+xcQzUlOsAxmaiPMTbYX6kVKCA6rDDN+aDFgDqc+x23iSK0w==",
      "path": "microsoft.extensions.caching.abstractions/3.1.28",
      "hashPath": "microsoft.extensions.caching.abstractions.3.1.28.nupkg.sha512"
    },
    "Microsoft.Extensions.Caching.Memory/3.1.28": {
      "type": "package",
      "serviceable": true,
      "sha512": "sha512-Dxaqix8SlraIAQp0oaqZr8TW/2qIxwENdzUMxBJq0PClnzgFuPHFKvXmJ2Y5ZqM8m3YRYFitb5mZGW0Y9pz84g==",
      "path": "microsoft.extensions.caching.memory/3.1.28",
      "hashPath": "microsoft.extensions.caching.memory.3.1.28.nupkg.sha512"
    },
    "Microsoft.Extensions.Configuration/3.1.28": {
      "type": "package",
      "serviceable": true,
      "sha512": "sha512-q24T91N+GAgpHdc/yKR/fxIvNXekn6RIvpCXMEoM++37TMbkWVrhacQWP89+MJYNyIhAWOkJKlcgPZTndoYVfQ==",
      "path": "microsoft.extensions.configuration/3.1.28",
      "hashPath": "microsoft.extensions.configuration.3.1.28.nupkg.sha512"
    },
    "Microsoft.Extensions.Configuration.Abstractions/3.1.28": {
      "type": "package",
      "serviceable": true,
      "sha512": "sha512-SHBQcqrAUoaEQ3bI+4grVkYmmZwQX/6/kalfn5+77/1khB4/lVnqYswcaLBR6vS/4CXXoLnzdRLzEGHPUgxC1w==",
      "path": "microsoft.extensions.configuration.abstractions/3.1.28",
      "hashPath": "microsoft.extensions.configuration.abstractions.3.1.28.nupkg.sha512"
    },
    "Microsoft.Extensions.Configuration.Binder/3.1.28": {
      "type": "package",
      "serviceable": true,
      "sha512": "sha512-ucSpm8M6Utt9dfbcwOvqPJeATZZ0uYI+Y94IP1YKiBV6u6xPGzGafvjQDhcY5kTRW4FNwLcifesVjEdEOhY1qg==",
      "path": "microsoft.extensions.configuration.binder/3.1.28",
      "hashPath": "microsoft.extensions.configuration.binder.3.1.28.nupkg.sha512"
    },
    "Microsoft.Extensions.DependencyInjection/3.1.28": {
      "type": "package",
      "serviceable": true,
      "sha512": "sha512-lZ/5tLFTbOU/YhWNgtnT884fk4LwsTNXtkTrEZHUVvvvQGNYmseXra69b3RJD3f4UxMWN7Pwf36IA/l8PkNo3g==",
      "path": "microsoft.extensions.dependencyinjection/3.1.28",
      "hashPath": "microsoft.extensions.dependencyinjection.3.1.28.nupkg.sha512"
    },
    "Microsoft.Extensions.DependencyInjection.Abstractions/3.1.28": {
      "type": "package",
      "serviceable": true,
      "sha512": "sha512-uO7jKl8mfmqp4E7lfHvRwO+n6eb2YZVDzyEgFNXcOavWSxMvU0qBXyzvfpFBLLeAMcubP49dNtx5Gu/yIVdJxg==",
      "path": "microsoft.extensions.dependencyinjection.abstractions/3.1.28",
      "hashPath": "microsoft.extensions.dependencyinjection.abstractions.3.1.28.nupkg.sha512"
    },
    "Microsoft.Extensions.Logging/3.1.28": {
      "type": "package",
      "serviceable": true,
      "sha512": "sha512-HxS9WAlcF45YjpU9OyLZ+PJkvXp+IM29shPO42yEKaarIpRXYTB/MYNMvSW4sZkVHBbeYhE1Wn68GTDntlA3oQ==",
      "path": "microsoft.extensions.logging/3.1.28",
      "hashPath": "microsoft.extensions.logging.3.1.28.nupkg.sha512"
    },
    "Microsoft.Extensions.Logging.Abstractions/3.1.28": {
      "type": "package",
      "serviceable": true,
      "sha512": "sha512-QcCzhUcHiUVR+RZzi4f51e9pDFSBeaypruu3N2+8sv4R9ZDGHeSYMHGzRirlkckNACgOdowYUq5p0wlauz73+w==",
      "path": "microsoft.extensions.logging.abstractions/3.1.28",
      "hashPath": "microsoft.extensions.logging.abstractions.3.1.28.nupkg.sha512"
    },
    "Microsoft.Extensions.Options/3.1.28": {
      "type": "package",
      "serviceable": true,
      "sha512": "sha512-uXiv46Bfd8bDvWng27u9MSOhwQ1otkNf9mf+NzBa3Ty/8MlutuUCIXpUzFo2bo3TvoZ4+VONrSQEHhWHeIQDDw==",
      "path": "microsoft.extensions.options/3.1.28",
      "hashPath": "microsoft.extensions.options.3.1.28.nupkg.sha512"
    },
    "Microsoft.Extensions.Primitives/3.1.28": {
      "type": "package",
      "serviceable": true,
      "sha512": "sha512-KXPub1KNWGogTI/3vW9cFcwCweOubwUhDS5GUnNOTt4277Ngks5YSC0Ea/xSd2kP3lAmA6p4MJlvuO/0IauHew==",
      "path": "microsoft.extensions.primitives/3.1.28",
      "hashPath": "microsoft.extensions.primitives.3.1.28.nupkg.sha512"
    },
    "Npgsql/4.1.9": {
      "type": "package",
      "serviceable": true,
      "sha512": "sha512-Afs+nX8OWZ8PPZRj7vdtjcj0xKQDZbl8b0jXUmDBuKgzEkHatX/fPu1NtgbCin14EkoyMMxKtQnagfoMC58i+Q==",
      "path": "npgsql/4.1.9",
      "hashPath": "npgsql.4.1.9.nupkg.sha512"
    },
    "Npgsql.EntityFrameworkCore.PostgreSQL/3.1.18": {
      "type": "package",
      "serviceable": true,
      "sha512": "sha512-b/g8tKEMVew45q0g1hZGUQwpzv/UE9NIyU2UNB9Ln8NNhodjhkUrzeMS49lPKFlFRW1aUK5eniKgebki/D3Aag==",
      "path": "npgsql.entityframeworkcore.postgresql/3.1.18",
      "hashPath": "npgsql.entityframeworkcore.postgresql.3.1.18.nupkg.sha512"
    },
    "System.Collections.Immutable/1.7.1": {
      "type": "package",
      "serviceable": true,
      "sha512": "sha512-B43Zsz5EfMwyEbnObwRxW5u85fzJma3lrDeGcSAV1qkhSRTNY5uXAByTn9h9ddNdhM+4/YoLc/CI43umjwIl9Q==",
      "path": "system.collections.immutable/1.7.1",
      "hashPath": "system.collections.immutable.1.7.1.nupkg.sha512"
    },
    "System.ComponentModel.Annotations/4.7.0": {
      "type": "package",
      "serviceable": true,
      "sha512": "sha512-0YFqjhp/mYkDGpU0Ye1GjE53HMp9UVfGN7seGpAMttAC0C40v5gw598jCgpbBLMmCo0E5YRLBv5Z2doypO49ZQ==",
      "path": "system.componentmodel.annotations/4.7.0",
      "hashPath": "system.componentmodel.annotations.4.7.0.nupkg.sha512"
    },
    "System.Diagnostics.DiagnosticSource/4.7.1": {
      "type": "package",
      "serviceable": true,
      "sha512": "sha512-j81Lovt90PDAq8kLpaJfJKV/rWdWuEk6jfV+MBkee33vzYLEUsy4gXK8laa9V2nZlLM9VM9yA/OOQxxPEJKAMw==",
      "path": "system.diagnostics.diagnosticsource/4.7.1",
      "hashPath": "system.diagnostics.diagnosticsource.4.7.1.nupkg.sha512"
    },
    "System.Runtime.CompilerServices.Unsafe/4.6.0": {
      "type": "package",
      "serviceable": true,
      "sha512": "sha512-HxozeSlipUK7dAroTYwIcGwKDeOVpQnJlpVaOkBz7CM4TsE5b/tKlQBZecTjh6FzcSbxndYaxxpsBMz+wMJeyw==",
      "path": "system.runtime.compilerservices.unsafe/4.6.0",
      "hashPath": "system.runtime.compilerservices.unsafe.4.6.0.nupkg.sha512"
    },
    "Otus.Teaching.Concurrency.Import.Core/1.0.0": {
      "type": "project",
      "serviceable": false,
      "sha512": ""
    },
    "Otus.Teaching.Concurrency.Import.DataAccess/1.0.0": {
      "type": "project",
      "serviceable": false,
      "sha512": ""
    },
    "Otus.Teaching.Concurrency.Import.DataGenerator/1.0.0": {
      "type": "project",
      "serviceable": false,
      "sha512": ""
    }
  }
}