%YAML 1.1
%TAG !u! tag:unity3d.com,2011:
--- !u!114 &11400000
MonoBehaviour:
  m_ObjectHideFlags: 0
  m_CorrespondingSourceObject: {fileID: 0}
  m_PrefabInstance: {fileID: 0}
  m_PrefabAsset: {fileID: 0}
  m_GameObject: {fileID: 0}
  m_Enabled: 1
  m_EditorHideFlags: 0
  m_Script: {fileID: 11500000, guid: 1e39c5c5391097e42a90b5577ac89183, type: 3}
  m_Name: 2
  m_EditorClassIdentifier: 
  Id: 2
  MessageData:
    Text: This is my new pup {_}!
    Pick: 1
    Value: 15
    Category: 1
