%YAML 1.1
%TAG !u! tag:unity3d.com,2011:
--- !u!114 &11400000
MonoBehaviour:
  m_ObjectHideFlags: 0
  m_CorrespondingSourceObject: {fileID: 0}
  m_PrefabInstance: {fileID: 0}
  m_PrefabAsset: {fileID: 0}
  m_GameObject: {fileID: 0}
  m_Enabled: 1
  m_EditorHideFlags: 0
  m_Script: {fileID: 11500000, guid: 98c84158bd26b544d8a951ca97f5c796, type: 3}
  m_Name: 7
  m_EditorClassIdentifier: 
  Id: 7
  SettingsData:
    Name: Effects
    Value: True
    Type: 3
