{
	"player": [
		{
			"name": "Identification",
			"value": "",
			"type": "Guid"
		},
		{
			"name": "Name",
			"value": "",
			"type": "String"
		},
		{
			"name": "Followers",
			"value": "0",
			"type": "Integer"
		},
		{
			"name": "MessagesSent",
			"value": "0",
			"type": "Integer"
		},
		{
			"name": "Music",
			"value": "True",
			"type": "Boolean"
		},
		{
			"name": "Sound",
			"value": "True",
			"type": "Boolean"
		},
		{
			"name": "Effects",
			"value": "True",
			"type": "Boolean"
		},
	],
}