{
	"body": [
		{
			"id": 1,
			"text": "Ughh, I'm so booored! Ask me anything about my {_}!",
			"pick": 1,
			"value": 5,
			"category": "Normal",
		},
		{
			"id": 2,
			"text": "This is my new pup {_}!",
			"pick": 1,
			"value": 15,
			"category": "Kawaii",
		},
		{
			"id": 3,
			"text": "Today I found this awesome new product {_} that improves my {_}!",
			"pick": 2,
			"value": 5,
			"category": "Lifestyle",
		},
		{
			"id": 4,
			"text": "For every like this gets {_} will donate 100 bucks to {_}.",
			"pick": 2,
			"value": 10,
			"category": "Lifestyle",
		},
		{
			"id": 5,
			"text": "Oh my god! You gotta try {_}!",
			"pick": 1,
			"value": 5,
			"category": "Lifestyle",
		},
		{
			"id": 6,
			"text": "I feel like there's a giant {_} inside of me!",
			"pick": 1,
			"value": 15,
			"category": "Sexuality",
		},
		{
			"id": 7,
			"text": "Always in my heart: {_}",
			"pick": 1,
			"value": 5,
			"category": "Normal",
		},
		{
			"id": 8,
			"text": "If only {_}'s {_} was bigger!",
			"pick": 2,
			"value": 5,
			"category": "Sexuality",
		},
		{
			"id": 9,
			"text": "I just really hate {_}!",
			"pick": 1,
			"value": -5,
			"category": "Vulgarity",
		},
		{
			"id": 10,
			"text": "Sooo, me and {_} are like best friends! haters gonna hate. whatever",
			"pick": 1,
			"value": 10,
			"category": "Lifestyle",
		},
		{
			"id": 11,
			"text": "{_} never stops.",
			"pick": 1,
			"value": 0,
			"category": "Normal",
		},
		{
			"id": 12,
			"text": "Getting ready for {_}!",
			"pick": 1,
			"value": 5,
			"category": "Lifestyle",
		},
		{
			"id": 13,
			"text": "Bought {_} as a present for my mums bday!",
			"pick": 1,
			"value": 15,
			"category": "Family",
		},
		{
			"id": 14,
			"text": "Oh God. I just realized I'm stuck with {_} my whole life.",
			"pick": 1,
			"value": 10,
			"category": "Family",
		},
		{
			"id": 15,
			"text": "Happy birthday to {_}",
			"pick": 1,
			"value": 5,
			"category": "Normal",
		},
		{
			"id": 16,
			"text": "Yo {_}, come over!",
			"pick": 1,
			"value": 5,
			"category": "Sexuality",
		},
		{
			"id": 17,
			"text": "Do ants have {_}",
			"pick": 1,
			"value": 15,
			"category": "Sexuality",
		},
		{
			"id": 18,
			"text": "{_} is my goal. {_} is my gym",
			"pick": 2,
			"value": 5,
			"category": "Fitness",
		},
	],
	"option": [
		{
			"id": 1,
			"text": "Duke",
			"value": 5,
			"category": "Normal"
		},
		{
			"id": 2,
			"text": "Spectacular abs",
			"value": 5,
			"category": "Fitness"
		},
		{
			"id": 3,
			"text": "Puberty",
			"value": 0,
			"category": "Normal"
		},
		{
			"id": 4,
			"text": "The Hustle",
			"value": 5,
			"category": "Normal"
		},
		{
			"id": 5,
			"text": "Dad",
			"value": 5,
			"category": "Family"
		},
		{
			"id": 6,
			"text": "Mom",
			"value": 5,
			"category": "Family"
		},
		{
			"id": 7,
			"text": "Brother",
			"value": 5,
			"category": "Family"
		},
		{
			"id": 8,
			"text": "Sister",
			"value": 5,
			"category": "Family"
		},
		{
			"id": 9,
			"text": "Grandma",
			"value": 15,
			"category": "Family"
		},
		{
			"id": 10,
			"text": "Grandpa",
			"value": 15,
			"category": "Family"
		},
		{
			"id": 11,
			"text": "Kanye West",
			"value": 10,
			"category": "Celebrity"
		},
		{
			"id": 12,
			"text": "Mr. Clean",
			"value": 0,
			"category": "Celebrity"
		},
		{
			"id": 13,
			"text": "Boot",
			"value": 0,
			"category": "Item"
		},
		{
			"id": 14,
			"text": "Yogurt",
			"value": 5,
			"category": "Item"
		},
		{
			"id": 15,
			"text": "Centaur",
			"value": 0,
			"category": "Fantasy"
		},
		{
			"id": 16,
			"text": "Ghost",
			"value": 15,
			"category": "Pop Culture"
		},
		{
			"id": 17,
			"text": "Abcde",
			"value": 15,
			"category": "Meme"
		},
		{
			"id": 18,
			"text": "Obesity",
			"value": -5,
			"category": "Vulgarity"
		},
		{
			"id": 19,
			"text": "Famine",
			"value": -5,
			"category": "Vulgarity"
		},
		{
			"id": 20,
			"text": "Tasteful sideboob",
			"value": 5,
			"category": "Sexuality"
		},
		{
			"id": 21,
			"text": "Finger",
			"value": 10,
			"category": "Sexuality"
		},
		{
			"id": 22,
			"text": "Paid Shadow Pinchers",
			"value": 25,
			"category": "Meme"
		},
	],
}