{
  "project_id":"relevant-online-dev",
  "bigquery_dataset_id":"dev_configged_cookie_scraper_data",
  "bigquery_table_id":"cooke_scraper_data_maxeda_test",
  "sitemap_count_to_get": 50,
  "preset_cookies": [
    {
        "name": "CookieNotificationSeen",
        "value": "1",
        "domain": ".praxis.nl",
        "path": "/",
        "size": 23,
        "httpOnly": false,
        "secure": false,
        "session": true
    },{
        "name": "CookieNotificationSeen",
        "value": "1",
        "domain": ".brico.be",
        "path": "/",
        "size": 23,
        "httpOnly": false,
        "secure": false,
        "session": true
    }
],
  "check_multiple_cookie_permission_levels": {
    "enable": false,
    "cookie_for_each_permission_level": [
      {
        "name": "Freo_cookieLevel",
        "value": "1sterren", 
        "domain": "www.freo.nl",
        "path": "/",
        "size": 24,
        "httpOnly": false,
        "secure": false,
        "session": true
      },
      {
        "name": "Freo_cookieLevel",
        "value": "2sterren", 
        "domain": "www.freo.nl",
        "path": "/",
        "size": 24,
        "httpOnly": false,
        "secure": false,
        "session": true
      },
      {
        "name": "Freo_cookieLevel",
        "value": "3sterren", 
        "domain": "www.freo.nl",
        "path": "/",
        "size": 24,
        "httpOnly": false,
        "secure": false,
        "session": true
      }
    ]
  },
  "slack_notifications": {
    "enable": false,
    "auth_key": "1234",
    "channel_id": "1234"
  }
}