{
    "browsertime": {
      "iterations": 1,
      "browser": "chrome"
    },
    "mobile":{
        "enable": true
    },
    "analysisstorer": {
      "enable": true
    },
    "axe": {
        "enable": true
    },
    "lighthouse": {
        "iterations": 2,
        "settings": {
            "emulatedFormFactor": "mobile"
        },
        "throttlingMethod": "simulate"
    },
    "gcs": {
        "projectId": "relevant-online-dev",
        "bucketname": "dev_docker_sitespeedio_custom_bake",
        "public": true,
        "key": "/sitespeedio/key.json"
    }
}