id,student_id,1_term,1_obtained_units,1_total_obtained_units,1_passed_units,1_total_passed_units,1_deleted_units,1_failed_units,1_gpa,1_cgpa,1_mashruti,2_term,2_obtained_units,2_total_obtained_units,2_passed_units,2_total_passed_units,2_deleted_units,2_failed_units,2_gpa,2_cgpa,2_mashruti,3_term,3_obtained_units,3_total_obtained_units,3_passed_units,3_total_passed_units,3_deleted_units,3_failed_units,3_gpa,3_cgpa,3_mashruti,4_term,4_obtained_units,4_total_obtained_units,4_passed_units,4_total_passed_units,4_deleted_units,4_failed_units,4_gpa,4_cgpa,4_mashruti,gender,residene,birthdate,entering,entering_type,mashruti
90168001,1,3901,17,17,14,14,0,3,13.74,13.74,0,3902,14,31,14,28,0,0,13.05,13.43,0,3911,18,49,15,43,2,3,11.06,12.56,1,3912,14,63,5,48,9,6,11.15,12.3,0,Male,No,1372,90,1,1
90168002,2,3901,17,17,11,11,0,6,13.79,13.79,0,3902,16,33,16,27,0,0,13.86,13.83,0,3911,17,50,17,44,2,0,15.06,14.25,0,3912,15,65,15,59,3,0,15.24,14.48,0,Male,Yes,1372,90,3,0
90168003,3,3901,17,17,14,14,0,3,12.91,12.91,0,3902,18,35,12,26,0,6,11.88,12.38,1,3911,14,49,11,37,0,3,11.41,12.1,1,3912,14,63,14,51,0,0,13.86,12.49,0,Male,Yes,1372,90,3,2
90168004,4,3901,17,17,10,10,0,7,11.47,11.47,1,3902,14,31,14,24,0,0,13.48,12.38,0,3911,16,47,6,30,2,10,10.8,11.84,1,3912,14,61,11,41,6,3,13.11,12.13,0,Male,Yes,1371,90,1,2
90168006,5,3901,17,17,17,17,0,0,13.9,13.9,0,3902,19,36,13,30,0,6,13.07,13.46,0,3911,17,56,11,44,2,6,11,12.88,1,3912,14,70,14,58,3,0,13.6,13.02,0,Female,Yes,1372,90,2,1
90168008,6,3901,17,17,10,10,0,7,11.47,11.47,1,3902,14,31,14,24,0,0,15.96,13.5,0,3911,20,51,17,41,0,3,13.39,13.46,0,3912,20,71,14,55,6,6,12.01,13.05,0,Male,No,1372,90,2,1
90168010,7,3901,17,17,8,8,0,9,10.29,10.29,1,3902,14,31,11,19,0,3,13.4,11.7,0,3911,20,51,20,39,0,0,12.16,11.88,0,3912,15,66,12,51,3,3,12.03,11.92,0,Male,No,1371,90,2,1
90168011,8,3901,17,17,14,14,0,3,13.79,13.79,0,3902,13,30,13,27,0,0,15.23,14.42,0,3911,17,47,17,44,0,0,14.53,14.46,0,3912,17,64,11,55,0,6,12.26,13.87,0,Female,Yes,1372,90,1,0
90168012,9,3901,17,17,17,17,0,0,14.63,14.63,0,3902,17,34,17,34,0,0,13.51,14.07,0,3911,18,52,18,52,0,0,14.04,14.06,0,3912,19,71,19,71,0,0,16.97,14.84,0,Male,Yes,1372,90,1,0
90168013,10,3901,14,14,11,11,3,3,12.68,12.68,0,3902,14,28,11,22,3,3,13.65,13.17,0,3911,18,46,15,37,0,3,13.68,13.37,0,3912,15,61,9,46,3,6,11.6,12.93,1,Female,No,1371,90,3,1
90168014,11,3901,17,17,14,14,0,3,12.44,12.44,0,3902,20,37,17,31,0,3,12.98,12.73,0,3911,17,54,17,48,0,0,15.93,13.74,0,3912,20,74,17,65,0,3,14.96,14.07,0,Female,No,1371,90,3,0
90168015,12,3901,17,17,17,17,0,0,12.6,12.6,0,3902,17,34,14,31,0,3,12.69,12.65,0,3911,18,52,15,46,0,3,14.13,13.16,0,3912,18,70,12,58,3,6,12.17,12.91,0,Female,Yes,1371,90,1,0
90168016,13,3901,17,17,17,17,0,0,14.71,14.71,0,3902,18,35,15,32,0,3,14.63,14.66,0,3911,19,54,16,48,0,3,14.93,14.76,0,3912,20,74,20,68,6,0,15.64,15,0,Female,Yes,1371,90,2,0
90168017,14,3901,17,17,13,13,0,4,11.54,11.54,1,3902,14,31,11,24,0,3,12.2,11.84,0,3911,18,49,12,36,0,6,12.39,12.04,0,3912,19,68,13,49,3,6,13.03,12.32,0,Female,Yes,1372,90,1,1
90168018,15,3901,17,17,14,14,0,3,12.96,12.96,0,3902,19,36,13,27,0,6,11.68,12.28,1,3911,14,56,11,44,0,3,15,13.31,0,3912,18,74,18,62,6,0,14.23,13.53,0,Female,Yes,1371,90,1,1
90168020,16,3901,17,17,11,11,0,6,12.41,12.41,0,3902,15,32,15,26,3,0,12.5,12.45,0,3911,15,47,15,41,0,0,15.67,13.48,0,3912,17,64,14,55,3,3,14.51,13.75,0,Male,Yes,1371,90,1,0
90168022,17,3901,17,17,14,14,0,3,11.5,11.5,1,3902,14,31,11,25,0,3,13.4,12.36,0,3911,19,50,16,41,0,3,12.7,12.49,0,3912,17,67,14,55,3,3,12.74,12.55,0,Female,Yes,1371,90,1,1
90168023,18,3901,17,17,7,7,0,10,11.12,11.12,1,3902,14,31,11,18,0,3,11.79,11.42,1,3911,14,45,11,29,0,3,14.24,12.3,0,3912,19,64,16,45,0,3,12.37,12.32,0,Female,Yes,1371,90,1,2
90168025,19,3901,17,17,17,17,0,0,13.19,13.19,0,3902,18,35,18,35,0,0,12.72,12.95,0,3911,15,50,15,50,0,0,14.3,13.36,0,3912,19,69,16,66,0,3,13.22,13.32,0,Female,Yes,1371,90,2,0
90168026,20,3901,17,17,4,4,0,13,10.06,10.06,1,3902,14,31,14,18,0,0,14.1,11.88,0,3911,19,50,7,25,0,12,9.72,11.06,1,3912,14,64,5,30,6,9,10.29,10.89,1,Male,Yes,1371,90,1,3
90168028,21,3901,17,17,14,14,0,3,13.72,13.72,0,3902,14,31,14,28,0,0,14.27,13.97,0,3911,20,51,17,45,0,3,13.28,13.7,0,3912,17,68,14,59,6,3,14.66,13.94,0,Male,Yes,1371,90,2,0
90168029,22,3901,17,17,10,10,0,7,11.03,11.03,1,3902,14,31,14,24,0,0,14.43,12.56,0,3911,13,44,3,27,7,3,9.5,12.07,0,3912,15,59,12,39,3,0,12.28,12.12,0,Male,No,1372,90,3,1
90168033,23,3901,17,17,17,17,0,0,14.29,14.29,0,3902,20,37,17,34,0,3,13.41,13.82,0,3911,16,53,16,50,0,0,15.24,14.25,0,3912,16,69,16,66,3,0,15.6,14.56,0,Male,Yes,1372,90,1,0
90168034,24,3901,17,17,14,14,0,3,14.13,14.13,0,3902,19,36,16,30,0,3,12.93,13.5,0,3911,16,52,16,46,0,0,14.25,13.73,0,3912,16,68,16,62,3,0,15.28,14.09,0,Male,Yes,1372,90,2,0
90168035,25,3901,17,17,17,17,0,0,14.91,14.91,0,3902,18,35,9,26,0,9,11.97,13.4,1,3911,14,55,11,43,0,3,12.07,13.1,0,3912,20,75,14,57,0,6,12.49,12.94,0,Female,Yes,1372,90,2,1
90168036,26,3901,17,17,17,17,0,0,14.25,14.25,0,3902,15,32,15,32,3,0,14.98,14.59,0,3911,17,49,14,46,0,3,14.42,14.53,0,3912,17,66,14,60,6,3,13.72,14.32,0,Male,No,1371,90,2,0
90168037,27,3901,17,17,10,10,0,7,11.38,11.38,1,3902,14,31,14,24,0,0,14.3,12.7,0,3911,18,49,18,42,0,0,12.97,12.8,0,3912,17,66,14,56,3,3,12.79,12.8,0,Male,Yes,1372,90,1,1
90168038,28,3902,13,13,10,10,0,3,13.4,13.4,0,3911,16,29,13,23,0,3,12.54,12.93,0,3912,19,48,19,42,0,0,12.47,12.74,0,3921,19,67,19,61,0,0,13.21,12.88,0,Male,Yes,1372,90,5,0
90213016,29,3901,15,15,11,11,0,4,12.55,12.55,0,3902,19,34,16,27,0,3,12.03,12.26,0,3911,16,53,16,46,0,0,12.92,12.58,0,3912,16,69,13,59,3,3,12.91,12.66,0,Female,No,1372,90,2,0
90213021,30,3901,15,15,12,12,0,3,12.3,12.3,0,3902,15,30,9,21,0,6,13.3,12.8,0,3911,20,53,20,44,0,0,14.79,13.55,0,3912,20,73,17,61,0,3,12.85,13.36,0,Female,Yes,1372,90,1,0
90213022,31,3901,15,15,15,15,0,0,15.8,15.8,0,3902,19,34,19,34,0,0,15.2,15.46,0,3911,18,52,18,52,2,0,14.91,15.27,0,3912,17,69,14,66,0,3,13.78,14.9,0,Female,Yes,1372,90,2,0
90213023,32,3901,16,16,16,16,2,0,15.53,15.53,0,3902,17,33,17,33,0,0,14.6,15.05,0,3911,15,48,15,48,3,0,15,15.04,0,3912,16,64,16,64,0,0,16.01,15.28,0,Male,Yes,1371,90,3,0
90213028,33,3901,18,18,18,18,2,0,16.14,16.14,0,3902,18,36,15,33,0,3,13.54,14.84,0,3911,17,53,8,41,0,9,10.27,13.37,1,3912,14,67,5,46,0,9,9.95,12.66,1,Male,No,1372,90,2,2
90213034,34,3901,15,15,11,11,0,4,12.72,12.72,0,3902,17,32,13,24,0,4,13.51,13.14,0,3911,19,51,19,43,0,0,12.68,12.97,0,3912,19,70,16,59,0,3,13.97,13.24,0,Female,No,1372,90,3,0
90213036,35,3901,17,17,17,17,0,0,14.04,14.04,0,3902,18,35,15,32,0,3,12.02,13,0,3911,13,48,10,42,3,3,11.9,12.71,1,3912,14,62,5,47,2,9,10.32,12.17,1,Male,No,1372,90,2,2
90213037,36,3901,15,15,15,15,0,0,12.62,12.62,0,3902,10,25,7,22,0,3,10.38,11.72,0,3911,13,41,10,35,0,3,12.04,11.86,0,3912,10,51,10,45,0,0,13.78,12.24,0,Female,Yes,1372,90,4,0
90213039,37,3901,18,18,18,18,0,0,15.35,15.35,0,3902,18,36,15,33,0,3,11.56,13.45,1,3911,14,53,14,50,0,0,12.21,13.1,0,3912,16,69,10,60,0,6,12.94,13.06,0,Male,No,1371,90,2,1
90213041,38,3901,15,15,11,11,0,4,13.7,13.7,0,3902,17,32,17,28,0,0,13.49,13.59,0,3911,18,50,18,46,0,0,15.54,14.29,0,3912,17,67,17,63,0,0,14.34,14.3,0,Female,No,1372,90,2,0
90213045,39,3901,15,15,8,8,0,7,12.73,12.73,0,3902,17,32,17,25,0,0,14.06,13.44,0,3911,16,48,13,38,0,3,12.72,13.2,0,3912,17,65,17,55,0,0,11.62,12.79,1,Female,No,1372,90,3,1
90213048,40,3901,15,15,12,12,0,3,14.58,14.58,0,3902,18,33,12,24,0,6,12.83,13.63,0,3911,17,53,17,44,0,0,17.02,14.85,0,3912,14,67,14,58,3,0,14.5,14.78,0,Male,Yes,1372,90,1,0
90213051,41,3901,17,17,17,17,0,0,15.9,15.9,0,3902,18,35,18,35,0,0,15.27,15.57,0,3911,18,53,15,50,0,3,14.33,15.15,0,3912,18,71,18,68,0,0,15.93,15.35,0,Male,No,1371,90,1,0
90213063,42,3901,15,15,15,15,0,0,14.45,14.45,0,3902,17,32,17,32,0,0,14.06,14.24,0,3911,16,48,16,48,3,0,14.27,14.25,0,3912,17,65,11,59,0,6,11.26,13.47,1,Male,Yes,1372,90,2,1
90213064,43,3901,15,15,15,15,0,0,16.22,16.22,0,3902,18,33,18,33,0,0,15.74,15.95,0,3911,16,49,16,49,0,0,17.73,16.53,0,3912,14,63,14,63,3,0,18.61,16.99,0,Female,Yes,1371,90,1,0
90213071,44,3901,15,15,12,12,0,3,13.03,13.03,0,3902,17,32,8,20,3,9,10.74,11.81,1,3911,14,52,14,40,0,0,12.97,12.16,0,3912,17,69,8,48,0,9,10.37,11.72,1,Male,Yes,1371,90,1,2
90213072,45,3901,15,15,11,11,0,4,12.83,12.83,0,3902,17,32,10,21,0,7,10.73,11.71,1,3911,14,46,11,32,0,3,12.02,11.81,0,3912,12,58,12,44,0,0,14.28,12.32,0,Male,No,1372,90,2,1
90213073,46,3901,17,17,14,14,0,3,13.29,13.29,0,3902,18,35,15,29,0,3,12.32,12.79,0,3911,16,51,16,45,0,0,13.4,12.98,0,3912,17,68,11,56,0,6,9.45,12.1,1,Male,Yes,1372,90,2,1
90213075,47,3901,15,15,11,11,0,4,14.28,14.28,0,3902,17,32,17,28,0,0,14.76,14.54,0,3911,19,51,19,47,0,0,13.26,14.06,0,3912,16,67,16,63,0,0,14.76,14.23,0,Female,No,1371,90,2,0
90213076,48,3901,15,15,15,15,2,0,13.98,13.98,0,3902,20,35,11,26,0,9,12.04,12.87,0,3911,19,57,16,45,0,3,12.77,12.84,0,3912,14,71,5,50,3,9,11.31,12.54,1,Male,Yes,1372,90,1,1
90213079,49,3901,17,17,17,17,0,0,16.13,16.13,0,3902,18,35,18,35,0,0,13.26,14.66,0,3911,16,51,16,51,0,0,15.02,14.77,0,3912,15,66,15,66,0,0,12.67,14.29,0,Male,No,1371,90,2,0
90213084,50,3901,17,17,17,17,1,0,15.68,15.68,0,3902,17,34,17,34,0,0,14.71,15.19,0,3911,17,51,14,48,0,3,11.88,14.09,1,3912,14,65,14,62,3,0,15.07,14.3,0,Male,Yes,1371,90,1,1
90213085,51,3901,15,15,15,15,0,0,16.38,16.38,0,3902,18,33,18,33,0,0,18.89,17.75,0,3911,18,51,18,51,0,0,18.29,17.94,0,3912,17,68,17,68,0,0,19.03,18.21,0,Male,Yes,1372,90,1,0
90213086,52,3901,15,15,15,15,0,0,15.52,15.52,0,3902,16,31,16,31,0,0,13.17,14.31,0,3911,16,47,16,47,0,0,13.58,14.06,0,3912,14,61,14,61,3,0,16.14,14.54,0,Female,Yes,1371,90,1,0
90213090,53,3901,17,17,17,17,0,0,14.93,14.93,0,3902,18,35,16,33,0,2,12.49,13.67,0,3911,17,52,14,47,0,3,12.94,13.43,0,3912,16,68,16,63,3,0,13.59,13.47,0,Male,Yes,1371,90,1,0
90213092,54,3901,15,15,15,15,0,0,15.67,15.67,0,3902,18,33,15,30,0,3,13.18,14.31,0,3911,15,51,15,48,0,0,13.2,13.73,0,3912,15,66,6,54,0,9,10.01,12.88,1,Female,No,1372,90,2,1
90213095,55,3901,16,16,12,12,0,4,14.61,14.61,0,3902,17,33,17,29,0,0,13.96,14.27,0,3911,17,50,17,46,0,0,12.93,13.82,0,3912,17,67,14,60,0,3,12.41,13.46,0,Female,No,1371,90,2,0
90213099,56,3901,17,17,13,13,0,4,13.61,13.61,0,3902,16,33,16,29,0,0,12.17,12.91,0,3911,15,48,15,44,0,0,13.29,13.03,0,3912,15,63,12,56,0,3,12.04,12.8,0,Male,Yes,1372,90,3,0
90213101,57,3901,15,15,15,15,0,0,17,17,0,3902,18,33,18,33,0,0,15.72,16.3,0,3911,18,51,15,48,0,3,14.08,15.52,0,3912,19,70,13,61,0,6,12.43,14.68,0,Male,Yes,1370,90,3,0
90213105,58,3901,16,16,16,16,0,0,14.45,14.45,0,3902,16,32,16,32,0,0,12.7,13.58,0,3911,16,48,16,48,0,0,15.08,14.08,0,3912,14,62,14,62,3,0,15.73,14.45,0,Female,Yes,1372,90,1,0
90213106,59,3901,15,15,15,15,0,0,15.4,15.4,0,3902,18,33,15,30,0,3,12.75,13.96,0,3911,14,47,14,44,3,0,17.68,15.06,0,3912,17,64,17,61,0,0,13.11,14.54,0,Male,Yes,1371,90,1,0
90213107,60,3901,17,17,17,17,0,0,18.37,18.37,0,3902,18,35,18,35,0,0,18.32,18.34,0,3911,18,53,18,53,0,0,18.28,18.32,0,3912,17,70,17,70,0,0,17.74,18.18,0,Male,No,1371,90,2,0
90213108,61,3901,15,15,15,15,0,0,15.2,15.2,0,3902,16,31,13,28,0,3,12.96,14.05,0,3911,14,45,14,42,3,0,16.33,14.75,0,3912,17,62,14,56,0,3,14.59,14.71,0,Female,Yes,1372,90,1,0
90213114,62,3901,15,15,15,15,0,0,16.18,16.18,0,3902,18,33,15,30,0,3,14.44,15.23,0,3911,18,54,15,48,0,3,13.2,14.6,0,3912,14,68,14,62,3,0,15.53,14.79,0,Male,Yes,1371,90,1,0
90213131,63,3901,15,15,15,15,0,0,14.45,14.45,0,3902,18,33,12,27,0,6,13.72,14.05,0,3911,14,50,14,44,3,0,14.61,14.4,0,3912,18,68,12,56,0,6,11.33,13.59,1,Male,Yes,1372,90,1,1
90213132,64,3901,15,15,15,15,0,0,15.28,15.28,0,3902,20,35,18,33,0,2,12.85,13.89,0,3911,18,53,18,51,0,0,16.1,14.64,0,3912,17,70,14,65,0,3,13.8,14.44,0,Male,Yes,1371,90,1,0
90213137,65,3901,15,15,11,11,0,4,14.13,14.13,0,3902,16,31,16,27,0,0,14.98,14.57,0,3911,17,48,17,44,0,0,12.47,13.83,0,3912,18,66,12,56,0,6,12.13,13.37,0,Female,Yes,1372,90,2,0
90213140,66,3901,15,15,15,15,0,0,13.55,13.55,0,3902,18,33,15,30,0,3,13.25,13.39,0,3911,18,51,18,48,0,0,13.47,13.42,0,3912,20,71,11,59,0,9,12.16,13.06,0,Male,No,1371,90,3,0
90213141,67,3901,15,15,15,15,0,0,12.7,12.7,0,3902,13,28,10,25,3,3,10.55,11.7,1,3911,14,45,11,39,0,3,11.75,11.74,1,3912,14,59,11,50,3,3,12,11.8,0,Female,Yes,1372,90,1,2
90213143,68,3901,15,15,15,15,0,0,15.48,15.48,0,3902,19,34,19,34,0,0,15.55,15.52,0,3911,16,50,16,50,0,0,14.61,15.23,0,3912,17,67,17,67,0,0,15.33,15.25,0,Female,Yes,1372,90,1,0
90213155,69,3901,15,15,15,15,0,0,14.68,14.68,0,3902,16,31,16,31,0,0,13.73,14.19,0,3911,14,45,11,42,0,3,14.84,14.39,0,3912,12,57,9,51,3,3,15.16,14.56,0,Female,Yes,1372,90,1,0
90213156,70,3901,15,15,15,15,0,0,15.4,15.4,0,3902,18,33,18,33,0,0,14.52,14.92,0,3911,18,51,18,51,0,0,15.34,15.07,0,3912,17,68,17,68,0,0,13.71,14.73,0,Female,No,1371,90,2,0
90213159,71,3901,15,15,15,15,2,0,13.05,13.05,0,3902,15,30,12,27,3,3,12.33,12.69,0,3911,16,49,16,46,0,0,15.03,13.5,0,3912,16,65,7,53,0,9,10.65,12.8,1,Male,Yes,1371,90,1,1
90213164,72,3901,15,15,15,15,0,0,14.77,14.77,0,3902,17,32,11,26,0,6,11.16,12.85,1,3911,14,49,8,37,0,6,10.5,12.14,1,3912,14,63,11,48,0,3,12.69,12.26,0,Male,Yes,1372,90,1,2
90213166,73,3901,15,15,15,15,0,0,15.05,15.05,0,3902,17,32,14,29,0,3,12.12,13.49,0,3911,20,52,20,49,0,0,13.29,13.41,0,3912,16,68,4,53,0,12,10.5,12.73,1,Male,No,1372,90,2,1
90213167,74,3901,15,15,15,15,0,0,15.47,15.47,0,3902,13,28,10,25,3,3,15.02,15.26,0,3911,16,44,16,41,0,0,14.31,14.91,0,3912,17,61,14,55,0,3,12.69,14.29,0,Female,No,1371,90,2,0
90213168,75,3901,15,15,15,15,0,0,13.88,13.88,0,3902,16,31,16,31,0,0,13.47,13.67,0,3911,20,51,20,51,0,0,14.36,13.94,0,3912,17,68,14,65,0,3,12.91,13.68,0,Female,Yes,1372,90,1,0
90213173,76,3901,17,17,17,17,1,0,15.21,15.21,0,3902,17,34,14,31,0,3,13.06,14.13,0,3911,17,54,14,45,0,3,10.43,12.68,1,3912,14,68,11,56,0,3,12.93,12.73,0,Male,Yes,1371,90,1,1
90213174,77,3901,15,15,12,12,0,3,13.65,13.65,0,3902,15,30,6,18,3,9,9.93,11.79,1,3911,14,47,14,35,0,0,15.01,13.08,0,3912,17,64,14,49,0,3,14.55,13.47,0,Female,Yes,1372,90,1,1
90213175,78,3901,15,15,15,15,0,0,13.73,13.73,0,3902,16,31,16,31,0,0,13.53,13.63,0,3911,17,48,17,48,3,0,16.3,14.57,0,3912,15,63,15,63,0,0,13.48,14.31,0,Female,Yes,1372,90,1,0
90213179,79,3901,15,15,15,15,0,0,15.47,15.47,0,3902,18,33,18,33,0,0,17.11,16.36,0,3911,18,51,18,51,0,0,17.69,16.83,0,3912,17,68,17,68,0,0,18.78,17.32,0,Male,No,1372,90,2,0
90213181,80,3901,15,15,15,15,0,0,14.7,14.7,0,3902,15,30,15,30,3,0,14.52,14.61,0,3911,14,44,14,44,0,0,15.1,14.76,0,3912,17,61,17,61,0,0,14.95,14.82,0,Male,Yes,1372,90,1,0
90213223,81,3901,13,13,13,13,0,0,15.88,15.88,0,3902,17,30,5,18,0,12,9.06,12.02,1,3911,14,44,14,32,0,0,12.39,12.14,0,3912,19,63,9,41,0,10,10.49,11.64,1,Male,Yes,1371,90,1,2
90222164,82,3901,15,15,11,11,3,4,16.75,16.75,0,3902,10,25,10,21,0,0,13.3,15.11,0,3911,20,48,17,41,0,3,12.62,13.92,0,3912,12,60,9,50,0,3,12.89,13.7,0,Male,Yes,1372,90,1,0
91113001,83,3911,17,17,17,17,0,0,13.15,13.15,0,3912,18,35,12,29,0,6,11.62,12.36,1,3921,14,52,11,43,0,3,15.5,13.39,0,3922,17,69,17,60,0,0,14.64,13.7,0,Female,Yes,1373,91,1,1
91113002,84,3911,17,17,17,17,0,0,14.82,14.82,0,3912,20,37,20,37,0,0,16.48,15.72,0,3921,18,55,18,55,0,0,15.28,15.58,0,3922,16,71,16,71,0,0,13.71,15.16,0,Male,Yes,1373,91,2,0
91113004,85,3911,17,17,17,17,0,0,12.79,12.79,0,3912,18,35,12,29,0,6,11.16,11.95,1,3921,14,52,11,43,0,3,12.48,12.33,0,3922,18,70,13,56,2,5,13.91,12.73,0,Male,Yes,1373,91,1,1
91113005,86,3911,17,17,17,17,0,0,14.54,14.54,0,3912,17,34,17,34,0,0,12.32,13.43,0,3921,15,49,6,40,0,9,11.27,12.77,1,3922,14,63,11,51,0,3,12.75,12.76,0,Male,Yes,1373,91,1,1
91113006,87,3911,17,17,17,17,0,0,13.39,13.39,0,3912,16,33,13,30,0,3,10.46,11.97,1,3921,14,47,14,44,0,0,16.04,13.18,0,3922,17,64,17,61,0,0,15.47,13.79,0,Female,Yes,1373,91,1,1
91113007,88,3911,17,17,17,17,0,0,13.09,13.09,0,3912,17,34,11,28,0,6,9.85,11.47,1,3921,13,50,10,41,0,3,10.56,11.54,0,3922,11,61,8,49,3,3,13.5,11.89,1,Male,Yes,1373,91,1,2
91113008,89,3911,17,17,17,17,0,0,14.2,14.2,0,3912,19,36,19,36,0,0,14.01,14.1,0,3921,14,50,11,47,0,3,13.48,13.93,0,3922,16,66,16,63,3,0,15.98,14.43,0,Male,Yes,1373,91,1,0
91113009,90,3911,17,17,17,17,0,0,14.46,14.46,0,3912,18,35,15,32,0,3,11.87,13.13,1,3921,14,49,14,46,0,0,14.54,13.53,0,3922,17,66,17,63,0,0,13.58,13.54,0,Female,Yes,1372,91,1,1
91113010,91,3911,17,17,17,17,0,0,13.66,13.66,0,3912,17,34,17,34,0,0,14.67,14.17,0,3921,19,53,19,53,0,0,14.61,14.32,0,3922,17,70,17,70,0,0,14.68,14.41,0,Male,Yes,1373,91,3,0
91113011,92,3911,17,17,17,17,0,0,17.32,17.32,0,3912,20,37,20,37,0,0,14.64,15.87,0,3921,18,55,18,55,0,0,15.34,15.7,0,3922,17,72,17,72,0,0,16.91,15.98,0,Male,Yes,1372,91,2,0
91113012,93,3911,17,17,13,13,0,0,12.73,12.73,0,3912,11,28,8,21,0,3,11.32,12.08,0,3921,14,48,8,35,0,6,11.14,11.93,1,3922,14,62,5,40,0,9,10.25,11.52,1,Male,Yes,1372,91,4,2
91113014,94,3911,17,17,13,13,0,4,12.38,12.38,0,3912,19,36,16,29,0,3,12.33,12.35,0,3921,20,56,17,46,0,3,12.7,12.48,0,3922,20,76,11,57,0,9,11.43,12.2,1,Male,Yes,1372,91,3,1
91113016,95,3911,17,17,13,13,0,4,12.87,12.87,0,3912,16,33,13,26,0,3,12.61,12.74,0,3921,16,49,16,42,0,0,15.04,13.49,0,3922,19,68,19,61,0,0,16.19,14.25,0,Female,Yes,1373,91,3,0
91113017,96,3911,17,17,17,17,0,0,12.59,12.59,0,3912,19,36,16,33,0,3,12.14,12.35,0,3921,17,53,17,50,0,0,12.5,12.4,0,3922,14,67,11,61,0,3,10.76,12.06,1,Male,Yes,1373,91,1,1
91113018,97,3911,17,17,14,14,0,3,13.97,13.97,0,3912,13,30,13,27,0,0,14.25,14.09,0,3921,17,47,11,38,0,6,11.6,13.19,1,3922,14,61,14,52,3,0,15.39,13.7,0,Male,Yes,1373,91,1,1
91113019,98,3911,17,17,14,14,0,3,12.93,12.93,0,3912,10,27,7,21,0,3,12.93,12.93,0,3921,16,43,16,37,0,0,13.76,13.24,0,3922,15,58,12,49,0,3,11.63,12.82,1,Male,Yes,1373,91,2,1
91113020,99,3911,17,17,17,17,0,0,16.94,16.94,0,3912,17,34,17,34,3,0,13.81,15.37,0,3921,18,52,18,52,0,0,18.54,16.47,0,3922,18,70,18,70,0,0,17.71,16.79,0,Male,Yes,1372,91,3,0
91113021,100,3911,17,17,17,17,0,0,15.55,15.55,0,3912,20,37,20,37,0,0,15.08,15.29,0,3921,15,52,12,49,0,3,13.55,14.79,0,3922,20,72,20,69,0,0,13.15,14.33,0,Male,Yes,1373,91,1,0
91113022,101,3911,17,17,17,17,0,0,18.97,18.97,0,3912,18,35,18,35,0,0,18.53,18.74,0,3921,20,55,20,55,0,0,18.73,18.74,0,3922,18,73,18,73,0,0,18.15,18.59,0,Female,No,1372,91,2,0
91113023,102,3911,17,17,7,7,0,10,11.71,11.71,1,3912,13,30,13,20,0,0,12.77,12.17,0,3921,14,44,14,34,0,0,16.02,13.39,0,3922,15,59,15,49,3,0,14.73,13.73,0,Female,Yes,1372,91,1,1
91113024,103,3911,15,15,15,15,2,0,15.47,15.47,0,3912,14,29,14,29,0,0,13.52,14.53,0,3921,15,44,15,44,0,0,14.61,14.55,0,3922,17,61,17,61,0,0,16.85,15.19,0,Female,No,1372,91,2,0
91113025,104,3911,17,17,17,17,0,0,13.19,13.19,0,3912,19,36,19,36,0,0,13.43,13.32,0,3921,17,53,14,50,0,3,13.54,13.39,0,3922,19,72,19,69,0,0,15.74,14.01,0,Male,No,1373,91,3,0
91113027,105,3911,17,17,13,13,0,4,12.47,12.47,0,3912,18,35,12,25,0,6,11.57,12.01,1,3921,14,52,11,39,0,3,13.46,12.4,0,3922,17,69,8,47,0,9,10.85,12.02,1,Female,Yes,1373,91,2,2
91113028,106,3911,17,17,10,10,0,7,13.26,13.26,0,3912,15,32,15,25,3,0,15.05,14.1,0,3921,17,52,17,45,0,0,17.29,15.37,0,3922,20,72,20,65,0,0,16.65,15.73,0,Male,Yes,1372,91,2,0
91113029,107,3911,17,17,17,17,0,0,17.75,17.75,0,3912,17,34,17,34,0,0,14.37,16.06,0,3921,16,50,13,47,0,3,14.83,15.67,0,3922,17,67,17,64,0,0,16.31,15.83,0,Female,Yes,1373,91,2,0
91113030,108,3911,17,17,17,17,0,0,13.78,13.78,0,3912,16,33,16,33,0,0,12.77,13.29,0,3921,15,48,15,48,0,0,14.98,13.82,0,3922,16,64,16,64,0,0,15.34,14.2,0,Female,Yes,1373,91,3,0
91113031,109,3911,17,17,14,14,0,3,12.56,12.56,0,3912,13,30,13,27,0,0,13.42,12.94,0,3921,19,49,16,43,0,3,12.61,12.81,0,3922,17,66,14,57,0,3,12.66,12.77,0,Male,No,1372,91,2,0
91113032,110,3911,17,17,14,14,0,3,11.31,11.31,1,3912,13,30,10,24,0,3,11.79,11.52,0,3921,14,50,11,41,0,3,12.92,12.57,0,3922,20,70,14,55,0,6,12.21,12.46,0,Male,No,1373,91,2,1
91113033,111,3911,17,17,17,17,0,0,15.91,15.91,0,3912,20,37,17,34,0,3,12.03,13.81,0,3921,17,57,14,51,0,3,12.4,13.62,0,3922,19,76,19,70,0,0,13.27,13.53,0,Male,No,1373,91,2,0
91113034,112,3911,17,17,17,17,0,0,16.41,16.41,0,3912,19,36,19,36,0,0,16.38,16.4,0,3921,16,52,16,52,0,0,14.67,15.87,0,3922,18,70,18,70,0,0,15.14,15.68,0,Male,Yes,1372,91,1,0
91113035,113,3911,17,17,17,17,0,0,13.48,13.48,0,3912,19,36,16,33,0,3,12.07,12.74,0,3921,15,54,6,42,0,9,11.3,12.41,1,3922,14,68,8,50,0,6,9.99,11.91,1,Male,Yes,1373,91,1,2
91113036,114,3911,17,17,14,14,0,3,12.35,12.35,0,3912,14,31,14,28,0,0,12.71,12.51,0,3921,15,46,15,43,3,0,14.68,13.22,0,3922,18,64,18,61,0,0,13.49,13.3,0,Male,Yes,1372,91,1,0
91113037,115,3911,17,17,14,14,0,3,12.41,12.41,0,3912,13,30,13,27,0,0,15.04,13.55,0,3921,16,46,16,43,0,0,15.08,14.08,0,3922,17,63,0,43,0,17,0,10.28,1,Male,Yes,1373,91,2,1
91113038,116,3911,17,17,17,17,0,0,12.6,12.6,0,3912,15,32,15,32,0,0,12.65,12.62,0,3921,9,41,6,38,0,3,10.67,12.19,0,3922,11,52,8,46,0,3,13.9,12.56,0,Female,No,1373,91,4,0
91113039,117,3911,17,17,17,17,0,0,14.66,14.66,0,3912,20,37,20,37,0,0,14.02,14.31,0,3921,17,54,14,51,0,3,13.31,14,0,3922,19,73,19,70,0,0,13.38,13.84,0,Male,Yes,1373,91,1,0
91113040,118,3911,17,17,17,17,0,0,15.36,15.36,0,3912,18,35,18,35,0,0,16.96,16.18,0,3921,16,51,16,51,3,0,16.91,16.41,0,3922,17,68,17,68,0,0,15.98,16.3,0,Female,Yes,1373,91,1,0
91113042,119,3911,17,17,17,17,0,0,13.78,13.78,0,3912,18,35,15,32,0,3,12.05,12.89,0,3921,17,52,11,43,0,6,11.78,12.53,1,3922,14,66,11,54,0,3,12.6,12.54,0,Male,Yes,1373,91,2,1
91113043,120,3911,17,17,17,17,0,0,14.36,14.36,0,3912,15,32,12,29,0,3,13.72,14.06,0,3921,14,46,14,43,0,0,12.2,13.49,0,3922,14,60,14,57,0,0,14.09,13.63,0,Male,Yes,1372,91,1,0
91113044,121,3911,17,17,17,17,0,0,18.41,18.41,0,3912,18,35,18,35,0,0,16.75,17.56,0,3921,14,49,14,49,0,0,16.95,17.38,0,3922,16,65,13,62,0,3,15.72,16.97,0,Male,No,1373,91,3,0
91113046,122,3911,17,17,17,17,0,0,17.49,17.49,0,3912,21,38,21,38,0,0,15.47,16.37,0,3921,17,55,14,52,0,3,14.28,15.72,0,3922,19,74,19,71,0,0,14.77,15.48,0,Male,No,1373,91,3,0
91113048,123,3911,17,17,14,14,0,3,12.15,12.15,0,3912,16,33,7,21,0,9,10.81,11.5,1,3921,14,47,14,35,0,0,14.97,12.53,0,3922,20,67,14,49,0,6,12.61,12.56,0,Male,Yes,1373,91,1,1
91213013,124,3911,20,20,20,20,0,0,13.85,13.85,0,3912,15,35,9,29,0,6,10.71,12.51,1,3921,14,49,8,37,0,6,11.58,12.24,1,3922,14,63,11,48,0,3,12.05,12.2,0,Male,Yes,1372,91,1,2
91213015,125,3911,18,18,18,18,0,0,16.82,16.82,0,3912,18,36,18,36,0,0,13.94,15.38,0,3921,15,51,15,51,0,0,16.96,15.84,0,3922,16,67,16,67,0,0,16.53,16.01,0,Male,No,1373,91,2,0
91213017,126,3911,15,15,15,15,0,0,12.25,12.25,0,3912,18,33,15,30,0,3,12.06,12.14,0,3921,17,50,14,44,0,3,12.9,12.4,0,3922,15,65,15,59,0,0,12.88,12.51,0,Female,Yes,1373,91,1,0
91213019,127,3911,15,15,15,15,0,0,17.42,17.42,0,3912,16,31,16,31,3,0,13.9,15.6,0,3921,16,50,16,50,0,0,18.27,16.61,0,3922,14,64,14,64,3,0,18.41,17.01,0,Female,Yes,1373,91,1,0
91213020,128,3911,15,15,15,15,0,0,13.6,13.6,0,3912,15,30,15,30,3,0,14.79,14.19,0,3921,15,45,15,45,0,0,14.52,14.3,0,3922,18,63,10,55,0,8,9.92,13.05,1,Female,Yes,1372,91,1,1
91213022,129,3911,15,15,11,11,0,4,14.89,14.89,0,3912,19,34,19,30,0,0,17.67,16.44,0,3921,17,51,17,47,0,0,15.78,16.22,0,3922,17,68,17,64,0,0,17.16,16.46,0,Female,Yes,1372,91,1,0
91213026,130,3911,15,15,15,15,0,0,16.22,16.22,0,3912,15,30,12,27,0,3,14.28,15.25,0,3921,17,50,17,47,0,0,17.63,16.16,0,3922,16,66,16,63,0,0,16.28,16.19,0,Female,Yes,1372,91,1,0
91213028,131,3911,15,15,15,15,0,0,15.75,15.75,0,3912,18,33,18,33,0,0,16.09,15.94,0,3921,17,50,17,50,0,0,17.56,16.49,0,3922,17,67,17,67,0,0,17.05,16.63,0,Female,No,1372,91,3,0
91213034,132,3911,15,15,15,15,0,0,18.33,18.33,0,3912,20,35,20,35,0,0,19.1,18.77,0,3921,22,57,22,57,0,0,18.92,18.83,0,3922,16,73,16,73,0,0,18.24,18.7,0,Female,No,1373,91,2,0
91213036,133,3911,3,3,3,3,12,0,11.5,11.5,0,3912,12,15,2,5,0,10,5.13,6.41,1,3921,14,29,11,16,0,3,12.02,9.12,0,3931,4,33,1,17,10,3,11.75,9.43,0,Male,Yes,1372,91,1,1
91213040,134,3911,15,15,15,15,0,0,16.72,16.72,0,3912,18,33,18,33,0,0,15.73,16.18,0,3921,17,50,14,47,0,3,13.09,15.13,0,3922,18,68,18,65,0,0,14.37,14.93,0,Female,Yes,1372,91,1,0
91213041,135,3911,15,15,15,15,0,0,16.15,16.15,0,3912,18,33,18,33,0,0,17.53,16.9,0,3921,17,50,17,50,0,0,18.4,17.41,0,3922,17,67,17,67,0,0,18.34,17.65,0,Female,No,1372,91,2,0
91213045,136,3911,15,15,15,15,0,0,14.57,14.57,0,3912,14,29,14,29,3,0,14.26,14.42,0,3921,15,44,15,44,0,0,15.44,14.77,0,3922,15,59,15,59,0,0,15.03,14.83,0,Male,Yes,1371,91,1,0
91213047,137,3911,15,15,15,15,0,0,17.15,17.15,0,3912,15,30,15,30,3,0,18.12,17.64,0,3921,17,47,17,47,0,0,17.59,17.62,0,3922,16,63,16,63,0,0,18.55,17.85,0,Female,Yes,1373,91,1,0
91213048,138,3911,15,15,15,15,0,0,17.2,17.2,0,3912,16,31,13,28,3,3,15.33,16.24,0,3921,17,54,14,48,0,3,15.65,15.89,0,3922,15,69,15,63,0,0,15.67,15.84,0,Female,Yes,1372,91,1,0
91213049,139,3911,15,15,15,15,0,0,14.22,14.22,0,3912,16,31,16,31,2,0,14.03,14.12,0,3921,17,48,14,45,0,3,14.29,14.18,0,3922,18,66,18,63,0,0,15.81,14.63,0,Female,Yes,1374,91,2,0
91213055,140,3911,15,15,11,11,0,4,15.05,15.05,0,3912,20,35,17,28,0,3,14.22,14.58,0,3921,16,54,16,47,0,0,17.59,15.47,0,3922,15,69,15,62,0,0,13.37,15.01,0,Female,No,1372,91,2,0
91213060,141,3911,17,17,17,17,1,0,14.18,14.18,0,3912,15,32,9,26,3,6,11.48,12.91,1,3921,14,46,11,37,0,3,12.72,12.85,0,3922,15,61,9,46,0,6,12.8,12.84,0,Male,No,1373,91,2,1
91213061,142,3911,17,17,13,13,0,4,12.38,12.38,0,3912,20,37,20,33,0,0,13.15,12.8,0,3921,17,54,14,47,0,3,15.99,13.8,0,3922,16,70,13,60,0,3,12.27,13.45,0,Male,No,1373,91,3,0
91213063,143,3911,17,17,17,17,0,0,17.29,17.29,0,3912,20,37,20,37,0,0,14.61,15.84,0,3921,14,51,11,48,0,3,14.29,15.42,0,3922,18,69,18,66,0,0,18.14,16.13,0,Male,Yes,1372,91,1,0
91213065,144,3911,15,15,15,15,0,0,14.72,14.72,0,3912,18,33,15,30,0,3,13.79,14.21,0,3921,17,50,17,47,0,0,16.9,15.13,0,3922,17,67,17,64,0,0,18.32,15.94,0,Female,Yes,1373,91,1,0
91213068,145,3911,17,17,17,17,0,0,16.9,16.9,0,3912,18,35,18,35,0,0,13.92,15.36,0,3921,18,53,9,44,0,9,12.52,14.4,0,3922,17,70,17,61,0,0,14.81,14.5,0,Male,No,1372,91,1,0
91213070,146,3911,17,17,17,17,0,0,18.29,18.29,0,3912,15,32,15,32,3,0,15.1,16.8,0,3921,17,52,17,52,0,0,18.32,17.36,0,3922,16,68,16,68,0,0,17.98,17.51,0,Male,Yes,1372,91,1,0
91213077,147,3911,17,17,14,14,0,3,14.06,14.06,0,3912,14,31,14,28,0,0,18.32,15.98,0,3921,20,54,14,42,0,6,14.52,14.9,0,3922,19,73,19,61,0,0,16.15,15.22,0,Male,Yes,1372,91,1,0
91213078,148,3911,17,17,17,17,0,0,16.19,16.19,0,3912,12,29,9,26,3,3,13.27,14.98,0,3921,18,50,18,47,0,0,15.61,14.91,0,3922,15,65,15,62,3,0,14.37,14.78,0,Female,Yes,1373,91,1,0
91213079,149,3911,17,17,17,17,0,0,14.29,14.29,0,3912,15,32,12,29,3,3,12.07,13.25,0,3921,17,49,14,43,0,3,14.4,13.65,0,3922,17,66,17,60,0,0,14.4,13.84,0,Male,No,1372,91,2,0
91213080,150,3911,15,15,15,15,0,0,17.55,17.55,0,3912,17,32,17,32,0,0,17.83,17.7,0,3921,20,52,20,52,0,0,18.38,17.96,0,3922,17,69,17,69,0,0,19.38,18.31,0,Female,No,1373,91,1,0
91213081,151,3911,17,17,8,8,0,9,11.12,11.12,1,3912,11,28,8,16,0,3,12.57,11.69,0,3921,14,42,5,21,6,9,9.28,10.88,1,3922,11,53,2,23,3,9,9.36,10.57,0,Male,Yes,1373,91,1,2
91213084,152,3911,17,17,17,17,0,0,12.99,12.99,0,3912,18,35,12,29,0,6,12.43,12.7,0,3921,17,52,11,40,0,6,11.8,12.4,1,3922,14,66,14,54,0,0,15.78,13.12,0,Male,No,1373,91,2,1
91213087,153,3911,17,17,17,17,0,0,12.81,12.81,0,3912,19,36,13,30,0,6,12.7,12.75,0,3921,14,50,8,38,0,6,12.42,12.66,0,3922,17,67,17,55,0,0,11.54,12.38,1,Male,No,1373,91,3,1
91213088,154,3911,15,15,15,15,0,0,16.98,16.98,0,3912,17,32,17,32,0,0,17.3,17.15,0,3921,17,49,17,49,0,0,16.59,16.96,0,3922,17,66,17,66,0,0,18.32,17.31,0,Female,Yes,1372,91,1,0
91213090,155,3911,15,15,15,15,0,0,15.22,15.22,0,3912,18,33,18,33,0,0,13.99,14.55,0,3921,11,44,11,44,0,0,13.71,14.34,0,3922,18,62,18,62,0,0,16.12,14.85,0,Female,No,1372,91,2,0
91213091,156,3911,18,18,18,18,0,0,17.99,17.99,0,3912,19,37,19,37,0,0,15.59,16.76,0,3921,18,55,15,52,0,3,14.1,15.89,0,3922,18,73,18,70,0,0,13.89,15.39,0,Male,No,1373,91,2,0
91213095,157,3911,15,15,15,15,0,0,17.13,17.13,0,3912,15,30,12,27,3,3,14.95,16.04,0,3921,16,49,16,46,0,0,17.05,16.53,0,3922,16,65,16,62,0,0,14.74,16.09,0,Female,No,1371,91,2,0
91213096,158,3911,16,16,16,16,0,0,15.22,15.22,0,3912,15,31,12,28,3,3,12.58,13.94,0,3921,17,48,14,42,0,3,13.94,13.94,0,3922,18,66,13,55,0,5,12.48,13.54,0,Male,No,1373,91,2,0
91213100,159,3911,15,15,11,11,0,4,12.55,12.55,0,3912,16,31,13,24,3,3,13.04,12.8,0,3921,16,50,13,40,0,3,14.41,13.6,0,3922,15,65,12,52,0,3,11.71,13.16,1,Male,Yes,1372,91,1,1
91213102,160,3911,15,15,15,15,0,0,16.4,16.4,0,3912,15,30,15,30,0,0,15.53,15.96,0,3921,17,47,17,47,0,0,15.92,15.95,0,3922,16,63,16,63,0,0,15.13,15.74,0,Female,Yes,1373,91,1,0
91213106,161,3911,15,15,11,11,0,4,12.7,12.7,0,3912,19,34,19,30,0,0,12.98,12.86,0,3921,15,49,9,39,0,6,13.04,12.91,0,3922,18,67,15,54,0,3,13.56,13.09,0,Male,Yes,1372,91,1,0
91213107,162,3911,15,15,15,15,0,0,18.1,18.1,0,3912,15,30,15,30,0,0,16.69,17.4,0,3921,17,47,17,47,0,0,17.73,17.52,0,3922,16,63,16,63,0,0,16.78,17.33,0,Female,Yes,1373,91,1,0
91213110,163,3911,17,17,14,14,0,3,14.56,14.56,0,3912,12,29,9,23,0,3,15.02,14.75,0,3921,14,46,8,34,3,6,11.93,13.71,1,3922,14,60,11,45,0,3,11.08,13.1,1,Male,No,1373,91,2,2
91213111,164,3911,18,18,18,18,0,0,14.75,14.75,0,3912,18,36,12,30,0,6,11.68,13.22,1,3921,14,50,8,38,0,6,13,13.16,0,3922,15,65,15,53,2,0,14.59,13.49,0,Male,Yes,1372,91,1,1
91213114,165,3911,17,17,17,17,0,0,14.6,14.6,0,3912,19,36,19,36,0,0,18.25,16.53,0,3921,15,54,15,54,0,0,17.02,16.55,0,3922,14,68,14,68,0,0,18.41,16.93,0,Male,Yes,1372,91,1,0
91213121,166,3911,17,17,17,17,0,0,15.68,15.68,0,3912,14,31,11,28,6,3,11.85,13.95,1,3921,14,51,14,48,0,0,18.3,15.23,0,3922,14,65,14,62,0,0,17.02,15.61,0,Male,Yes,1373,91,1,1
91213127,167,3911,17,17,13,13,0,4,13.86,13.86,0,3912,18,35,14,27,0,4,12.33,13.07,0,3921,15,50,15,42,0,0,12.68,12.96,0,3922,16,66,16,58,0,0,12.75,12.91,0,Male,Yes,1373,91,1,0
91213130,168,3911,18,18,18,18,0,0,16.57,16.57,0,3912,18,36,15,33,0,3,13.73,15.15,0,3921,19,58,19,55,0,0,15.74,15.54,0,3922,16,74,16,71,0,0,14.54,15.33,0,Female,Yes,1373,91,1,0
91213132,169,3911,17,17,17,17,0,0,18.25,18.25,0,3912,20,37,20,37,0,0,17.43,17.81,0,3921,19,56,19,56,0,0,17.94,17.85,0,3922,18,74,18,74,0,0,16.53,17.53,0,Male,No,1372,91,2,0
91213136,170,3911,17,17,17,17,0,0,17.76,17.76,0,3912,13,30,10,27,3,3,14.31,16.27,0,3921,16,52,16,49,0,0,17.56,16.77,0,3922,16,68,16,65,0,0,15.2,16.4,0,Male,Yes,1372,91,1,0
91213141,171,3911,17,17,17,17,0,0,15.06,15.06,0,3912,16,33,16,33,3,0,14.08,14.58,0,3921,16,52,16,52,0,0,17.79,15.81,0,3922,15,67,15,67,0,0,16.33,15.93,0,Female,Yes,1373,91,1,0
91213143,172,3911,15,15,11,11,0,4,12.15,12.15,0,3912,14,29,14,25,0,0,15.46,13.75,0,3921,17,46,17,42,0,0,16.45,14.75,0,3922,15,61,15,57,3,0,13.84,14.52,0,Female,Yes,1372,91,5,0
91213144,173,3911,17,17,10,10,0,7,15.78,15.78,0,3912,16,33,16,26,0,0,17.8,17.02,0,3921,15,54,15,47,0,0,15.47,16.65,0,3922,14,68,11,58,1,3,17.07,16.73,0,Male,Yes,1373,91,1,0
91213145,174,3911,17,17,10,10,0,7,14.46,14.46,0,3912,16,33,16,26,0,0,17.03,15.7,0,3921,15,54,15,47,0,0,13.52,15.32,0,3922,14,68,14,61,0,0,14.18,15.09,0,Female,Yes,1372,91,1,0
91213146,175,3911,17,17,10,10,0,7,11.79,11.79,1,3912,10,27,3,13,3,7,9.93,11.1,0,3921,14,47,11,24,0,3,14,11.68,0,3922,15,62,0,24,0,15,8.35,10.88,1,Male,Yes,1371,91,1,2
91213150,176,3911,15,15,11,11,0,4,13.22,13.22,0,3912,15,30,9,20,0,6,13.2,13.21,0,3921,18,48,18,38,0,0,13.74,13.41,0,3922,15,63,9,47,2,6,12.25,13.13,0,Male,Yes,1373,91,5,0
91213154,177,3911,15,15,8,8,0,7,10.47,10.47,1,3912,14,29,14,22,0,0,14.64,12.48,0,3921,17,46,17,39,0,0,13.66,12.92,0,3922,15,61,15,54,0,0,15.12,13.46,0,Male,Yes,1373,91,1,1
91213163,178,3911,15,15,8,8,0,7,12.2,12.2,0,3912,13,28,13,21,0,0,13.85,12.96,0,3921,16,47,16,40,3,0,15.43,13.81,0,3922,17,64,17,57,0,0,13.96,13.85,0,Male,No,1371,91,5,0
91213165,179,3911,12,12,7,7,3,5,12,12,0,3912,13,25,13,20,0,0,12.23,12.12,0,3921,12,37,3,23,3,9,4.67,9.7,0,3922,14,51,2,25,0,12,9.76,9.72,1,Male,No,1371,91,5,1
91213181,180,3911,17,17,10,10,0,7,17.01,17.01,0,3912,17,34,9,19,0,8,14.97,16.04,0,3921,16,50,2,21,0,14,19,16.33,0,3931,16,85,16,37,0,0,14.58,15.57,0,Male,Yes,1373,91,1,0
91219010,181,3911,14,14,5,5,0,9,19,19,0,3912,16,30,7,12,0,9,17.86,18.33,0,3921,14,44,14,26,0,0,17.04,17.63,0,3922,16,60,13,39,3,3,13.35,16,0,Male,No,1372,91,2,0
92213010,182,3921,15,15,8,8,0,7,12.17,15.75,0,3922,16,31,16,24,0,0,14.84,15.14,0,3931,19,50,19,43,0,0,15.03,15.09,0,3932,14,64,8,51,3,6,12.68,14.78,0,Female,No,1371,92,5,0
92213018,183,3921,18,18,18,18,0,0,14.29,14.29,0,3922,17,35,8,26,0,9,10.54,13.34,1,3931,14,55,11,43,0,3,10.96,12.97,1,3932,14,69,14,57,2,0,13.04,12.99,0,Male,Yes,1374,92,1,2
92213020,184,3921,18,18,15,15,0,3,14.6,15.62,0,3922,15,33,9,24,3,6,13.45,15.15,0,3931,14,50,14,41,0,0,14.27,14.82,0,3932,16,66,16,57,2,0,13.45,14.46,0,Male,No,1374,92,2,0
92213024,185,3921,20,20,20,20,0,0,16.66,16.66,0,3922,16,36,10,30,0,6,11.89,15.75,1,3931,14,53,14,47,1,0,19.19,16.92,0,3932,18,71,18,65,0,0,13.93,16.09,0,Female,No,1374,92,2,1
92213027,186,3921,20,20,12,12,0,8,12.41,12.69,0,3922,18,38,14,26,0,4,10.66,11.71,1,3931,14,52,8,34,0,6,11.09,11.54,1,3932,11,63,5,39,3,6,10.93,11.43,0,Male,Yes,1374,92,1,2
92213032,187,3921,18,18,18,18,0,0,17.92,17.92,0,3922,19,37,19,37,0,0,15.08,16.46,0,3931,16,53,16,53,0,0,17.56,16.79,0,3932,16,69,16,69,3,0,16.98,16.84,0,Male,No,1374,92,1,0
92213034,188,3921,18,18,18,18,0,0,14.46,14.46,0,3922,17,35,8,26,0,9,11.31,13.27,1,3931,14,55,11,40,0,3,13.04,12.89,0,3932,16,71,10,50,0,6,10.52,12.53,1,Male,Yes,1373,92,1,2
92213037,189,3921,18,18,18,18,0,0,17.94,17.94,0,3922,18,36,18,36,0,0,16.9,17.42,0,3931,17,53,17,53,0,0,14.45,16.47,0,3932,16,69,16,69,0,0,17.27,16.66,0,Male,No,1374,92,3,0
92213038,190,3921,18,18,15,15,0,3,15.6,17.12,0,3922,16,34,16,31,2,0,17.02,17.06,0,3931,17,51,17,48,0,0,14.75,16.25,0,3932,17,68,17,65,0,0,15.49,16.05,0,Female,Yes,1373,92,1,0
92213044,191,3921,18,18,18,18,0,0,17.86,17.86,0,3922,16,34,13,31,0,3,16.7,18.04,0,3931,18,52,18,49,0,0,18,18.03,0,3932,16,68,16,65,0,0,17.51,17.9,0,Female,No,1373,92,2,0
92213046,192,3921,18,18,18,18,0,0,14.28,14.28,0,3922,15,33,13,31,3,2,13.02,14.01,0,3931,18,51,18,49,0,0,14.33,14.13,0,3932,16,67,10,59,2,6,13.22,14.41,0,Female,Yes,1374,92,1,0
92213050,193,3921,18,18,18,18,0,0,17.08,17.08,0,3922,17,35,14,32,3,3,13.95,15.56,0,3931,17,52,14,46,0,3,12.54,14.57,0,3932,14,66,8,54,2,6,12.02,14.03,0,Male,No,1373,92,2,0
92213051,194,3921,18,18,15,15,0,3,16.68,16.68,0,3922,18,36,18,33,0,0,16.93,16.81,0,3931,16,52,16,49,0,0,18.41,17.3,0,3932,16,68,16,65,0,0,17.69,17.39,0,Male,Yes,1373,92,1,0
92213052,195,3921,18,18,18,18,0,0,17.57,17.57,0,3922,18,36,15,33,0,3,13.04,15.31,0,3931,16,52,13,46,0,3,13,14.6,0,3932,15,67,15,61,0,0,14.9,14.66,0,Male,Yes,1374,92,2,0
92213055,196,3921,19,19,19,19,0,0,18.11,18.11,0,3922,19,38,19,38,0,0,15.39,16.75,0,3931,19,57,19,57,0,0,15.4,16.3,0,3932,16,73,16,73,0,0,15.54,16.13,0,Male,No,1374,92,2,0
92213061,197,3921,18,18,18,18,0,0,15.49,15.49,0,3922,16,34,16,34,0,0,15.85,15.66,0,3931,18,52,18,52,0,0,15.88,15.73,0,3932,16,68,16,68,0,0,16.72,15.97,0,Male,No,1373,92,2,0
92213063,198,3921,18,18,18,18,0,0,16.84,16.84,0,3922,18,36,18,36,0,0,16.15,16.5,0,3931,17,53,17,53,0,0,16.85,16.61,0,3932,15,68,15,68,0,0,15.72,16.41,0,Female,Yes,1373,92,1,0
92213065,199,3921,18,18,18,18,0,0,16.22,16.22,0,3922,17,35,17,35,0,0,13.43,14.86,0,3931,17,52,14,49,0,3,11.62,14.1,1,3932,14,66,11,60,0,3,12.08,13.65,0,Male,No,1374,92,3,1
92213067,200,3921,20,20,17,17,0,3,12.12,12.12,0,3922,15,35,2,19,1,13,8.44,11.17,1,3931,14,55,11,36,0,3,13.07,12.41,0,3932,15,70,9,45,2,6,13.53,12.67,0,Female,Yes,1374,92,1,1
92213069,201,3921,18,18,18,18,0,0,15.86,15.86,0,3922,17,35,8,26,2,9,10.65,15.29,1,3931,14,55,14,46,0,0,14.88,15.32,0,3932,14,69,14,60,0,0,14.79,15.2,0,Male,No,1374,92,2,1
92213070,202,3921,18,18,18,18,0,0,15.99,15.99,0,3922,16,34,10,28,0,6,11.22,15.03,1,3931,14,51,14,45,0,0,15.71,15.45,0,3932,15,66,12,57,3,3,15.8,15.54,0,Female,Yes,1374,92,1,1
92213072,203,3921,18,18,18,18,0,0,16.53,16.53,0,3922,16,34,16,34,0,0,16.18,16.37,0,3931,18,52,18,52,0,0,16.61,16.45,0,3932,14,66,14,66,0,0,15.91,16.34,0,Female,Yes,1373,92,1,0
92213078,204,3921,18,18,18,18,0,0,17.09,17.09,0,3922,16,34,13,31,0,3,14.38,16.57,0,3931,17,54,17,51,0,0,18,17.25,0,3932,14,68,14,65,0,0,18.11,17.43,0,Female,No,1373,92,3,0
92213082,205,3921,20,20,20,20,0,0,17.81,17.81,0,3922,15,35,15,35,3,0,17.98,17.89,0,3931,18,53,16,51,0,2,13.68,16.46,0,3932,15,68,9,60,0,6,12.41,15.56,0,Female,Yes,1373,92,1,0
92213086,206,3921,18,18,15,15,0,3,11.94,11.94,1,3922,14,32,9,24,4,5,11.57,11.78,1,3931,14,52,14,44,0,0,13.04,12.34,0,3932,14,66,11,55,3,3,13.54,12.6,0,Female,Yes,1373,92,1,2
92213095,207,3921,20,20,20,20,0,0,16.65,16.65,0,3922,14,34,14,34,3,0,15.52,16.18,0,3931,19,57,16,54,0,3,14.77,16.16,0,3932,15,72,15,69,0,0,16.53,16.24,0,Female,Yes,1373,92,1,0
92213096,208,3921,20,20,20,20,0,0,17.05,17.05,0,3922,16,36,16,36,0,0,17.47,17.24,0,3931,18,54,18,54,0,0,18.07,17.51,0,3932,12,66,12,66,0,0,19.45,17.87,0,Female,Yes,1373,92,1,0
92213099,209,3921,18,18,15,15,0,3,16.04,17.45,0,3922,13,31,13,28,0,0,18,17.71,0,3931,14,45,14,42,3,0,18.97,18.13,0,3932,11,56,11,53,3,0,17.07,17.91,0,Female,Yes,1373,92,1,0
92213104,210,3921,17,17,17,17,0,0,17.47,17.47,0,3922,19,36,19,36,0,0,16.02,16.7,0,3931,20,56,20,56,0,0,16.82,16.74,0,3932,17,73,14,70,0,3,16.28,16.64,0,Male,No,1373,92,2,0
92213105,211,3921,18,18,18,18,0,0,15.26,15.26,0,3922,17,35,5,23,0,12,9.18,14.69,1,3931,14,55,14,43,0,0,16.17,15.23,0,3932,16,71,16,59,0,0,12.04,14.36,0,Female,Yes,1374,92,1,1
92213111,212,3921,18,18,18,18,0,0,17.1,17.1,0,3922,17,35,17,35,0,0,17.11,17.1,0,3931,15,50,12,47,0,3,13.87,16.59,0,3932,18,68,18,65,0,0,14.57,16.03,0,Male,No,1374,92,2,0
92213114,213,3921,18,18,18,18,0,0,18.6,18.6,0,3922,16,34,16,34,0,0,16.93,17.81,0,3931,18,52,18,52,0,0,19.81,18.5,0,3932,16,68,16,68,0,0,18.64,18.53,0,Female,Yes,1374,92,1,0
92213117,214,3921,19,19,19,19,0,0,16.54,16.54,0,3922,17,36,17,36,0,0,18.03,17.24,0,3931,15,51,15,51,3,0,16.02,16.88,0,3932,18,69,18,69,0,0,18.5,17.31,0,Male,Yes,1372,92,1,0
92213118,215,3921,18,18,18,18,0,0,15.99,15.99,0,3922,15,33,15,33,3,0,13.04,14.65,0,3931,16,52,13,49,0,3,12.02,13.92,0,3932,13,65,13,62,3,0,14.24,13.98,0,Male,Yes,1374,92,1,0
92213122,216,3921,20,20,20,20,0,0,12.79,12.79,0,3922,16,36,1,21,0,15,8.11,10.71,1,3931,14,56,8,35,0,6,11.43,11.26,1,3932,14,70,11,46,0,3,12.96,11.62,0,Female,Yes,1373,92,1,2
92213125,217,3921,18,18,18,18,0,0,14.42,14.42,0,3922,16,34,16,34,0,0,14.31,14.37,0,3931,14,48,14,48,0,0,16.23,14.91,0,3932,15,63,15,63,0,0,14.43,14.8,0,Female,Yes,1373,92,3,0
92213127,218,3921,18,18,18,18,0,0,17.04,17.04,0,3922,20,38,20,38,0,0,14.95,15.94,0,3931,17,55,17,55,0,0,15.66,15.85,0,3932,17,72,17,72,0,0,14.45,15.52,0,Male,No,1373,92,2,0
92213130,219,3921,18,18,18,18,0,0,17.71,17.71,0,3922,19,37,16,34,0,3,15.37,17.26,0,3931,16,53,16,50,0,0,15.33,16.64,0,3932,14,67,11,61,0,3,14.75,16.23,0,Male,No,1373,92,2,0
92213131,220,3921,18,18,18,18,0,0,17.93,17.93,0,3922,18,36,15,33,0,3,14.69,16.31,0,3931,19,55,19,52,0,0,16.35,16.32,0,3932,14,69,14,66,3,0,16.49,16.36,0,Male,No,1373,92,2,0
92213137,221,3921,20,20,20,20,0,0,16.65,16.65,0,3922,16,36,16,36,0,0,15.6,16.18,0,3931,17,53,17,53,0,0,16.26,16.21,0,3932,15,68,15,68,0,0,14.6,15.86,0,Female,No,1374,92,2,0
92213140,222,3921,18,18,18,18,0,0,17.39,17.39,0,3922,16,34,16,34,0,0,14.43,15.99,0,3931,15,49,15,49,3,0,18.04,16.62,0,3932,17,66,17,66,0,0,16.49,16.59,0,Female,Yes,1373,92,1,0
92213144,223,3921,20,20,20,20,0,0,16.78,16.78,0,3922,15,35,15,35,0,0,17,16.87,0,3931,18,53,18,53,0,0,17.53,17.1,0,3932,14,67,14,67,0,0,15.81,16.83,0,Female,No,1374,92,2,0
92213145,224,3921,18,18,18,18,0,0,17.03,17.03,0,3922,16,34,16,34,0,0,17.26,17.14,0,3931,17,51,17,51,0,0,16.97,17.08,0,3932,16,67,16,67,0,0,18.81,17.49,0,Female,Yes,1373,92,2,0
92213149,225,3921,18,18,11,11,0,7,11.79,12.33,1,3922,14,32,11,22,4,3,12.62,13.1,0,3931,16,53,13,40,0,3,12.76,13.2,0,3932,15,68,12,52,0,3,12.92,13.13,0,Male,No,1373,92,2,1
92213150,226,3921,18,18,18,18,0,0,14.31,14.31,0,3922,15,33,9,27,3,6,11.16,12.88,1,3931,14,53,11,44,0,3,11.39,12.57,1,3932,14,67,14,58,0,0,15.59,13.23,0,Male,Yes,1373,92,1,2
92213151,227,3921,18,18,18,18,0,0,15.83,15.83,0,3922,17,35,17,35,0,0,13.62,14.76,0,3931,17,52,17,52,0,0,14.28,14.6,0,3932,17,69,11,63,0,6,12.63,14.12,0,Female,No,1373,92,2,0
92213152,228,3921,18,18,18,18,0,0,15.87,15.87,0,3922,17,35,14,32,0,3,12.87,14.85,0,3931,16,54,16,51,0,0,13.78,14.64,0,3932,17,71,14,65,0,3,14.69,14.65,0,Male,No,1373,92,2,0
92213155,229,3921,18,18,14,14,0,4,14.81,16.46,0,3922,15,33,15,29,0,0,16.66,16.57,0,3931,15,48,15,44,0,0,17.34,16.83,0,3932,17,65,14,58,0,3,13.68,15.95,0,Female,Yes,1373,92,1,0
92213160,230,3921,18,18,15,15,0,3,12.07,12.07,0,3922,14,32,14,29,3,0,12.34,12.19,0,3931,14,46,11,40,0,3,12.39,12.25,0,3941,15,67,9,49,3,6,10.9,11.52,1,Male,Yes,1374,92,1,1
92213165,231,3921,18,18,14,14,0,4,12.33,12.9,0,3922,18,36,15,29,0,3,12.57,12.72,0,3931,14,50,14,43,3,0,12.65,12.7,0,3932,15,65,9,52,0,6,12.1,12.76,0,Male,Yes,1373,92,1,0
92213170,232,3921,18,18,18,18,0,0,15.47,15.47,0,3922,16,34,13,31,0,3,13.21,14.41,0,3931,17,51,14,45,0,3,13,14.19,0,3932,18,69,12,57,0,6,12.95,13.85,0,Female,Yes,1374,92,1,0
92213172,233,3921,18,18,18,18,0,0,15.14,15.14,0,3922,18,36,18,36,0,0,14.59,14.86,0,3931,19,55,16,52,0,3,14.69,14.8,0,3932,17,72,14,66,0,3,14.05,14.93,0,Male,No,1374,92,2,0
92213173,234,3921,18,18,18,18,0,0,17.86,17.86,0,3922,16,34,16,34,0,0,16.9,17.41,0,3931,18,56,18,56,0,0,18,17.53,0,3932,16,72,16,72,0,0,18.83,17.82,0,Female,Yes,1374,92,1,0
92213188,235,3921,18,18,7,7,0,11,11.38,11.38,1,3922,14,32,11,18,0,3,12.24,11.75,0,3931,17,49,17,35,0,0,14.6,12.74,0,3932,16,65,10,45,0,6,12.21,12.61,0,Male,Yes,1374,92,1,1
92213189,236,3921,18,18,18,18,0,0,14.96,14.96,0,3922,15,33,15,33,0,0,15.81,15.35,0,3931,18,51,18,51,0,0,16.22,15.66,0,3932,15,66,15,66,0,0,15.39,15.59,0,Female,No,1373,92,3,0
92213191,237,3921,18,18,18,18,0,0,16.03,16.03,0,3922,18,36,18,36,0,0,14.93,15.48,0,3931,19,55,19,55,0,0,16.59,15.86,0,3932,14,69,14,69,0,0,14.57,15.6,0,Female,No,1374,92,2,0
92213192,238,3921,20,20,17,17,0,3,16.65,18.09,0,3922,15,35,12,29,0,3,12.54,15.49,0,3931,14,55,11,46,0,3,11.52,14.34,1,3932,14,69,11,57,0,3,15.61,14.62,0,Female,Yes,1374,92,1,1
92213193,239,3921,18,18,18,18,0,0,15.96,15.96,0,3922,17,35,17,35,0,0,13.82,14.92,0,3931,17,52,17,52,0,0,15.93,15.25,0,3932,17,69,17,69,0,0,14.83,15.15,0,Male,No,1374,92,2,0
92213198,240,3921,18,18,18,18,0,0,16.67,16.67,0,3922,17,35,17,35,0,0,15.07,15.89,0,3931,16,51,16,51,0,0,14.78,15.54,0,3932,17,68,14,65,0,3,13.3,14.98,0,Male,Yes,1373,92,1,0
92213203,241,3921,18,18,18,18,0,0,16.51,16.51,0,3922,17,35,17,35,0,0,14.9,15.73,0,3931,18,53,18,53,0,0,17.23,16.24,0,3932,18,71,18,71,0,0,17.19,16.48,0,Male,No,1374,92,2,0
92213205,242,3921,18,18,18,18,0,0,16.42,16.42,0,3922,17,35,17,35,0,0,16.9,16.65,0,3931,16,51,16,51,0,0,17.11,16.79,0,3932,17,68,17,68,0,0,18.05,17.11,0,Male,Yes,1374,92,1,0
92213212,243,3921,17,17,15,15,0,2,14.91,15.83,0,3922,15,32,15,30,0,0,14.71,15.27,0,3931,18,50,15,45,0,3,14.7,15.49,0,3932,14,64,14,59,3,0,16.45,15.72,0,Female,Yes,1374,92,2,0
92213216,244,3921,18,18,18,18,0,0,16.4,16.4,0,3922,16,34,16,34,0,0,14.62,15.56,0,3931,18,52,15,49,1,3,13.46,14.84,0,3932,16,68,16,65,0,0,16.02,15.11,0,Female,No,1373,92,2,0
92213219,245,3921,18,18,18,18,0,0,15.01,15.01,0,3922,17,35,11,29,0,6,11.52,13.32,1,3931,14,49,8,37,0,6,10.86,12.61,1,3941,14,63,8,45,0,6,12.01,12.48,0,Male,Yes,1374,92,1,2
92213226,246,3921,18,18,18,18,0,0,15.83,15.83,0,3922,18,36,12,30,0,6,11.45,13.64,1,3931,14,50,14,44,0,0,12.66,13.37,0,3932,15,65,9,53,3,6,12.68,13.21,0,Male,No,1374,92,2,1
92213228,247,3921,18,18,13,13,0,5,11.74,11.74,1,3922,14,32,11,24,0,3,12.05,11.87,0,3931,17,49,14,38,3,3,13.54,12.45,0,3932,15,64,12,50,0,3,12,12.35,0,Male,Yes,1373,92,5,1
92213229,248,3921,18,18,10,10,0,8,13.68,17.61,0,3922,14,32,14,24,0,0,16.63,17.06,0,3931,14,46,11,35,0,3,13.67,16.42,0,3932,15,61,12,47,3,3,12.25,15.19,0,Female,Yes,1373,92,1,0
92213230,249,3921,18,18,10,10,0,8,12.06,12.93,0,3922,16,34,13,23,0,3,13.81,13.4,0,3931,14,51,11,37,2,3,14.45,13.56,0,3932,14,65,8,45,0,6,14.18,13.89,0,Male,Yes,1373,92,1,0
92213235,250,3921,18,18,9,9,0,9,9.97,9.97,1,3922,14,32,14,23,0,0,14.27,11.85,0,3931,14,46,11,34,3,3,15.34,12.91,0,3932,14,60,5,39,3,9,9.34,12.08,1,Male,Yes,1373,92,1,2
92213238,251,3921,18,18,11,11,0,7,14.02,15.2,0,3922,14,32,14,25,0,0,15.58,15.39,0,3931,15,47,15,40,0,0,17.64,16.17,0,3932,14,61,8,48,0,6,13.27,16.26,0,Female,Yes,1373,92,1,0
92213244,252,3921,18,18,13,13,0,5,12.67,12.67,0,3922,14,32,11,24,0,3,14.04,13.27,0,3931,17,49,9,33,0,8,10.46,12.29,1,3941,14,63,5,38,0,9,8.93,11.55,1,Male,Yes,1373,92,1,2
92213250,253,3921,18,18,13,13,0,1,13.73,13.73,0,3922,12,30,12,25,6,0,15.34,14.48,0,3931,15,45,15,40,0,0,15.23,14.75,0,3932,16,61,10,50,0,3,14.27,14.64,0,Male,Yes,1369,92,5,0
92213252,254,3921,14,14,14,14,0,0,16.3,16.3,0,3922,16,30,16,30,0,0,14.83,15.52,0,3931,17,47,17,47,0,0,17.96,16.4,0,3932,14,61,14,61,3,0,15.68,16.24,0,Female,Yes,1374,92,5,0
92213260,255,3921,15,15,12,12,0,3,14.58,15.88,0,3922,15,30,15,27,0,0,14.89,15.33,0,3931,16,46,16,43,0,0,16.69,15.83,0,3932,16,62,16,59,0,0,16.31,15.96,0,Female,Yes,1374,92,2,0
92213266,256,3922,16,16,13,13,0,3,13.59,13.59,0,3931,17,36,17,33,0,0,16.61,15.39,0,3932,15,51,12,45,0,3,12.57,14.56,0,3941,17,68,17,62,0,0,17.58,15.31,0,Male,Yes,1373,92,1,0
92213269,257,3921,15,15,6,6,0,9,17.25,17.25,0,3922,15,30,12,18,4,3,12.07,14.22,0,3931,14,44,14,32,0,0,14.43,14.31,0,3932,14,58,14,46,0,0,15.11,14.55,0,Male,Yes,1373,92,1,0
92213281,258,3921,15,15,15,15,0,0,14.93,14.93,0,3922,20,35,20,35,0,0,16.54,15.85,0,3931,19,54,19,54,0,0,17.62,16.47,0,3932,16,70,16,70,0,0,16.25,16.42,0,Female,Yes,1374,92,1,0
92213282,259,3921,17,17,11,11,0,6,14.73,16.09,0,3922,12,29,7,18,1,5,18.86,17.17,0,3931,14,43,7,25,0,5,14.19,17.57,0,3932,13,56,7,32,0,6,12.5,16.42,0,Male,Yes,1373,92,1,0
92213283,260,3931,11,11,11,11,0,0,15.77,15.77,0,3932,17,28,17,28,0,0,15.05,15.34,0,3941,9,37,6,34,0,3,12.36,14.61,0,3942,14,51,14,48,0,0,16.59,15.15,0,Male,Yes,1375,92,1,0
92243003,261,3921,17,17,10,10,0,7,13.14,13.14,0,3922,16,33,7,17,0,9,14.77,13.81,0,3941,15,48,15,32,0,0,18.38,15.95,0,3942,20,68,17,49,0,3,12.12,14.48,0,Male,Yes,1373,92,4,0
93213002,262,3931,17,17,14,14,0,3,11.48,12.55,1,3932,14,31,14,28,1,0,14.23,13.39,0,3941,15,49,12,43,0,3,13.75,13.96,0,3942,16,65,16,59,3,0,15.85,14.48,0,Female,Yes,1375,93,5,1
93213003,263,3931,17,17,10,10,0,7,12.56,12.56,0,3932,16,33,14,24,0,0,10.31,12.21,1,3941,14,47,8,32,0,6,12,12.14,0,3951,16,63,7,39,0,3,10.41,12.06,1,Male,Yes,1373,93,5,2
93213010,264,3931,17,17,17,17,0,0,17.53,17.53,0,3932,17,34,17,34,0,0,16.56,17.04,0,3941,16,50,16,50,0,0,17.25,17.11,0,3942,20,70,20,70,0,0,17.55,17.23,0,Female,No,1374,93,2,0
93213013,265,3931,20,20,20,20,0,0,16.58,16.58,0,3932,14,34,13,33,3,1,15.15,15.99,0,3941,16,50,13,46,3,3,13.46,15.59,0,3942,12,62,12,58,2,0,14.67,15.4,0,Male,Yes,1374,93,1,0
93213017,266,3931,17,17,11,11,0,6,13.09,15.32,0,3932,20,37,14,25,0,6,10.79,12.87,1,3941,14,51,14,39,0,0,13.8,13.18,0,3942,15,66,9,48,3,6,12.43,13.42,0,Male,Yes,1374,93,1,1
93213019,267,3931,17,17,17,17,0,0,16.53,16.53,0,3932,20,37,20,37,0,0,16.42,16.47,0,3941,20,57,20,57,0,0,17.26,16.75,0,3942,18,75,18,75,0,0,18.42,17.15,0,Female,No,1375,93,1,0
93213023,268,3931,17,17,17,17,0,0,15.15,15.15,0,3932,16,33,16,33,2,0,12.7,13.96,0,3941,12,45,3,36,3,9,10.13,13.29,1,3942,14,59,5,41,0,9,11.16,13.2,1,Male,No,1375,93,2,2
93213025,269,3931,17,17,17,17,0,0,14.35,14.35,0,3932,17,34,17,34,0,0,15.1,14.73,0,3941,16,50,16,50,0,0,16.78,15.38,0,3942,15,65,15,65,3,0,17.05,15.77,0,Female,Yes,1375,93,2,0
93213030,270,3931,17,17,17,17,0,0,12.65,12.65,0,3932,14,31,2,19,0,12,6.43,9.84,1,3941,14,45,8,27,0,6,11.86,10.47,1,3951,3,51,0,27,11,3,9.99,10.38,0,Female,No,1374,93,2,2
93213039,271,3931,17,17,17,17,0,0,14,14,0,3932,17,34,14,31,0,3,11.72,13.33,1,3941,14,51,14,48,0,0,14.48,13.91,0,3942,14,65,14,62,0,0,14.74,14.1,0,Male,Yes,1374,93,1,1
93213040,272,3931,17,17,17,17,0,0,14.66,14.66,0,3932,14,31,14,31,3,0,16.64,15.55,0,3941,17,48,17,48,0,0,15.24,15.44,0,3942,17,65,17,65,0,0,14.05,15.08,0,Female,Yes,1375,93,1,0
93213047,273,3931,17,17,17,17,1,0,15.35,15.35,0,3932,14,31,14,31,3,0,14.2,14.83,0,3941,14,45,8,39,0,6,11.56,14.52,1,3942,14,59,14,53,0,0,13.62,14.28,0,Male,Yes,1375,93,1,1
93213063,274,3931,17,17,17,17,0,0,17.53,17.53,0,3932,17,34,17,34,0,0,16.46,16.99,0,3941,15,49,15,49,0,0,17.43,17.13,0,3942,18,67,18,67,0,0,16.42,16.94,0,Male,No,1374,93,2,0
93213066,275,3931,17,17,17,17,0,0,16.78,16.78,0,3932,17,34,17,34,0,0,15.91,16.35,0,3941,16,50,16,50,0,0,17.78,16.81,0,3942,15,65,15,65,3,0,17.58,16.98,0,Female,Yes,1374,93,1,0
93213068,276,3931,17,17,15,15,0,2,13.43,14.42,0,3932,17,34,14,29,0,3,13.03,14.17,0,3941,16,53,13,45,0,3,15.26,15.13,0,3942,14,67,14,59,0,0,17.72,15.74,0,Male,Yes,1374,93,1,0
93213069,277,3931,17,17,14,14,0,3,13.85,15.32,0,3932,20,37,20,34,0,0,14.93,15.09,0,3941,17,54,14,48,0,3,13.49,14.55,0,3942,19,73,13,61,0,6,11.67,13.96,1,Male,No,1374,93,3,1
93213072,278,3931,18,18,9,9,0,9,13.15,16.1,0,3932,16,34,13,22,0,3,13.98,14.89,0,3941,17,54,14,39,0,3,12.12,13.79,0,3942,16,70,13,52,3,3,14.08,14.25,0,Male,No,1374,93,3,0
93213075,279,3931,18,18,18,18,0,0,16.99,16.99,0,3932,19,37,19,37,0,0,16.72,16.85,0,3941,17,54,14,51,0,3,13.46,16.32,0,3942,16,70,16,67,0,0,17.25,16.54,0,Female,No,1374,93,2,0
93213076,280,3931,17,17,17,17,0,0,16.76,16.76,0,3932,18,35,18,35,0,0,13.9,15.29,0,3941,19,54,16,51,0,3,13.78,14.76,0,3942,18,72,15,66,0,3,12.81,14.27,0,Male,No,1374,93,2,0
93213081,281,3931,17,17,17,17,0,0,14.04,14.04,0,3932,20,37,11,28,0,9,11.28,13.23,1,3941,14,54,11,42,0,3,13.61,13.33,0,3942,16,70,13,55,3,3,13.44,13.67,0,Male,Yes,1375,93,1,1
93213086,282,3931,17,17,13,13,0,4,12.68,13.58,0,3932,17,34,17,30,0,0,13.66,13.63,0,3941,20,54,17,47,0,3,11.88,12.93,1,3942,14,68,14,61,5,0,14.77,13.33,0,Male,Yes,1375,93,3,1
93213087,283,3931,18,18,18,18,0,0,16.11,16.11,0,3932,18,36,18,36,0,0,14.41,15.26,0,3941,17,53,17,53,0,0,16.98,15.81,0,3942,14,67,14,67,0,0,17.66,16.2,0,Female,Yes,1375,93,2,0
93213088,284,3931,17,17,14,14,0,3,13.79,15.04,0,3932,16,33,13,27,0,3,12.86,13.88,0,3941,18,51,15,42,0,3,13.04,13.93,0,3942,14,65,8,50,3,6,12.24,13.85,0,Male,Yes,1375,93,2,0
93213089,285,3931,17,17,17,17,0,0,16.09,16.09,0,3932,17,34,14,31,0,3,14.47,15.89,0,3941,16,53,13,47,0,3,15.69,16.27,0,3942,14,67,14,61,3,0,17.17,16.48,0,Female,Yes,1374,93,1,0
93213090,286,3931,17,17,17,17,0,0,17.21,17.21,0,3932,14,31,14,31,0,0,17.84,17.49,0,3941,17,48,17,48,0,0,17.12,17.36,0,3942,17,65,14,62,0,3,15.6,17.26,0,Male,Yes,1375,93,2,0
93213096,287,3931,18,18,18,18,0,0,17.83,17.83,0,3932,22,40,22,40,0,0,18.13,17.99,0,3941,16,56,16,56,2,0,19.62,18.46,0,3942,14,70,14,70,0,0,18.32,18.43,0,Female,Yes,1375,93,1,0
93213100,288,3931,17,17,5,5,0,12,10.72,13.92,1,3932,13,30,13,18,0,0,14.08,14.01,0,3941,14,44,14,32,0,0,14.13,14.06,0,3942,14,58,11,43,6,3,11.76,13.67,1,Female,Yes,1374,93,1,2
93213101,289,3931,18,18,15,15,0,3,11.79,12.75,1,3932,14,32,11,26,1,3,12.8,13.21,0,3941,16,48,16,42,0,0,14.07,13.54,0,3942,20,68,17,59,0,3,15.46,14.4,0,Female,No,1374,93,3,1
93213103,290,3931,17,17,13,13,0,4,10.91,11.32,1,3932,14,31,11,24,0,3,12.96,12.52,0,3941,18,49,18,42,0,0,15.56,13.79,0,3942,18,67,18,60,0,0,13.94,13.83,0,Male,No,1375,93,3,1
93213109,291,3931,17,17,14,14,0,3,15.6,17.45,0,3932,14,31,14,28,3,0,15.54,16.49,0,3941,14,45,14,42,3,0,17.94,16.98,0,3942,11,56,11,53,6,0,17.36,17.06,0,Female,No,1375,93,2,0
93213111,292,3931,17,17,14,14,1,3,14.72,15.95,0,3932,19,36,19,33,0,0,13.76,14.69,0,3941,20,56,17,50,0,3,14.98,15.18,0,3942,20,76,20,70,0,0,14.89,15.09,0,Male,No,1374,93,2,0
93213112,293,3931,17,17,17,17,0,0,14.4,14.4,0,3932,14,31,14,31,3,0,14.29,14.35,0,3941,14,45,14,45,0,0,16.05,14.88,0,3942,17,62,14,59,0,3,13,14.36,0,Male,Yes,1375,93,1,0
93213115,294,3931,17,17,14,14,0,3,12.46,13.2,0,3932,15,32,12,26,0,3,11.47,12.92,1,3941,14,49,11,40,0,3,13.8,13.41,0,3942,17,66,14,54,0,3,12.54,13.52,0,Male,Yes,1375,93,4,1
93213116,295,3931,17,17,10,10,0,7,12.15,12.15,0,3941,14,31,8,18,0,6,10.77,11.53,1,3951,12,43,6,24,0,6,12.7,11.86,0,3971,13,56,13,37,0,0,13.39,12.21,0,Female,No,1374,93,2,1
93213117,296,3931,17,17,17,17,0,0,16.19,16.19,0,3932,16,33,13,30,2,3,12.03,14.17,0,3941,12,48,10,43,3,2,10.67,13.22,1,3942,11,59,11,54,3,0,17.03,13.93,0,Male,No,1375,93,2,1
93213118,297,3931,17,17,14,14,0,3,12.65,13.54,0,3932,16,33,13,27,0,3,12.09,13.19,0,3941,11,44,11,38,4,0,13.45,13.26,0,3942,20,64,20,58,0,0,12.94,13.15,0,Male,No,1373,93,3,0
93213124,298,3931,17,17,17,17,0,0,18.5,18.5,0,3932,18,35,18,35,0,0,17.71,18.09,0,3941,18,53,18,53,0,0,17.63,17.94,0,3942,18,71,18,71,0,0,17.41,17.8,0,Male,Yes,1375,93,1,0
93213125,299,3931,18,18,18,18,0,0,18.28,18.28,0,3932,18,36,18,36,0,0,18.64,18.46,0,3941,17,53,17,53,0,0,18.88,18.6,0,3942,14,67,14,67,0,0,14.24,17.69,0,Female,Yes,1375,93,1,0
93213126,300,3931,17,17,14,14,0,3,13.63,14.84,0,3932,19,36,19,33,0,0,14.87,14.86,0,3941,15,51,15,48,3,0,15.12,14.94,0,3942,18,69,15,63,0,3,14.44,15.04,0,Male,No,1375,93,2,0
93213128,301,3931,18,18,18,18,0,0,16.14,16.14,0,3932,19,37,19,37,0,0,16.16,16.15,0,3941,20,57,17,54,0,3,15.6,16.29,0,3942,16,73,16,70,0,0,16.13,16.25,0,Female,Yes,1375,93,1,0
93213129,302,3931,17,17,14,14,0,3,14.56,15.64,0,3932,18,35,12,26,0,6,11.42,13.66,1,3941,14,49,11,37,0,3,12.49,13.27,0,3942,16,65,13,50,0,3,12.69,13.39,0,Male,Yes,1375,93,1,1
93213131,303,3931,10,10,3,3,0,7,9,9,0,3932,10,20,7,10,0,3,10.7,9.85,0,3941,5,31,2,15,9,3,9.9,10.27,0,3942,14,45,4,19,0,10,9.35,9.99,1,Male,Yes,1375,93,4,1
93213133,304,3931,17,17,17,17,0,0,18.94,18.94,0,3932,13,30,13,30,3,0,18.25,18.64,0,3941,21,51,21,51,0,0,19.6,19.03,0,3942,16,67,16,67,0,0,17.9,18.76,0,Female,Yes,1375,93,1,0
93213139,305,3931,17,17,17,17,0,0,14.46,14.46,0,3932,17,34,17,34,0,0,16.28,15.37,0,3941,16,50,16,50,0,0,18.29,16.3,0,3942,11,61,11,61,3,0,16.82,16.4,0,Female,Yes,1375,93,1,0
93213142,306,3931,17,17,17,17,0,0,15.09,15.09,0,3932,16,33,16,33,0,0,14.59,14.85,0,3941,15,48,9,42,0,6,12.69,14.83,0,3942,19,67,19,61,0,0,15.8,15.14,0,Male,Yes,1375,93,1,0
93213148,307,3931,17,17,14,14,0,3,13.94,15.21,0,3932,17,34,17,31,3,0,14.97,15.08,0,3941,13,50,13,47,3,0,14.44,14.71,0,3942,11,61,11,58,5,0,15.82,14.92,0,Male,No,1375,93,2,0
93213150,308,3931,17,17,8,8,0,9,11.09,14.38,1,3932,14,31,11,19,0,3,13.54,13.84,0,3941,12,43,6,25,6,6,12.44,13.77,0,3942,14,57,11,36,3,3,12.3,13.31,0,Male,No,1374,93,4,1
93213154,309,3931,17,17,17,17,0,0,17.46,17.46,0,3932,20,37,20,37,0,0,18.65,18.1,0,3941,20,57,20,57,0,0,16.8,17.64,0,3942,15,72,15,72,0,0,18.14,17.75,0,Male,Yes,1375,93,1,0
93213162,310,3931,17,17,7,7,0,10,11.1,13.42,1,3932,13,30,10,17,5,3,10.73,12.48,1,3941,14,44,14,31,0,0,15.09,13.56,0,3942,16,60,10,41,0,6,11.81,13.53,1,Female,No,1374,93,4,3
93213164,311,3931,18,18,15,15,0,3,14.32,15.58,0,3932,16,34,16,31,0,0,12.68,14.09,0,3941,14,48,14,45,3,0,14.5,14.21,0,3942,17,65,17,62,3,0,14.99,14.43,0,Male,Yes,1375,93,1,0
93213165,312,3931,17,17,14,14,0,3,13.68,14.68,0,3932,16,33,10,24,0,6,12.39,14.51,0,3941,15,54,12,42,3,3,14.63,15.02,0,3942,17,71,14,56,3,3,13.62,14.88,0,Female,Yes,1375,93,1,0
93213167,313,3931,17,17,14,14,0,3,14.97,16.25,0,3932,18,35,15,29,0,3,12.39,14.6,0,3941,12,50,9,41,0,3,13.55,14.74,0,3942,15,65,15,56,3,0,15.21,14.87,0,Female,Yes,1375,93,1,0
93213170,314,3931,17,17,14,14,0,3,13.84,14.88,0,3932,16,33,16,30,0,0,14.71,14.79,0,3941,15,48,12,42,0,3,11.27,13.96,1,3942,14,62,8,50,0,6,12.21,13.78,0,Male,Yes,1374,93,2,1
93213172,315,3931,18,18,8,8,0,10,11.46,11.46,1,3932,14,32,14,22,0,0,18.43,14.51,0,3941,17,49,17,39,0,0,12.76,13.9,0,3942,17,66,11,50,0,6,12.7,13.59,0,Male,Yes,1375,93,1,1
93213174,316,3931,17,17,17,17,0,0,15.79,15.79,0,3932,18,35,18,35,0,0,15.63,15.7,0,3941,18,58,18,58,0,0,15.33,15.86,0,3942,15,73,12,70,0,3,13.34,15.34,0,Female,Yes,1375,93,1,0
93213175,317,3931,17,17,14,14,0,3,12.66,12.66,0,3932,16,33,10,24,0,6,11.12,11.91,1,3941,14,53,14,44,0,0,13.44,12.44,0,3942,14,67,14,58,0,0,13.29,12.62,0,Male,Yes,1375,93,1,1
93213177,318,3931,18,18,12,12,0,6,11.83,11.83,1,3932,14,32,11,23,0,3,12.53,12.14,0,3941,16,51,16,42,3,0,14.09,12.65,0,3942,14,65,11,53,3,3,12.04,12.52,0,Male,Yes,1374,93,1,1
93213179,319,3931,17,17,17,17,0,0,15.71,15.71,0,3932,15,32,8,25,3,7,10.67,13.34,1,3941,14,52,14,42,0,0,14.9,13.68,0,3942,13,65,10,52,4,3,12.59,13.46,0,Male,Yes,1374,93,1,1
93213185,320,3931,18,18,15,15,0,3,12.84,12.84,0,3932,17,35,17,32,0,0,13.26,13.04,0,3941,14,55,14,52,3,0,11,12.85,1,3942,13,68,13,65,0,0,15.6,13.37,0,Male,Yes,1374,93,5,1
93243004,321,3931,19,19,19,19,0,0,17.71,17.71,0,3932,16,35,16,35,2,0,16.19,17.02,0,3941,14,49,14,49,0,0,17.27,17.09,0,3942,15,64,15,64,3,0,17.58,17.2,0,Male,Yes,1374,93,1,0
93243005,322,3931,15,15,13,13,0,2,18.83,18.83,0,3932,17,32,15,28,0,2,18.4,18.6,0,3941,17,49,17,45,0,0,17.95,18.35,0,3942,20,69,20,65,0,0,16.98,17.93,0,Male,Yes,1374,93,1,0
94219027,323,3941,15,15,3,3,0,12,19,19,0,3942,15,30,3,6,0,12,15,17,0,3951,14,44,14,20,0,0,16.35,16.54,0,3952,16,60,16,36,0,0,13.46,15.17,0,Female,Yes,1375,94,1,0
94243003,324,3941,16,16,13,13,0,3,15.09,16.5,0,3942,18,34,18,31,2,0,16.04,16.24,0,3951,16,50,16,47,0,0,17.95,16.82,0,3952,18,68,18,65,0,0,18.91,17.4,0,Female,No,1375,94,2,0
94243004,325,3941,16,16,16,16,0,0,17.94,17.94,0,3942,18,34,18,34,0,0,17.92,17.93,0,3951,19,53,19,53,0,0,16.54,17.43,0,3952,17,70,17,70,0,0,18.16,17.61,0,Male,No,1375,94,1,0
94243005,326,3941,16,16,16,16,0,0,17.38,17.38,0,3942,14,30,14,30,3,0,18.58,17.94,0,3951,16,46,16,46,0,0,15.58,17.12,0,3952,16,62,16,62,0,0,16.98,17.08,0,Male,Yes,1375,94,1,0
94243006,327,3941,16,16,16,16,0,0,15.41,15.41,0,3942,17,33,14,30,0,3,13.55,14.97,0,3951,15,51,15,48,0,0,16.08,15.38,0,3952,17,68,17,65,0,0,16.06,15.56,0,Female,Yes,1375,94,1,0
94243007,328,3941,16,16,16,16,0,0,15.38,15.38,0,3942,13,29,13,29,3,0,14.76,15.1,0,3951,17,46,17,46,0,0,16.35,15.56,0,3952,14,60,14,60,0,0,16.32,15.74,0,Female,Yes,1375,94,1,0
94243008,329,3941,16,16,16,16,0,0,16.71,16.71,0,3942,16,32,16,32,0,0,18.56,17.64,0,3951,16,48,16,48,0,0,15.86,17.04,0,3952,15,63,15,63,3,0,15.77,16.74,0,Male,Yes,1376,94,1,0
94243009,330,3941,16,16,16,16,0,0,16.52,16.52,0,3942,18,34,18,34,0,0,16.31,16.41,0,3951,13,47,10,44,3,3,13.72,16.06,0,3952,16,63,10,54,1,6,12.78,15.84,0,Female,Yes,1376,94,1,0
94243010,331,3941,16,16,13,13,0,3,14.52,16.02,0,3942,16,32,13,26,3,3,13.01,15.98,0,3951,14,52,14,46,0,0,15.41,15.32,0,3952,17,69,17,63,3,0,16.24,15.57,0,Male,No,1376,94,2,0
94243011,332,3941,16,16,16,16,0,0,17.65,17.65,0,3942,18,34,18,34,0,0,19.19,18.46,0,3951,17,51,17,51,0,0,19.13,18.68,0,3952,16,67,16,67,0,0,19.33,18.84,0,Female,Yes,1375,94,1,0
94243012,333,3941,16,16,16,16,0,0,16.43,16.43,0,3942,16,32,16,32,0,0,16.9,16.67,0,3951,19,51,19,51,0,0,14.96,16.03,0,3952,18,69,18,69,0,0,13.81,15.45,0,Male,Yes,1375,94,1,0
94243013,334,3941,16,16,16,16,0,0,16.66,16.66,0,3942,18,34,18,34,0,0,14.43,15.48,0,3951,16,50,16,50,0,0,15.1,15.36,0,3952,16,66,13,63,0,3,12.02,14.81,0,Male,No,1376,94,2,0
94243014,335,3941,16,16,16,16,0,0,14.06,14.06,0,3942,15,31,12,28,3,3,11.92,13.02,1,3951,14,45,5,33,0,9,10.84,12.34,1,3952,14,59,14,47,0,0,17.17,13.49,0,Male,No,1375,94,2,2
94243015,336,3941,16,16,16,16,0,0,17.09,17.09,0,3942,16,32,16,32,3,0,17.97,17.53,0,3951,16,48,16,48,0,0,17.48,17.51,0,3952,18,66,18,66,0,0,17.8,17.59,0,Male,Yes,1376,94,1,0
94243016,337,3941,18,18,16,16,0,2,14.03,14.75,0,3942,14,32,8,24,3,6,12,14.58,0,3951,12,47,12,39,0,0,13,14.3,0,3952,15,62,15,54,3,0,12.64,13.84,0,Female,Yes,1376,94,1,0
94243017,338,3941,16,16,16,16,0,0,15.92,15.92,0,3942,16,32,16,32,2,0,14.57,15.25,0,3951,13,45,13,45,3,0,16.29,15.55,0,3952,16,61,16,61,2,0,15.8,15.62,0,Female,Yes,1375,94,1,0
94243018,339,3941,17,17,17,17,0,0,15.58,15.58,0,3942,19,36,18,35,0,0,16.2,15.9,0,3951,19,55,19,54,0,0,15.05,15.6,0,3952,17,72,17,71,0,0,13.29,15.05,0,Female,No,1376,94,2,0
94243019,340,3941,18,18,17,17,0,0,16.16,16.16,0,3942,20,38,19,36,0,0,17.04,16.62,0,3951,17,55,17,53,0,0,17.82,17.01,0,3952,16,71,16,69,0,0,18.51,17.36,0,Female,No,1376,94,2,0
94243020,341,3941,16,16,13,13,0,3,14.52,16.49,0,3942,18,34,18,31,0,0,17.16,16.88,0,3951,16,50,16,47,0,0,14.96,16.23,0,3952,17,67,17,64,0,0,16.04,16.18,0,Female,Yes,1375,94,1,0
94243021,342,3941,16,16,16,16,0,0,16.71,16.71,0,3942,18,34,18,34,0,0,17.43,17.09,0,3951,19,53,19,53,0,0,14.82,16.28,0,3952,17,70,17,70,0,0,16.75,16.39,0,Male,No,1375,94,2,0
94243023,343,3941,16,16,13,13,0,3,14.42,15.79,0,3942,18,34,18,31,0,0,14.99,15.33,0,3951,14,48,14,45,0,0,14.52,15.08,0,3952,16,64,16,61,0,0,16.18,15.36,0,Male,Yes,1376,94,3,0
94243024,344,3941,18,18,18,18,0,0,17.19,17.19,0,3942,19,37,19,37,0,0,16.39,16.78,0,3951,12,49,12,49,3,0,16.88,16.8,0,3952,13,62,13,62,3,0,15.43,16.52,0,Male,Yes,1377,94,1,0
94243025,345,3941,18,18,18,18,0,0,15.08,15.08,0,3942,17,35,11,29,0,6,12.01,14.51,0,3951,17,58,17,52,0,0,15.95,15.17,0,3952,15,73,15,67,2,0,13.89,14.88,0,Male,Yes,1376,94,1,0
94243026,346,3941,18,18,18,18,0,0,14.36,14.36,0,3942,17,35,11,29,0,6,11.69,13.42,1,3951,14,52,14,43,0,0,14.11,13.63,0,3952,16,68,16,59,0,0,14.6,13.88,0,Male,Yes,1375,94,1,1
94243027,347,3941,16,16,16,16,0,0,15.78,15.78,0,3942,19,35,19,35,0,0,15.59,15.68,0,3951,17,52,17,52,0,0,16.52,15.96,0,3952,16,68,16,68,0,0,19.25,16.73,0,Male,Yes,1375,94,1,0
94243028,348,3941,16,16,16,16,0,0,18.03,18.03,0,3942,13,29,13,29,3,0,16.73,17.44,0,3951,14,43,14,43,0,0,16.02,16.98,0,3952,14,57,14,57,3,0,16.15,16.78,0,Female,Yes,1376,94,1,0
94243029,349,3941,16,16,7,7,0,9,12.78,12.78,0,3942,16,32,10,17,0,6,12.06,12.42,0,3951,16,48,13,30,0,3,12.09,12.31,0,3952,15,63,5,35,3,10,9.74,11.7,1,Female,Yes,1376,94,1,1
94243030,350,3941,16,16,16,16,0,0,17.41,17.41,0,3942,15,31,15,31,0,0,16.55,16.99,0,3951,19,50,19,50,0,0,18.12,17.42,0,3952,17,67,17,67,0,0,18.59,17.72,0,Female,Yes,1376,94,1,0
94243031,351,3941,16,16,16,16,0,0,16.77,16.77,0,3942,14,30,11,27,3,3,15.31,16.84,0,3951,11,44,11,41,3,0,16.89,16.35,0,3952,16,60,16,57,0,0,14.46,15.82,0,Male,Yes,1375,94,1,0
94243032,352,3941,16,16,16,16,0,0,14.73,14.73,0,3942,17,33,14,30,0,3,13.94,14.83,0,3951,12,45,12,42,0,0,13.38,14.41,0,3952,17,62,14,56,0,3,13.12,14.29,0,Male,Yes,1376,94,1,0
94243033,353,3941,16,16,16,16,0,0,15.48,15.48,0,3942,20,36,20,36,0,0,15.44,15.46,0,3951,14,50,14,50,0,0,16.07,15.63,0,3952,12,62,12,62,3,0,13.07,15.13,0,Male,No,1376,94,2,0
94243034,354,3941,16,16,10,10,0,6,13.14,17.73,0,3942,19,35,16,26,0,3,12.7,15.06,0,3951,14,49,11,37,3,3,12.14,14.38,0,3961,15,64,14,51,2,0,13.21,14.06,0,Male,Yes,1376,94,4,0
94243035,355,3941,16,16,13,13,0,3,14.19,15.73,0,3942,19,35,16,29,0,3,12.38,13.74,0,3951,17,52,17,46,0,0,14.49,14,0,3952,15,67,15,61,3,0,13.53,13.89,0,Female,No,1375,94,3,0
94243037,356,3941,16,16,16,16,0,0,18.17,18.17,0,3942,21,37,19,35,0,2,14.59,16.52,0,3951,19,56,19,54,0,0,15.92,16.31,0,3952,20,76,20,74,0,0,17.46,16.62,0,Male,No,1375,94,1,0
94243040,357,3941,16,16,16,16,0,0,16.1,16.1,0,3942,18,34,18,34,0,0,16.72,16.43,0,3951,14,48,14,48,3,0,16.23,16.37,0,3952,16,64,16,64,0,0,15.06,16.04,0,Female,Yes,1376,94,2,0
94243041,358,3941,16,16,16,16,0,0,14.75,14.75,0,3942,19,35,16,32,0,3,12.33,13.78,0,3951,17,52,11,43,0,6,12.21,13.9,0,3952,17,69,17,60,0,0,14.68,14.12,0,Male,No,1376,94,4,0
94243042,359,3941,16,16,16,16,0,0,15.52,15.52,0,3942,18,34,18,34,0,0,17.47,16.55,0,3951,17,51,17,51,0,0,16.75,16.62,0,3952,17,68,17,68,0,0,17.18,16.76,0,Female,Yes,1375,94,1,0
94243043,360,3941,18,18,18,18,0,0,17.11,17.11,0,3942,15,33,15,33,3,0,15.68,16.46,0,3951,14,47,14,47,3,0,15.06,16.04,0,3952,15,62,12,59,0,3,15.4,16.21,0,Male,Yes,1376,94,1,0
94243044,361,3941,18,18,18,18,0,0,17.64,17.64,0,3942,17,35,17,35,0,0,16.07,16.88,0,3951,14,49,14,49,0,0,16.9,16.89,0,3952,15,64,15,64,0,0,17.98,17.14,0,Male,Yes,1375,94,1,0
94243045,362,3941,10,10,10,10,6,0,13.91,13.91,0,3942,15,25,6,16,0,9,10.1,13.57,1,3951,13,38,13,29,0,0,12.54,13.11,0,3952,14,52,8,37,0,6,12.11,13.07,0,Female,Yes,1375,94,4,1
94243046,363,3941,16,16,16,16,0,0,17.56,17.56,0,3942,18,34,18,34,0,0,18.93,18.29,0,3951,20,54,20,54,0,0,19.11,18.59,0,3952,19,73,19,73,0,0,19.21,18.75,0,Female,Yes,1375,94,1,0
94243047,364,3941,16,16,16,16,0,0,18.34,18.34,0,3942,18,34,18,34,0,0,17.89,18.1,0,3951,17,51,17,51,0,0,18.3,18.17,0,3952,14,65,14,65,0,0,18.98,18.34,0,Female,Yes,1376,94,1,0
94243048,365,3941,16,16,13,13,0,3,13.5,14.77,0,3942,16,32,16,29,0,0,12.55,13.54,0,3951,14,46,14,43,0,0,13.29,13.46,0,3952,18,64,15,58,2,3,11.14,12.77,1,Male,Yes,1375,94,4,1
94243049,366,3941,16,16,16,16,0,0,15.92,15.92,0,3942,17,33,17,33,0,0,16.39,16.17,0,3951,17,50,17,50,0,0,17.58,16.65,0,3952,17,67,17,67,0,0,18.82,17.2,0,Male,Yes,1376,94,2,0
94243050,367,3941,16,16,10,10,0,6,13.91,17.46,0,3942,19,35,16,26,0,3,15.4,16.84,0,3951,16,51,13,39,3,3,14.53,16.51,0,3961,15,66,12,51,2,3,13.41,16.04,0,Male,Yes,1375,94,3,0
94243051,368,3941,16,16,16,16,0,0,16.72,16.72,0,3942,15,31,15,31,0,0,17.1,16.9,0,3951,16,47,16,47,0,0,17.09,16.97,0,3952,15,62,15,62,0,0,16.51,16.86,0,Female,Yes,1375,94,3,0
94243052,369,3941,16,16,16,16,0,0,16.66,16.66,0,3942,19,35,16,32,0,3,14.27,15.96,0,3951,14,49,14,46,0,0,14.95,15.65,0,3952,18,67,18,64,0,0,16.6,15.92,0,Male,Yes,1375,94,2,0
94243053,370,3941,16,16,16,16,0,0,15.73,15.73,0,3942,19,35,19,35,0,0,14.97,15.32,0,3951,18,53,18,53,0,0,17.84,16.18,0,3952,16,69,16,69,0,0,17.12,16.39,0,Female,No,1376,94,3,0
94243054,371,3941,16,16,10,10,0,6,12.85,17.26,0,3942,16,32,16,26,0,0,15.36,16.09,0,3951,16,48,8,34,0,8,13.08,15.24,0,3952,13,61,13,47,0,0,14.44,15.04,0,Male,Yes,1376,94,2,0
94243056,372,3941,13,13,7,7,3,6,12.61,12.61,0,3942,13,26,4,11,0,9,12.4,12.51,0,3951,11,37,5,16,3,6,11.22,12.12,0,3952,15,52,11,27,0,4,13,12.38,0,Male,Yes,1376,94,1,0
94243057,373,3941,16,16,16,16,0,0,12.65,12.65,0,3942,14,30,14,30,0,0,14.43,13.48,0,3951,14,44,8,38,0,6,11.93,13.54,1,3952,14,58,11,49,0,3,14.47,14.11,0,Male,Yes,1376,94,1,1
94243058,374,3941,16,16,13,13,0,3,13.8,13.8,0,3942,14,30,11,24,0,3,14.2,13.99,0,3951,18,48,15,39,0,3,13.17,13.68,0,3952,12,60,9,48,3,3,13.5,13.64,0,Male,Yes,1375,94,1,0
94243059,375,3941,16,16,13,13,0,3,14.06,15.46,0,3942,16,32,13,26,0,3,12.42,13.78,0,3951,17,49,17,43,3,0,13.96,13.85,0,3952,14,63,8,51,0,6,11.6,13.78,1,Female,Yes,1376,94,1,1
94243060,376,3941,16,16,16,16,0,0,15.93,15.93,0,3942,18,34,18,34,0,0,14.74,15.3,0,3951,16,50,16,50,0,0,14.5,15.04,0,3952,17,67,17,67,0,0,14.4,14.88,0,Female,Yes,1375,94,1,0
94243062,377,3941,16,16,10,10,0,6,13.47,14.31,0,3942,17,33,17,27,0,0,15.63,15.06,0,3951,17,50,17,44,0,0,13.76,14.59,0,3952,14,64,11,55,0,3,12.57,14.13,0,Female,Yes,1375,94,1,0
94243064,378,3941,16,16,13,13,0,3,14.39,14.39,0,3942,16,32,10,23,0,6,12.92,13.66,0,3951,13,45,7,30,5,6,12.79,13.41,0,3952,13,58,10,40,0,3,12.07,13.11,0,Male,Yes,1376,94,2,0
94243065,379,3941,16,16,13,13,0,3,13.9,15.49,0,3942,14,30,14,27,2,0,14.91,15.19,0,3951,19,49,16,43,0,3,14.51,15.29,0,3952,17,66,17,60,0,0,14.85,15.17,0,Female,Yes,1375,94,1,0
94243067,380,3941,16,16,10,10,0,6,13.89,13.89,0,3942,18,34,18,28,0,0,13.83,13.86,0,3951,16,50,16,44,0,0,14.13,13.95,0,3952,14,64,11,55,0,3,13.05,13.75,0,Female,Yes,1376,94,1,0
94243068,381,3941,16,16,13,13,0,3,14.13,15.32,0,3942,15,31,15,28,0,0,15.1,15.2,0,3951,16,47,13,41,3,3,13.54,14.94,0,3952,15,62,15,56,0,0,14.87,14.92,0,Female,Yes,1376,94,1,0
94243070,382,3941,12,12,11,11,6,1,14.38,14.82,0,3942,17,29,17,28,0,0,13.47,14,0,3951,14,43,11,39,0,3,13.38,14.12,0,3952,12,55,12,51,3,0,12.82,13.81,0,Male,Yes,1374,94,5,0
94243072,383,3941,12,12,9,9,2,3,17.33,17.33,0,3942,15,27,15,24,2,0,13.66,15.04,0,3951,18,45,15,39,2,3,12.83,14.49,0,3952,14,59,14,53,0,0,15.45,14.74,0,Female,Yes,1376,94,1,0
95243002,384,3951,15,15,15,15,3,0,15.94,15.94,0,3952,20,35,20,35,0,0,15.14,15.48,0,3961,17,52,17,52,0,0,15.85,15.6,0,3962,17,69,14,66,0,3,12.23,15.13,0,Male,No,1377,95,2,0
95243003,385,3951,18,18,18,18,0,0,16.2,16.2,0,3952,15,33,12,30,3,3,11.47,14.05,1,3961,14,47,14,44,0,0,15.56,14.5,0,3962,17,64,17,61,0,0,15.82,14.85,0,Male,No,1377,95,1,1
95243004,386,3951,18,18,15,15,0,3,13.39,14.19,0,3952,17,35,16,31,3,1,14.5,14.51,0,3961,16,51,16,47,0,0,13.73,14.25,0,3962,20,71,20,67,0,0,15.66,14.67,0,Male,Yes,1376,95,1,0
95243005,387,3951,16,16,16,16,0,0,16.02,16.02,0,3952,18,34,18,34,0,0,13.97,14.93,0,3961,17,51,17,51,0,0,15.22,15.03,0,3962,18,69,18,69,0,0,14.4,14.86,0,Female,Yes,1377,95,1,0
95243006,388,3951,16,16,16,16,0,0,16.83,16.83,0,3952,18,34,18,34,0,0,15.35,16.05,0,3961,16,50,16,50,0,0,17.01,16.36,0,3962,18,68,15,65,0,3,15.94,16.57,0,Female,No,1377,95,2,0
95243007,389,3951,16,16,16,16,0,0,13.45,13.45,0,3952,18,34,18,34,0,0,14.52,14.02,0,3961,16,50,16,50,0,0,15.45,14.47,0,3962,18,68,15,65,0,3,12.79,14.22,0,Female,Yes,1377,95,3,0
95243009,390,3951,16,16,13,13,0,3,13.36,14.27,0,3952,16,32,13,26,3,3,14.42,14.88,0,3961,16,51,16,45,0,0,15.45,15.43,0,3962,17,68,17,62,3,0,14.42,15.15,0,Male,Yes,1377,95,2,0
95243010,391,3951,18,18,18,18,0,0,16.04,16.04,0,3952,19,37,19,37,0,0,13.66,14.82,0,3961,15,52,15,52,0,0,15.06,14.89,0,3962,17,69,14,66,0,3,13.68,14.82,0,Male,Yes,1376,95,1,0
95243011,392,3951,17,17,13,13,3,4,13.29,13.8,0,3952,20,37,20,33,0,0,14.47,14.18,0,3961,16,53,10,43,2,6,12.44,14.22,0,3962,17,70,17,60,0,0,17.87,15.22,0,Male,Yes,1376,95,1,0
95243012,393,3951,20,20,14,14,0,6,14.03,16.12,0,3952,17,37,17,31,0,0,14.54,15.25,0,3961,15,52,15,46,0,0,15,15.17,0,3962,18,70,15,61,0,3,14.61,15.31,0,Male,No,1376,95,3,0
95243014,394,3951,16,16,16,16,0,0,17.49,17.49,0,3952,18,34,18,34,0,0,18.44,17.99,0,3961,16,50,16,50,0,0,17.33,17.78,0,3962,17,67,17,67,0,0,18.94,18.07,0,Male,Yes,1377,95,1,0
95243015,395,3951,16,16,16,16,0,0,15.75,15.75,0,3952,16,32,13,29,0,3,15.5,16.31,0,3961,16,48,16,45,3,0,14.97,15.84,0,3962,16,64,16,61,0,0,18.76,16.6,0,Male,Yes,1377,95,1,0
95243016,396,3951,18,18,18,18,0,0,16.57,16.57,0,3952,15,33,15,33,3,0,16.35,16.47,0,3961,18,51,18,51,0,0,13.75,15.51,0,3962,15,66,15,66,0,0,12.31,14.78,0,Male,No,1376,95,2,0
95243017,397,3951,16,16,16,16,0,0,15.98,15.98,0,3952,17,33,17,33,3,0,16.22,16.11,0,3961,17,50,14,47,0,3,14.52,15.95,0,3962,17,67,17,64,0,0,17.5,16.37,0,Male,Yes,1377,95,1,0
95243018,398,3951,16,16,16,16,0,0,16.23,16.23,0,3952,16,32,16,32,2,0,13.09,14.66,0,3961,15,47,12,44,0,3,14.05,14.84,0,3962,17,64,17,61,3,0,15.89,15.13,0,Male,Yes,1376,95,1,0
95243019,399,3951,18,18,18,18,0,0,17.65,17.65,0,3952,18,36,18,36,0,0,16.78,17.21,0,3961,17,53,17,53,0,0,15.44,16.64,0,3962,14,67,14,67,3,0,17.05,16.73,0,Male,Yes,1377,95,1,0
95243021,400,3951,18,18,18,18,0,0,13.36,13.36,0,3952,17,35,17,35,3,0,13.45,13.4,0,3961,19,54,4,39,0,15,9.92,13.34,1,3962,13,67,13,52,3,0,14.91,13.71,0,Male,Yes,1376,95,1,1
95243022,401,3951,16,16,16,16,0,0,17.36,17.36,0,3952,18,34,18,34,0,0,15.83,16.55,0,3961,16,50,16,50,0,0,16.83,16.64,0,3962,18,68,18,68,0,0,17.42,16.85,0,Female,Yes,1377,95,1,0
95243023,402,3951,20,20,20,20,0,0,17.31,17.31,0,3952,20,40,20,40,0,0,15.64,16.48,0,3961,18,58,18,58,0,0,15.7,16.24,0,3962,18,76,18,76,0,0,17.3,16.49,0,Male,No,1377,95,2,0
95243024,403,3951,16,16,16,16,0,0,17.52,17.52,0,3952,20,36,20,36,0,0,18.85,18.26,0,3961,17,53,17,53,0,0,17.32,17.96,0,3962,18,71,18,71,0,0,18.78,18.17,0,Male,No,1377,95,2,0
95243025,404,3951,7,7,7,7,9,0,16.92,16.92,0,3952,16,23,13,20,3,3,15.34,15.82,0,3961,19,42,19,39,0,0,12.68,14.4,0,3962,20,62,14,53,0,6,10.2,13.04,1,Female,Yes,1377,95,4,1
95243026,405,3951,18,18,15,15,0,3,14.28,15.3,0,3952,16,34,16,31,0,0,14.81,15.05,0,3961,17,51,14,45,0,3,13.3,14.73,0,3962,20,71,20,65,0,0,16.72,15.34,0,Male,Yes,1377,95,1,0
95243027,406,3951,20,20,20,20,0,0,16.06,16.06,0,3952,16,36,16,36,0,0,16.04,16.05,0,3961,17,53,17,53,0,0,17.76,16.6,0,3962,18,71,15,68,0,3,14.54,16.35,0,Male,Yes,1376,95,1,0
95243028,407,3951,16,16,16,16,0,0,18.03,18.03,0,3952,18,34,18,34,0,0,15.74,16.82,0,3961,19,53,19,53,0,0,16.24,16.61,0,3962,18,71,18,71,0,0,19.15,17.26,0,Male,Yes,1376,95,1,0
95243029,408,3951,16,16,16,16,0,0,16.25,16.25,0,3952,18,34,18,34,0,0,16.11,16.17,0,3961,16,50,16,50,0,0,14.68,15.7,0,3962,18,68,18,68,0,0,16.93,16.02,0,Male,Yes,1376,95,1,0
95243030,409,3951,16,16,16,16,0,0,15.51,15.51,0,3952,15,31,15,31,0,0,13.51,14.54,0,3961,19,50,13,44,0,6,11.17,13.83,1,3962,14,64,14,58,0,0,15.98,14.35,0,Male,Yes,1377,95,1,1
95243031,410,3951,16,16,16,16,0,0,16.53,16.53,0,3952,16,32,15,31,0,1,10.8,13.66,1,3961,14,46,14,45,0,0,15.85,14.33,0,3962,14,60,14,59,3,0,18.07,15.2,0,Female,Yes,1377,95,1,1
95243032,411,3951,16,16,16,16,0,0,14.74,14.74,0,3952,18,34,18,34,0,0,15.05,14.9,0,3961,18,52,18,52,0,0,16.94,15.61,0,3962,18,70,18,70,0,0,17.13,16,0,Female,Yes,1376,95,1,0
95243034,412,3951,16,16,16,16,0,0,17.35,17.35,0,3952,17,33,17,33,3,0,16.43,16.87,0,3961,17,50,17,50,0,0,15.49,16.4,0,3962,18,68,18,68,0,0,16.35,16.39,0,Male,Yes,1376,95,1,0
95243035,413,3951,18,18,18,18,0,0,16.43,16.43,0,3952,15,33,15,33,3,0,15.8,16.14,0,3961,18,51,18,51,0,0,14.56,15.59,0,3962,15,66,15,66,0,0,13.75,15.17,0,Male,No,1376,95,2,0
95243036,414,3951,18,18,18,18,0,0,16.64,16.64,0,3952,20,38,20,38,0,0,14.07,15.28,0,3961,16,54,16,54,0,0,14.78,15.14,0,3962,17,71,17,71,0,0,16.3,15.42,0,Male,Yes,1377,95,1,0
95243038,415,3951,16,16,16,16,0,0,16.31,16.31,0,3952,18,34,18,34,0,0,14.69,15.45,0,3961,17,51,17,51,0,0,15.27,15.39,0,3962,16,67,16,67,3,0,14.77,15.24,0,Female,Yes,1376,95,1,0
95243040,416,3951,16,16,10,10,0,6,11.84,11.84,1,3952,13,29,6,16,0,7,10.36,11.18,1,3961,14,49,8,30,0,6,12.36,11.98,0,3962,17,66,7,37,3,10,11.76,11.93,1,Female,Yes,1376,95,4,3
95243041,417,3951,16,16,16,16,0,0,14.36,14.36,0,3952,14,30,2,18,2,12,9.43,13.18,1,3961,14,44,14,32,0,0,13.32,13.24,0,3962,17,61,14,46,0,3,12,13.16,0,Male,Yes,1376,95,1,1
95243042,418,3951,16,16,16,16,0,0,14.5,14.5,0,3952,18,34,15,31,0,3,12.93,14.22,0,3961,17,51,17,48,0,0,15.72,14.75,0,3962,20,71,20,68,0,0,14.73,14.74,0,Female,No,1376,95,2,0
95243043,419,3951,16,16,16,16,0,0,15.91,15.91,0,3952,18,34,18,34,0,0,12.89,14.31,0,3961,17,51,11,45,0,6,12.25,14.34,0,3962,18,69,15,60,0,3,13.04,13.97,0,Female,Yes,1376,95,1,0
95243044,420,3951,16,16,16,16,0,0,16.3,16.3,0,3952,18,34,18,34,0,0,14.8,15.51,0,3961,17,51,11,45,0,6,12.37,15.13,0,3962,20,71,20,65,0,0,16.23,15.47,0,Male,Yes,1377,95,1,0
95243045,421,3951,13,13,13,13,3,0,17.18,17.18,0,3952,18,31,18,31,0,0,15.48,16.2,0,3961,17,48,17,48,0,0,18.03,16.85,0,3962,18,66,18,66,0,0,16.64,16.79,0,Female,Yes,1376,95,2,0
95243046,422,3951,18,18,18,18,0,0,15.28,15.28,0,3952,15,33,15,33,3,0,15.88,15.55,0,3961,18,51,18,51,0,0,15.04,15.37,0,3962,15,66,15,66,0,0,13.4,14.92,0,Male,No,1376,95,2,0
95243047,423,3951,16,16,16,16,0,0,17.83,17.83,0,3952,18,34,18,34,0,0,16.35,17.04,0,3961,17,51,17,51,0,0,18.78,17.62,0,3962,18,69,18,69,0,0,18.89,17.95,0,Female,No,1376,95,2,0
95243048,424,3951,16,16,16,16,0,0,15.3,15.3,0,3952,18,34,18,34,0,0,14.8,15.04,0,3961,18,52,18,52,0,0,13.91,14.65,0,3962,17,69,15,67,0,2,12.31,14.22,0,Male,No,1377,95,2,0
95243049,425,3951,16,16,16,16,0,0,16.49,16.49,0,3952,20,36,20,36,0,0,16.53,16.51,0,3961,17,53,17,53,0,0,17.86,16.95,0,3962,19,72,19,72,0,0,16.32,16.78,0,Female,No,1377,95,2,0
95243050,426,3951,16,16,16,16,0,0,17.25,17.25,0,3952,15,31,15,31,3,0,16.38,16.83,0,3961,18,49,18,49,0,0,15.16,16.21,0,3962,17,66,17,66,0,0,13.78,15.59,0,Male,No,1376,95,2,0
95243051,427,3951,16,16,16,16,0,0,15.94,15.94,0,3952,17,33,17,33,0,0,13.47,14.67,0,3961,17,50,11,44,3,6,12.69,14.58,0,3962,15,65,15,59,3,0,16.45,15.06,0,Male,Yes,1376,95,1,0
95243052,428,3951,16,16,16,16,0,0,18.78,18.78,0,3952,16,32,16,32,2,0,19.38,19.08,0,3961,19,51,19,51,0,0,18.41,18.83,0,3962,18,69,18,69,0,0,19.54,19.02,0,Male,Yes,1377,95,1,0
95243053,429,3951,16,16,16,16,0,0,15.88,15.88,0,3952,20,36,20,36,0,0,15.04,15.41,0,3961,18,54,18,54,0,0,15.49,15.44,0,3962,20,74,20,74,0,0,15.11,15.35,0,Male,Yes,1376,95,1,0
95243054,430,3951,16,16,13,13,0,3,13.71,14.68,0,3952,16,32,13,26,0,3,13.3,13.92,0,3961,13,45,13,39,3,0,13.87,13.9,0,3962,18,63,6,45,0,12,10.33,14.05,1,Male,No,1376,95,4,1
95243055,431,3951,16,16,16,16,0,0,17.25,17.25,0,3952,18,34,18,34,0,0,15.27,16.2,0,3961,16,50,16,50,0,0,19.1,17.13,0,3962,15,65,15,65,0,0,18.02,17.34,0,Female,Yes,1377,95,1,0
95243056,432,3951,16,16,16,16,0,0,15.69,15.69,0,3952,18,34,18,34,0,0,14.48,15.05,0,3961,19,53,19,53,0,0,15.44,15.19,0,3962,18,71,18,71,0,0,15.01,15.14,0,Female,No,1376,95,2,0
95243057,433,3951,13,13,7,7,3,6,13.39,13.39,0,3952,14,27,14,21,0,0,15.15,14.3,0,3961,16,43,13,34,0,3,14.5,14.37,0,3962,19,62,7,41,0,12,10.37,13.15,1,Male,Yes,1376,95,4,1
95243058,434,3951,18,18,18,18,0,0,16.76,16.76,0,3952,20,38,20,38,0,0,16.34,16.54,0,3961,16,54,13,51,0,3,14.36,16.25,0,3962,15,69,15,66,0,0,15.85,16.16,0,Male,No,1377,95,2,0
95243059,435,3951,16,16,16,16,0,0,17.37,17.37,0,3952,18,34,15,31,0,3,14.86,16.72,0,3961,19,53,19,50,0,0,16.22,16.53,0,3962,15,68,15,65,0,0,17.55,16.76,0,Female,Yes,1377,95,1,0
95243060,436,3951,18,18,18,18,0,0,17.02,17.02,0,3952,20,38,20,38,0,0,17.35,17.2,0,3961,15,53,15,53,0,0,16.91,17.11,0,3962,17,70,17,70,0,0,18.56,17.47,0,Male,Yes,1377,95,1,0
95243061,437,3951,15,15,14,14,3,1,15.64,15.64,0,3952,16,31,16,30,2,0,15.14,15.38,0,3961,15,46,12,42,0,3,11.49,14.11,1,3962,14,60,14,56,3,0,14.5,14.2,0,Male,Yes,1377,95,1,1
95243062,438,3951,13,13,13,13,3,0,18.64,18.64,0,3952,18,31,18,31,0,0,16.9,17.63,0,3961,17,48,17,48,0,0,17.73,17.67,0,3962,18,66,18,66,0,0,14.89,16.91,0,Female,No,1376,95,2,0
95243063,439,3951,16,16,16,16,0,0,14.48,14.48,0,3952,20,36,20,36,0,0,12.42,13.34,0,3961,18,54,18,54,0,0,13.67,13.45,0,3962,20,74,20,74,0,0,16.27,14.21,0,Male,No,1376,95,3,0
95243065,440,3951,16,16,16,16,0,0,17.12,17.12,0,3952,20,36,20,36,0,0,17.35,17.25,0,3961,18,54,18,54,0,0,16.05,16.85,0,3962,20,74,20,74,0,0,19.46,17.55,0,Male,No,1377,95,3,0
95243067,441,3951,16,16,16,16,0,0,15.64,15.64,0,3952,18,34,15,31,0,3,12.34,14.42,0,3961,16,50,16,47,0,0,14.33,14.39,0,3962,14,64,11,58,3,3,15.39,14.88,0,Female,Yes,1376,95,1,0
95243068,442,3951,16,16,16,16,0,0,17.09,17.09,0,3952,18,34,18,34,0,0,15.78,16.4,0,3961,17,51,17,51,0,0,16.34,16.38,0,3962,19,70,19,70,0,0,18.12,16.85,0,Female,Yes,1377,95,1,0
95243069,443,3951,16,16,10,10,0,6,10.09,10.09,1,3952,10,26,10,20,2,0,13.93,11.57,0,3961,14,40,8,28,0,6,13.36,12.19,0,3962,12,52,6,34,0,6,12.41,12.24,0,Male,Yes,1376,95,1,1
95243070,444,3951,16,16,16,16,0,0,16.16,16.16,0,3952,18,34,18,34,0,0,13.89,14.95,0,3961,17,51,17,51,0,0,16.16,15.36,0,3962,18,69,18,69,0,0,16.39,15.63,0,Female,No,1377,95,2,0
95243071,445,3951,16,16,16,16,0,0,17.09,17.09,0,3952,18,34,18,34,0,0,15.83,16.42,0,3961,17,51,17,51,0,0,15.95,16.27,0,3962,19,70,19,70,0,0,15.67,16.11,0,Female,Yes,1376,95,1,0
95243072,446,3951,13,13,10,10,3,3,14.08,14.08,0,3952,16,29,16,26,0,0,12.27,13.08,0,3961,17,46,14,40,3,3,12.55,12.88,0,3962,17,63,8,48,0,9,10.65,12.28,1,Female,Yes,1376,95,1,1
95243073,447,3961,13,13,6,6,3,7,10.92,10.92,1,3962,10,23,10,16,3,0,15.34,12.84,0,3971,13,36,13,29,3,0,16.04,14,0,3972,16,52,10,39,0,6,9.63,12.65,1,Male,Yes,1377,95,1,2
95243074,448,3951,16,16,16,16,0,0,15.54,15.54,0,3952,16,32,16,32,0,0,15.76,15.65,0,3961,18,50,18,50,0,0,14.22,15.14,0,3962,19,69,19,69,0,0,15.97,15.37,0,Female,Yes,1376,95,1,0
95243075,449,3951,16,16,13,13,0,3,15.58,17.1,0,3952,16,32,16,29,3,0,14.29,15.55,0,3961,19,51,13,42,0,6,12.24,14.98,0,3962,20,71,20,62,0,0,13.78,14.59,0,Male,Yes,1376,95,1,0
95243076,450,3951,16,16,13,13,0,3,15.26,16.62,0,3952,15,31,15,28,3,0,13.81,15.11,0,3961,17,48,17,45,0,0,14.96,15.06,0,3962,20,68,20,65,0,0,16.68,15.55,0,Female,Yes,1376,95,1,0
95243078,451,3951,16,16,13,13,0,3,13.81,14.77,0,3952,12,28,9,22,3,3,13.53,14.81,0,3961,18,46,18,40,0,0,15.06,14.92,0,3962,20,66,17,57,0,3,12.05,14.2,0,Female,Yes,1376,95,1,0
95243079,452,3951,16,16,13,13,0,3,14.78,16.23,0,3952,14,30,14,27,3,0,14,15.08,0,3961,17,47,8,35,3,9,10.45,14.44,1,3962,12,59,12,47,0,0,15.11,14.61,0,Male,Yes,1377,95,2,1
95243080,453,3951,16,16,16,16,0,0,16.03,16.03,0,3952,16,32,10,26,2,6,14.38,15.2,0,3961,19,51,19,45,0,0,14.78,15.05,0,3962,20,71,20,65,0,0,15.05,15.05,0,Male,Yes,1376,95,1,0
95243081,454,3951,16,16,13,13,0,3,13.5,14.56,0,3952,13,29,13,26,6,0,15.61,15.09,0,3961,19,48,19,45,0,0,12.8,14.12,0,3962,19,67,13,58,0,6,12.18,13.89,0,Female,Yes,1377,95,1,0
95243083,455,3951,13,13,13,13,3,0,16.5,16.5,0,3952,18,31,18,31,0,0,13.16,14.56,0,3961,17,48,14,45,0,3,12.04,13.98,0,3962,16,64,16,61,3,0,17.4,14.88,0,Male,No,1377,95,2,0
95243084,456,3951,16,16,16,16,0,0,14.44,14.44,0,3952,15,31,15,31,0,0,16.61,15.49,0,3961,16,47,13,44,2,3,13.46,15.15,0,3962,18,65,18,62,0,0,15.36,15.21,0,Female,Yes,1377,95,1,0
95243087,457,3951,16,16,16,16,0,0,15.93,15.93,0,3952,16,32,16,32,0,0,15.75,15.84,0,3961,20,52,20,52,0,0,14.06,15.15,0,3962,19,71,18,70,0,1,13.85,14.87,0,Male,No,1376,95,1,0
96243003,458,3961,16,16,16,16,0,0,17.8,17.8,0,3962,18,34,18,34,0,0,16.59,17.16,0,3971,19,53,19,53,0,0,16.89,17.06,0,3972,17,70,17,70,0,0,17.13,17.08,0,Female,Yes,1377,96,1,0
96243004,459,3961,16,16,16,16,0,0,16.7,16.7,0,3962,16,32,16,32,0,0,12.57,14.64,0,3971,16,48,16,48,0,0,13.73,14.33,0,3972,16,64,16,64,0,0,14.6,14.4,0,Male,Yes,1377,96,4,0
96243006,460,3961,16,16,16,16,0,0,20,20,0,3962,18,34,18,34,0,0,19.25,19.6,0,3971,17,51,17,51,0,0,18.63,19.28,0,3972,20,71,20,71,0,0,19.36,19.3,0,Male,No,1378,96,2,0
96243008,461,3961,16,16,16,16,0,0,19.01,19.01,0,3962,17,33,17,33,3,0,18.4,18.7,0,3971,20,53,20,53,0,0,15.99,17.68,0,3972,20,73,20,73,0,0,18.63,17.94,0,Female,Yes,1378,96,1,0
96243012,462,3961,16,16,16,16,0,0,20,20,0,3962,18,34,18,34,0,0,19.76,19.88,0,3971,16,50,16,50,0,0,19.91,19.89,0,3972,20,70,20,70,0,0,19.9,19.89,0,Male,No,1378,96,2,0
96243013,463,3961,16,16,16,16,0,0,18.89,18.89,0,3962,18,34,18,34,0,0,17.64,18.23,0,3971,17,51,17,51,0,0,18.13,18.2,0,3972,20,71,20,71,0,0,18.78,18.36,0,Male,No,1377,96,3,0
96243014,464,3961,16,16,16,16,0,0,14.98,14.98,0,3962,18,34,18,34,0,0,16.24,15.65,0,3971,16,50,16,50,0,0,16.77,16.01,0,3972,20,70,20,70,0,0,13.79,15.37,0,Male,No,1378,96,4,0
96243016,465,3961,16,16,16,16,0,0,18.77,18.77,0,3962,18,34,18,34,0,0,14.85,16.7,0,3971,18,52,18,52,0,0,15.38,16.24,0,3972,17,69,17,69,0,0,16.11,16.21,0,Female,No,1378,96,3,0
96243032,466,3961,16,16,16,16,0,0,19.77,19.77,0,3962,20,36,20,36,0,0,17.96,18.76,0,3971,20,56,20,56,0,0,17.59,18.35,0,3972,19,75,19,75,0,0,19.37,18.61,0,Female,Yes,1378,96,1,0
96243040,467,3961,16,16,16,16,0,0,17.63,17.63,0,3962,18,34,18,34,0,0,16,16.77,0,3971,19,53,16,50,0,3,14.17,16.27,0,3972,19,72,19,69,0,0,16.36,16.29,0,Female,No,1378,96,4,0
96243041,468,3961,16,16,16,16,0,0,18.93,18.93,0,3962,18,34,18,34,0,0,18.42,18.66,0,3971,20,54,20,54,0,0,18.54,18.61,0,3972,19,73,19,73,0,0,19.16,18.76,0,Male,No,1377,96,2,0
96243051,469,3961,16,16,16,16,0,0,19.94,19.94,0,3962,16,32,16,32,0,0,18.71,19.32,0,3971,18,50,18,50,0,0,19.26,19.3,0,3972,20,70,20,70,0,0,19.64,19.4,0,Male,Yes,1377,96,1,0
96243052,470,3961,16,16,16,16,0,0,19.03,19.03,0,3962,16,32,16,32,2,0,17.04,18.04,0,3971,16,48,16,48,0,0,17.19,17.75,0,3972,16,64,16,64,3,0,18.07,17.83,0,Female,Yes,1378,96,2,0
96243063,471,3961,13,13,13,13,3,0,19.29,19.29,0,3962,18,31,18,31,0,0,17.08,18.01,0,3971,17,48,17,48,0,0,17.65,17.88,0,3972,20,68,20,68,0,0,16.81,17.56,0,Male,Yes,1377,96,1,0
96243074,472,3961,16,16,16,16,0,0,19.3,19.3,0,3962,17,33,17,33,3,0,18.8,19.04,0,3971,17,50,17,50,0,0,15.97,18,0,3972,19,69,19,69,0,0,17.79,17.94,0,Female,Yes,1378,96,1,0
96243096,473,3961,16,16,13,13,0,3,15.44,16.93,0,3962,16,32,16,29,0,0,16.32,16.59,0,3971,18,50,18,47,0,0,16.46,16.54,0,3972,16,66,16,63,3,0,14.52,16.03,0,Female,Yes,1377,96,1,0
91213033,474,3911,15,15,15,15,0,0,13.58,13.58,0,3912,17,32,17,32,3,0,13.82,13.71,0,3921,15,47,15,47,0,0,13.57,13.67,0,3922,15,62,6,53,0,9,11.07,13.04,1,Female,Yes,1372,91,1,1
95243037,475,3951,20,20,20,20,0,0,16.66,16.66,0,3952,18,38,18,38,0,0,16.06,16.38,0,3961,18,56,18,56,0,0,15.06,15.96,0,3962,18,74,15,71,0,3,12.4,15.09,0,Male,No,1377,95,2,0
95243088,476,3951,1,1,1,1,15,0,10.5,10.5,0,3961,16,17,10,11,1,6,12,11.91,0,3962,18,35,12,23,0,6,14.33,13.16,0,3971,14,49,14,37,0,0,13.45,13.24,0,Male,Yes,1376,95,5,0
96243002,477,3961,16,16,16,16,0,0,14.8,14.8,0,3962,15,31,15,31,3,0,11.81,13.35,1,3971,14,45,8,39,0,6,12.84,13.2,0,3972,20,65,17,56,0,3,13.63,13.33,0,Male,Yes,1377,96,4,1
96243005,478,3961,16,16,16,16,0,0,17.76,17.76,0,3962,18,34,18,34,0,0,15.33,16.47,0,3971,16,50,16,50,0,0,14.74,15.92,0,3972,17,67,17,67,0,0,15.18,15.73,0,Female,Yes,1377,96,1,0
96243007,479,3961,16,16,16,16,0,0,19.96,19.96,0,3962,18,34,18,34,0,0,17.61,18.71,0,3971,18,52,18,52,0,0,15.33,17.54,0,3972,17,69,17,69,0,0,17.15,17.45,0,Male,No,1377,96,3,0
96243009,480,3961,16,16,16,16,0,0,15.29,15.29,0,3962,18,34,18,34,0,0,15.92,15.62,0,3971,17,51,17,51,0,0,17.1,16.12,0,3972,16,67,16,67,3,0,17.73,16.5,0,Male,No,1378,96,2,0
96243010,481,3961,16,16,16,16,0,0,15.26,15.26,0,3962,18,34,18,34,0,0,14.53,14.88,0,3971,17,51,17,51,0,0,13.75,14.5,0,3972,15,66,15,66,2,0,13.98,14.38,0,Male,No,1378,96,2,0
96243011,482,3961,16,16,16,16,0,0,17.04,17.04,0,3962,18,34,18,34,0,0,13.68,15.26,0,3971,15,49,9,43,0,6,12.24,14.34,0,3972,16,65,16,59,3,0,15.2,14.55,0,Male,Yes,1377,96,2,0
96243015,483,3961,16,16,16,16,0,0,16.35,16.35,0,3962,18,34,18,34,0,0,18.22,17.34,0,3971,19,53,19,53,0,0,15.67,16.74,0,3972,15,68,15,68,3,0,16.71,16.74,0,Female,Yes,1378,96,4,0
96243018,484,3961,16,16,16,16,0,0,17.09,17.09,0,3962,18,34,15,31,0,3,12.92,14.88,0,3971,17,54,14,48,0,3,13.9,14.55,0,3972,20,74,20,68,0,0,15.84,14.9,0,Male,Yes,1377,96,4,0
96243019,485,3961,16,16,16,16,0,0,16.71,16.71,0,3962,20,36,20,36,0,0,16.08,16.36,0,3971,20,56,17,53,0,3,13.3,15.27,0,3972,15,71,15,68,0,0,15.38,15.29,0,Female,Yes,1378,96,1,0
96243020,486,3961,16,16,16,16,0,0,18.09,18.09,0,3962,15,31,15,31,3,0,15.99,17.07,0,3971,18,49,18,49,0,0,14.78,16.23,0,3972,18,67,18,67,0,0,15,15.9,0,Female,No,1377,96,2,0
96243021,487,3961,13,13,13,13,3,0,17.01,17.01,0,3962,18,31,18,31,0,0,14.11,15.33,0,3971,19,50,19,50,0,0,13.33,14.57,0,3972,14,64,14,64,3,0,17.09,15.12,0,Female,Yes,1378,96,1,0
96243024,488,3961,16,16,7,7,0,9,11.52,11.52,1,3962,13,29,10,17,0,3,11.83,11.66,1,3971,11,40,11,28,3,0,14.25,12.37,0,3972,17,57,17,45,0,0,15.16,13.2,0,Male,Yes,1378,96,1,2
96243025,489,3961,16,16,16,16,0,0,16.62,16.62,0,3962,13,29,13,29,3,0,12.35,14.71,0,3971,15,44,12,41,0,3,12.86,14.08,0,3972,19,63,19,60,0,0,15.52,14.51,0,Male,Yes,1378,96,1,0
96243027,490,3961,16,16,16,16,0,0,14.07,14.07,0,3962,20,36,20,36,0,0,14.81,14.48,0,3971,19,55,19,55,0,0,13.15,14.02,0,3972,19,74,16,71,0,3,13.05,13.77,0,Male,Yes,1378,96,1,0
96243028,491,3961,16,16,16,16,0,0,17.08,17.08,0,3962,18,34,18,34,0,0,15.11,16.04,0,3971,17,51,14,48,0,3,13.7,15.26,0,3972,16,67,13,61,3,3,12.08,14.5,0,Male,No,1378,96,2,0
96243029,492,3961,16,16,16,16,0,0,18.53,18.53,0,3962,20,36,17,33,0,3,14.19,16.12,0,3971,17,53,14,47,3,3,13.02,15.12,0,3972,16,69,16,63,0,0,16.16,15.36,0,Male,No,1378,96,1,0
96243030,493,3961,16,16,16,16,0,0,19.22,19.22,0,3962,18,34,18,34,0,0,16.7,17.88,0,3971,17,51,17,51,0,0,16.22,17.33,0,3972,15,66,15,66,2,0,16.4,17.12,0,Male,Yes,1379,96,2,0
96243031,494,3961,16,16,16,16,0,0,17.98,17.98,0,3962,20,36,20,36,0,0,16.15,16.96,0,3971,16,52,16,52,0,0,16.48,16.81,0,3972,16,68,16,68,0,0,15.7,16.55,0,Male,No,1378,96,1,0
96243033,495,3961,16,16,16,16,0,0,17.96,17.96,0,3962,20,36,20,36,0,0,18.12,18.04,0,3971,17,53,17,53,0,0,17.7,17.94,0,3972,17,70,17,70,3,0,17.25,17.77,0,Male,No,1378,96,2,0
96243034,496,3961,16,16,16,16,0,0,18.69,18.69,0,3962,18,34,18,34,0,0,15.82,17.17,0,3971,16,50,16,50,3,0,14.6,16.35,0,3972,18,68,18,68,0,0,16.59,16.41,0,Male,No,1377,96,4,0
96243035,497,3961,16,16,10,10,0,6,11.27,11.27,1,3962,14,30,8,18,0,6,12.19,11.7,0,3971,14,44,13,31,3,1,13.5,12.27,0,3972,17,61,14,45,3,3,13.06,12.49,0,Male,Yes,1378,96,4,1
96243036,498,3961,16,16,16,16,0,0,17.75,17.75,0,3962,15,31,12,28,3,3,14.4,16.13,0,3971,17,48,17,45,2,0,12.87,14.97,0,3972,17,65,14,59,3,3,11.59,14.09,1,Male,Yes,1378,96,4,1
96243038,499,3961,16,16,13,13,0,3,14.4,14.4,0,3962,18,34,12,25,0,6,12.63,13.47,0,3971,16,50,16,41,0,0,14.24,13.71,0,3972,17,67,17,58,0,0,12.83,13.49,0,Male,No,1377,96,4,0
96243042,500,3961,16,16,16,16,0,0,18.04,18.04,0,3962,18,34,12,28,0,6,12.95,15.34,0,3971,15,49,12,40,0,3,12.71,14.54,0,3972,20,69,17,57,0,3,12.45,13.93,0,Male,Yes,1377,96,4,0
96243043,501,3961,16,16,16,16,0,0,18.88,18.88,0,3962,18,34,18,34,0,0,18.46,18.66,0,3971,18,52,18,52,0,0,19.52,18.95,0,3972,17,69,17,69,0,0,19.47,19.08,0,Female,No,1377,96,2,0
96243044,502,3961,16,16,16,16,0,0,18.7,18.7,0,3962,18,34,18,34,0,0,16.88,17.74,0,3971,17,51,17,51,0,0,16.6,17.36,0,3972,17,68,17,68,0,0,17.36,17.36,0,Female,No,1378,96,3,0
96243045,503,3961,16,16,16,16,0,0,18.81,18.81,0,3962,18,34,18,34,0,0,16.46,17.57,0,3971,17,51,14,48,0,3,13.27,16.14,0,3972,11,62,11,59,3,0,12.55,15.5,0,Male,No,1378,96,2,0
96243046,504,3961,16,16,16,16,0,0,17.38,17.38,0,3962,15,31,15,31,3,0,15.41,16.43,0,3971,14,45,14,45,2,0,14.85,15.94,0,3972,16,61,16,61,0,0,16.6,16.11,0,Male,Yes,1378,96,1,0
96243047,505,3961,16,16,16,16,0,0,14.8,14.8,0,3962,18,34,12,28,0,6,13.22,13.96,0,3971,20,54,20,48,0,0,15.98,14.71,0,3972,20,74,20,68,0,0,14.69,14.71,0,Male,Yes,1377,96,3,0
96243048,506,3961,16,16,16,16,0,0,15.07,15.07,0,3962,18,34,12,28,0,6,11.25,13.04,1,3971,14,48,14,42,0,0,13.52,13.18,0,3972,16,64,16,58,2,0,14.31,13.46,0,Female,Yes,1378,96,1,1
96243049,507,3961,16,16,16,16,0,0,16.46,16.46,0,3962,18,34,18,34,0,0,14.75,15.55,0,3971,17,51,17,51,0,0,14.28,15.13,0,3972,18,69,18,69,0,0,14.61,14.99,0,Male,No,1378,96,2,0
96243050,508,3961,16,16,16,16,0,0,18.61,18.61,0,3962,18,34,18,34,0,0,16.77,17.64,0,3971,16,50,16,50,0,0,13.99,16.47,0,3972,17,67,17,67,0,0,16.97,16.6,0,Male,Yes,1377,96,4,0
96243054,509,3961,16,16,13,13,0,3,15.37,15.37,0,3962,18,34,12,25,0,6,11.02,13.07,1,3971,14,48,14,39,0,0,12.14,12.8,0,3972,16,64,7,46,3,9,11.73,12.53,1,Male,No,1377,96,4,2
96243056,510,3961,16,16,10,10,0,6,13.36,13.36,0,3962,16,32,13,23,0,3,13,13.18,0,3971,14,46,11,34,3,3,10.08,12.23,1,3972,14,60,11,45,0,3,12.12,12.21,0,Female,Yes,1378,96,4,1
96243057,511,3961,16,16,16,16,0,0,15.13,15.13,0,3962,15,31,12,28,3,3,11.94,13.59,1,3971,14,45,11,39,0,3,15.1,14.06,0,3972,17,62,17,56,3,0,12.81,13.71,0,Male,No,1378,96,2,1
96243058,512,3961,16,16,7,7,0,9,7.91,7.91,1,3962,12,28,12,19,0,0,14.99,10.94,0,3971,16,44,16,35,0,0,13.21,11.77,0,3972,14,58,4,39,3,10,7.71,10.79,1,Male,No,1377,96,4,2
96243059,513,3961,13,13,13,13,3,0,14.84,14.84,0,3962,18,31,18,31,0,0,12.05,13.22,0,3971,16,47,10,41,0,6,12.52,12.98,0,3972,16,63,16,57,3,0,15.46,13.61,0,Female,Yes,1378,96,1,0
96243060,514,3961,16,16,16,16,0,0,17.82,17.82,0,3962,15,31,12,28,3,3,13.66,15.81,0,3971,16,47,16,44,0,0,12.98,14.85,0,3972,17,64,17,61,2,0,13.53,14.5,0,Male,No,1377,96,2,0
96243061,515,3961,16,16,16,16,0,0,17.09,17.09,0,3962,18,34,18,34,0,0,14.4,15.67,0,3971,17,51,17,51,0,0,14.86,15.4,0,3972,13,64,13,64,3,0,17.61,15.85,0,Male,Yes,1377,96,1,0
96243062,516,3961,16,16,16,16,0,0,16.21,16.21,0,3962,18,34,15,31,0,3,11.45,13.69,1,3971,14,48,14,45,0,0,14.79,14.01,0,3972,19,67,19,64,0,0,13.51,13.87,0,Female,No,1378,96,3,1
96243064,517,3961,16,16,16,16,0,0,15.48,15.48,0,3962,18,34,12,28,0,6,13.15,14.25,0,3971,17,51,14,42,0,3,13.26,13.92,0,3972,16,67,16,58,3,0,16.58,14.55,0,Male,Yes,1377,96,1,0
96243065,518,3961,16,16,16,16,0,0,15.81,15.81,0,3962,13,29,10,26,6,3,12.66,14.4,0,3971,17,46,14,40,0,3,12.87,13.83,0,3972,17,63,14,54,3,3,13.21,13.66,0,Male,No,1377,96,2,0
96243066,519,3961,16,16,16,16,0,0,15.98,15.98,0,3962,16,32,16,32,0,0,13.47,14.73,0,3971,16,48,16,48,0,0,13.53,14.33,0,3972,13,61,13,61,3,0,11.83,13.8,1,Male,Yes,1377,96,1,1
96243067,520,3961,16,16,16,16,0,0,13.97,13.97,0,3962,18,34,18,34,0,0,15.46,14.76,0,3971,17,51,17,51,0,0,15.62,15.05,0,3972,19,70,16,67,0,3,14.62,14.93,0,Female,No,1377,96,3,0
96243068,521,3961,16,16,16,16,0,0,18.27,18.27,0,3962,15,31,12,28,3,3,14.99,16.68,0,3971,17,48,17,45,2,0,16.82,16.73,0,3972,20,68,17,62,0,3,14.41,16.05,0,Male,Yes,1378,96,1,0
96243069,522,3961,13,13,7,7,3,6,12.5,12.5,0,3962,16,29,13,20,0,3,13.22,12.89,0,3971,15,44,12,32,0,3,12.56,12.78,0,3972,17,61,11,43,3,6,10.2,12.06,1,Female,Yes,1378,96,4,1
96243070,523,3961,16,16,16,16,0,0,17.45,17.45,0,3962,18,34,18,34,0,0,15.04,16.18,0,3971,17,51,14,48,0,3,15.37,15.91,0,3972,20,71,17,65,0,3,12.68,15,0,Male,No,1378,96,4,0
96243071,524,3961,16,16,16,16,0,0,17.8,17.8,0,3962,20,36,20,36,0,0,14.42,15.92,0,3971,18,54,18,54,0,0,15.87,15.9,0,3972,15,69,12,66,3,3,12.43,15.15,0,Male,No,1378,96,2,0
96243072,525,3961,16,16,16,16,0,0,16.09,16.09,0,3962,15,31,15,31,3,0,12.99,14.59,0,3971,16,47,10,41,0,6,13.83,14.33,0,3972,20,67,20,61,0,0,12.77,13.87,0,Male,Yes,1377,96,1,0
96243073,526,3961,13,13,13,13,3,0,17.84,17.84,0,3962,18,31,18,31,0,0,17.46,17.62,0,3971,21,52,21,52,0,0,16.57,17.19,0,3972,17,69,17,69,0,0,17.16,17.18,0,Male,Yes,1377,96,1,0
96243075,527,3961,16,16,16,16,0,0,18.09,18.09,0,3962,18,34,15,31,0,3,14.23,16.04,0,3971,15,49,15,46,0,0,14.68,15.63,0,3972,20,69,20,66,0,0,14.71,15.36,0,Male,No,1378,96,4,0
96243076,528,3961,16,16,16,16,0,0,16.23,16.23,0,3962,18,34,18,34,0,0,14.93,15.54,0,3971,16,50,16,50,0,0,13.32,14.83,0,3972,17,67,14,64,0,3,14.06,14.64,0,Male,Yes,1377,96,1,0
96243077,529,3961,16,16,16,16,0,0,14.39,14.39,0,3962,14,30,14,30,0,0,15.52,14.92,0,3971,14,44,14,44,0,0,15.58,15.13,0,3972,15,59,15,59,0,0,17.02,15.61,0,Male,Yes,1377,96,1,0
96243078,530,3961,16,16,16,16,0,0,14.54,14.54,0,3962,18,34,15,31,0,3,13.47,13.97,0,3971,16,50,13,44,0,3,13.07,13.68,0,3972,16,66,16,60,3,0,13.25,13.58,0,Female,Yes,1378,96,1,0
96243079,531,3961,16,16,16,16,0,0,13.69,13.69,0,3962,18,34,18,34,0,0,13.81,13.75,0,3971,16,50,16,50,0,0,14.21,13.9,0,3972,14,64,11,61,3,3,10.82,13.22,1,Female,Yes,1378,96,1,1
96243080,532,3961,16,16,16,16,0,0,18.14,18.14,0,3962,17,33,17,33,3,0,16.32,17.2,0,3971,20,53,17,50,0,3,14.79,16.29,0,3972,20,73,20,70,0,0,17.16,16.53,0,Female,Yes,1377,96,1,0
96243081,533,3961,16,16,13,13,0,3,12.81,12.81,0,3962,16,32,16,29,0,0,14.01,13.41,0,3971,14,46,11,40,3,3,13.85,13.54,0,3972,17,63,17,57,3,0,13.45,13.52,0,Female,Yes,1377,96,1,0
96243082,534,3961,16,16,16,16,0,0,16.09,16.09,0,3962,12,28,6,22,3,6,11.44,14.1,1,3971,11,39,8,30,3,3,12.07,13.53,0,3972,11,50,8,38,3,3,12.15,13.22,0,Male,Yes,1378,96,1,1
96243084,535,3961,16,16,16,16,0,0,16.27,16.27,0,3962,18,34,18,34,0,0,15.64,15.93,0,3971,17,51,17,51,0,0,16.08,15.98,0,3972,19,70,16,67,0,3,16.77,16.2,0,Female,Yes,1378,96,1,0
96243085,536,3961,16,16,13,13,0,3,13.76,13.76,0,3962,13,29,13,26,3,0,16.43,14.96,0,3971,15,44,15,41,0,0,15.32,15.08,0,3972,13,57,13,54,3,0,15.39,15.15,0,Male,Yes,1378,96,1,0
96243086,537,3961,16,16,10,10,0,6,12.86,12.86,0,3962,13,29,13,23,0,0,15.46,14.03,0,3971,14,43,11,34,0,3,12.63,13.57,0,3972,14,57,9,43,3,5,10.78,12.89,1,Male,Yes,1377,96,2,1
96243087,538,3961,16,16,7,7,0,9,12.03,12.03,0,3962,14,30,14,21,0,0,16.79,14.25,0,3971,17,47,17,38,0,0,15.06,14.54,0,3972,16,63,13,51,0,3,13.48,14.27,0,Male,Yes,1377,96,1,0
96243089,539,3961,16,16,16,16,0,0,13.92,13.92,0,3962,13,29,10,26,3,3,10.87,12.55,1,3971,14,43,8,34,0,6,10.39,11.85,1,3972,14,57,14,48,0,0,14.15,12.42,0,Male,Yes,1378,96,1,2
96243091,540,3961,16,16,16,16,0,0,15.17,15.17,0,3962,17,33,14,30,0,3,14.87,15.01,0,3971,13,46,10,40,0,3,15.75,15.22,0,3972,17,63,17,57,0,0,17.18,15.75,0,Male,Yes,1377,96,5,0
96243092,541,3961,16,16,16,16,0,0,13.56,13.56,0,3962,14,30,14,30,0,0,12.26,12.95,0,3971,14,44,14,44,0,0,17.05,14.26,0,3972,12,56,12,56,3,0,15.08,14.43,0,Male,Yes,1377,96,5,0
96243093,542,3961,16,16,13,13,0,3,13.74,13.74,0,3962,17,33,17,30,0,0,15.31,14.55,0,3971,15,48,15,45,0,0,16.9,15.28,0,3972,16,64,16,61,0,0,17.48,15.83,0,Male,Yes,1378,96,5,0
96243094,543,3961,16,16,16,16,0,0,16.47,16.47,0,3962,14,30,14,30,0,0,16.25,16.37,0,3971,17,47,14,44,0,3,14.35,15.64,0,3972,16,63,16,60,0,0,15.84,15.69,0,Female,No,1377,96,2,0
96243095,544,3961,16,16,13,13,0,3,13.56,13.56,0,3962,18,34,18,31,0,0,11.8,12.63,1,3971,14,48,8,39,0,6,11.06,12.17,1,3972,14,62,8,47,0,6,12.4,12.22,0,Male,Yes,1378,96,1,2
96243097,545,3961,16,16,13,13,0,3,14.01,14.01,0,3962,14,30,14,27,0,0,16.64,15.24,0,3971,14,44,14,41,0,0,17.31,15.9,0,3972,17,61,17,58,0,0,16.35,16.02,0,Male,Yes,1378,96,1,0
96243099,546,3961,16,16,16,16,0,0,13.83,13.83,0,3962,16,32,16,32,0,0,14.1,13.96,0,3971,19,51,16,48,0,3,13.27,13.71,0,3972,18,69,18,66,0,0,14.1,13.81,0,Female,Yes,1377,96,1,0
