id,student_id,gender,residence,birthdate,entering,gpa,obtained_units,passed_units,failed_units,mashruti,mashruti_motevali,entering_type,terms
91213033,1,Female,Yes,1372,91,12.73,136,94,24,2,2,1,15
95243037,2,Male,No,1377,95,12.97,151,122,29,3,3,2,11
95243088,3,Male,Yes,1376,95,12.85,127,92,21,2,1,5,9
96243002,4,Male,Yes,1377,96,14.87,149,130,9,1,1,4,9
96243005,5,Female,Yes,1377,96,16.31,140,128,0,0,0,1,9
96243007,6,Male,No,1377,96,16.79,140,124,3,0,0,3,9
96243009,7,Male,No,1378,96,17.91,140,136,0,0,0,2,9
96243010,8,Male,No,1378,96,14.68,142,129,2,0,0,2,9
96243011,9,Male,Yes,1377,96,14.68,139,122,6,0,0,2,9
96243015,10,Female,Yes,1378,96,15.65,143,119,3,2,2,4,9
96243018,11,Male,Yes,1377,96,15.61,146,132,6,0,0,4,9
96243019,12,Female,Yes,1378,96,15.22,143,123,3,0,0,1,9
96243020,13,Female,No,1377,96,16.53,140,127,0,0,0,2,9
96243021,14,Female,Yes,1378,96,17.18,140,131,0,0,0,1,9
96243024,15,Male,Yes,1378,96,13.71,127,97,12,2,2,1,8
96243025,16,Male,Yes,1378,96,14.12,140,118,9,1,1,1,9
96243027,17,Male,Yes,1378,96,11.47,124,92,32,2,2,1,9
96243028,18,Male,No,1378,96,14.88,146,130,6,0,0,2,9
96243029,19,Male,No,1378,96,15.89,146,129,6,0,0,1,9
96243030,20,Male,Yes,1379,96,16.69,141,131,1,0,0,2,9
96243031,21,Male,No,1378,96,16.53,140,136,0,0,0,1,9
96243033,22,Male,No,1378,96,15.99,146,126,6,0,0,2,9
96243034,23,Male,No,1377,96,16.37,140,134,0,0,0,4,9
96243035,24,Male,Yes,1378,96,12.71,148,103,25,2,1,4,9
96243036,25,Male,Yes,1378,96,14.03,146,117,12,1,1,4,9
96243038,26,Male,No,1377,96,14.34,149,129,9,0,0,4,9
96243042,27,Male,Yes,1377,96,15.27,152,123,12,0,0,4,9
96243043,28,Female,No,1377,96,18.92,140,134,0,0,0,2,9
96243044,29,Female,No,1378,96,17.31,140,134,0,0,0,3,9
96243045,30,Male,No,1378,96,14.01,118,86,18,1,1,2,8
96243046,31,Male,Yes,1378,96,16.66,140,127,0,0,0,1,9
96243047,32,Male,Yes,1377,96,15.96,146,134,6,0,0,3,9
96243048,33,Female,Yes,1378,96,14.97,146,132,6,1,1,1,9
96243049,34,Male,No,1378,96,15.54,140,127,0,0,0,2,9
96243050,35,Male,Yes,1377,96,16.95,140,133,0,0,0,4,9
96243054,36,Male,No,1377,96,12.82,144,99,30,2,1,4,9
96243056,37,Female,Yes,1378,96,13.46,158,117,18,1,1,4,9
96243057,38,Male,No,1378,96,13.38,135,105,12,2,1,2,9
96243058,39,Male,No,1377,96,12.36,147,101,26,2,1,4,9
96243059,40,Female,Yes,1378,96,14.9,149,123,9,0,0,1,9
96243060,41,Male,No,1377,96,14.5,139,123,4,0,0,2,9
96243061,42,Male,Yes,1377,96,16.98,140,131,0,0,0,1,9
96243062,43,Female,No,1378,96,14.8,146,133,6,1,1,3,9
96243064,44,Male,Yes,1377,96,14.02,144,112,18,1,1,1,9
96243065,45,Male,No,1377,96,13.27,142,101,21,2,2,2,9
96243066,46,Male,Yes,1377,96,14.53,136,121,0,1,1,1,9
96243067,47,Female,No,1377,96,15.79,146,130,6,0,0,3,9
96243068,48,Male,Yes,1378,96,16.17,146,127,6,0,0,1,9
96243069,49,Female,Yes,1378,96,12.35,143,99,30,2,1,4,9
96243070,50,Male,No,1378,96,14.09,152,113,21,0,0,4,9
96243071,51,Male,No,1378,96,14.49,152,124,12,1,1,2,9
96243072,52,Male,Yes,1377,96,14.34,146,132,6,0,0,1,9
96243073,53,Male,Yes,1377,96,16.82,140,126,0,0,0,1,9
96243075,54,Male,No,1378,96,15.83,143,132,3,0,0,4,9
96243076,55,Male,Yes,1377,96,14.89,147,126,6,0,0,1,9
96243077,56,Male,Yes,1377,96,15.69,127,107,3,0,0,1,9
96243078,57,Female,Yes,1378,96,13.87,149,121,9,0,0,1,9
96243079,58,Female,Yes,1378,96,14.23,143,122,3,1,1,1,9
96243080,59,Female,Yes,1377,96,16.8,143,136,3,0,0,1,9
96243081,60,Female,Yes,1377,96,14.89,146,125,6,0,0,1,9
96243082,61,Male,Yes,1378,96,13.83,127,86,21,1,1,1,8
96243084,62,Female,Yes,1378,96,17.06,143,139,3,0,0,1,9
96243085,63,Male,Yes,1378,96,15.35,136,113,6,0,0,1,9
96243086,64,Male,Yes,1377,96,13.27,142,99,24,1,1,2,9
96243087,65,Male,Yes,1377,96,14.83,145,120,12,0,0,1,9
96243089,66,Male,Yes,1378,96,13.18,142,114,9,2,2,1,9
96243091,67,Male,Yes,1377,96,15.9,149,129,9,0,0,5,9
96243092,68,Male,Yes,1377,96,14.22,109,96,3,0,0,5,8
96243093,69,Male,Yes,1378,96,15.44,143,120,6,0,0,5,9
96243094,70,Female,No,1377,96,15.45,143,124,3,0,0,2,9
96243095,71,Male,Yes,1378,96,12.81,148,107,21,2,2,1,9
96243097,72,Male,Yes,1378,96,17.01,136,118,3,0,0,1,9
96243099,73,Female,Yes,1377,96,14.96,143,130,3,0,0,1,9
96243114,74,Male,Yes,1377,96,15.62,98,78,6,1,1,5,7
96243116,75,Male,Yes,1378,96,13.02,116,84,14,1,1,5,7
97243001,76,Male,Yes,1373,97,12.96,106,70,16,1,1,5,7
97243002,77,Female,Yes,1379,97,14.52,109,80,9,1,1,3,7
97243003,78,Female,Yes,1378,97,17.75,114,99,0,0,0,1,7
97243005,79,Male,Yes,1379,97,14.08,120,90,13,0,0,1,7
97243006,80,Female,Yes,1379,97,14.6,114,91,6,0,0,4,7
97243007,81,Male,No,1378,97,8.27,71,26,31,3,3,4,6
97243008,82,Male,Yes,1379,97,12.25,86,53,20,3,3,1,7
97243009,83,Female,Yes,1373,97,18.94,123,104,0,0,0,1,7
97243011,84,Male,Yes,1378,97,16.8,117,105,0,0,0,1,7
97243012,85,Male,Yes,1378,97,15.85,119,100,3,0,0,1,7
97243013,86,Male,No,1378,97,14.61,116,95,3,0,0,2,7
97243014,87,Male,No,1378,97,16.92,123,107,3,0,0,2,7
97243015,88,Female,Yes,1378,97,13.61,103,73,15,1,1,4,7
97243016,89,Male,No,1379,97,16.44,119,99,3,0,0,2,7
97243017,90,Male,Yes,1378,97,16.1,123,93,6,0,0,1,7
97243018,91,Male,Yes,1378,97,14.67,122,98,6,0,0,4,7
97243019,92,Male,Yes,1378,97,13.21,103,63,21,1,1,4,7
97243020,93,Female,Yes,1378,97,17.58,125,105,0,0,0,1,7
97243022,94,Female,Yes,1378,97,12.55,111,83,9,1,1,4,7
97243023,95,Male,Yes,1379,97,17.84,123,105,0,0,0,1,7
97243024,96,Male,Yes,1379,97,15.52,120,103,3,0,0,1,7
97243025,97,Male,Yes,1379,97,18.91,125,106,0,0,0,1,7
97243026,98,Female,Yes,1379,97,16.65,114,95,3,0,0,1,7
97243027,99,Male,Yes,1379,97,13.9,108,75,15,2,1,4,7
97243028,100,Male,Yes,1378,97,18.67,125,109,0,0,0,1,7
97243029,101,Male,Yes,1379,97,17.83,122,103,0,0,0,1,7
97243030,102,Female,Yes,1378,97,13.37,121,94,9,0,0,4,7
97243031,103,Female,Yes,1378,97,13.43,107,72,21,1,1,4,7
97243032,104,Female,Yes,1379,97,15.73,116,100,0,0,0,1,7
97243034,105,Female,Yes,1379,97,18.77,117,100,0,0,0,1,7
97243035,106,Male,Yes,1378,97,17.13,127,110,0,0,0,1,7
97243036,107,Male,Yes,1379,97,14.66,112,89,5,1,1,2,7
97243037,108,Male,Yes,1380,97,17.62,118,102,0,0,0,4,7
97243038,109,Male,Yes,1379,97,16.31,120,101,3,0,0,4,7
97243039,110,Male,Yes,1378,97,16.89,109,90,0,0,0,1,7
97243040,111,Male,No,1379,97,11.51,98,60,21,3,3,4,7
97243041,112,Male,No,1378,97,16.45,115,99,0,0,0,3,7
97243042,113,Male,Yes,1378,97,17.38,119,103,0,0,0,4,7
97243043,114,Male,No,1379,97,17.98,106,91,0,0,0,2,7
97243044,115,Male,No,1378,97,17.18,118,103,0,0,0,2,7
97243045,116,Female,Yes,1378,97,16.75,119,97,3,0,0,1,7
97243046,117,Female,No,1378,97,16.18,119,98,3,0,0,1,7
97243047,118,Male,No,1378,97,17.02,111,99,0,0,0,1,7
97243049,119,Male,Yes,1378,97,12.85,110,68,28,1,1,4,7
97243050,120,Female,Yes,1379,97,18.96,123,110,0,0,0,1,7
97243051,121,Male,No,1379,97,15.31,117,96,3,0,0,1,7
97243052,122,Female,Yes,1378,97,14,115,89,9,0,0,3,7
97243054,123,Male,No,1379,97,18.71,122,106,0,0,0,2,7
97243055,124,Male,Yes,1379,97,16.37,110,92,0,0,0,4,7
97243056,125,Male,No,1379,97,15.96,112,86,9,0,0,1,7
97243057,126,Female,Yes,1378,97,15.81,116,102,0,0,0,1,7
97243058,127,Female,Yes,1379,97,16.83,119,98,3,0,0,4,7
97243059,128,Male,Yes,1379,97,13.13,71,47,10,1,1,1,5
97243060,129,Male,Yes,1378,97,14.99,111,94,3,0,0,1,7
97243061,130,Male,Yes,1379,97,16.03,107,91,3,0,0,1,7
97243062,131,Male,Yes,1378,97,16.02,115,99,3,0,0,2,7
97243063,132,Female,Yes,1379,97,16.18,118,104,0,0,0,1,7
97243064,133,Male,Yes,1379,97,17.04,116,101,2,0,0,2,7
97243066,134,Male,No,1378,97,17.67,123,106,0,0,0,2,7
97243067,135,Female,No,1378,97,16.49,116,100,0,0,0,2,7
97243068,136,Male,Yes,1378,97,16.56,120,104,0,0,0,1,7
97243069,137,Male,Yes,1379,97,13.49,110,72,24,2,2,1,7
97243070,138,Male,Yes,1379,97,17.93,118,102,0,0,0,1,7
97243072,139,Female,No,1379,97,17.15,116,99,0,0,0,1,7
97243073,140,Male,Yes,1378,97,18.18,123,110,0,0,0,4,7
97243074,141,Male,Yes,1379,97,15.26,117,96,3,0,0,1,7
97243075,142,Male,Yes,1377,97,12.9,94,68,12,2,2,3,7
97243076,143,Male,Yes,1378,97,17.78,115,96,0,0,0,1,7
97243077,144,Male,Yes,1378,97,15.43,124,95,12,1,1,2,7
97243080,145,Male,Yes,1378,97,13.88,123,91,12,0,0,1,7
97243081,146,Male,No,1379,97,16.18,116,90,6,0,0,2,7
97243082,147,Male,Yes,1377,97,14.71,122,97,6,0,0,1,7
97243083,148,Male,Yes,1379,97,15.33,120,92,9,0,0,1,7
97243084,149,Male,Yes,1379,97,14.63,102,85,3,0,0,1,7
97243086,150,Female,Yes,1378,97,14.98,116,100,0,0,0,1,7
97243088,151,Female,Yes,1379,97,15.27,114,94,3,0,0,1,7
97243089,152,Male,Yes,1378,97,16.67,115,97,3,0,0,1,7
97243090,153,Male,Yes,1378,97,14.88,110,89,3,0,0,1,7
97243091,154,Male,Yes,1378,97,16.15,116,95,3,0,0,1,7
97243092,155,Male,Yes,1379,97,15.9,115,95,3,0,0,1,7
97243093,156,Male,Yes,1379,97,17.33,124,109,0,0,0,1,7
97243094,157,Male,Yes,1378,97,17.6,117,105,0,0,0,1,7
97243096,158,Female,Yes,1379,97,16.26,117,95,6,0,0,1,7
97243097,159,Male,Yes,1379,97,11.01,92,54,26,2,1,1,7
97243098,160,Female,Yes,1378,97,15.46,118,96,3,0,0,1,7
97243100,161,Female,Yes,1379,97,12.36,90,66,24,3,2,1,6
97243101,162,Male,Yes,1380,97,14.93,118,92,6,0,0,1,7
97243102,163,Female,Yes,1378,97,12.92,125,84,22,1,1,1,7
97243103,164,Male,Yes,1379,97,15.68,114,98,0,0,0,1,7
97243104,165,Female,Yes,1379,97,14.87,116,93,6,0,0,1,7
97243105,166,Male,Yes,1378,97,13.72,125,90,18,1,1,5,7
97243113,167,Male,Yes,1379,97,16.59,75,61,0,0,0,5,5
97243128,168,Male,Yes,1378,97,18.34,48,35,0,0,0,5,3
97243129,169,Male,Yes,1379,97,17.24,120,100,4,0,0,5,7
98243001,170,Male,Yes,1380,98,16.87,99,81,0,0,0,1,5
98243002,171,Female,Yes,1380,98,18.88,86,71,0,0,0,1,5
98243003,172,Male,Yes,1380,98,15.82,81,67,0,0,0,1,5
98243004,173,Male,Yes,1380,98,19.25,88,71,0,0,0,1,5
98243005,174,Male,No,1380,98,18.1,94,77,0,0,0,2,5
98243007,175,Male,Yes,1379,98,16.07,89,73,0,0,0,4,5
98243008,176,Female,Yes,1380,98,18.94,93,75,0,0,0,1,5
98243009,177,Male,Yes,1380,98,8.85,65,32,20,2,1,1,5
98243010,178,Male,No,1380,98,14.77,81,61,6,1,1,2,5
98243011,179,Female,Yes,1379,98,16.57,86,68,0,0,0,1,5
98243012,180,Female,Yes,1380,98,14.32,77,54,9,1,1,1,5
98243014,181,Male,Yes,1380,98,10.28,61,35,14,3,3,4,5
98243015,182,Male,Yes,1380,98,15.75,90,71,0,0,0,4,5
98243016,183,Male,Yes,1380,98,16.94,88,69,0,0,0,1,5
98243017,184,Male,Yes,1379,98,16.8,90,71,3,0,0,1,5
98243018,185,Female,No,1380,98,14.49,87,64,9,1,1,4,5
98243019,186,Male,Yes,1380,98,14.78,89,69,3,0,0,4,5
98243020,187,Female,Yes,1379,98,14.89,88,68,0,0,0,4,5
98243021,188,Male,Yes,1379,98,16.04,98,72,6,0,0,3,5
98243022,189,Male,Yes,1379,98,17.14,95,74,3,0,0,1,5
98243023,190,Female,No,1379,98,16.27,93,70,6,0,0,4,5
98243024,191,Male,Yes,1379,98,16.24,83,65,0,0,0,1,5
98243025,192,Male,Yes,1380,98,18.07,87,68,0,0,0,1,5
98243026,193,Female,Yes,1380,98,15.75,91,71,3,0,0,4,5
98243027,194,Male,Yes,1380,98,16.74,87,67,0,0,0,1,5
98243028,195,Male,Yes,1379,98,16.61,90,64,6,0,0,1,5
98243029,196,Male,Yes,1380,98,17.67,83,70,0,0,0,2,5
98243030,197,Male,No,1379,98,15.83,66,47,6,0,0,2,5
98243031,198,Male,Yes,1379,98,15.12,84,61,3,0,0,1,5
98243032,199,Male,Yes,1380,98,18.59,84,66,0,0,0,1,5
98243033,200,Female,No,1380,98,16.58,90,76,0,0,0,2,5
98243034,201,Male,Yes,1380,98,15.81,83,66,0,0,0,1,5
98243035,202,Female,Yes,1380,98,15.36,87,68,3,0,0,4,5
98243036,203,Female,No,1379,98,14.28,80,66,0,0,0,2,5
98243037,204,Male,Yes,1380,98,16.27,89,67,3,0,0,1,5
98243038,205,Male,No,1380,98,15.94,83,66,0,0,0,4,5
98243039,206,Female,Yes,1379,98,16.56,92,69,3,0,0,3,5
98243040,207,Female,No,1380,98,13.69,72,58,0,1,1,4,5
98243041,208,Female,No,1379,98,15.14,89,67,6,0,0,4,5
98243042,209,Male,Yes,1379,98,13.68,77,56,9,1,1,1,5
98243043,210,Female,Yes,1380,98,17.98,91,72,0,0,0,1,5
98243045,211,Male,Yes,1379,98,15.25,85,66,0,0,0,4,5
98243046,212,Male,No,1379,98,13.74,80,60,3,0,0,2,5
98243047,213,Female,Yes,1380,98,15.28,86,63,6,0,0,4,5
98243048,214,Male,No,1380,98,16.35,70,53,0,0,0,2,5
98243049,215,Male,Yes,1380,98,17.62,86,71,0,0,0,1,5
98243050,216,Male,Yes,1380,98,17.52,89,72,0,0,0,1,5
98243051,217,Female,Yes,1379,98,14.55,80,50,10,1,1,1,5
98243052,218,Female,No,1380,98,15.49,87,65,3,0,0,2,5
98243053,219,Male,No,1379,98,16.53,87,69,0,0,0,4,5
98243054,220,Female,Yes,1379,98,16.42,76,60,0,0,0,4,5
98243055,221,Male,No,1380,98,17.36,89,71,0,0,0,2,5
98243056,222,Male,Yes,1379,98,17.75,75,62,0,0,0,2,5
98243058,223,Male,No,1380,98,18.28,86,69,0,0,0,2,5
98243059,224,Male,No,1380,98,14.82,85,70,0,0,0,4,5
98243060,225,Male,Yes,1380,98,17.25,88,69,0,0,0,1,5
98243061,226,Male,Yes,1380,98,16.89,90,73,0,0,0,1,5
98243062,227,Male,Yes,1380,98,17.34,75,56,2,0,0,1,5
98243063,228,Male,Yes,1379,98,15.33,84,65,0,0,0,3,5
98243064,229,Male,Yes,1379,98,17.3,88,69,0,0,0,1,5
98243065,230,Male,Yes,1379,98,8.13,58,24,22,2,2,4,5
98243066,231,Male,No,1379,98,18.07,84,63,0,0,0,2,5
98243068,232,Male,No,1380,98,18.5,79,62,0,0,0,2,5
98243070,233,Male,No,1379,98,18.07,87,70,0,0,0,2,5
98243072,234,Male,Yes,1379,98,15.24,87,66,2,0,0,1,5
98243074,235,Female,Yes,1379,98,14.91,78,58,3,0,0,1,5
98243075,236,Female,Yes,1380,98,14.77,85,56,9,0,0,1,5
98243076,237,Male,Yes,1379,98,15.35,85,63,3,0,0,1,5
98243077,238,Male,Yes,1379,98,13.82,72,52,6,2,2,1,5
98243078,239,Male,Yes,1380,98,13.34,69,40,15,1,1,1,5
98243079,240,Female,Yes,1380,98,17.55,89,71,3,0,0,2,5
98243080,241,Male,Yes,1379,98,13.23,58,36,9,1,1,1,4
98243081,242,Male,Yes,1379,98,15.67,76,60,0,0,0,1,5
98243082,243,Female,Yes,1379,98,15.86,66,52,0,0,0,1,5
98243083,244,Female,Yes,1380,98,15.05,72,55,0,0,0,1,5
98243084,245,Male,Yes,1380,98,14.41,83,60,5,0,0,2,5
98243085,246,Female,Yes,1379,98,19.09,91,71,0,0,0,1,5
98243086,247,Male,Yes,1380,98,12.96,74,45,15,2,2,1,5
98243087,248,Female,Yes,1380,98,14.26,83,59,6,0,0,1,5
98243089,249,Male,No,1380,98,16.51,66,48,0,0,0,2,5
98243090,250,Female,Yes,1381,98,16.76,83,66,0,0,0,1,5
98243091,251,Male,Yes,1379,98,15.65,91,66,6,0,0,1,5
98243092,252,Female,No,1380,98,18.18,86,66,0,0,0,2,5
98243094,253,Male,Yes,1380,98,13.29,37,22,0,0,0,1,5
98243095,254,Female,Yes,1380,98,15.29,86,64,3,0,0,1,5
98243097,255,Male,Yes,1379,98,17.31,95,72,3,0,0,1,5
98243107,256,Female,Yes,1379,98,17.53,36,19,0,0,0,1,5
99243003,257,Female,Yes,1379,99,16.75,3,3,0,0,0,1,3
99243004,258,Male,No,1379,99,13.22,3,3,0,0,0,2,2
99243007,259,Male,Yes,1375,99,14.77,44,25,3,0,0,5,3
99243009,260,Male,Yes,1381,99,16.69,51,31,0,0,0,2,3
99243010,261,Male,No,1381,99,16.58,49,32,0,0,0,4,3
99243011,262,Male,Yes,1381,99,18.14,49,31,0,0,0,1,3
99243012,263,Female,No,1381,99,14.87,48,29,0,0,0,2,3
99243013,264,Male,Yes,1380,99,15.98,51,33,0,0,0,4,3
99243014,265,Male,Yes,1380,99,17.17,55,36,0,0,0,4,3
99243015,266,Female,Yes,1380,99,16.48,53,33,0,0,0,1,3
99243016,267,Male,No,1381,99,16.08,51,32,0,0,0,2,3
99243017,268,Female,No,1381,99,16.97,51,31,0,0,0,2,3
99243018,269,Male,Yes,1381,99,16.83,48,29,0,0,0,1,3
99243019,270,Male,No,1380,99,16.9,51,31,0,0,0,2,3
99243020,271,Male,Yes,1381,99,13.82,46,29,3,1,1,1,3
99243021,272,Male,No,1379,99,15.41,49,31,0,0,0,2,3
99243022,273,Female,Yes,1381,99,16.08,51,32,0,0,0,4,3
99243023,274,Male,No,1381,99,17.5,51,31,0,0,0,1,3
99243024,275,Male,No,1380,99,11.85,38,16,10,1,1,4,3
99243025,276,Male,No,1381,99,17.11,52,32,0,0,0,2,3
99243026,277,Male,Yes,1381,99,16.62,49,32,0,0,0,1,3
99243027,278,Female,Yes,1381,99,17.37,53,33,0,0,0,1,3
99243028,279,Male,Yes,1381,99,17.76,51,32,0,0,0,1,3
99243029,280,Female,Yes,1381,99,17.27,49,31,0,0,0,4,3
99243030,281,Male,Yes,1381,99,16.16,51,32,0,0,0,4,3
99243031,282,Male,No,1381,99,17.44,51,31,0,0,0,3,3
99243032,283,Female,Yes,1380,99,18.16,51,32,0,0,0,1,3
99243033,284,Male,Yes,1380,99,14.48,49,31,0,0,0,4,3
99243034,285,Female,No,1380,99,17.06,49,32,0,0,0,1,3
99243035,286,Female,Yes,1380,99,16.93,49,31,0,0,0,1,3
99243036,287,Male,Yes,1380,99,15.36,52,33,0,0,0,1,3
99243037,288,Male,No,1381,99,17.69,53,33,0,0,0,3,3
99243038,289,Male,No,1381,99,13.78,49,29,3,0,0,4,3
99243039,290,Female,Yes,1380,99,10.26,44,18,13,1,1,1,3
99243040,291,Female,Yes,1381,99,11.7,39,17,9,1,1,4,3
99243041,292,Male,No,1380,99,15.85,46,31,0,0,0,1,3
99243042,293,Female,Yes,1380,99,18.31,53,33,0,0,0,1,3
99243043,294,Male,No,1380,99,13.84,43,29,0,1,1,4,3
99243044,295,Male,Yes,1380,99,17.5,46,29,0,0,0,2,3
99243045,296,Male,No,1380,99,14.57,49,31,0,0,0,4,3
99243046,297,Female,Yes,1381,99,15.79,51,32,0,0,0,3,3
99243047,298,Male,Yes,1381,99,16.73,51,31,0,0,0,1,3
99243048,299,Female,No,1380,99,16.64,51,32,0,0,0,4,3
99243049,300,Male,Yes,1381,99,16.83,49,31,0,0,0,1,3
99243050,301,Female,No,1381,99,17.2,51,32,0,0,0,2,3
99243051,302,Female,No,1381,99,17.63,51,33,0,0,0,3,3
99243052,303,Female,Yes,1380,99,14.58,51,29,3,0,0,3,3
99243053,304,Female,Yes,1380,99,16.54,51,31,0,0,0,4,3
99243054,305,Male,No,1381,99,15.42,51,32,0,0,0,1,3
99243055,306,Male,No,1381,99,13.46,43,26,3,1,1,3,3
99243056,307,Male,Yes,1381,99,16.67,53,34,0,0,0,2,3
99243057,308,Female,Yes,1380,99,17.99,51,33,0,0,0,1,3
99243058,309,Male,No,1380,99,14.52,51,31,3,0,0,2,3
99243059,310,Male,No,1381,99,12.97,51,28,3,0,0,4,3
99243060,311,Male,Yes,1380,99,16.66,51,32,0,0,0,4,3
99243061,312,Female,Yes,1381,99,18.51,51,31,0,0,0,1,3
99243062,313,Female,Yes,1380,99,16.35,51,32,0,0,0,1,3
99243063,314,Female,Yes,1381,99,14.95,49,29,0,0,0,4,3
99243064,315,Female,No,1380,99,17.09,51,32,0,0,0,1,3
99243065,316,Male,No,1381,99,16.73,51,31,0,0,0,2,3
99243066,317,Male,Yes,1382,99,16.64,53,33,0,0,0,1,3
99243067,318,Male,Yes,1380,99,13.52,46,24,6,0,0,1,3
99243068,319,Female,No,1381,99,16.75,51,32,0,0,0,2,3
99243069,320,Male,Yes,1382,99,17.49,49,31,0,0,0,2,3
99243070,321,Female,Yes,1381,99,17.86,53,33,0,0,0,1,3
99243071,322,Female,Yes,1380,99,14.76,49,31,0,0,0,1,3
99243072,323,Female,Yes,1381,99,15.88,48,29,0,0,0,4,3
99243073,324,Male,No,1380,99,16.62,51,31,0,0,0,1,3
99243074,325,Male,No,1380,99,17.34,49,32,0,0,0,4,3
99243075,326,Female,No,1380,99,16.99,51,31,0,0,0,2,3
99243076,327,Female,No,1381,99,16.85,51,32,0,0,0,1,3
99243077,328,Male,No,1381,99,15.42,49,31,0,0,0,4,3
99243078,329,Male,Yes,1381,99,14.73,48,29,3,0,0,1,3
99243079,330,Female,Yes,1380,99,13.89,45,26,0,0,0,4,3
99243080,331,Female,Yes,1381,99,15.59,50,31,0,0,0,1,3
99243081,332,Male,Yes,1380,99,14.83,50,30,0,0,0,3,3
99243082,333,Female,Yes,1380,99,17.17,51,32,0,0,0,1,3
99243083,334,Male,Yes,1380,99,16.88,51,31,0,0,0,1,3
99243084,335,Male,Yes,1381,99,16.76,49,32,0,0,0,1,3
99243085,336,Male,Yes,1380,99,15.37,52,32,3,0,0,1,3
99243086,337,Male,Yes,1380,99,15.63,51,32,0,0,0,4,3
99243087,338,Male,Yes,1380,99,15.51,45,30,1,0,0,1,3
99243088,339,Female,Yes,1380,99,13.05,30,11,3,0,0,1,3
99243089,340,Female,Yes,1380,99,17.21,54,34,0,0,0,1,3
99243091,341,Male,Yes,1380,99,12.4,44,23,6,0,0,5,3
99243093,342,Male,No,1379,99,16,3,3,0,0,0,1,2
99243098,343,Male,Yes,1380,99,0,12,0,12,1,1,5,2
99243099,344,Male,Yes,1381,99,16.46,24,12,0,0,0,5,2
99243100,345,Male,Yes,1381,99,16.78,27,12,0,0,0,5,2
99243101,346,Male,Yes,1380,99,15.59,27,12,0,0,0,5,2
99243102,347,Male,Yes,1382,99,15.26,28,12,0,0,0,5,2
99243103,348,Male,Yes,1380,99,12.88,29,12,0,0,0,5,2
99243104,349,Male,Yes,1379,99,13.61,27,9,3,0,0,5,2
