student_id,F_obtained_units,F_passed_units,F_failed_units,F_gpa,TF_gpa,1_term,1_obtained_units,1_total_obtained_units,1_passed_units,1_total_passed_units,1_deleted_units,1_failed_units,1_gpa,1_cgpa,1_mashruti,2_term,2_obtained_units,2_total_obtained_units,2_passed_units,2_total_passed_units,2_deleted_units,2_failed_units,2_gpa,2_cgpa,2_mashruti,3_term,3_obtained_units,3_total_obtained_units,gender,residence,birthdate,entering,reported_mashrooti,mashrooti,entering_type,obtained_units_till_Th,f_o,p_o,terms_last,m_t
1,15,15,0,13.58,13.58,3932,14,90,14,72,0,0,13.75,12.82,0,3941,20,110,17,89,0,3,13.12,12.88,0,3942,8,118,Female,Yes,1372,91,1,1,1,110,0.19090909,0.8090909,13,0.15384616
2,20,20,0,16.66,16.66,3981,16,126,6,107,3,10,9.75,13.56,1,3982,12,138,8,115,6,4,9.93,13.24,1,3991,13,151,Male,No,1377,95,2,2,2,138,0.16666667,0.8333333,9,0.22222222
3,1,1,0,10.5,10.5,3981,16,79,13,64,0,3,11.32,12.98,1,3991,14,93,14,78,0,0,13.63,13.07,0,3992,20,113,Male,Yes,1376,95,1,1,5,93,0.16129032,0.83870965,7,0.14285715
4,16,16,0,14.8,14.8,3982,20,104,20,95,0,0,16.8,14.1,0,3991,15,119,15,110,0,0,15.6,14.29,0,3992,19,138,Male,Yes,1377,96,1,1,4,119,0.075630255,0.9327731,7,0.14285715
5,16,16,0,17.76,17.76,3982,12,96,12,96,3,0,17.85,16.13,0,3991,16,112,16,112,0,0,17.79,16.37,0,3992,15,127,Female,Yes,1377,96,0,0,1,112,0,1.0089285,7,0
6,16,16,0,19.96,19.96,3982,9,94,9,94,6,0,17.4,17.26,0,3991,17,111,14,108,0,3,14.29,16.8,0,3992,16,127,Male,No,1377,96,0,0,3,111,0.027027028,0.972973,7,0
7,16,16,0,15.29,15.29,3982,18,102,18,102,0,0,19.42,17.33,0,3991,19,121,19,121,0,0,19.52,17.68,0,3992,15,136,Male,No,1378,96,0,0,2,121,0,1,7,0
8,16,16,0,15.26,15.26,3982,14,98,13,97,5,1,13.06,14.26,0,3991,17,115,17,114,0,0,16.77,14.63,0,3992,16,131,Male,No,1378,96,0,0,2,115,0.008695652,0.99130434,7,0
9,16,16,0,17.04,17.04,3982,16,98,16,92,3,0,15.7,14.76,0,3991,16,114,16,108,0,0,15.69,14.89,0,3992,13,127,Male,Yes,1377,96,0,0,2,114,0.05263158,0.95614034,7,0
10,16,16,0,16.35,16.35,3982,13,93,10,90,3,3,16.16,16.86,0,3991,15,108,15,105,3,0,11.7,16.14,1,3992,14,122,Female,Yes,1378,96,1,1,4,108,0.027777778,0.9722222,7,0.14285715
11,16,16,0,17.09,17.09,3982,19,107,19,101,0,0,15.94,15.07,0,3991,16,123,16,117,0,0,17.31,15.36,0,3992,15,138,Male,Yes,1377,96,0,0,4,123,0.04878049,0.9512195,7,0
12,16,16,0,16.71,16.71,3982,13,99,13,96,3,0,15.63,15.26,0,3991,12,111,12,108,3,0,13.74,15.09,0,3992,15,126,Female,Yes,1378,96,0,0,1,111,0.027027028,0.972973,7,0
13,16,16,0,18.09,18.09,3982,17,102,17,102,0,0,17.63,16.08,0,3991,13,115,13,115,2,0,18.75,16.38,0,3992,12,127,Female,No,1377,96,0,0,2,115,0,1,7,0
14,13,13,0,17.01,17.01,3982,16,103,16,103,3,0,18.97,16.5,0,3991,16,119,16,119,0,0,19.4,16.89,0,3992,12,131,Female,Yes,1378,96,0,0,1,119,0,1,7,0
15,16,7,9,11.52,11.52,3981,17,74,17,62,3,0,13.41,13.25,0,3991,19,93,19,81,0,0,14.6,13.53,0,3992,16,109,Male,Yes,1378,96,2,2,1,93,0.12903225,0.87096775,6,0.33333334
16,16,16,0,16.62,16.62,3982,16,95,13,89,0,3,12.28,14.22,0,3991,17,112,17,106,0,0,15.6,14.43,0,3992,15,127,Male,Yes,1378,96,0,0,1,112,0.05357143,0.9464286,7,0
17,16,16,0,14.07,14.07,3982,15,98,12,92,0,3,13.52,13.58,0,3991,12,110,0,92,3,12,7.67,12.93,1,3992,14,124,Male,Yes,1378,96,1,1,1,110,0.16363636,0.8363636,7,0.14285715
18,16,16,0,17.08,17.08,3982,20,106,20,100,0,0,14.74,14.74,0,3991,12,118,12,112,3,0,14.14,14.68,0,3992,18,136,Male,No,1378,96,0,0,2,118,0.05084746,0.9491525,7,0
19,16,16,0,18.53,18.53,3982,17,100,17,94,0,0,14.71,15.11,0,3991,18,118,18,112,0,0,17.93,15.54,0,3992,16,134,Male,No,1378,96,0,0,1,118,0.05084746,0.9576271,7,0
20,16,16,0,19.22,19.22,3982,18,102,17,101,0,1,14.58,16.36,0,3991,16,118,16,117,0,0,18.44,16.65,0,3992,14,132,Male,Yes,1379,96,0,0,2,118,0.008474576,0.9915254,7,0
21,16,16,0,17.98,17.98,3982,17,102,17,102,0,0,14.55,16.08,0,3991,17,119,17,119,0,0,18.11,16.37,0,3992,17,136,Male,No,1378,96,0,0,1,119,0,1,7,0
22,16,16,0,17.96,17.96,3982,16,102,14,100,0,2,13.59,16.71,0,3991,18,120,17,117,0,1,14.13,16.32,0,3992,12,132,Male,No,1378,96,0,0,2,120,0.025,0.975,7,0
23,16,16,0,18.69,18.69,3982,15,101,15,101,0,0,17.08,16.69,0,3991,17,118,17,118,0,0,15.83,16.57,0,3992,16,134,Male,No,1377,96,0,0,4,118,0,1,7,0
24,16,10,6,11.27,11.27,3982,13,88,10,66,0,3,12.45,12.23,0,3991,20,108,17,83,0,3,13.51,12.47,0,3992,17,125,Male,Yes,1378,96,2,2,4,125,0.2,0.8,7,0.2857143
25,16,16,0,17.75,17.75,3982,19,98,16,89,0,3,14.81,14.19,0,3991,17,115,17,106,3,0,13.3,14.06,0,3992,14,129,Male,Yes,1378,96,1,1,4,115,0.07826087,0.9217391,7,0.14285715
26,16,13,3,14.4,14.4,3982,19,103,19,94,0,0,14.79,13.9,0,3991,17,120,17,111,0,0,16.22,14.23,0,3992,18,138,Male,No,1377,96,0,0,4,120,0.075,0.925,7,0
27,16,16,0,18.04,18.04,3982,18,106,18,94,0,0,17.42,14.82,0,3991,15,121,15,109,0,0,18.5,15.27,0,3992,14,135,Male,Yes,1377,96,0,0,4,121,0.09917355,0.90082645,7,0
28,16,16,0,18.88,18.88,3982,16,102,16,102,0,0,17.98,18.89,0,3991,14,118,14,118,0,0,19.44,18.97,0,3992,15,133,Female,No,1377,96,0,0,2,118,0,1.0084746,7,0
29,16,16,0,18.7,18.7,3982,20,105,20,105,0,0,15.92,17.31,0,3991,17,122,17,122,0,0,16.46,17.19,0,3992,11,133,Female,No,1378,96,0,0,3,122,0,1.0081967,7,0
30,16,16,0,18.81,18.81,3981,13,75,10,69,3,3,12.54,14.99,0,3982,13,88,7,76,4,6,12.16,14.57,0,3992,16,104,Male,No,1378,96,0,0,2,88,0.13636364,0.8636364,6,0
31,16,16,0,17.38,17.38,3982,16,93,16,93,3,0,17.17,16.48,0,3991,17,110,17,110,0,0,16.72,16.52,0,3992,17,127,Male,Yes,1378,96,0,0,1,110,0,1,7,0
32,16,16,0,14.8,14.8,3982,20,112,20,106,0,0,17.91,15.37,0,3991,15,127,15,121,0,0,18.49,15.74,0,3992,13,140,Male,Yes,1377,96,0,0,3,127,0.047244094,0.9527559,7,0
33,16,16,0,15.07,15.07,3982,19,103,19,97,0,0,15.09,14.11,0,3991,20,123,20,117,0,0,18.17,14.77,0,3992,15,138,Female,Yes,1378,96,1,1,1,123,0.04878049,0.9512195,7,0.14285715
34,16,16,0,16.46,16.46,3982,13,97,13,97,3,0,17,15.39,0,3991,16,113,16,113,0,0,15.99,15.48,0,3992,13,126,Male,No,1378,96,0,0,2,113,0,1.0088495,7,0
35,16,16,0,18.61,18.61,3982,16,101,16,101,0,0,15.28,16.46,0,3991,15,116,15,116,0,0,17.93,16.65,0,3992,17,133,Male,Yes,1377,96,0,0,4,116,0,1,7,0
36,16,13,3,15.37,15.37,3982,20,98,17,77,0,3,12.77,12.73,0,3991,14,112,11,88,3,3,13.22,12.79,0,3992,16,128,Male,No,1377,96,2,2,4,112,0.21428572,0.79464287,7,0.2857143
37,16,10,6,13.36,13.36,3982,18,98,18,80,0,0,16.16,13.25,0,3991,20,118,20,100,0,0,14.66,13.49,0,3992,17,135,Female,Yes,1378,96,1,1,4,118,0.15254237,0.84745765,7,0.14285715
38,16,16,0,15.13,15.13,3982,11,87,11,81,3,0,14.88,13.56,0,3991,15,102,9,90,3,6,12.25,13.36,0,3992,14,116,Male,No,1378,96,2,2,2,102,0.11764706,0.89215684,7,0.2857143
39,16,7,9,7.91,7.91,3982,20,91,19,68,0,1,14.76,11.91,0,3991,20,111,17,85,0,3,12.7,12.05,0,3992,16,127,Male,No,1377,96,2,2,4,111,0.23423423,0.7657658,7,0.2857143
40,13,13,0,14.84,14.84,3982,17,96,14,87,0,3,15.38,14.31,0,3991,16,112,16,103,3,0,15.77,14.52,0,3992,20,132,Female,Yes,1378,96,0,0,1,112,0.08035714,0.91964287,7,0
41,16,16,0,17.82,17.82,3982,19,100,18,96,0,1,15.19,14.71,0,3991,14,114,14,110,3,0,15.2,14.77,0,3992,13,127,Male,No,1377,96,0,0,2,114,0.03508772,0.9649123,7,0
42,16,16,0,17.09,17.09,3982,18,99,18,99,0,0,18.21,16.25,0,3991,14,113,14,113,3,0,18.91,16.58,0,3992,18,131,Male,Yes,1377,96,0,0,1,113,0,1,7,0
43,16,16,0,16.21,16.21,3982,19,106,16,100,0,3,15.07,14.16,0,3991,19,125,19,119,0,0,17.18,14.62,0,3992,14,139,Female,No,1378,96,1,1,3,125,0.048,0.952,7,0.14285715
44,16,16,0,15.48,15.48,3982,16,97,16,88,3,0,15.59,14.85,0,3991,17,114,14,102,3,3,12.47,14.49,0,3992,16,130,Male,Yes,1377,96,0,0,1,114,0.10526316,0.8947368,7,0
45,16,16,0,15.81,15.81,3982,14,94,8,79,3,6,11.85,13.34,1,3991,14,108,8,87,0,6,11.73,13.13,1,3992,14,122,Male,No,1377,96,2,2,2,108,0.19444445,0.8055556,7,0.2857143
46,16,16,0,15.98,15.98,3982,13,88,13,88,3,0,15.83,14.13,0,3991,18,106,18,106,0,0,15.57,14.38,0,3992,15,121,Male,Yes,1377,96,1,1,1,106,0,1,7,0.14285715
47,16,16,0,13.97,13.97,3982,16,104,16,98,0,0,17.89,15.16,0,3991,18,122,18,116,0,0,17.32,15.48,0,3992,13,135,Female,No,1377,96,0,0,3,122,0.04918033,0.9590164,7,0
48,16,16,0,18.27,18.27,3982,18,100,18,94,0,0,17.11,16.18,0,3991,18,118,18,112,0,0,15.7,16.1,0,3992,15,133,Male,Yes,1378,96,0,0,1,118,0.05084746,0.9491525,7,0
49,13,7,6,12.5,12.5,3982,17,92,14,68,0,3,13.72,12.4,0,3991,17,109,14,82,3,3,13.01,12.49,0,3992,20,129,Female,Yes,1378,96,1,1,4,109,0.24770643,0.7522936,7,0.14285715
50,16,16,0,17.45,17.45,3982,11,100,2,82,9,9,7.36,13.67,0,3991,14,114,11,93,0,3,14.82,13.81,0,3992,19,133,Male,No,1378,96,0,0,4,114,0.18421052,0.8245614,7,0
51,16,16,0,17.8,17.8,3982,14,101,11,92,0,3,14.97,14.49,0,3991,17,118,17,109,0,0,15.04,14.57,0,3992,18,136,Male,No,1378,96,1,1,2,118,0.076271184,0.9237288,7,0.14285715
52,16,16,0,16.09,16.09,3982,18,101,18,95,0,0,13.78,13.89,0,3991,17,118,17,112,0,0,14.8,14.02,0,3992,20,138,Male,Yes,1377,96,0,0,1,118,0.05084746,0.9491525,7,0
53,13,13,0,17.84,17.84,3982,13,94,13,94,3,0,16.39,16.95,0,3991,14,108,14,108,3,0,16.1,16.84,0,3992,16,124,Male,Yes,1377,96,0,0,1,124,0,1,7,0
54,16,16,0,18.09,18.09,3982,18,101,18,98,0,0,17.18,15.37,0,3991,18,119,18,116,0,0,17.36,15.67,0,3992,16,135,Male,No,1378,96,0,0,4,119,0.025210084,0.9747899,7,0
55,16,16,0,16.23,16.23,3982,17,98,14,92,0,3,15.03,14.59,0,3991,16,114,15,107,3,0,13.87,14.5,0,3992,19,133,Male,Yes,1377,96,0,0,1,114,0.05263158,0.9385965,7,0
56,16,16,0,14.39,14.39,3982,14,86,11,83,3,3,14.26,15.87,0,3991,12,98,12,95,3,0,15.94,15.88,0,3992,12,110,Male,Yes,1377,96,0,0,1,98,0.030612245,0.96938777,7,0
57,16,16,0,14.54,14.54,3982,17,100,17,91,0,0,15.79,13.69,0,3991,15,115,15,106,3,0,14.57,13.8,0,3992,15,130,Female,Yes,1378,96,0,0,1,115,0.07826087,0.9217391,7,0
58,16,16,0,13.69,13.69,3982,16,93,16,90,0,0,16.27,14.07,0,3991,17,110,17,107,3,0,14.68,14.16,0,3992,15,125,Female,Yes,1378,96,1,1,1,110,0.027272727,0.9727273,7,0.14285715
59,16,16,0,18.14,18.14,3982,17,109,17,106,0,0,16.32,16.43,0,3991,17,126,17,123,0,0,17.99,16.64,0,3992,13,139,Female,Yes,1377,96,0,0,1,126,0.023809524,0.97619045,7,0
60,16,13,3,12.81,12.81,3982,20,98,20,92,0,0,17.28,14.98,0,3991,15,113,15,107,3,0,15.1,14.99,0,3992,18,131,Female,Yes,1377,96,0,0,1,113,0.053097345,0.94690263,7,0
61,16,16,0,16.09,16.09,3981,16,66,13,51,3,3,12.07,12.94,0,3982,20,86,20,71,0,0,16.81,13.84,0,3991,17,107,Male,Yes,1378,96,1,1,1,90,0.16666667,0.8333333,6,0.16666667
62,16,16,0,16.27,16.27,3982,15,103,15,100,3,0,18.56,16.8,0,3991,19,122,19,119,3,0,17.34,16.88,0,3992,20,142,Female,Yes,1378,96,0,0,1,122,0.024590164,0.97540987,7,0
63,16,13,3,13.76,13.76,3982,16,89,16,86,0,0,15.92,15.59,0,3991,13,105,10,99,0,3,13.91,15.23,0,3992,14,119,Male,Yes,1378,96,0,0,1,105,0.057142857,0.94285715,7,0
64,16,10,6,12.86,12.86,3982,16,87,12,69,3,4,13.12,13.02,0,3991,18,105,12,81,0,6,12.66,12.96,0,3992,18,123,Male,Yes,1377,96,1,1,2,105,0.22857143,0.7714286,7,0.14285715
65,16,7,9,12.03,12.03,3982,18,99,18,87,0,0,14.83,14.65,0,3991,17,116,17,104,0,0,14.88,14.68,0,3992,15,131,Male,Yes,1377,96,0,0,1,116,0.10344828,0.9051724,7,0
66,16,16,0,13.92,13.92,3982,17,90,17,81,0,0,14.12,13.03,0,3991,15,107,15,98,0,0,14.47,13.29,0,3992,16,123,Male,Yes,1378,96,2,2,1,107,0.08411215,0.91588783,7,0.2857143
67,16,16,0,15.17,15.17,3982,19,100,19,94,0,0,16.12,15.62,0,3991,19,119,16,110,0,3,16.71,15.79,0,3992,19,138,Male,Yes,1377,96,0,0,5,119,0.075630255,0.92436975,7,0
68,16,16,0,13.56,13.56,3981,15,71,15,71,0,0,16.7,14.91,0,3991,15,86,12,83,2,3,12.04,14.41,0,3992,13,99,Male,Yes,1377,96,0,0,5,86,0.034883723,0.96511626,6,0
69,16,13,3,13.74,13.74,3982,14,94,14,91,0,0,16.54,15.54,0,3991,15,109,12,103,3,3,12.99,15.19,0,3992,16,125,Male,Yes,1378,96,0,0,5,109,0.055045873,0.95412844,7,0
70,16,16,0,16.47,16.47,3982,15,91,15,88,1,0,16.28,15.7,0,3991,15,106,15,103,3,0,15.29,15.65,0,3992,20,126,Female,No,1377,96,0,0,2,106,0.028301887,0.9811321,7,0
71,16,13,3,13.56,13.56,3982,19,97,16,79,0,3,12.94,12.79,0,3991,17,114,17,96,3,0,12.88,12.8,0,3992,14,128,Male,Yes,1378,96,2,2,1,114,0.15789473,0.84210527,7,0.2857143
72,16,13,3,14.01,14.01,3982,16,93,16,90,0,0,18.01,16.83,0,3991,13,106,13,103,0,0,17.1,16.86,0,3992,15,121,Male,Yes,1378,96,0,0,1,106,0.028301887,0.9716981,7,0
73,16,16,0,13.83,13.83,3982,17,103,17,100,1,0,15.04,14.19,0,3991,14,117,14,114,0,0,16.23,14.44,0,3992,15,132,Female,Yes,1377,96,0,0,1,117,0.025641026,0.982906,7,0
74,14,14,0,14.43,14.43,3982,9,55,9,55,6,0,17.03,16.45,0,3991,17,72,17,72,0,0,15.68,16.26,0,3992,12,84,Male,Yes,1377,96,0,0,5,72,0,1,5,0
75,14,14,0,12.02,12.02,3982,18,69,14,56,0,4,11.43,12.58,1,3991,14,83,14,70,0,0,13.59,12.75,0,3992,15,98,Male,Yes,1378,96,1,1,5,83,0.15662651,0.8433735,5,0.2
76,16,12,4,12.05,12.05,3982,12,54,12,41,1,0,15.69,12.55,0,3991,19,73,16,57,0,3,13.15,12.71,0,3992,13,86,Male,Yes,1373,97,1,1,5,73,0.21917808,0.7808219,5,0.2
77,16,16,0,16.66,16.66,3982,12,55,9,49,0,3,11.63,13.49,1,3991,14,69,11,60,0,3,15.1,13.82,0,3992,20,89,Female,Yes,1379,97,1,1,3,69,0.13043478,0.8695652,5,0.2
78,16,16,0,18.54,18.54,3982,18,68,18,68,0,0,18.33,18.04,0,3991,17,85,17,85,0,0,17.37,17.9,0,3992,14,99,Female,Yes,1378,97,0,0,1,85,0,1,5,0
79,16,16,0,16.43,16.43,3982,14,60,11,54,3,3,13.66,14.51,0,3991,19,79,16,70,0,3,14.82,14.58,0,3992,19,98,Male,Yes,1379,97,0,0,1,98,0.13265306,0.86734694,5,0
80,16,13,3,12.51,12.51,3982,15,66,15,60,0,0,16.05,14.38,0,3991,15,81,15,75,0,0,14.62,14.42,0,3992,16,97,Female,Yes,1379,97,0,0,4,81,0.074074075,0.9259259,5,0
81,16,16,0,13.33,13.33,3972,13,29,10,26,3,3,10.87,12.23,1,3981,14,43,0,26,0,14,8.36,10.97,1,3992,14,57,Male,No,1378,97,2,2,4,43,0.39534885,0.60465115,4,0.5
82,16,16,0,16,16,3981,11,42,5,33,6,6,9.76,13.18,1,3982,14,56,11,44,3,3,10.54,12.52,1,3991,14,70,Male,Yes,1379,97,2,2,1,70,0.2857143,0.71428573,5,0.6
83,16,16,0,19.11,19.11,3982,15,65,15,65,3,0,18.79,18.93,0,3991,18,85,18,85,0,0,18.37,18.84,0,3992,16,101,Female,Yes,1373,97,0,0,1,101,0,1,5,0
84,16,16,0,18.26,18.26,3982,15,69,15,69,3,0,16.72,17.01,0,3991,19,88,19,88,0,0,16.74,16.95,0,3992,17,105,Male,Yes,1378,97,0,0,1,88,0,1,5,0
85,16,16,0,15.62,15.62,3982,16,69,16,66,0,0,16.36,15.64,0,3991,17,86,17,83,0,0,17.04,15.92,0,3992,17,103,Male,Yes,1378,97,0,0,1,86,0.034883723,0.96511626,5,0
86,16,16,0,14.95,14.95,3982,16,63,16,60,0,0,17.22,14.86,0,3991,19,82,19,79,0,0,15.36,14.98,0,3992,16,98,Male,No,1378,97,0,0,2,82,0.036585364,0.9634146,5,0
87,16,16,0,17.02,17.02,3982,19,75,19,75,0,0,16.5,17.13,0,3991,17,92,17,92,0,0,17.72,17.24,0,3992,17,109,Male,No,1378,97,0,0,2,92,0,1.0108696,5,0
88,13,13,0,14.68,14.68,3982,14,58,14,49,0,0,15.34,13.95,0,3991,13,71,7,56,3,6,10.39,13.3,1,3992,14,85,Female,Yes,1378,97,1,1,4,85,0.1764706,0.8235294,5,0.2
89,16,16,0,18.3,18.3,3982,18,67,18,67,0,0,15.63,16.51,0,3991,16,83,16,83,3,0,17.76,16.75,0,3992,19,102,Male,No,1379,97,0,0,2,83,0,1,5,0
90,16,16,0,17.39,17.39,3982,13,61,13,55,4,0,15.56,15.45,0,3991,17,78,17,72,2,0,17.2,15.83,0,3992,19,97,Male,Yes,1378,97,0,0,1,97,0.06185567,0.9381443,5,0
91,16,16,0,15.78,15.78,3982,19,70,19,64,0,0,13.9,14.44,0,3991,17,87,17,81,0,0,15.51,14.65,0,3992,17,104,Male,Yes,1378,97,0,0,4,87,0.06896552,0.9310345,5,0
92,13,10,3,14.33,14.33,3982,15,54,12,33,0,3,15.13,12.16,0,3991,14,68,14,47,3,0,15.67,12.88,0,3992,11,79,Male,Yes,1378,97,1,1,4,79,0.2658228,0.73417723,5,0.2
93,16,16,0,16.79,16.79,3982,17,68,17,68,0,0,17.22,17.6,0,3991,20,88,20,88,0,0,16.64,17.39,0,3992,17,105,Female,Yes,1378,97,0,0,1,88,0,1,5,0
94,16,16,0,13.62,13.62,3982,14,62,14,56,0,0,11.93,12.57,1,3991,14,76,11,67,0,3,12.03,12.47,0,3992,16,92,Female,Yes,1378,97,1,1,4,76,0.118421055,0.8815789,5,0.2
95,16,16,0,17.96,17.96,3982,15,71,15,71,0,0,17.37,17.59,0,3991,17,88,17,88,0,0,18.43,17.75,0,3992,17,105,Male,Yes,1379,97,0,0,1,88,0,1,5,0
96,16,16,0,15.19,15.19,3982,18,73,18,70,0,0,15.53,14.93,0,3991,18,91,18,88,0,0,16.8,15.3,0,3992,15,106,Male,Yes,1379,97,0,0,1,91,0.032967035,0.96703297,5,0
97,16,16,0,18.89,18.89,3982,15,69,15,69,0,0,18.99,18.73,0,3991,20,89,20,89,0,0,19.13,18.82,0,3992,17,106,Male,Yes,1379,97,0,0,1,89,0,1,5,0
98,16,16,0,19.43,19.43,3982,13,63,10,60,3,3,14.67,17,0,3991,18,81,18,78,0,0,16.46,16.88,0,3992,17,98,Female,Yes,1379,97,0,0,1,81,0.037037037,0.962963,5,0
99,16,16,0,15.07,15.07,3982,14,60,14,48,0,0,16.18,13.74,0,3991,16,76,13,61,0,3,11.81,13.33,1,3992,14,90,Male,Yes,1379,97,2,2,4,76,0.19736843,0.80263156,5,0.4
100,16,16,0,19.52,19.52,3982,19,74,19,74,0,0,18.29,18.83,0,3991,17,91,17,91,0,0,18.89,18.84,0,3992,15,106,Male,Yes,1378,97,0,0,1,106,0,1,5,0
101,16,16,0,17.88,17.88,3982,15,69,15,69,0,0,18.18,17.34,0,3991,17,86,17,86,0,0,18.97,17.66,0,3992,17,103,Male,Yes,1379,97,0,0,1,86,0,1,5,0
102,16,16,0,14.33,14.33,3982,15,65,15,56,0,0,15.08,13.71,0,3991,18,83,18,74,0,0,13.04,13.56,0,3992,20,103,Female,Yes,1378,97,0,0,4,83,0.10843374,0.8915663,5,0
103,16,16,0,15.16,15.16,3982,14,60,14,51,0,0,14.71,14.33,0,3991,18,78,12,63,0,6,12.88,14,0,3992,15,93,Female,Yes,1378,97,0,0,4,78,0.1923077,0.8076923,5,0
104,16,16,0,15.8,15.8,3982,17,67,17,67,1,0,15.65,15.32,0,3991,18,85,18,85,0,0,16.32,15.53,0,3992,15,100,Female,Yes,1379,97,0,0,1,85,0,1,5,0
105,16,16,0,19.07,19.07,3982,17,67,17,67,0,0,18.52,18.84,0,3991,18,85,18,85,0,0,17.95,18.65,0,3992,15,100,Female,Yes,1379,97,0,0,1,85,0,1,5,0
106,16,16,0,18.17,18.17,3982,18,74,18,74,0,0,18.12,17.07,0,3991,19,93,19,93,0,0,17.32,17.12,0,3992,17,110,Male,Yes,1378,97,0,0,1,93,0,1,5,0
107,16,16,0,16.12,16.12,3982,14,68,9,63,3,5,11.9,14.64,1,3991,13,81,13,76,0,0,14.23,14.57,0,3992,13,94,Male,Yes,1379,97,1,1,2,81,0.061728396,0.9382716,5,0.2
108,16,16,0,17.65,17.65,3982,17,69,17,69,0,0,18.91,17.1,0,3991,17,86,17,86,0,0,18.24,17.33,0,3992,16,102,Male,Yes,1380,97,0,0,4,86,0,1,5,0
109,18,18,0,16.08,16.08,3982,15,68,15,65,3,0,17.82,16,0,3991,17,85,17,82,0,0,16.71,16.14,0,3992,19,104,Male,Yes,1379,97,0,0,4,85,0.03529412,0.9647059,5,0
110,16,16,0,17.93,17.93,3982,14,64,14,64,3,0,17.7,17.04,0,3991,13,77,13,77,3,0,16.41,16.93,0,3992,13,90,Male,Yes,1378,97,0,0,1,77,0,1,5,0
111,16,13,3,13.76,13.76,3982,11,55,5,37,3,6,8.95,11.26,1,3991,14,69,11,48,0,3,12.07,11.42,0,3992,12,81,Male,No,1379,97,3,3,4,69,0.3043478,0.6956522,5,0.6
112,16,16,0,15.08,15.08,3982,17,69,17,69,0,0,18.23,16.17,0,3991,16,85,16,85,0,0,17.31,16.39,0,3992,14,99,Male,No,1378,97,0,0,3,85,0,1,5,0
113,16,16,0,17.85,17.85,3982,18,70,18,70,0,0,17.15,17,0,3991,18,88,18,88,0,0,17.91,17.19,0,3992,15,103,Male,Yes,1378,97,0,0,4,88,0,1,5,0
114,16,16,0,19.19,19.19,3982,16,66,16,66,0,0,16.23,17.85,0,3991,13,79,13,79,0,0,17.95,17.87,0,3992,12,91,Male,No,1379,97,0,0,2,79,0,1,5,0
115,18,18,0,16.34,16.34,3982,17,71,17,71,0,0,17.63,16.3,0,3991,16,87,16,87,0,0,18.54,16.71,0,3992,16,103,Male,No,1378,97,0,0,2,87,0,1,5,0
116,16,16,0,17.19,17.19,3982,15,61,15,58,0,0,16.8,16.14,0,3991,17,78,17,75,0,0,17.75,16.49,0,3992,19,97,Female,Yes,1378,97,0,0,1,97,0.030927835,0.96907216,5,0
117,16,16,0,16.93,16.93,3982,16,65,16,65,1,0,15.54,15.99,0,3991,18,83,18,83,0,0,17.1,16.23,0,3992,18,101,Female,No,1378,97,0,0,1,83,0,1,5,0
118,16,16,0,16.64,16.64,3982,18,69,18,69,0,0,16.98,17.09,0,3991,16,85,16,85,0,0,17.35,17.14,0,3992,14,99,Male,No,1378,97,0,0,1,85,0,1,5,0
119,16,16,0,14.99,14.99,3982,12,57,9,45,4,3,13.29,13.17,0,3991,16,73,10,55,3,6,12.49,13.02,0,3992,17,90,Male,Yes,1378,97,0,0,4,90,0.31111112,0.6888889,5,0.2
120,16,16,0,19.16,19.16,3982,17,67,17,67,3,0,18.89,19,0,3991,22,91,22,91,0,0,18.31,18.86,0,3992,17,108,Female,Yes,1379,97,0,0,1,108,0,1,5,0
121,16,16,0,18.26,18.26,3982,14,63,14,63,3,0,15.74,16,0,3991,17,80,14,77,0,3,15.02,15.79,0,3992,14,94,Male,No,1379,97,0,0,1,94,0.031914894,0.9680851,5,0
122,16,16,0,14.2,14.2,3982,16,63,16,60,0,0,14.45,13.62,0,3991,17,80,14,74,0,3,14.04,13.71,0,3992,15,95,Female,Yes,1378,97,0,0,3,95,0.094736844,0.9052632,5,0
123,16,16,0,19.46,19.46,3982,16,70,16,70,3,0,18.63,18.98,0,3991,15,85,15,85,3,0,18.43,18.89,0,3992,17,102,Male,No,1379,97,0,0,2,102,0,1,5,0
124,16,16,0,17.24,17.24,3982,10,55,10,55,3,0,18.53,16.63,0,3991,19,78,19,78,0,0,16.15,16.63,0,3992,14,92,Male,Yes,1379,97,0,0,4,78,0,1,5,0
125,16,16,0,18.19,18.19,3982,16,68,16,65,0,0,15.41,16.55,0,3991,13,81,13,78,0,0,15.79,16.43,0,3992,14,95,Male,No,1379,97,0,0,1,81,0.037037037,0.962963,5,0
126,16,16,0,17.26,17.26,3982,19,67,19,67,0,0,15.25,15.99,0,3991,17,84,17,84,0,0,16.37,16.07,0,3992,18,102,Female,Yes,1378,97,0,0,1,84,0,1,5,0
127,16,16,0,15.55,15.55,3982,16,65,16,62,0,0,18.56,15.93,0,3991,19,84,19,81,0,0,18.3,16.46,0,3992,17,101,Female,Yes,1379,97,0,0,4,84,0.035714287,0.96428573,5,0
128,16,16,0,15.01,15.01,3972,14,30,10,26,3,4,13.46,14.28,0,3981,15,45,12,38,3,3,13.32,13.96,0,3992,12,57,Male,Yes,1379,97,0,0,1,45,0.15555556,0.84444445,3,0
129,16,16,0,14.57,14.57,3982,18,67,18,64,1,0,16.35,14.92,0,3991,15,82,15,79,0,0,15.97,15.11,0,3992,15,97,Male,Yes,1378,97,0,0,1,82,0.036585364,0.9634146,5,0
130,16,15,1,14.81,14.81,3982,15,63,15,62,0,0,16.25,16.24,0,3991,19,82,17,79,0,2,13.99,15.72,0,3992,12,94,Male,Yes,1379,97,0,0,1,82,0.036585364,0.9634146,5,0
131,16,16,0,16.37,16.37,3982,16,66,16,63,0,0,16.38,15.72,0,3991,17,83,17,80,0,0,17.1,16,0,3992,19,102,Male,Yes,1378,97,0,0,2,83,0.036144577,0.96385545,5,0
132,16,16,0,17.52,17.52,3982,16,69,16,69,0,0,16.96,16.07,0,3991,19,88,19,88,0,0,17.46,16.37,0,3992,14,102,Female,Yes,1379,97,0,0,1,102,0,1,5,0
133,16,16,0,18.54,18.54,3982,18,69,18,69,0,0,18.86,17.41,0,3991,19,88,19,88,0,0,17.01,17.32,0,3992,13,101,Male,Yes,1379,97,0,0,2,101,0,1,5,0
134,16,16,0,17.09,17.09,3982,19,71,19,71,0,0,18.09,17.44,0,3991,18,89,18,89,0,0,17.85,17.53,0,3992,17,106,Male,No,1378,97,0,0,2,89,0,1,5,0
135,16,16,0,17.79,17.79,3982,18,68,18,68,0,0,16.66,16.46,0,3991,17,85,17,85,0,0,16.59,16.48,0,3992,15,100,Female,No,1378,97,0,0,2,85,0,1,5,0
136,16,16,0,17.56,17.56,3982,18,72,18,72,0,0,15.64,16.51,0,3991,16,88,16,88,0,0,16.47,16.5,0,3992,16,104,Male,Yes,1378,97,0,0,1,88,0,1,5,0
137,16,16,0,17.08,17.08,3982,19,69,13,60,0,6,13.43,14.88,0,3991,14,83,8,68,3,6,10.53,14.15,1,3992,13,96,Male,Yes,1379,97,1,1,1,83,0.18072289,0.8192771,5,0.2
138,16,16,0,17.25,17.25,3982,18,71,18,71,0,0,18.59,18,0,3991,17,88,17,88,0,0,17.82,17.97,0,3992,14,102,Male,Yes,1379,97,0,0,1,88,0,1,5,0
139,16,16,0,17.85,17.85,3982,18,69,18,69,0,0,17.97,17.15,0,3991,16,85,16,85,0,0,16.32,16.99,0,3992,14,99,Female,No,1379,97,0,0,1,85,0,1,5,0
140,16,16,0,18.35,18.35,3982,19,74,19,74,0,0,18.28,18.04,0,3991,19,95,19,95,0,0,17.89,18.05,0,3992,14,109,Male,Yes,1378,97,0,0,4,95,0,1.0105263,5,0
141,16,16,0,13.71,13.71,3982,16,65,16,62,0,0,17.64,14.5,0,3991,15,80,15,77,3,0,17.17,15,0,3992,16,96,Male,Yes,1379,97,0,0,1,96,0.03125,0.96875,5,0
142,16,16,0,13.97,13.97,3982,7,53,4,50,12,3,12,13.72,0,3991,13,66,7,57,3,6,11.62,13.3,1,3992,11,77,Male,Yes,1377,97,1,1,3,77,0.15584415,0.84415585,5,0.4
143,16,16,0,16.83,16.83,3982,19,64,19,64,0,0,19.54,17.61,0,3991,16,80,16,80,3,0,18.15,17.72,0,3992,16,96,Male,Yes,1378,97,0,0,1,80,0,1,5,0
144,16,16,0,16.78,16.78,3982,19,70,13,64,0,6,11.9,15.3,1,3991,14,84,14,78,0,0,16.87,15.56,0,3992,19,103,Male,Yes,1378,97,1,1,2,103,0.116504855,0.88349515,5,0.2
145,16,13,3,12.96,12.96,3982,17,61,11,49,0,6,12.56,13.85,0,3991,18,79,18,67,0,0,14.02,13.89,0,3992,18,97,Male,Yes,1378,97,0,0,1,97,0.12371134,0.87628865,5,0
146,16,13,3,14.31,14.31,3982,6,56,6,53,12,0,19.13,16.31,0,3991,19,77,16,71,0,3,14.63,15.99,0,3992,19,96,Male,No,1379,97,0,0,2,77,0.077922076,0.9220779,5,0
147,16,13,3,12.86,12.86,3982,18,63,18,60,1,0,14.01,14.56,0,3991,20,83,20,80,0,0,14.89,14.64,0,3992,20,103,Male,Yes,1377,97,0,0,1,83,0.036144577,0.96385545,5,0
148,16,13,3,13.75,13.75,3982,17,62,17,53,0,0,15.66,14.35,0,3991,17,82,17,73,0,0,16.77,14.99,0,3992,16,98,Male,Yes,1379,97,0,0,1,98,0.091836736,0.90816325,5,0
149,16,16,0,14.75,14.75,3982,16,59,16,59,0,0,16.37,14.68,0,3991,15,74,12,71,0,3,13.9,14.52,0,3992,14,88,Male,Yes,1379,97,0,0,1,74,0.040540542,0.9594595,5,0
150,16,16,0,16.71,16.71,3982,17,68,17,68,1,0,14.4,15.23,0,3991,14,82,14,82,0,0,14.9,15.17,0,3992,18,100,Female,Yes,1378,97,0,0,1,82,0,1,5,0
151,16,16,0,13.65,13.65,3982,17,65,17,62,0,0,17.27,15.06,0,3991,18,83,18,80,0,0,16.51,15.37,0,3992,14,97,Female,Yes,1379,97,0,0,1,83,0.036144577,0.96385545,5,0
152,16,16,0,17.17,17.17,3982,15,63,15,63,0,0,17.93,17.03,0,3991,18,81,18,81,3,0,16.62,16.93,0,3992,17,98,Male,Yes,1378,97,0,0,1,98,0.030612245,0.96938777,5,0
153,16,16,0,16.77,16.77,3982,16,61,16,58,0,0,16.62,15.05,0,3991,16,77,16,74,0,0,15.19,15.08,0,3992,15,92,Male,Yes,1378,97,0,0,1,77,0.038961038,0.96103895,5,0
154,16,16,0,15.1,15.1,3982,19,63,19,60,0,0,18.3,15.73,0,3991,17,80,17,77,3,0,17.92,16.19,0,3992,15,95,Male,Yes,1378,97,0,0,1,95,0.031578947,0.96842104,5,0
155,16,16,0,16.48,16.48,3982,16,63,16,63,0,0,16.86,15.76,0,3991,17,80,17,80,0,0,16.91,16,0,3992,15,95,Male,Yes,1379,97,0,0,1,95,0.031578947,0.96842104,5,0
156,16,16,0,18.27,18.27,3982,17,71,17,71,0,0,17.22,16.74,0,3991,18,91,18,91,0,0,18,17.06,0,3992,18,109,Male,Yes,1379,97,0,0,1,91,0,1,5,0
157,16,16,0,16.93,16.93,3982,16,70,16,70,1,0,18.18,17.34,0,3991,18,88,18,88,0,0,17.94,17.47,0,3992,17,105,Male,Yes,1378,97,0,0,1,88,0,1,5,0
158,16,16,0,18.4,18.4,3982,13,63,10,57,3,3,15.56,15.96,0,3991,18,81,18,75,0,0,16.67,16.12,0,3992,17,98,Female,Yes,1379,97,0,0,1,98,0.06122449,0.93877554,5,0
159,16,16,0,14.31,14.31,3982,17,65,17,62,0,0,16.85,15.43,0,3991,17,82,17,79,0,0,16.32,15.61,0,3992,14,96,Female,Yes,1378,97,0,0,1,96,0.03125,0.96875,5,0
160,16,10,6,12.18,12.18,3982,14,61,14,46,0,0,14.63,12.84,0,3991,15,76,12,58,0,3,11.95,12.66,1,3992,14,90,Female,Yes,1379,97,2,2,1,62,0.29032257,0.9354839,4,0.5
161,16,16,0,16.58,16.58,3982,13,62,13,59,6,0,14.62,15.18,0,3991,15,77,15,74,3,0,14.23,15,0,3992,17,94,Male,Yes,1380,97,0,0,1,94,0.06382979,0.9361702,5,0
162,14,11,3,14.64,14.64,3982,14,64,11,46,0,3,12.04,12.65,0,3991,17,87,14,66,0,3,12.48,12.89,0,3992,19,106,Female,Yes,1378,97,1,1,1,87,0.2413793,0.7586207,5,0.2
163,16,16,0,15.15,15.15,3982,15,62,15,62,1,0,15.74,14.67,0,3991,18,80,18,80,0,0,17.16,15.23,0,3992,18,98,Male,Yes,1379,97,0,0,1,80,0,1,5,0
164,16,10,6,12.8,12.8,3982,16,64,16,58,0,0,14.72,14.53,0,3991,17,81,17,75,0,0,15.17,14.66,0,3992,15,96,Female,Yes,1379,97,0,0,1,96,0.0625,0.9375,5,0
165,13,10,3,13.35,13.35,3982,14,58,11,40,0,3,15.01,12.93,0,3991,20,84,20,66,0,0,14.37,13.62,0,3992,19,103,Male,Yes,1378,97,1,1,5,103,0.17475729,0.8252427,5,0.2
166,14,14,0,16.96,16.96,3982,15,29,15,29,0,0,17.57,17.27,0,3991,17,46,17,46,0,0,16.33,16.92,0,3992,15,61,Male,Yes,1379,97,0,0,5,46,0,1,3,0
167,20,18,2,17.36,17.36,3982,16,73,16,70,1,0,17,17.05,0,3991,17,90,16,86,0,1,17.01,17.04,0,3992,14,104,Male,Yes,1379,97,0,0,5,90,0.044444446,0.95555556,5,0
168,16,16,0,18.86,18.86,3982,22,38,22,38,1,0,16.51,17.5,0,3991,20,64,20,64,0,0,15.5,16.98,0,3992,17,81,Male,Yes,1380,98,0,0,1,64,0,1,3,0
169,16,16,0,19.42,19.42,3982,17,33,17,33,0,0,18.68,19.04,0,3991,19,52,19,52,0,0,18.19,18.73,0,3992,19,71,Female,Yes,1380,98,0,0,1,52,0,1,3,0
170,16,16,0,16.86,16.86,3982,14,30,14,30,3,0,17.83,17.31,0,3991,20,50,20,50,0,0,15.84,16.72,0,3992,14,64,Male,Yes,1380,98,0,0,1,64,0,1,3,0
171,17,17,0,19.68,19.68,3982,17,34,17,34,1,0,19.61,19.64,0,3991,19,53,19,53,0,0,18.83,19.35,0,3992,18,71,Male,Yes,1380,98,0,0,1,53,0,1,3,0
172,16,16,0,18.78,18.78,3982,19,35,19,35,1,0,18.37,18.56,0,3991,19,56,19,56,0,0,17.84,18.29,0,3992,17,73,Male,No,1380,98,0,0,2,73,0,1,3,0
173,16,16,0,17.85,17.85,3982,17,33,17,33,0,0,15.29,16.53,0,3991,19,52,19,52,0,0,16.56,16.54,0,3992,18,70,Male,Yes,1379,98,0,0,4,70,0,1,3,0
174,16,16,0,19.86,19.86,3982,20,36,20,36,0,0,19.26,19.52,0,3991,20,56,20,56,0,0,18.06,19,0,3992,19,75,Female,Yes,1380,98,0,0,1,56,0,1,3,0
175,16,16,0,14.98,14.98,3982,12,28,3,19,0,9,4.06,10.3,1,3991,13,41,13,32,0,0,13.21,11.23,0,3992,11,52,Male,Yes,1380,98,1,1,1,41,0.2195122,0.7804878,3,0.33333334
176,16,16,0,15.92,15.92,3982,16,32,16,32,4,0,15.81,15.86,0,3991,19,51,19,51,0,0,16.6,16.14,0,3992,16,67,Male,No,1380,98,0,0,2,51,0,1,3,0
177,16,16,0,18.2,18.2,3982,14,30,14,30,4,0,14.73,16.58,0,3991,18,48,18,48,0,0,15.82,16.29,0,3992,17,65,Female,Yes,1379,98,0,0,1,65,0,1,3,0
178,16,16,0,17.52,17.52,3982,17,33,17,33,0,0,13.48,15.44,0,3991,17,50,17,50,0,0,15.16,15.34,0,3992,13,63,Female,Yes,1380,98,0,0,1,50,0,1,3,0
179,16,16,0,12.23,12.23,3982,15,31,10,26,0,5,10.28,11.29,1,3991,7,38,7,33,6,0,11.71,11.37,1,3992,11,49,Male,Yes,1380,98,2,2,4,38,0.13157895,0.8684211,3,0.6666667
180,16,16,0,14.53,14.53,3982,14,30,14,30,0,0,16.81,15.59,0,3991,20,50,20,50,0,0,15.85,15.69,0,3992,18,68,Male,Yes,1380,98,0,0,4,68,0,1,3,0
181,16,16,0,17.82,17.82,3982,18,34,18,34,1,0,18.78,18.33,0,3991,19,53,19,53,0,0,15.96,17.48,0,3992,16,69,Male,Yes,1380,98,0,0,1,53,0,1,3,0
182,16,16,0,15.55,15.55,3982,19,35,16,32,1,3,17.54,16.63,0,3991,19,54,19,51,0,0,17.42,16.91,0,3992,18,72,Male,Yes,1379,98,0,0,1,72,0.041666668,0.9583333,3,0
183,16,13,3,12.86,12.86,3982,15,31,12,25,4,3,16.63,14.68,0,3991,17,54,17,48,0,0,16,15.45,0,3992,19,73,Female,No,1380,98,0,0,4,54,0.11111111,0.8888889,3,0
184,16,13,3,13.38,13.38,3982,19,35,19,32,1,0,16.39,15.01,0,3991,19,57,19,54,0,0,14.6,15.08,0,3992,15,72,Male,Yes,1380,98,0,0,4,57,0.05263158,0.94736844,3,0
185,16,16,0,14.04,14.04,3982,17,33,17,33,1,0,17.14,15.64,0,3991,18,51,18,51,0,0,15.53,15.6,0,3992,17,68,Female,Yes,1379,98,0,0,4,51,0,1,3,0
186,16,16,0,17.7,17.7,3982,19,35,19,35,1,0,17.69,17.7,0,3991,23,58,20,55,0,3,15.53,16.84,0,3992,20,78,Male,Yes,1379,98,0,0,3,58,0.05172414,0.94827586,3,0
187,16,16,0,19.34,19.34,3982,17,33,14,30,1,3,14.63,16.91,0,3991,19,52,19,49,0,0,17.36,17.08,0,3992,20,72,Male,Yes,1379,98,0,0,1,72,0.041666668,0.9583333,3,0
188,16,10,6,13.39,13.39,3982,16,32,16,26,1,0,18.64,16.02,0,3991,21,56,21,50,0,0,16.93,16.57,0,3992,17,73,Female,No,1379,98,0,0,4,73,0.08219178,0.91780823,3,0
189,18,18,0,16.46,16.46,3982,17,35,17,35,1,0,17.29,16.86,0,3991,16,51,16,51,0,0,15.61,16.47,0,3992,14,65,Male,Yes,1379,98,0,0,1,51,0,1,3,0
190,16,16,0,19.72,19.72,3982,17,33,17,33,0,0,18.93,19.31,0,3991,18,51,18,51,0,0,16.98,18.49,0,3992,17,68,Male,Yes,1380,98,0,0,1,51,0,1,3,0
191,16,13,3,12.91,12.91,3982,16,32,16,29,1,0,16.88,14.89,0,3991,19,54,19,51,0,0,17.18,15.89,0,3992,20,74,Female,Yes,1380,98,0,0,4,54,0.055555556,0.9444444,3,0
192,16,16,0,16.73,16.73,3982,17,33,17,33,1,0,17.72,17.24,0,3991,16,49,16,49,0,0,15.68,16.73,0,3992,14,63,Male,Yes,1380,98,0,0,1,63,0,1,3,0
193,16,16,0,18.61,18.61,3982,17,33,17,33,1,0,17.08,17.82,0,3991,18,51,12,45,0,6,13.63,16.34,0,3992,19,70,Male,Yes,1379,98,0,0,1,51,0.11764706,0.88235295,3,0
194,16,16,0,19.44,19.44,3982,15,31,15,31,2,0,18.05,18.77,0,3991,22,53,22,53,0,0,16.6,17.87,0,3992,17,70,Male,Yes,1380,98,0,0,2,53,0,1,3,0
195,16,16,0,17.01,17.01,3981,16,16,16,16,0,0,17.01,17.01,0,3982,17,33,17,33,1,0,16.81,16.91,0,3991,16,53,Male,No,1379,98,0,0,2,37,0,1,3,0
196,13,13,0,14.75,14.75,3982,16,29,16,29,1,0,15.26,15.03,0,3991,17,49,17,49,0,0,16.41,15.69,0,3992,15,64,Male,Yes,1379,98,0,0,1,49,0,1,3,0
197,16,16,0,18.36,18.36,3982,17,33,17,33,1,0,19.09,18.74,0,3991,17,50,17,50,0,0,18.79,18.75,0,3992,16,66,Male,Yes,1380,98,0,0,1,50,0,1,3,0
198,16,16,0,16.97,16.97,3982,16,32,16,32,3,0,17.26,17.12,0,3991,21,58,21,58,0,0,15.79,16.44,0,3992,18,76,Female,No,1380,98,0,0,2,58,0,1,3,0
199,16,16,0,16.62,16.62,3982,17,33,17,33,1,0,17.22,16.93,0,3991,17,50,17,50,0,0,15.66,16.5,0,3992,16,66,Male,Yes,1380,98,0,0,1,50,0,1,3,0
200,16,13,3,15.54,15.54,3982,15,31,15,28,0,0,16.32,15.92,0,3991,19,56,19,53,0,0,13.72,15.61,0,3992,15,71,Female,Yes,1380,98,0,0,4,56,0.05357143,0.9464286,3,0
201,16,16,0,15.97,15.97,3982,11,27,11,27,9,0,14.34,15.31,0,3991,19,49,19,49,0,0,15.01,14.99,0,3992,17,66,Female,No,1379,98,0,0,2,49,0,1,3,0
202,16,16,0,17.38,17.38,3982,17,33,14,30,0,3,15.96,16.65,0,3991,19,52,19,49,0,0,16.53,16.6,0,3992,16,68,Male,Yes,1380,98,0,0,1,68,0.04411765,0.9558824,3,0
203,16,16,0,14.9,14.9,3982,17,33,17,33,1,0,17.44,16.21,0,3991,16,49,16,49,0,0,16.12,16.18,0,3992,17,66,Male,No,1380,98,0,0,4,49,0,1,3,0
204,16,13,3,15.46,15.46,3982,16,32,16,29,1,0,18.98,17.22,0,3991,22,54,22,51,0,0,16.95,17.11,0,3992,18,72,Female,Yes,1379,98,0,0,3,54,0.055555556,0.9444444,3,0
205,16,16,0,13.85,13.85,3982,13,29,13,29,3,0,15.61,14.64,0,3991,17,46,17,46,3,0,13.55,14.24,0,3992,12,58,Female,No,1380,98,0,0,4,46,0,1,3,0
206,16,10,6,12.88,12.88,3982,16,32,16,26,1,0,18.28,15.58,0,3991,18,56,18,50,0,0,14.56,15.5,0,3992,15,71,Female,No,1379,98,0,0,4,71,0.08450704,0.91549295,3,0
207,16,16,0,16.4,16.4,3982,18,34,15,31,1,3,15.01,15.67,0,3991,17,51,17,48,0,0,12.03,14.45,0,3992,14,65,Male,Yes,1379,98,0,0,1,51,0.05882353,0.9411765,3,0
208,16,16,0,18.51,18.51,3982,17,33,17,33,1,0,18.74,18.63,0,3991,21,54,21,54,0,0,17.18,18.07,0,3992,16,70,Female,Yes,1380,98,0,0,1,70,0,1,3,0
209,16,16,0,13.83,13.83,3982,17,33,17,33,1,0,15.87,14.88,0,3991,19,52,19,52,0,0,15.5,15.11,0,3992,14,66,Male,Yes,1379,98,0,0,4,52,0,1,3,0
210,16,16,0,13.89,13.89,3982,17,33,14,30,1,3,13.97,13.93,0,3991,16,49,16,46,0,0,14.08,13.98,0,3992,14,63,Male,No,1379,98,0,0,2,49,0.06122449,0.93877554,3,0
211,16,10,6,14.51,14.51,3982,15,31,15,25,3,0,16.84,15.64,0,3991,19,53,19,47,0,0,15.08,15.68,0,3992,16,69,Female,Yes,1380,98,0,0,4,53,0.11320755,0.8867925,3,0
212,16,16,0,17.5,17.5,3981,16,16,16,16,0,0,17.5,17.5,0,3982,19,35,19,35,1,0,16.47,16.94,0,3991,12,53,Male,No,1380,98,0,0,2,41,0,1,3,0
213,16,16,0,18.73,18.73,3982,19,35,19,35,1,0,18.31,18.5,0,3991,20,55,20,55,0,0,16.99,17.95,0,3992,16,71,Male,Yes,1380,98,0,0,1,55,0,1,3,0
214,16,16,0,18.23,18.23,3982,18,34,18,34,1,0,18.93,18.6,0,3991,20,54,20,54,0,0,17.46,18.18,0,3992,18,72,Male,Yes,1380,98,0,0,1,54,0,1,3,0
215,16,9,7,10.8,10.8,3981,16,16,9,9,0,7,10.8,10.8,1,3982,13,29,13,22,0,0,16.37,13.29,0,3991,20,55,Female,Yes,1379,98,1,1,1,55,0.18181819,0.8181818,3,0.33333334
216,16,13,3,12.44,12.44,3982,15,31,15,28,4,0,15.29,13.82,0,3991,19,50,19,47,0,0,16.38,14.79,0,3992,15,65,Female,No,1380,98,0,0,2,65,0.046153847,0.95384616,3,0
217,16,16,0,17.4,17.4,3982,19,35,19,35,1,0,17.63,17.53,0,3991,18,53,18,53,0,0,15.89,16.97,0,3992,16,69,Male,No,1379,98,0,0,4,53,0,1,3,0
218,16,16,0,16.58,16.58,3982,11,27,11,27,5,0,16.73,16.64,0,3991,20,47,20,47,0,0,15.43,16.12,0,3992,13,60,Female,Yes,1379,98,0,0,4,47,0,1,3,0
219,16,16,0,17.83,17.83,3982,17,33,17,33,1,0,16.87,17.33,0,3991,19,52,19,52,0,0,17.62,17.44,0,3992,17,69,Male,No,1380,98,0,0,2,69,0,1,3,0
220,16,16,0,19.01,19.01,3982,16,32,16,32,1,0,18.59,18.8,0,3991,14,46,14,46,0,0,17.67,18.46,0,3992,16,62,Male,Yes,1379,98,0,0,2,46,0,1,3,0
221,16,16,0,17.99,17.99,3982,17,33,17,33,1,0,18.61,18.31,0,3991,19,52,19,52,0,0,18.39,18.34,0,3992,17,69,Male,No,1380,98,0,0,2,52,0,1,3,0
222,16,16,0,14.03,14.03,3982,18,34,18,34,0,0,17,15.6,0,3991,18,52,18,52,0,0,14.37,15.18,0,3992,15,67,Male,No,1380,98,0,0,4,67,0,1,3,0
223,16,16,0,18.14,18.14,3982,18,34,18,34,1,0,19.07,18.63,0,3991,19,53,19,53,0,0,16.36,17.82,0,3992,16,69,Male,Yes,1380,98,0,0,1,53,0,1,3,0
224,16,16,0,16.01,16.01,3982,19,35,19,35,1,0,17.94,17.06,0,3991,18,53,18,53,0,0,16.17,16.75,0,3992,18,71,Male,Yes,1380,98,0,0,1,71,0,1,3,0
225,16,16,0,17.36,17.36,3982,13,29,11,27,7,2,15.94,16.72,0,3991,14,43,14,41,0,0,18.35,17.25,0,3992,15,58,Male,Yes,1380,98,0,0,1,43,0.046511628,0.95348835,3,0
226,16,16,0,15.19,15.19,3982,15,31,15,31,0,0,14.9,15.05,0,3991,16,47,16,47,0,0,14.77,14.95,0,3992,15,62,Male,Yes,1379,98,0,0,3,62,0,1,3,0
227,16,16,0,18.11,18.11,3982,18,34,18,34,1,0,18.6,18.37,0,3991,19,53,19,53,0,0,16.48,17.69,0,3992,16,69,Male,Yes,1379,98,0,0,1,53,0,1,3,0
228,16,16,0,19.77,19.77,3982,14,30,14,30,6,0,16.19,18.1,0,3991,15,45,15,45,2,0,18.54,18.25,0,3992,18,63,Male,No,1379,98,0,0,2,45,0,1,3,0
229,16,16,0,18.15,18.15,3982,12,28,12,28,6,0,18.83,18.44,0,3991,18,46,18,46,3,0,18.5,18.46,0,3992,14,60,Male,No,1380,98,0,0,2,60,0,1,3,0
230,16,16,0,19.76,19.76,3982,17,33,17,33,1,0,19.17,19.46,0,3991,19,52,19,52,0,0,16.77,18.48,0,3992,18,70,Male,No,1379,98,0,0,2,52,0,1,3,0
231,16,16,0,16.81,16.81,3982,17,33,17,33,1,0,16.74,16.78,0,3991,14,47,14,47,3,0,14.17,16,0,3992,16,63,Male,Yes,1379,98,0,0,1,63,0,1,3,0
232,13,13,0,16.53,16.53,3982,11,24,11,24,7,0,17.1,16.79,0,3991,17,41,17,41,0,0,13.76,15.54,0,3992,20,61,Female,Yes,1379,98,0,0,1,41,0,1,3,0
233,16,13,3,14.64,14.64,3982,17,33,17,30,0,0,17.32,16.02,0,3991,17,50,14,44,0,3,14.65,15.56,0,3992,15,65,Female,Yes,1380,98,0,0,1,50,0.12,0.88,3,0
234,16,16,0,15.71,15.71,3982,16,32,16,32,1,0,15.96,15.84,0,3991,18,50,18,50,0,0,15.5,15.72,0,3992,14,64,Male,Yes,1379,98,0,0,1,64,0.046875,0.953125,3,0
235,16,16,0,15.36,15.36,3982,14,30,14,30,2,0,17.03,16.14,0,3991,14,44,8,38,3,6,11.29,14.59,1,3992,14,58,Male,Yes,1379,98,1,1,1,44,0.13636364,0.8636364,3,0.33333334
236,13,10,3,13.05,13.05,3982,13,26,13,23,2,0,15.68,14.36,0,3991,14,40,8,31,3,6,13.6,14.1,0,3992,12,52,Male,Yes,1380,98,0,0,1,52,0.28846154,0.71153843,3,0.33333334
237,16,13,3,14.64,14.64,3982,16,32,16,29,0,0,19.58,17.11,0,3991,24,56,24,53,0,0,18.97,17.91,0,3992,18,74,Female,Yes,1380,98,0,0,2,56,0.05357143,0.9464286,3,0
238,16,16,0,14.66,14.66,3981,16,16,16,16,0,0,14.66,14.66,0,3991,17,33,14,30,3,3,14.11,14.38,0,3992,12,45,Male,Yes,1379,98,0,0,1,33,0.09090909,0.90909094,2,0
239,13,13,0,16.43,16.43,3982,16,29,16,29,2,0,17.44,16.99,0,3991,16,45,16,45,0,0,15.44,16.44,0,3992,12,57,Male,Yes,1379,98,0,0,1,57,0,1,3,0
240,16,16,0,16.06,16.06,3981,16,16,16,16,0,0,16.06,16.06,0,3982,14,30,14,30,1,0,16.81,16.41,0,3991,18,48,Female,Yes,1379,98,0,0,1,48,0,1,3,0
241,16,16,0,14.61,14.61,3982,12,28,12,28,2,0,16.06,15.23,0,3991,15,43,15,43,3,0,15.82,15.44,0,3992,12,55,Female,Yes,1380,98,0,0,1,43,0,1,3,0
242,13,13,0,14.25,14.25,3982,15,28,15,28,3,0,16.05,15.21,0,3991,19,47,14,42,0,5,13.85,14.66,0,3992,18,65,Male,Yes,1380,98,0,0,2,47,0.10638298,0.89361703,3,0
243,16,16,0,19.86,19.86,3982,18,34,18,34,0,0,18.81,19.31,0,3991,18,52,18,52,0,0,18.58,19.05,0,3992,15,67,Female,Yes,1379,98,0,0,1,67,0,1,3,0
244,13,10,3,12.65,12.65,3982,13,26,13,23,2,0,17.08,14.86,0,3991,14,46,11,40,0,3,10.45,13.86,1,3992,14,60,Male,Yes,1380,98,1,1,1,46,0.13043478,0.8695652,3,0.33333334
245,16,13,3,12.55,12.55,3982,12,28,12,25,3,0,15.66,13.88,0,3991,19,47,19,44,0,0,15.94,14.72,0,3992,18,65,Female,Yes,1380,98,0,0,1,47,0.06382979,0.9361702,3,0
246,16,16,0,17.03,17.03,3981,16,16,16,16,0,0,17.03,17.03,0,3982,16,32,16,32,0,0,18.09,17.56,0,3991,16,48,Male,No,1380,98,0,0,2,32,0,1,3,0
247,13,13,0,16.13,16.13,3982,16,29,16,29,0,0,16.47,16.32,0,3991,17,46,17,46,0,0,17.09,16.6,0,3992,17,63,Female,Yes,1381,98,0,0,1,63,0,1,3,0
248,16,13,3,15.18,15.18,3982,19,35,19,32,1,0,16.78,16.05,0,3991,17,55,14,49,0,3,13.42,15.42,0,3992,17,72,Male,Yes,1379,98,0,0,1,55,0.10909091,0.8909091,3,0
249,16,16,0,19.3,19.3,3982,17,33,17,33,1,0,17.91,18.59,0,3991,17,50,17,50,2,0,16.56,17.9,0,3992,13,63,Female,No,1380,98,0,0,2,63,0,1,3,0
250,13,13,0,15.9,15.9,3982,17,30,17,30,0,0,16.26,16.11,0,3991,19,52,19,52,0,0,14.3,15.56,0,3992,15,67,Female,Yes,1380,98,0,0,1,52,0,1,3,0
251,16,13,3,16.72,16.72,3982,16,32,16,29,4,0,18.3,17.51,0,3991,23,58,23,55,0,0,18.15,17.82,0,3992,17,75,Male,Yes,1379,98,0,0,1,58,0.05172414,0.94827586,3,0
