<?xml version="1.0" encoding="utf-8"?>
<!-- Generator: Adobe Illustrator 22.0.1, SVG Export Plug-In . SVG Version: 6.00 Build 0)  -->
<svg version="1.1" id="Ebene_3" xmlns="http://www.w3.org/2000/svg" xmlns:xlink="http://www.w3.org/1999/xlink" x="0px" y="0px"
	 width="250px" height="150px" viewBox="0 0 250 150" style="enable-background:new 0 0 250 150;" xml:space="preserve">
<style type="text/css">
	.st0{fill:none;stroke:#1685C2;stroke-linecap:round;stroke-linejoin:round;stroke-miterlimit:10;}
</style>
<g>
	<polygon class="st0" points="42.8,115 120,141.2 169.1,46.1 9.2,24.1 	"/>
	<path class="st0" d="M120,141.2l20-6.9c0,0,4.6,2.1,5.1,1.7c0.5-0.3,1-15.1,1-15.1l31.3-9.9l-0.2,10.5c0,0-0.8,3.8-3,2.7l-28.8,9.5
		"/>
	<line class="st0" x1="140" y1="134.4" x2="146.1" y2="121.1"/>
	<polyline class="st0" points="177.2,121.6 185.4,118.7 209.5,79.9 145.6,97.9 143.4,95.9 	"/>
	<path class="st0" d="M146.3,90.3c0.2,0.1,2.2,2.1,2.2,2.1l67.6-17.7l-2,4.4l-4.6,0.8"/>
	<line class="st0" x1="148.5" y1="92.4" x2="145.6" y2="97.9"/>
	<polyline class="st0" points="146.4,90.3 214.1,72.5 216.1,74.7 	"/>
	<polyline class="st0" points="9.2,24.1 2.3,23.7 1.9,18.2 174.3,38.2 248.1,26.2 248.1,33.9 174.4,46.7 169.1,46.1 	"/>
	<polyline class="st0" points="100,77.4 132.6,84.5 121,87.6 120.7,87.5 29.2,65.5 31.7,62.5 52.1,66.9 	"/>
	<line class="st0" x1="56.2" y1="67.8" x2="95.5" y2="76.4"/>
	<polyline class="st0" points="29.2,65.5 30.1,67.9 119.5,89.8 120.7,87.5 	"/>
	<polygon class="st0" points="99,36.7 100,77.4 100.1,78.9 98.3,79.6 95.5,78.8 95.5,76.4 94.6,44.2 53.1,37.9 54.7,69.8 52.2,69.1 
		52.1,66.9 50.4,29.8 	"/>
	<line class="st0" x1="98.3" y1="79.6" x2="97" y2="36.4"/>
	<polyline class="st0" points="54.7,69.8 56.3,69 56.2,67.8 55,38.3 	"/>
	<polyline class="st0" points="1.9,18.2 7.7,17.3 174.3,36.4 174.3,38.2 174.4,46.7 	"/>
	<polyline class="st0" points="248.1,26.2 76,12.1 7.7,17.3 	"/>
	<line class="st0" x1="76" y1="12.1" x2="81.9" y2="25.7"/>
	<line class="st0" x1="174.3" y1="36.4" x2="244" y2="26"/>
	<polyline class="st0" points="157.7,129.6 157.6,117.5 146,129.5 	"/>
	<polyline class="st0" points="166.6,126.8 166.6,114.5 157.7,122.8 	"/>
	<line class="st0" x1="177.4" y1="111.1" x2="166.5" y2="121.6"/>
	<path class="st0" d="M145.8,130.5l9.4-3.3c0,0,2.1,0.7,1.5,2.1"/>
	<path class="st0" d="M157.7,126.3c0.5,0,6.1-1.9,6.1-1.9s2.5,0.7,1.4,2.8"/>
	<path class="st0" d="M166.6,123.7l7.4-2.5c0,0,2.4,0.1,1.8,1.5c-0.6,1.4-1.7,1.6-1.7,1.6"/>
	<line class="st0" x1="214.1" y1="72.5" x2="237" y2="35.9"/>
</g>
</svg>
