-------------------------------------------------------------------------------
Test set: MainPochtaTest
-------------------------------------------------------------------------------
Tests run: 1, Failures: 0, Errors: 0, Skipped: 0, Time elapsed: 20.312 s - in MainPochtaTest
HomeWorkTest  Time elapsed: 20.021 s
