1 10 20
100 200 125
201 210 89
900 1000 174
300 200 128
1 999999 525
599999 600001 227
22999 23000 145
23000 22999 145
532000 532155 302
99520 235 351
22958 252579 443
700000 700001 168
250875 202352 443
48802 239522 443
99925 275929 443
8928 23525 279
678765 45434 509
99801 27547 351
990987 23456 525
999999 999998 259
52586 857483 525
47395 57837 340
7593 8779 252
574839 528308 452
57394 57493 260
46384 599499 470
9 4444 238
98635 2465 351
79753 585753 470
978643 797963 525
8842 78998 351
59993 39584 340
99999 22222 351
3434 556546 470
4949 234343 443
56789 5672 340
7777 7777 84
94945 564839 470
88882 245749 443
78762 222494 386
37393 489020 449
43058 473202 449
1 2 2
880 2 179
99784 79475 333
382940 3755 443
994 343435 443
9992 34343 311
886758 47635 525
58504 2353 340
90595 29359 351
3959 58585 340
39353 35666 306
94636 46346 351
26262 24646 264
6850 264 262
79879 4532 351
68607 45342 340
5960 45345 324
803375 9999 509
9292 393850 443
9876 3433 262
45945 24545 324
3994 35454 311
34984 5532 311
33929 9999 308
90909 222 351
4 56 113
22 77777 351
9573 28484 308
86943 27496 351
96436 97064 266
96942 97953 297
99706 4647 351
976 78869 351
8790 3343 262
6852 99999 351
626 456738 449
876431 97 525
9865 99999 351
3456 769 217
959 464638 449
393993 4474 443
99794 4453 351
38205 57594 340
9999 9998 92
4455 5646 236
343436 53537 443
758675 47687 509
89780 454656 449
2295 24241 282
29295 19924 308
10202 20304 279
4920 45292 324
48428 3848 324
3740 8503 262
238473 28734 443
775 2353 183
3255 4957 238
1352 8888 262
