.................
----------------------------------------------------------------------
Ran 17 tests in 0.554s

OK
Name             Stmts   Miss Branch BrPart  Cover   Missing
------------------------------------------------------------
Collatz.py          47      1     16      1    97%   137, 136->137
TestCollatz.py      68      0      0      0   100%
------------------------------------------------------------
TOTAL              115      1     16      1    98%
