1 10 20
100 200 125
500 1500 182
500 3500 217
1000 2000 182
1500 500 182
2000 2000 113
1 999999 525
999999 1 525
1 999 179
999000 999999 396
211168 169986 373
468839 30891 449
246824 202265 443
205830 458510 449
546027 682962 509
278859 613949 470
187219 595753 470
122034 4165 354
288252 673939 509
377885 539349 470
267471 51022 443
78307 369557 443
105874 628264 509
483749 671565 509
388123 577129 470
185408 749725 509
354455 83066 443
232903 8 443
304104 575049 470
490083 84691 449
258667 336458 407
196796 635207 509
401454 424083 449
293347 470476 449
522102 215425 470
152001 685036 509
102304 788661 509
180885 45096 383
417971 759792 509
131088 466997 449
396324 214101 443
250395 351787 441
37340 930906 525
681 877971 525
267 754666 509
665 888059 525
528 806122 509
329 726726 509
550 581334 470
87 960696 525
910 927158 525
533 807896 509
740 852498 525
329 751337 509
543 912827 525
912 817258 509
875 794225 509
292 599087 470
349 741035 509
142 912589 525
372 966208 525
128 887258 525
822 952278 525
977 560564 470
529 559173 470
912 709587 509
202 568240 470
317 709052 509
777 881620 525
615 645890 509
775 560520 470
424 866312 525
701 999933 525
517 846999 525
536 591831 470
725 649140 509
947396 114661 525
608724 830099 509
745278 283478 509
136844 78868 354
471229 889550 525
886368 975272 507
263121 503372 449
705732 115191 509
104038 153571 375
999305 737887 525
864913 195967 525
445264 955191 525
13286 776807 509
339148 872342 525
809753 218043 509
185804 508096 449
922219 776118 525
787073 63808 509
702395 567268 509
234255 908847 525
131603 592632 470
696956 961412 525
550573 54766 470
365682 576386 470
850747 673066 525
341882 211941 443
155115 660002 509
289486 711517 509
370379 570963 470
703271 539207 509
480646 124648 449
203193 252366 443
310156 798690 509
