{
    "min_packer_version": "1.2.3",
    "variables": {
        "type": "ec2",
        "os_version": "8",
        "minor_version": "5",
        "mirror_source": "https://dl.rockylinux.org/stg/rocky/",
        "mirror_arch": "x86_64",
        "aws_instance_type": "t3.medium",
        "ntp_source_1": "time.google.com",
        "ipv4_forward": "0",
        "name": "Rocky Linux {{ user `os_version` }}.{{ user `minor_version` }} x86_64 Minimal",
        "description": "Rocky Linux 8 x86_64",
        "vpc_id": "vpc-9274f3f7",
        "subnet_id": "subnet-5bcf7202",
        "region": "eu-west-1",
        "source_ami": "ami-071dac00197ca7d33",
        "volume_size": "40",
        "part_root": "10240",
        "part_tmp": "2048",
        "part_var": "1024",
        "part_vartmp": "1024",
        "part_varlog": "3072",
        "part_varlogaudit": "3072",
        "part_opt": "1024",
        "part_home_min": "2048",
        "part_swap": "2048"
    },
    "builders": [
        {
            "type": "amazon-ebs",
            "ami_name": "rockylinux-{{ user `os_version` }}.{{ user `minor_version` }}-x86_64-{{ isotime \"20060102\" }}",
            "ami_description": "{{user `type`}} Rocky Linux 8 x86_64 (encrypted)",
            "instance_type": "{{user `aws_instance_type`}}",
            "vpc_id": "{{ user `vpc_id` }}",
            "subnet_id": "{{ user `subnet_id` }}",
            "region": "{{ user `region` }}",
            "source_ami": "{{ user `source_ami` }}",
            "ami_virtualization_type": "hvm",
            "ssh_username": "rocky",
            "ssh_file_transfer_method": "sftp",
            "associate_public_ip_address": false,
            "tags": {
                "Name": "rockylinux-{{ user `os_version` }}.{{ user `minor_version` }}-x86_64-{{ isotime \"20060102\" }}"
            },
            "encrypt_boot": true,
            "launch_block_device_mappings": [
                {
                    "device_name": "/dev/sda1",
                    "volume_type": "gp3",
                    "volume_size": "{{ user `volume_size` }}",
                    "encrypted": true,
                    "delete_on_termination": true
                }
            ],
            "communicator": "ssh",
            "ssh_pty": true
        }
    ],
    "provisioners": [
        {
            "environment_vars": [
                "FULL_VERSION={{ user `os_version` }}.{{ user `minor_version` }}",
                "MIRROR_URL={{ user `mirror_source` }}",
                "MIRROR_ARCH={{ user `mirror_arch` }}",
                "NTP_SOURCE_1={{ user `ntp_source_1` }}",
                "IPV4FORWARD={{ user `ipv4_forward` }}",
                "PART_ROOT={{ user `part_root` }}",
                "PART_TMP={{ user `part_tmp` }}",
                "PART_VAR={{ user `part_var` }}",
                "PART_VARTMP={{ user `part_vartmp` }}",
                "PART_VARLOG={{ user `part_varlog` }}",
                "PART_VARLOGAUDIT={{ user `part_varlogaudit` }}",
                "PART_OPT={{ user `part_opt` }}",
                "PART_HOME_MIN={{ user `part_home_min` }}",
                "PART_SWAP={{ user `part_swap` }}"
            ],
            "type": "shell",
            "expect_disconnect": "true",
            "pause_before": "20s",
            "execute_command": "echo 'rocky'| {{.Vars}} sudo -S -E bash '{{.Path}}'",
            "start_retry_timeout": "15m",
            "scripts": [
                "scripts/rockylinux8/x86_64/000-base.sh",
                "scripts/rockylinux8/generic/010-packages.sh",
                "scripts/rockylinux8/generic/020-config.sh",
                "scripts/rockylinux8/generic/030-services.sh",
                "scripts/rockylinux8/generic/040-network.sh",
                "scripts/rockylinux8/generic/050-cloud-init.sh",
                "scripts/rockylinux8/generic/060-grub.sh",
                "scripts/rockylinux8/generic/090-harden.sh",
                "scripts/rockylinux8/generic/100-cleanup.sh"
            ]
        }
    ]
}